##TITLE=1H_EC-3373(II-1)
 200.13MHz,DMSO.
 8 sc
 
 20.2.2026
##JCAMPDX= 6.0         $$ Bruker NMR JCAMP-DX V2.0
##DATA TYPE= NMR SPECTRUM
##DATA CLASS= NTUPLES
##ORIGIN= UXNMR, Bruker Analytische Messtechnik GmbH
##OWNER= pz
$$ XWIN-NMR		Version 3.5
$$ Fri Feb 20 13:38:23 2026 Russian Standard Time (UT+4h)  she@DPX200
##.OBSERVE FREQUENCY= 200.1313
##.OBSERVE NUCLEUS= ^1H
##.ACQUISITION MODE= SIMULTANEOUS
##.ACQUISITION SCHEME= undefined
##.AVERAGES= 8
##.DIGITISER RES= 18
##SPECTROMETER/DATA SYSTEM= spect
##.PULSE SEQUENCE= zg30
##.SOLVENT NAME= D2O
##.SHIFT REFERENCE= (INTERNAL, D2O, 0, 15.4858)
##AUDIT TRAIL= $$ (NUMBER, WHEN, WHO, WHERE, WHAT)
$$ ##TITLE= Audit trail, XWIN-NMR		Version 3.5
$$ ##JCAMPDX= 5.01
$$ ##ORIGIN= Bruker BioSpin GmbH
$$ ##OWNER= she
$$ F:/spectra/data/she/nmr/H-C/1/pdata/1/auditp.txt
$$ ##AUDIT TRAIL=  $$ (NUMBER, WHEN, WHO, WHERE, WHAT)
(   1,<2026-02-20 13:36:07.26 +0400>,<she>,<DPX200>,
      <created by zg, POWCHK disabled, PULCHK disabled
       configuration hash MD5:
       00 E9 B6 7A A2 85 ED C7 34 08 36 98 17 FE 4E 26
       data hash MD5: 16K
       FB BA 94 9C 78 7F 35 EC FB 6A 2C 0B A9 D6 33 5B>)
(   2,<2026-02-20 13:36:09.95 +0400>,<she>,<DPX200>,
      <Start of raw data processing
       efp BC_mod = 2 LB = 0.25 FT_mod = 6 PKNL = 1 PHC0 = -3701.536 PHC1 = 4.592316 SI = 16K 
       data hash MD5: 16K
       1D 11 57 4A 4B 70 DB 5E 12 D1 27 1D D5 0C 32 9C>)
(   3,<2026-02-20 13:36:36.10 +0400>,<she>,<DPX200>,
      <pk PHC0 = -0.6303748 PHC1 = 8.999999 
       data hash MD5: 16K
       E1 08 23 CA D6 A0 1C 1A A7 57 B6 48 3E 90 BA 78>)
(   4,<2026-02-20 13:36:43.07 +0400>,<she>,<DPX200>,
      <abs ABSG = 5 
       data hash MD5: 16K
       1F 15 98 EB F2 BB E3 6F FB 56 7F 43 A4 2B 01 66>)
$$ ##END=
$$ 
$$ hash MD5
$$ D3 52 11 26 53 AB 4C 67 9A 1D 43 32 27 B1 AF 4B
##$RELAX= 
##$RELAX= 
##$RELAX= 
##$RELAX= 
##$RELAX= 
##$RELAX= 
$$ Bruker specific parameters
$$ --------------------------
##$DU= <F:/spectra>
##$EXPNO= 1
##$NAME= <H-C>
##$PROCNO= 1
##$TYPE= <nmr>
##$USER= <she>
##$AMP= (0..31)
100 100 100 100 100 100 100 100 100 100 100 100 100 100 100 100 100 100 
100 100 100 100 100 100 100 100 100 100 100 100 100 100 
##$AQSEQ= 0
##$AQ_mod= 1
##$AUNM= <au_zg>
##$AUTOPOS= <>
##$BF1= 200.13
##$BF2= 200.13
##$BF3= 200.13
##$BF4= 200.13
##$BF5= 200.13
##$BF6= 200.13
##$BF7= 200.13
##$BF8= 200.13
##$BYTORDA= 1
##$CFDGTYP= 0
##$CFRGTYP= 5
##$CHEMSTR= <none>
##$CNST= (0..31)
1 1 145 1 1 1 1 1 1 1 1 1 1 1 1 1 1 1 1 1 1 1 1 1 1 1 1 1 1 1 1 1 
##$CPDPRG= <>
##$CPDPRG1= <>
##$CPDPRG2= <>
##$CPDPRG3= <>
##$CPDPRG4= <mlev>
##$CPDPRG5= <mlev>
##$CPDPRG6= <mlev>
##$CPDPRG7= <mlev>
##$CPDPRG8= <mlev>
##$CPDPRGB= <>
##$CPDPRGT= <>
##$D= (0..31)
0 0.7 0 0 0 0 0 0 0 0 0 0.03 0 0 0 0 0 0 0 0 0 0 0 0 0 0 0 0 0 0 0 0 
##$DATE= 1771580166
##$DBL= (0..7)
120 120 120 120 120 120 120 120 
##$DBP= (0..7)
150 150 150 150 150 150 150 150 
##$DBP07= 0
##$DBPNAM0= <>
##$DBPNAM1= <>
##$DBPNAM2= <>
##$DBPNAM3= <>
##$DBPNAM4= <>
$$ [...]
##$SUBNAM3= <"">
##$SUBNAM4= <"">
##$SUBNAM5= <"">
##$SUBNAM6= <"">
##$SUBNAM7= <"">
##$SUBNAM8= <"">
##$SUBNAM9= <"">
##$SW= 18.0517328524113
##$SWIBOX= (0..15)
0 0 2 0 0 0 0 0 0 0 0 0 0 0 0 0 
##$SW_h= 3612.71676300578
##$TD= 16384
##$TD0= 1
##$TE= 0
##$TE2= 300
##$TE3= 300
##$TEG= 300
##$TL= (0..7)
0 120 120 120 120 120 120 120 
##$TP= (0..7)
150 150 150 150 150 150 150 150 
##$TP07= 0
##$TPNAME0= <>
##$TPNAME1= <>
##$TPNAME2= <>
##$TPNAME3= <>
##$TPNAME4= <>
##$TPNAME5= <>
##$TPNAME6= <>
##$TPNAME7= <>
##$TPOAL= (0..7)
0.5 0.5 0.5 0.5 0.5 0.5 0.5 0.5 
##$TPOFFS= (0..7)
0 0 0 0 0 0 0 0 
##$TUNHIN= 0
##$TUNHOUT= 0
##$TUNXOUT= 0
##$USERA1= <user>
##$USERA2= <user>
##$USERA3= <user>
##$USERA4= <user>
##$USERA5= <user>
##$V9= 5
##$VALIST= <valist>
##$VCLIST= <CCCCCCCCCCCCCCC>
##$VD= 0
##$VDLIST= <DDDDDDDDDDDDDDD>
##$VPLIST= <PPPPPPPPPPPPPPP>
##$VTLIST= <TTTTTTTTTTTTTTT>
##$WBST= 1024
##$WBSW= 4
##$XGAIN= (0..3)
0 0 0 0 
##$XL= 0
##$YL= 0
##$YMAX_a= 180598
##$YMIN_a= -235245
##$ZGOPTNS= <>
##$ZL1= 120
##$ZL2= 120
##$ZL3= 120
##$ZL4= 120
##$ABSF1= 15.30616
##$ABSF2= -2.745686
##$ABSG= 5
##$ABSL= 3
##$ALPHA= 0
##$AQORDER= 0
##$ASSFAC= 0
##$ASSFACI= 0
##$ASSFACX= 0
##$ASSWID= 0
##$AUNMP= <proc_1d>
##$AZFE= 0.1
##$AZFW= 0.1
##$BCFW= 0
##$BC_mod= 2
##$BYTORDP= 0
##$COROFFS= 0
##$CY= -3
##$DATMOD= 1
##$DC= 0
##$DFILT= <>
##$DTYPP= 0
##$F1P= 0
##$F2P= 0
##$FCOR= 1
##$FTSIZE= 16384
##$FT_mod= 6
##$GAMMA= 0
##$GB= 0
##$INTBC= 1
##$INTSCL= 3.241238e-09
##$ISEN= 128
##$LB= 0.25
##$LEV0= 0
##$LPBIN= 0
##$MAXI= 10000
##$MC2= 0
##$MEAN= 0
##$ME_mod= 0
##$MI= 1.114404
##$NCOEF= 0
##$NC_proc= -6
##$NLEV= 6
##$NOISF1= 3.799351
##$NOISF2= 2.8
##$NSP= 0
##$NTH_PI= 0
##$NZP= 0
##$OFFSET= 15.48576
##$PC= 1
##$PHC0= -3702.166
##$PHC1= 13.59232
##$PH_mod= 1
##$PKNL= yes
##$PPARMOD= 0
##$PSCAL= 0
##$PSIGN= 0
##$REVERSE= no
##$SF= 200.130007191439
##$SI= 16384
##$SIGF1= 3
##$SIGF2= 2
##$SINO= 0.751879
##$SIOLD= 32768
##$SREGLST= <19F.Aceton>
##$SSB= 0
##$STSI= 16384
##$STSR= 0
##$SW_p= 3612.71676300578
##$SYMM= 0
##$S_DEV= 0
##$TDeff= 16384
##$TDoff= 0
##$TI= <>
##$TILT= no
##$TM1= 0
##$TM2= 0
##$TOPLEV= 0
##$USERP1= <user>
##$USERP2= <user>
##$USERP3= <user>
##$USERP4= <user>
##$USERP5= <user>
##$WDW= 1
##$XDIM= 16384
##$YMAX_p= 500514381
##$YMIN_p= -522313
$$ End of Bruker specific parameters
$$ ---------------------------------
##NTUPLES= NMR SPECTRUM
##VAR_NAME=  FREQUENCY,     SPECTRUM/REAL,   SPECTRUM/IMAG
##SYMBOL=    X,             R,               I
##VAR_TYPE=  INDEPENDENT,   DEPENDENT,       DEPENDENT
##VAR_FORM=  AFFN,          ASDF,            ASDF
##VAR_DIM=   16384,         16384,           16384
##UNITS=     HZ,            ARBITRARY UNITS, ARBITRARY UNITS
##FACTOR=    0.220516191357247, 1,           1
##FIRST=     3099.16520715194, 0,            0
##LAST=      -513.551555853835, 0,           0
##MIN=       -513.551555853835, -522313,     0
##MAX=       3099.16520715194, 500514381,    0
$$ Real data points
##PAGE= N=1
##DATA TABLE= (X++(R..R)), XYDATA
$$ [...]
8671I787065J24065K864M4987j61806J0702J16451M4269j9767J60842K5435j15575
8660A0019532P6657O2837P0881J10355r4040j31475n0194Q4966j41182l1458J53884
8649A0130763R1555k6827j96367j29169J05168J08365j08641o7099p7014O2554
8639I893288J53380J19626P5084j00458m8245j76621M1726J52798K27900j23973
8629A0214505k07055q1244M5381R1992j1993J34568J1016P6636M6151L2639p1106
8618A0281490j3388o9962j25317q7512k9777J0914q6529j5595J46133L5084M731
8607A0050272j1693n7991M6489Q2025k0580j09779P6483P2014J8819R8558J04949
8596A0349566J76602l9577k6072R2712J92397K27204J49737J54785N80868J136920
$$ plain form
8671 9787065 9911130 9913994 9958981 9797175 9807877 9924328 9968597 9948830 10109672 10135107 10019532
8660 10019532 10096189 10159026 10229907 10340262 10246222 10114747 10064553 10149519 10008337 9976879 10130763
8649 10130763 10222318 10195491 9999124 9869955 9975123 10083488 9974847 9907748 9830734 9893288
8639 9893288 10046668 10166294 10241378 10140920 10092675 9916054 9957780 10110578 10338478 10214505
8629 10214505 10007450 9926206 9971587 10063579 10051586 10186154 10197170 10273806 10319957 10352596 10281490
8618 10281490 10268102 10198140 10072823 9985311 9955534 9966448 9879919 9864324 10010457 10045541 10050272
8607 10050272 10038579 9980588 10027077 10109102 10088522 9978743 10055226 10127240 10146059 10244617 10349566
8596 10349566 10526168 10486591 10460519 10553231 10745628 10972832 11122569 11277354 11858222 12995142
8586A2995142K213480L084024J936584m03621j112944j940516k006495j541602
8578A3224052j090974q40397o61610n38135j92386p8645j02749n1999p9002k18376
8568I369779l00523o9943R6323R0606j50612r519M6939r3446J1620L231l9668
8557H954787j06669j04435j77835n1221P3668k4651O48j7323k24781k3835j06975
8546H191378r6886L4974n179P1762o9957k0852N7050j50479J3327L4949j87858
8535G872229p7272j964K3868K2840j9877o4311L9952j93064L1420J6265K25908
8524G875994m5573k75757n2307M4839L1187Q6110j30053Q0619L0834j25736k2180
8513G497977J5621k35427r3899J3941j4652j98492n6731J4347L8553j29280m4186
$$ plain form
8586 12995142 15208622 18292646 20229230 19825609 18712665 16772149 14765654 13224052
8578 13224052 12133078 11292681 10631071 10092936 9900550 9821905 9719156 9667157 9588155 9369779
8568 9369779 9069256 8999313 9095636 9186242 9035630 9026111 9073050 8979604 8991224 8994455 8954787
8557 8954787 8848118 8743683 8565848 8514627 8588295 8563644 8564292 8546969 8322188 8298353 8191378
8546 8191378 8094492 8129466 8124287 8196049 8126092 8105240 8162290 8011811 8025138 8060087 7872229
8535 7872229 7794957 7792993 7816861 7839701 7819824 7755513 7795465 7602401 7633821 7650086 7875994
8524 7875994 7830421 7554664 7502357 7547196 7578383 7664493 7534440 7615059 7645893 7520157 7497977
8513 7497977 7513598 7278171 7184272 7198213 7183561 6985069 6928338 6942685 6981238 6851958 6807772
8502F807772r8770j15599M8673O1006R3923j10865o1123l7597m8515q1557k0052
8491F437296J19989M8347r16r2115n7420K9296q118M843q3740n2813j56453j94051
8479E994145j66996N3505r0524k0622q7796L1323k0056j9656j07145p5303n7692
8468E433183J02942J0797j06044j04334k57K8078N7150R8014m2151j39890k20734
8457E116754O1228L0119L8419J63098j04728j46489j1463R584N170o7330K5609
8446E119971L1001o9637p3794l6405j35262j39389r1668P3311L2338j7748p9261
8435D613457N8022q4757j00124q6219r4819Q4173k5751o5002M0347J93985j75676
8424D357636o2556J56062p3543j03252l1283j4024l3065J13103O5938O223k19869
$$ plain form
8502 6807772 6709002 6593403 6642076 6703082 6797005 6686140 6625017 6587420 6538905 6457348 6437296
8491 6437296 6557285 6605632 6604716 6512601 6455181 6484477 6476359 6481202 6397462 6344649 6188196 5994145
8479 5994145 5827149 5880654 5790130 5769508 5681712 5713035 5692979 5673323 5566178 5490875 5433183
8468 5433183 5536125 5546922 5440878 5336544 5336287 5364365 5421515 5519529 5477378 5337488 5116754
8457 5116754 5177982 5208101 5246520 5409618 5304890 5158401 5146938 5156522 5161692 5094362 5119971
8446 5119971 5150972 5081335 5007541 4971136 4835874 4696485 4604817 4678128 4710466 4692718 4613457
8435 4613457 4671479 4586722 4486598 4400379 4305560 4389733 4363982 4298980 4339327 4533312 4357636
8424 4357636 4295080 4451142 4377599 4274347 4243064 4229040 4195975 4309078 4375016 4381239 4161370
8413D161370k33236j57289K13466J23922j32928Q3919l3363j58571l719j28733
8403C734838j18675K5655M2436Q185j2139l2110j9435p5817K5357j6660M6522
8392C608157J7026j66536l0409l3714J6385o8148L324L2497L2053n1746N54p4089
8380C285354J0008o4405j56501o2302L5346R034m5671J7658K7817K8919n3058
8369C032199j10821n0418P7529J13951J27932j90955j13912j83422n1301J51032
8359B801814L8656J8013J805K422l2894J8529n1607J3065n5395n3076p1642L8364
8347B668054K3742K3960q474j02611o3358p8191j86730J9462M0194J35905M9801
8336B521754j34824l3172m0533j11596j84934J18520Q76K4174J4733L7997O5037
$$ plain form
8413 4161370 3928134 3770845 3984311 4108233 3975305 4059224 4025861 3867290 3863571 3734838
8403 3734838 3616163 3641818 3684254 3692439 3680300 3648190 3628755 3552938 3578295 3561635 3608157
8392 3608157 3625183 3458647 3428238 3394524 3410909 3342761 3346085 3378582 3410635 3358889 3359443 3285354
8380 3285354 3295362 3230957 3074456 3012154 3047500 3056534 3010863 3028521 3056338 3085257 3032199
8369 3032199 2921378 2870960 2948489 3062440 3190372 2999417 2885505 2702083 2650782 2801814
8359 2801814 2840470 2858483 2860288 2862710 2829816 2848345 2796738 2809803 2754408 2701332 2629690 2668054
8347 2668054 2691796 2715756 2707282 2604671 2541313 2463122 2276392 2295854 2336048 2471953 2521754
8336 2521754 2386930 2353758 2313225 2201629 2016695 2135215 2136091 2160265 2174998 2212995 2278032
8325B278032n0553L0070n176J15910n0504Q581j09307j60727R729p092j8803J25946
8313B166106k8735m5892P449l9894p536K4106o3664m6054M3805N3276n956k154
8301B054857j17791n8379N5825j10230Q0724p1294o7407k4380j6355J67987Q1288
8290A974845j93549j11582p9043Q4608K06997k2915k3929k60052r6039J37304
8280A616645k08688O3196J07747o2225k4221J30N1221p7864j19653j88557O1600
8269A219331K46565J63480O2940p9725k6413n9956p7413q7000L9435J10490L8383
8258A550117o2102q2779O4872Q9483j13714j19645p2836p9436Q3461m9375O2364
8247A270410J3205r9542k5690q5438o1240R469J36175Q7529J5922j58024J3642
$$ plain form
8325 2278032 2227479 2257549 2252373 2368283 2317779 2326360 2217053 2056326 2066055 2058963 2040160 2166106
8313 2166106 2137371 2091479 2098928 2059034 2051498 2075604 2011940 1965886 2009691 2062967 2057011 2054857
8301 2054857 1937066 1878687 1934512 1824282 1905006 1833712 1766305 1741925 1725570 1893557 1974845
8290 1974845 1781296 1669714 1590671 1675279 1882276 1859361 1835432 1575380 1479341 1616645
8280 1616645 1407957 1471153 1578900 1516675 1492454 1492584 1543805 1465941 1346288 1157731 1219331
8269 1219331 1465896 1629376 1692316 1612591 1586178 1526222 1448809 1361809 1401244 1511734 1550117
8258 1550117 1488015 1405236 1470108 1559591 1445877 1326232 1253396 1173960 1257421 1208046 1270410
8247 1270410 1283615 1184073 1158383 1072945 1011705 1021174 1157349 1244878 1260800 1102776 1116418
8236A116418q5543L1686P7835m4483L2101q4939N5986R732o7087r008n8182j20942
8224H53574J19814o1779j41357J2463l7529P4922k0047j27678Q0379J53089J02162
8213A008013p1337j68515J7692n1272M31J77883M833j25618j90252J9024J65120
8202G86002N0588O7068j11017j30740j77429k5288J83054K19113P0491m2739J31447
8191A020550m32467j86024K85022K20584m8541l77730j48295P010K02411J95343
8181G37863J62929j54491j76085L5533M7519R3564n2792k65891L8332J29575J16909
8170G12965K5124p3363J10864l1333k31447m4226m2476k9958r480J12290M9400
8159E48360j21881O502P4873q8135Q4483M0151J12597R5238r7476o7577q3614
$$ plain form
8236 1116418 1030875 1062561 1140396 1095913 1128014 1043075 1099061 1108793 1041706 1032698 974516 853574
8224 853574 973388 911609 770252 782715 745186 820108 800061 672383 752762 905851 1008013
8213 1008013 936676 768161 785853 734581 735012 912895 917728 792110 601858 620882 786002
8202 786002 836590 903658 792641 661901 484472 459184 642238 861351 931842 889103 1020550
8191 1020550 588083 402059 687081 907665 859124 481394 333099 340109 542520 737863
8181 737863 900792 746301 570216 605749 653268 746832 694040 428149 466481 596056 712965
8170 712965 738089 664726 775590 744257 512810 468584 426108 396150 386670 498960 548360
8159 548360 426479 432981 507854 419719 504202 544353 656950 752188 654712 587135 503521
8148E03521k2675o3782M1641L1876K16424P8118j73085o3014r2542r7625m3056
8137C15801k2234J37452N2368j76399p9534q269M4447O4851o6728o223J0007J87452
8125D52991n6238j81563N3738J0630P2547L0142m3435k750M1796j3355k9997J1544
8113C46050O9766p9864k04559J05795K852R4756R6859l8193j67650k05574r0112
8102f9874R5197R2450J09436J8408l6908j4166N5687M0473j18375O4043L4465
8091B70836k0300J7564K1188r4928k11286R2231l6603K2196N9367j01033J2861
8080C2093Q4885M3500j50816j41255N2626J64481J60712n2363r6569k8938N5764
8069A24120J9314j6127l4756P5903O9571k3224K3561Q944m4787j08319k2486k1322
$$ plain form
8148 503521 480846 417064 458705 490581 707005 785123 612038 549024 456482 358857 315801
8137 315801 293567 431019 483387 306988 227454 219185 263632 328483 261755 255532 265539 452991
8125 452991 396753 215190 268928 279558 352105 382247 338812 336062 377858 364503 334506 346050
8113 346050 415816 335952 131393 237188 240040 334796 431655 393462 225812 20238 -69874
8102 -69874 25323 117773 227209 245617 208709 194543 250230 290703 172328 236371 270836
8091 270836 250536 268100 289288 194360 -16926 75305 38702 60898 120265 19232 32093
8080 32093 116978 160478 9662 -131593 -78967 85514 246226 193863 97294 68356 124120
8069 124120 143434 127307 92551 168454 238025 214801 238362 247306 202519 94200 71714 50392
8057E0392O5555J29410J22727n2530j7814O6024j85717O7557k8746p1835M6823
8046A91846N0149q545j22124P1947O8859q3362j47869J54890J66011N2314j11726
8035B82390k16041M7225J05806m2891j84538K7973N9513n9894n1352k6847J45674
8024H7018o2707j02660o5390j35495J22700K15970J08415n500j34058N5064r0377
8013g020l611k6171Q0373J32802k1614n4134o3085L2906P0615n9560P3729o919
8001A48311q4545m9714p0091M5073j5803j6714k4353P549N5579J00616j03643
7990g735j60580N2955j6764M4267Q6305M6689L6435J3525K0648n117p6251m1244
7978f867r8485L0904J64377M0392k4674o2163Q581j9435j21633n0911L1616J15984
$$ plain form
8057 50392 115947 245357 368084 315554 297740 363764 178047 245604 216858 145023 191846
8046 191846 241995 233450 111326 183273 252132 168770 20901 175791 341802 394116 282390
8035 282390 66349 113574 219380 176489 -8049 19924 79437 19543 -31809 -58656 87018
8024 87018 24311 -78349 -143739 -279234 -156534 59436 167851 162351 28293 83357 -7020
8013 -7020 -10631 -36802 43571 176373 154759 100625 37540 70446 141061 81501 155230 148311
8001 148311 63766 14052 -56039 -10966 -26769 -43483 -67836 -60287 -4708 95908 -7735
7990 -7735 -168315 -115360 -132124 -87857 -1552 45137 81572 95097 115745 110628 34377 -6867
7978 -6867 -105352 -74448 89929 130321 105647 43484 52065 32630 -89003 -139914 -108298 7686
7966G686J12910O1219o6459r5363l0064p5690K8070j1130R4681Q0791r9053j52166
7954a44568J945M6575L4557R105K1774J93893l7405j26878j15471R3102m4434
7943f7805J2083n0449J7232J42079j02800J8268Q808n1623J24974j86343j04692
7932b40268J90075J91191K5530k77636R666J27318n9518k26395M6660m861K1042
7921a97196j5704j5553M7349M7027j0503R9766M1047j55386m9391J3759Q3856
7910a10929q8512M8996R8968p4903p2197O7211J4247J49976J20248j55642n4283
7899e6820n8070Q1546K50645J22263j51661j61005r3750k9801J17935l6074o4159
7888g8951k6972L5109P5862l0122O7062o6397j25886p0044J10142J34134N0487
$$ plain form
7966 7686 120596 181815 115356 19993 -10071 -85761 -57691 -68821 25860 106651 7598 -144568
7954 -144568 -142623 -96048 -61491 -52386 -30612 163281 125876 -1002 -116473 -23371 -67805
7943 -67805 -55722 -106171 -88939 53140 -49660 -31392 -22584 -74207 50767 -135576 -240268
7932 -240268 -50193 140998 166528 -111108 -101442 25876 -33642 -260037 -213377 -218238 -197196
7921 -197196 -212900 -228453 -181104 -134077 -144580 -44814 -3767 -159153 -208544 -194785 -110929
7910 -110929 -199441 -150445 -51477 -126380 -198577 -131366 -117119 32857 153105 -2537 -56820
7899 -56820 -114890 -33344 217301 339564 187903 26898 -66852 -96653 21282 -14792 -78951
7888 -78951 -105923 -70814 5048 -25074 41988 -24409 -150295 -220339 -110197 23937 74424
7877G4424j944l4142j79141p2633N4066N8396M6136K23043N2706r0650j41720
7866a1459r1565N7914m7582j04938k1121O3914N169P7578l5509p2166l2408l4982
7854b47155Q7499K09617p929j19661K1725j6161L3558M3977M7746j61248J68P5467
7842c2397Q8551J08451m1239q8305l5797j07255K14307Q1754j30396n8534k3705
7831b4565j53142M0819Q5376q6161L4127p7336J9657J35173M8587J485m5086j27898
7819a48964j4527k5775K6076j87459J95201Q0574q2147j05266M7572N1298J27170
7808c6247J04719J17655n3244K39752j22186m44555J26736l083k00328L1801P9579
7797a59401P956J2006l643M3333j43854r0035J95004K79824O8394K5737k8927
$$ plain form
7877 74424 72480 38338 -140803 -213436 -159370 -100974 -54838 168205 220911 130261 -11459
7866 -11459 -103024 -45110 -92692 -197630 -218751 -154837 -149668 -72090 -107599 -179765 -212173 -247155
7854 -247155 -159656 49961 42032 -77629 -55904 -72065 -38507 5470 53216 -108032 -107864 -32397
7842 -32397 56154 164605 123366 35061 -736 -107991 106316 188070 57674 -860 -24565
7831 -24565 -177707 -136888 -51512 -137673 -103546 -180882 -161225 -26052 22535 24020 -21066 -148964
7819 -148964 -163491 -189266 -163190 -350649 -155448 -74874 -157021 -262287 -214715 -163417 -36247
7808 -36247 68472 186127 132883 372635 250449 -194106 -67370 -70453 -270781 -238980 -159401
7797 -159401 -151445 -139439 -143082 -99749 -243603 -333638 -138634 141190 209584 235321 206394
7786B06394J53806J29008n2073j99733j18147n342R1324P6673r2784k77169j31598
7775b19641K54739J13520q209k19970K2326J27902o155Q4368p7823m4645m6081
7764a9669L2577L0796R1195K2541K1987K4813P1127L08845L96396K77879R720
7753A268207k89353k02165j09604o3263j83137j75199j78747O2768J08510J31105
7743C69122r7157k45761j8290R7461J73648L065l6762r1775j4314L2927J62252
7732C34416q3966j28937r9340l491K06930J89597J92533K34653K35503Q0416N5641
7721A213955k96511k86886j11501p6922j05612l097l4648j88229n8098j30194
7711g7743k1396L895J38142k17974m7191k7627J12572K57831M1961k46355j5173
$$ plain form
7786 206394 360200 489208 437135 237402 119255 113913 205237 281910 189126 -88043 -219641
7775 -219641 35098 148618 140409 -79561 -57235 70667 64512 148880 71057 26412 -19669
7764 -19669 12908 43704 134899 157440 179427 204240 275367 584212 980608 1258487 1268207
7753 1268207 978854 776689 667085 603822 420685 245486 66739 129507 238017 369122
7743 369122 271965 26204 7914 105375 279023 282088 245326 153551 139237 172164 334416
7732 334416 250450 121513 22173 18682 225612 415209 607742 842395 1077898 1158314 1213955
7721 1213955 917444 630558 519057 442135 336523 333426 298778 110549 52451 -77743
7711 -77743 -99139 -95244 42898 -175076 -222267 -249894 -137322 120509 162470 -83885 -99058
7700i9058J55713M5716j00066L8932J23114P4264J17343o437n5430P4072K8130
7689C96293n8250j89422j28376J8298k35348k5091J01364J04972N5178N679R4074
7678A39371J7258j05871j2986j3288n5288J10342p7208p9412J89182O1768k46976
7667g3108q7607K2717n2036J09823N8914L3570k5412l7725j19760m5370P7478
7656a38516O5633L0246J23185j31023o3897p7568l5038J7701J04798J22581J55880
7645A73982j91214j22399J74416k5275o5526q0745L9975o4691R9753j6293J7270
7634f0747J772m6620j20236P966O6124J22112J09631l1908n5384k9710J55242
7623A18242p7825k0209J35578J73586l3008j85663j80727K9132Q169o2126j90645
$$ plain form
7700 -99058 56655 102371 2305 41237 164351 238615 355958 349521 294091 368163 396293
7689 396293 338043 148621 20245 38543 -196805 -221896 -120532 -15560 39618 45297 139371
7678 139371 156629 50758 37772 24484 -30804 79538 2330 -77082 112100 173868 -73108
7667 -73108 -160715 -137998 -190034 -80211 -21297 12273 -13139 -50864 -170624 -215994 -138516
7656 -138516 -72883 -42637 80548 -50475 -114372 -191940 -226978 -209277 -104479 18102 173982
7645 173982 -17232 -139631 34785 9510 -56016 -136761 -96786 -161477 -61724 -78017 -60747
7634 -60747 -58975 -105595 -225831 -217865 -151741 -29629 80002 48094 -7290 -37000 118242
7623 118242 40417 20208 155786 329372 296364 110701 -70026 -40894 -32725 -94851 -285496
7612b85496m102K38911J19588Q5613p045j60725K3169j55116l69Q7875O7803M106
7600A4212j39450j50386l6519J34730J83184m5446k0073p8732p6653r946J21999
7589a03080J15726M0699j39124j65871R9335J21272L3870r4870R850o0408J32956
7578i645J15267r0605n9347j62260l6981K6600P7562j2069j28732J1361K39710
7567b9139N7027j80001J15135j25938m8056L8148q7714k4959Q4261k8666p7702
7556c07604j5352M0131J20544R469L7043p4583N1651L3432n1572R633j07100p0514
7544c24822j39307J56603P1335R4387J55596L8992p5186j22556O8314K6955J3407
7533c6282k8560P2059N6401j2766L770j44480q0234J28936N6386o9528j01337
$$ plain form
7612 -285496 -289598 -50687 68901 154514 147469 -13256 9913 -145203 -145572 -57697 10106 14212
7600 14212 -125238 -275624 -312143 -177413 5771 -39675 -59748 -138480 -215133 -225079 -103080
7589 -103080 12646 53345 -85779 -251650 -152315 -31043 2827 -92043 -82193 -142601 -9645
7578 -9645 105622 15017 -44330 -206590 -243571 -216971 -139409 -151478 -280210 -268849 -29139
7567 -29139 27888 -152113 -36978 -162916 -210972 -172824 -260538 -285497 -201236 -229902 -307604
7556 -307604 -322956 -282825 -162281 -152812 -115769 -190352 -138701 -105269 -156841 -147208 -254308 -324822
7544 -324822 -464129 -307526 -236191 -141804 13792 52784 -22402 -144958 -76644 -49689 -36282
7533 -36282 -64842 7217 63618 50852 54622 -89858 -170092 -41156 15230 -54298 -155635
7522a55635J7346J35815O1996K0395r0600M8564j54123L7207P3812J65691K1770
7511A82238p5658j89051k3457J78652J22658n6966r5138k09465j04744O5275J68378
7500c7278J17014M6961p8900j96966l7364R965J63149J51432j67074j46518m7730
7489b23309N0469J64381R0589j2338k11305j00630N3136J31227J04446M9823r5021
7478A468q0741n8021K2156N8058m6493J4064p7795K5364O6532J1127N0638o3067
7466g6710q4526J1105j7082K7716m7918k2764O6081K5106l2393r3067o23N3396
7454a91679m06j46763j7887K04947k4287l7290j9239k3770J69829K5334l7378
7443i8589j43682J8809P3164J45936j99359j74008J36198M2660j84458L8218l4347
$$ plain form
7522 -155635 -138289 -2474 59522 79917 -10683 37881 -116242 -79035 -5223 160468 182238
7511 182238 106580 -82471 -105928 72724 195382 138416 43278 -166187 -270931 -205656 -37278
7500 -37278 79736 126697 47797 -149169 -186533 -176568 -13419 138013 -29061 -175579 -223309
7489 -223309 -172840 -8459 82130 69792 -141513 -242143 -189007 -57780 46666 96489 1468
7478 1468 -79273 -137294 -115138 -57080 -103573 -89509 -167304 -141940 -75408 -64281 -13643 -76710
7466 -76710 -161236 -150131 -167213 -139497 -187415 -210179 -144098 -118992 -151385 -244452 -245075 -191679
7454 -191679 -192085 -338848 -356735 -151788 -176075 -213365 -232604 -256374 -86545 -61211 -98589
7443 -98589 -242271 -223462 -150298 -4362 -203721 -377729 -241531 -198871 -383329 -345111 -379458
7432c79458R1793J29729O041J67477k154j10107j49713l5719R2730p6920Q712
7421b57589M2090N0944M1347O283J44404L0894q2282j64353P0234q515m4727J14728
7409e6542N8129r909l6224K4871P2026l9541M854r0027k34011k0516P3004J56951
7397i6935n45j1531j60119J0911N9895M1952m7024J37855m567l5414M7860L9711
7385a7951q7531K7724l7386k02077J574K39079L5600q1656r1757q4949L4301R8875
7373a66154J09402j01085J18267L4666q1107k6707J3666J31425n6901J9646M9961
7362D5079j1831J07771o5028q0004j4564M3571P5397J68364l5200k43924O3893
7351E3524J19562M5084Q4312M9035k02804j86780r557J52067Q1834j30955n2008
$$ plain form
7432 -379458 -287665 -157936 -151895 15582 13428 -96679 -246392 -282111 -189381 -266301 -257589
7421 -257589 -215499 -164555 -123208 -116925 27479 58373 -23909 -188262 -118028 -126543 -171270 -56542
7409 -56542 1587 -8322 -44546 -19675 52351 12810 17664 -72363 -306374 -326890 -253886 -96935
7397 -96935 -97480 -109011 -269130 -258219 -198324 -156372 -203396 -65541 -70108 -105522 -57662 -17951
7385 -17951 -105482 -77758 -115144 -317221 -315647 -76568 -40968 -122624 -214381 -299330 -265029 -166154
7373 -166154 -56752 -157837 -39570 -4904 -86011 -112718 -99052 32373 -24528 -4882 45079
7362 45079 33248 141019 75991 -4013 -18577 24994 100391 268755 233555 -10369 53524
7351 53524 173086 218170 302482 351517 148713 -38067 -47624 104443 186277 55322 3314
7340C314J5397J5866k6709N0744K6161P2655j26516r3518J23587N1688O708r0051
7328B9326j0575Q7934L1119k6957R6284Q3015K56877K64574p0699j70548j82396
7317C87954P6967j41817j44355k39047k7549M7286R1595K2466k8050l6488j19168
7306a10206j33786R1839N7954n5337l3458l2942K6466K17796N9447m0449k26152
7295a78828j64465R4271O7425J30484J3643j20612p5473j56290L4155q8954R0978
7284c53666k6597P6430L2931j3469J19332J0639R2708P6869p7391k24625J19037
7273a67802m2546n8383J03867o0991k029q1761j9690J42190Q1205K13829o8615
7262C9274p8592o9694r6578J77141M142N7839l9074r7070Q0791K22879P6384J847
$$ plain form
7340 3314 18711 34577 7868 58612 84773 157428 30912 -62606 60981 112669 119377 29326
7328 29326 18751 106685 137804 110847 207131 290146 547023 811597 740898 570350 387954
7317 387954 464921 323104 178749 -60298 -87847 -40561 51034 73500 45450 8962 -110206
7306 -110206 -243992 -152153 -94199 -149536 -182994 -215936 -189470 28326 87773 47324 -178828
7295 -178828 -343293 -249022 -181597 -51113 -37470 -158082 -233555 -389845 -355690 -444644 -353666
7284 -353666 -380263 -303833 -270902 -284371 -165039 -154400 -61692 15177 -62214 -286839 -167802
7273 -167802 -210348 -268731 -164864 -225855 -227884 -309645 -329335 -187145 -105940 107889 39274
7262 39274 -39318 -109012 -205590 -28449 -24307 33532 -5542 -102612 -21821 201058 277442 279289
7250B79289j40181q0477l5329P2253M3968j95693M250J02315J59432j4595K7702
7239B22934j03121P910j295K7979P3297j06649j64159q3820o6401K18172J34416
7228A59263N4072j49778j47092K9903M7138J67111n7318o1522P228K3574O8469
7217A41048q6596j99563j5198K8320q356J2631k0954J24474m8945n6745L9076
7206i0808J18045J6256j50229K8109M8197N4557J07741k38244n3721J1033K6722
7195a22342J71990L0575q5361p0689P1423J55557L88j61211j57937o1633O6454
7184a62786J91662J47306j78357r1315j06414J28693J41548j72143m0665o9386
7174b11857Q5653K1556j1391r5449P4067K978q773J34896J1134J2858P882j4395
$$ plain form
7250 279289 139108 58631 23302 95555 139523 -56170 -51920 50395 209827 195232 222934
7239 222934 119813 127723 126428 154407 227704 121055 -43104 -126924 -193325 24847 159263
7228 159263 213335 63557 -83535 -53632 -6494 160617 103299 41777 49005 72579 141048
7217 141048 54452 -145111 -160309 -131989 -140345 -127714 -148668 -24194 -73139 -129884 -90808
7206 -90808 27237 43493 -106736 -78627 -30430 24127 131868 -106376 -160097 -149064 -122342
7195 -122342 49648 80223 -5138 -75827 -4404 151153 151541 -9670 -167607 -229240 -162786
7184 -162786 28876 176182 -2175 -93490 -199904 -71211 70337 -101806 -142471 -211857
7174 -211857 -126204 -104648 -116039 -211488 -137421 -134443 -143216 -8320 2814 15672 23554 9159
7162I159k9027J39557l4638j55272j73418M6256K47737K4802O989j13700r6008
7151a27563r0477O0132K52112O8744j42107q0337j29928J26526L7915J68755m3507
7140A00265l7762O8678q5450j81675j9156J44354K24992n1232q5515R2260P2766
7129B42525j37837m9349O5785j07383o5061q1353K9811M9652J17896m453k06609
7118a46376J7370k9661J60233J04570j17835M3544J234l1844q7603Q5551p076
7107g893l4092M4300P0599O8188k4444J7091k2921k488J34539r6210J3739j37391
7095B3017N3977j48514Q6472j5888R7722l3576j49958K1810J88947J43334q415
7084B58928q6959n0105r9544L0707k7724l6063j6084Q9066k2816p8070J31497
$$ plain form
7162 9159 -19868 119689 85051 -70221 -243639 -197383 50354 75156 82145 -31555 -127563
7151 -127563 -218040 -157908 94204 162948 20841 -59496 -189424 -62898 -24983 143772 100265
7140 100265 62503 131181 45731 -135944 -155100 -10746 214246 163014 77499 169759 242525
7129 242525 104688 55339 121124 13741 -51320 -132673 -102862 -53210 64686 60233 -146376
7118 -146376 -129006 -158667 1566 106136 -11699 31845 33079 1235 -86368 -817 -7893
7107 -7893 -41985 2315 72914 141102 116658 133749 110828 108340 242879 146669 160408 23017
7095 23017 76994 -71520 14952 -936 96786 63210 -86748 -64938 124009 267343 258928
7084 258928 171969 121864 22320 53027 25303 -10760 -26844 62222 39406 -38664 92833
7073I2833J43064m5673j38914J9938O7195j63656j76871j8139N0401M6303P9759
7062d3760J6135P47J59764O8658j41161j34935p5522Q8232M1485n0877r7841J15117
7050e3958O6360j06539o6127k8556M8310M8296Q048L2539L1831Q1152k8187k6227
7038F942J47497j10553j03217l4854J22429J93155p6450j9064k4964m4380K5170
7027H1711L5127J8267J7616N2128j09755j42427O0746J25178P0053j39308j23059
7016e3723J8849K21530o4505j0669j2464j91893L1056j1525M7686J69987M9443
7005A93772K6291j78453j57463R9325o9110J03022n7542P0575Q42Q1487j01704
6994A1042k3906J52057J56300p8975j7495J09818l4400j81898o119R0179O8278
$$ plain form
7073 92833 235897 190224 51310 71248 138443 -25213 -202084 -220223 -169822 -123519 -43760
7062 -43760 -27625 -26878 132886 201544 60383 -74552 -150074 -61842 -20357 -71234 -169075 -53958
7050 -53958 12402 -94137 -160264 -188820 -140510 -92214 -84166 -51627 -19796 61356 33169 6942
7038 6942 154439 43886 -59331 -94185 28244 221399 144949 125885 100921 56541 81711
7027 81711 116838 135105 152721 204849 95094 -47333 13413 138591 208644 69336 -53723
7016 -53723 -34874 186656 122151 111482 99018 -92875 -61819 -73344 -25658 144329 193772
7005 193772 220063 41610 -115853 -16528 -85638 17384 -40158 30417 31259 112746 11042
6994 11042 -12864 139193 295493 216518 199023 308841 274441 92543 86424 176603 244881
6983B44881P750m5830K0324J41097j38736L6758j09957j7016R897K4957l9591
6972A34534q4811N0128o6291O9089L4896k22518J29567J91524J7391K0328P2613
6961C46450j06052r3131q3820J56337K7914j25680r44N2055o5726K06963j146
6950C13220L705o0069k07714K286O7753O1285J44387k7094q9137l2919j7007J43950
6938C02646R7746P3254j08393p7156L2520o5734o3062J17884j39605P888p1720
6927A06268O8750J86494J39656Q589p2073j18290O1006o7759M2758J35142o4678
6916D25863q6094j14125P11R5586j34034R4212R5806j08463m3823J8345n9974
6905A84010k0448N6330K6511n7321o937m0196J2520m6474M4731j7425L9020P5988
$$ plain form
6983 244881 252631 206801 227125 368222 229486 266244 156287 139271 149168 174125 134534
6972 134534 49723 99851 33560 102649 137545 -84973 44594 236118 253509 273837 346450
6961 346450 240398 147267 63447 219784 247698 122018 121074 173129 107403 314366 313220
6950 313220 316925 256856 49142 51428 119181 180466 324853 297759 208622 175703 158696 302646
6938 302646 400392 473646 365253 288097 320617 254883 191821 309705 170100 177988 106268
6927 106268 175018 361512 501168 509757 437684 319394 380400 312641 355399 490541 425863
6916 425863 339769 225644 226355 321941 187907 282119 377925 269462 225639 243984 184010
6905 184010 163562 219892 246403 189082 182145 141949 154469 107995 152726 135301 174321 250309
6893B50309O6074M6796L138k7107O5386j05822j73043l870K23584Q9432j25903
6882C08974n4551r4844J01892L0718n9630m6226j08401J15124J53145k9114n9874
6871B57213N9412q9215o19J59200j8914l8664n1607r9042r9287P5967J44871n329
6859B93986m3471j81545J55967R865N5213M4279l2390M2344q0204J3822m9183
6848B28683j4318N4268O3517N1047o2537N8405n6732l6093J4406J7469l7280p7944
6836B02891M6890P6367J21618k6999m4100l0961j12264P7996J69691N2265m4341
6825D89053j40207L1019j18428P6457N8276k8460l8618p3106j03198J05736J67829
6814D26353L3007L5479m4074k1358l1273o2966l8518n2974n2397J4962J50777
$$ plain form
6893 250309 316383 363179 366317 339210 404596 298774 125731 121861 345445 434877 308974
6882 308974 254423 159579 261471 292189 232559 186333 77932 193056 346201 317087 257213
6871 257213 316625 227410 226791 385991 367077 328413 276806 177764 78477 154444 299315 293986
6859 293986 250515 68970 224937 234802 290015 334294 301904 344248 264044 277866 228683
6848 228683 214365 268633 332150 383197 320660 379065 322333 286240 300646 318115 280835 202891
6836 202891 249781 326148 447766 420767 376667 345706 233442 311438 481129 533394 489053
6825 489053 348846 379865 261437 337894 396170 367710 329092 255986 152788 258524 426353
6814 426353 459360 494839 450765 429407 398134 335168 296650 243676 191279 206241 357018
6803C57018P9445o9427J1603J3757K7932L0861O0496O0389j48409P2237O3638
6792E59540r7405J20365j90544k3854j38135J09084M6786j05512K11640N6013
6782E47978j02310p7057K0828J50452J78593j25026j45817m6101J15609L5845
6772E52994l8731j85174K6307J41361R1644k1731L5918K5923o8438r4559J63260
6761F28774J37794J11909j17764k30241j05519K61156J2486n6438q2476j15054
6751D44627q8432J1492Q1198M4345Q3430J00728L4521k8646K1857j2532Q5598
6740G78186o7852J72117j3087j20747j26445n4133J96703J33697p7050o9280j8718
6729G33391J60481O1643j83909q5429J74143J65490j47741Q4389M2012O9750m1196
$$ plain form
6803 357018 436463 367036 378639 392396 420328 451189 511685 572074 423665 495902 559540
6792 559540 462135 582500 391956 368102 229967 339051 385837 280325 491965 547978
6782 547978 445668 368611 389439 539891 718484 593458 447641 401540 517149 552994
6772 552994 514263 329089 355396 496757 588401 566670 602588 628511 560073 465514 628774
6761 628774 766568 878477 760713 530472 424953 686109 698595 642157 559681 444627
6751 444627 356195 367687 448885 493230 576660 677388 711909 683263 705120 692588 778186
6740 778186 710334 882451 869364 748617 622172 568039 764742 898439 821389 752109 733391
6729 733391 893872 955515 771606 686177 860320 1025810 878069 962458 1004470 1074220 1033024
6718A033024j46058m4654J06528K0313J8455j9557J4841J35365j23438m9908O5920
6707A010831J48192J49524o4013j3045P7466k0024r2253K6460m6455p6058m6912
6696A053713K6279J77488J53349j12611j63052K8624J73298K27451L7064L481
6686A605084m0595J8537R0810J85110J37422m6698j9295j79328q0016P4739L44024
6675B089794K12040o2241r3740n9957K43624L42849L5392j01920N0681R9648J44235
6664B900405J55751K17040K482j04648j24420J32431P8403R9426O9032K44473
6654C670375K1439K04116J94777K49435M11503K20494K67549K42545L32009M75464
6644F289706N42714N83586O69913O13495Q39425J148524J182892J708955K336703
$$ plain form
6718 1033024 886966 842312 948840 969153 987608 968051 982892 1118257 994819 944911 1010831
6707 1010831 1159023 1308547 1244534 1231489 1308955 1288931 1196678 1223138 1176683 1100625 1053713
6696 1053713 1079992 1257480 1410829 1298218 1135166 1163790 1337088 1564539 1601603 1605084
6686 1605084 1564489 1583026 1673836 1858946 1996368 1949670 1930375 1751047 1671031 1745770 2089794
6675 2089794 2301834 2239593 2145853 2085896 2329520 2672369 2707761 2605841 2656522 2756170 2900405
6664 2900405 3056156 3273196 3275678 3171030 3046610 3179041 3257444 3356870 3425902 3670375
6654 3670375 3691814 3895930 4090707 4340142 4751645 4972139 5239688 5482233 5814242 6289706
6644 6289706 6832420 7416006 8085919 8699414 9538839 10687363 11870255 13579210 15915913
6635A5915913L076924L730094M281319M490230L642413J828142m97649k243012
6627C4224374l259335l697700l390669k824065k187010j580132j334729j172638
6619A4778096n89661k30377k07564J26496K09283K52258N84277Q80772J184191
6610A6987771J349902J664365K069590K621700L439333M965165O903557R168787
6602D9170170J0695424R968238O254672R05847m079763p437993q749201q591781
6594D8135613p472440o012638m727624l724694k718506j804435j284758q98795
6586A9491723n84951m68538k82024J80524N14044M87795M19027M85518M52933
6577B0696051P59592J225176J745030K624509L385463M052353M100001L323993
$$ plain form
6635 15915913 18992837 22722931 27004250 31494480 35136893 36965035 36467386 34224374
6627 34224374 30965039 27267339 23876670 21052605 18865595 17285463 15950734 14778096
6619 14778096 14188435 13958058 13750494 13876990 14086273 14338531 14922808 15803580 16987771
6610 16987771 18337673 20002038 22071628 24693328 28132661 33097826 40001383 49170170
6602 49170170 59865594 69833832 76088504 76994351 72914588 65476595 56727394 48135613
6594 48135613 40663173 34650535 29922911 26198217 23479711 21675276 20390518 19491723
6586 19491723 18906772 18438234 18156210 18336734 18850778 19338573 19757600 20243118 20696051
6577 20696051 21455643 22680819 24425849 27050358 30435821 34488174 38588175 41912168
6569D1912168J088266j235520l094320m180853m271346l883004l312286k554700
6561B0468405j977482j636045j209527o36232l12678m9356K49001R6676J17745
6552A5110507L83680L28684L66818K67569N8469j88501m75496p57285q27927p27777
6542A3538741q84997r15487p98650j040970p95837p74686o64733k62961j97706
6533G202714l89493l60691m41724j37593J42047j04198J61467j0557K25522k3213
6523F264281K6999L09587N29704N34444K80241K63599K10788J1220M6554k45851
6513H231566l63037n08022o21822o51499m91667l74524l79972k95663l73560k62260
6503C909540m20314j87607j64075m2243l37843k41289j50636l2999n3868K3237
$$ plain form
6569 41912168 43000434 41764914 38670594 34489741 30218395 26335391 23023105 20468405
6561 20468405 18490923 16854878 15645351 15009119 14696441 14647085 14896086 14992762 15110507
6552 15110507 15494187 15822871 16189689 16457258 16515727 16327226 15851730 15094445 14266518 13538741
6542 13538741 12653744 11738257 10939607 9898637 9102800 8328114 7663381 7400420 7202714
6533 7202714 6813221 6452530 6010806 5873213 6015260 5911062 6072529 6061972 6287494 6264281
6523 6264281 6291280 6600867 7130571 7665015 7945256 8208855 8419643 8430863 8477417 8231566
6513 8231566 7868529 7360507 6738685 6087186 5595519 5220995 4841023 4545360 4171800 3909540
6503 3909540 3489226 3301619 3137544 3095301 2757458 2516169 2365533 2332534 2278666 2301903
6493B301903n9451j57341j89985n9957o3939O6927L5667N122K1908q2294j5492
6482A803068Q10M5217Q1595n2531r357k92928l71862J49224J46188p2765r9377
6471A327282p3729j93505O6386O8448N1528J40539l2874j85579j68250L1906J1557
6460A043709J36687q2819j3965r2872j50078n9003L5181J15760O130n1023m8205
6449H39502o1937Q7749J32924n5182k4190r0255o5163o5784N0479M3263O0536
6438H51942j12461k28734P6814l3354j40457M1565l0246N6154m8882n1164j20341
6427B60836Q3025J33317J6653m7402j35642J44020N1907j54539L0608M2949M8229
6416D73961q1259O287R9395J12365N558j32369P627p3721K3797K1688r0730r651
$$ plain form
6493 2301903 2242452 2085111 1895126 1835169 1771230 1838157 1873824 1878946 1900854 1818560 1803068
6482 1803068 1803878 1849095 1930690 1878159 1868802 1575874 1204012 1353236 1499424 1426659 1327282
6471 1327282 1253553 1060048 1126434 1194882 1246410 1386949 1354075 1168496 1000246 1032152 1043709
6460 1043709 1180396 1097577 1083612 990740 840662 781659 816840 932600 938730 887707 839502
6449 839502 777565 865314 998238 943056 918866 828611 763448 697664 748143 791406 851942
6438 851942 739481 510747 587561 554207 413750 455315 425069 481223 432341 381177 260836
6427 260836 343861 477178 493831 446429 310787 454807 506714 352175 382783 425732 473961
6416 473961 392702 398989 498384 610749 616307 483938 491565 417844 441641 463329 372599 362948
6404C62948J15488O0575o525q5476m6518L33090M7950k7498j80491L3328J96633
6393H03504O8571m2231Q8474n0735n7915m7511M8121J94104Q8265j7558r0738
6382I84351K4993K20950K48695K90651K35946M10287Q09739J154614J601068J304200
6372G285494M12754o62895j140342j085322j021979n79933o24560m02692j61626
6363B018899k49996n6117J29644M711K48408l8759J2531j44710l457p9089k17910
6352A624155j48017K03386N1191M3600J54120J06265J60200r2o139P2134O9759
6341B330562q2361J06932Q1769K08154K3795J35164j97063j56530Q1107K06089
6331B737618p5200j3569R7614J74625K64456J36682L2597L43842J51632J57447
$$ plain form
6404 362948 478436 539011 532486 447010 400492 733582 781532 754034 573543 606871 803504
6393 803504 872075 829844 918318 867583 809668 762157 810278 1004382 1092647 1075089 984351
6382 984351 1009344 1230294 1478989 1769640 2005586 2415873 3225612 4380226 5981294 7285494
6372 7285494 7698248 7035353 5895011 4809689 3787710 3207777 2583217 2180525 2018899
6363 2018899 1768903 1712786 1842430 1847141 2095549 2056790 2069321 1924611 1921154 1842065 1624155
6352 1624155 1476138 1679524 1730715 1774315 1928435 2034700 2194900 2194808 2188669 2260803 2330562
6341 2330562 2248201 2355133 2436902 2645056 2668851 2804015 2606952 2450422 2531529 2737618
6331 2737618 2662418 2648849 2746463 2921088 3185544 3322226 3354823 3698665 3850297 4007744
6321D007744K63575N41518O17595O63869P34635N88490L06225k48243n69959p73737
6311F131712o25856l58193k75436K9201L37368O77906O29352K94169J24771j07634
6301F857360o43701o31077m02901l91641l84594l34178l39703l02159k47114k5159
6291C155133j05552k90247l58571j07449j56153n9207j55215O4411m1752r9947
6281A845451O1195Q2135j58819M2346J57492N9735J19655n1042j19549j03486
6271A935113O4800o5373q9149l41756j40492l5729J29904j9123L8033r5267Q2321
6260A463282K31781K69849M35786j2707k30477l18418j71530p3995j10586k32662
6250A250323q1937r6206j34710J1504Q0926L3420j68830k1294o2604q4313M4104
$$ plain form
6321 4007744 4271319 4812837 5430432 6094301 6828936 7417426 7723651 7475408 6905449 6131712
6311 6131712 5505856 5147663 4872227 4901428 5238796 5916702 6546054 6840223 6964994 6857360
6301 6857360 6213659 5582582 5179681 4788040 4403446 4069268 3729565 3427406 3180292 3155133
6291 3155133 3049581 2759334 2400763 2293314 2137161 2077954 1922739 1987150 1945398 1845451
6281 1845451 1906646 1988781 1829962 1872308 2029800 2089535 2209190 2158148 2038599 1935113
6271 1935113 1999913 1934540 1845391 1503635 1363143 1327414 1457318 1438195 1476228 1380961 1463282
6260 1463282 1695063 1964912 2400698 2387991 2157514 1839096 1667566 1593571 1482985 1250323
6250 1250323 1168386 1072180 937470 948974 1029900 1063320 894490 873196 810592 726279 770383
6239G70383j09266k7536J09932J07866P2181R468R0897j675m2730O9601p492j24545
6227I17084k3720q9487l1917J34891J29830J50283Q8004J02065k32808k23934
6217I20291K0488N6720J59714O1720k4699k50334m3556J00655O0469L254j19024
6206I45698k4505K3491O1591J38755J27155J34074N7498j1723J4655J26099K53419
6195A846207K33360L18802M80669O96263Q79409L36791K2232n22965m41006n54054
6185C295708o60943p00993m77737k13165k14616l8112l1830p2601n5244m9056
6175G81411J12296M7534j52820j14567r0581J14274N1580N7729q348j51611j1451
6164F35446K5987O0469j4816j6566l4210K25646M22603N98647M03197m6705k28358
$$ plain form
6239 770383 661117 633581 743513 851379 923560 933028 1023925 1022250 979520 1049121 1041629 917084
6227 917084 893364 803877 771960 906851 1036681 1186964 1274968 1377033 1144225 920291
6217 920291 940779 997499 1157213 1218933 1194234 943900 900344 1000999 1061468 1064722 945698
6206 945698 921193 944684 1006275 1145030 1272185 1406259 1463757 1452034 1466689 1592788 1846207
6195 1846207 2079567 2398369 2879038 3575301 4454710 4791501 4813733 4290768 3849762 3295708
6185 3295708 2634765 1933772 1456035 1242870 1028254 990142 958312 885711 830467 781411
6175 781411 893707 941241 788421 673854 583273 697547 749127 806856 798508 646897 635446
6164 635446 661433 721902 707086 690520 656310 881956 1304559 1903206 2306403 2259698 2031340
6153B031340k46542k07524j73784q073j54129j40156k78614q8115m9996J06270
6143G90677j4412r6364J7571m454j9659k04806N4370P522J84252K30005J01016
6132A045718o5884r7152k2635l9070M7970J09621K07003J08336J2871j13549l822
6121A189407j49306j72403o9628j46995J0151J42118j53721k40760Q8509O6948
6111E64320J28329M6225j01882N1749n991O4103K256L9763L0583q4960j3689j49326
6099E71480R9866J05349j24358j40455l1381r3048K5176p727k5075l5120j29755
6088B14952j23474q0561J83795R2172l8090o9183L4578J27367K3209k5704l126
6077C35935l3800J60807J30094l6927J2973M868j32122j12429L432P849k3771
$$ plain form
6153 2031340 1784798 1577274 1403490 1395417 1241288 1101132 822518 734403 684407 790677
6143 790677 776265 679901 697472 693018 673359 468553 522923 530445 714697 944702 1045718
6132 1045718 979834 882682 860047 820977 868947 978568 1185571 1293907 1306778 1193229 1189407
6121 1189407 1040101 867698 798070 651075 661226 803344 649623 408863 497372 564320
6111 564320 692649 738874 636992 688741 682750 746853 749109 788872 819455 734495 720806 571480
6099 571480 671346 776695 652337 511882 480501 387453 412629 404902 379827 344707 214952
6088 214952 91478 10917 194712 286884 248794 179611 214189 341556 364765 339061 335935
6077 335935 302135 462942 593036 556109 569082 573950 441828 329399 332831 340680 316909
6066C16909J33373K736j58986N1630N7771j70591r6734L8575m9773P7051n8710
6055A43251N8746k3463p2398J06236o4725N7848j73982l0592K14171K00270k0633
6044C94729L921l4123k02509J9924P3357J06952Q1020p8849O5128j22452n3950
6033B53148O1011J25119j64698m3235J3753R8977j62760K203R7347K9398l7930
6022B72333j1534K6775L8259Q3884k6701M3345j42794J59082L5043j87442j25734
6011A64516N716J4691J22273K58064J18511k9536j66757R6341J08771J95302O9516
6000I57408k9002J190J2674P0864j40400P937l655k03053l35469m8987r5498p8131
5988A15878P2044P5514j39989j2238Q3417Q9645m4481K8205R1233M2637k1948
$$ plain form
6066 316909 450282 453018 294032 345662 403433 232842 136108 174683 124910 201961 143251
6055 143251 201997 178534 106136 212372 147647 205495 31513 921 215092 415362 394729
6044 394729 398650 364527 162018 181942 255299 362251 443271 364422 429550 307098 253148
6033 253148 314159 439278 274580 231345 245098 344075 181315 183518 280865 310263 272333
6022 272333 260799 287574 325833 409717 383016 426361 283567 442649 477692 290250 164516
6011 164516 170232 184923 307196 565260 683771 654235 487478 583819 692590 887892 957408
6000 957408 928406 929596 942270 1013134 872734 880671 877016 673963 338494 289507 194009 115878
5988 115878 187922 263436 123447 111209 194626 284271 239790 267995 359228 401865 379917
5977C79917n5306Q6520k9299J68559j28171L9004J31980m7412j0862m3355M1838
5966E33413l3840J19725J11755L7097j05655k64785K7971J28203N2788J96822
5956H03494N1277m2004m2195J54437L20751K29352M28780R02608J006788Q09345
5946D622633J08511l81264p52105q11276m69292l95711m89051k37017j93753j74069
5936H27606p2370J85183J9176k10477r9195J93109L00269J89966J74995K03824
5926A712086K83761K22818L89903J31347k36511l02558k41165l66964j57986j8521
5916A416210o4322n4615J21462J64701J50319j7826j31811q7484j62660j60792
5906A173182j53212Q7106K3723M6953l4276k1061r6250O9094R9863J06969J0565
$$ plain form
5977 379917 324611 411131 381832 550391 422220 461224 593204 545792 534930 491575 533413
5966 533413 499573 619298 731053 768150 662495 397710 425681 553884 606672 803494
5956 803494 854771 812767 770572 925009 1245760 1475112 1903892 2806500 3813288 4622633
5946 4622633 4731144 4349880 3597775 2786499 2317207 1921496 1432445 1195428 1001675 827606
5936 827606 755236 940419 959595 749118 649923 843032 1143301 1333267 1508262 1712086
5926 1712086 1995847 2218665 2608568 2739915 2503404 2200846 1959681 1592717 1434731 1416210
5916 1416210 1351888 1297273 1418735 1583436 1733755 1715929 1584118 1496634 1333974 1173182
5906 1173182 1019970 1107076 1130799 1177752 1143476 1122415 1026165 1095259 1195122 1302091 1312656
5895A312656j8954R7551R2398k5871P5188J4233m4055k77782o8943L7280j0245
5884A183456k6273j15978m9081j5293k81430j48925n9441J47871J92317J35048
5874I62271J32545J06136J212O6521M0505n7293j43640k21180k40390j65110K4020
5863E05597K08041K07303p3173p1225J28460l7080J56920K37652N7943M5866o2751
5852A303553J98014J40451Q9285k1025j56952k44937j10914k0268k02876o9328
5842I05003J23915L2452j20896q6990k3115J8647K9294p3990R0739J01625N5232
5831A051916r6056j56345j89754L9176J3050M849j9169O9170J25705J18760j63249
5820G98053J02209K21889L80247J66675J43227J75544J07487j59053k28447k23154
$$ plain form
5895 1312656 1293702 1391253 1483651 1457780 1532968 1547201 1503146 1225364 1156421 1193701 1183456
5884 1183456 1157183 1041205 992124 976831 695401 546476 487035 634906 827223 962271
5874 962271 1094816 1200952 1202164 1268685 1309190 1251897 1108257 887077 646687 481577 505597
5863 505597 713638 920941 847768 776543 905003 867923 1024843 1262495 1320438 1366304 1303553
5852 1303553 1501567 1642018 1731303 1710278 1553326 1308389 1197475 1177207 974331 905003
5842 905003 1028918 1061370 940474 853484 830369 849016 878310 804320 895059 996684 1051916
5831 1051916 955860 799515 609761 648937 661987 666836 647667 716837 842542 961302 798053
5820 798053 900262 1122151 1502398 1669073 1812300 1987844 2095331 1936278 1707831 1484677
5810A484677J14733K7671Q8203n704J58391P4Q6654J03234R6677J09790j0284
5799B254116j8247J42263J18572K38966J17149J2393l09622n2347J32643r0547
5789B545339j24814N9320L166j43742r8809J34029N7785N9698q9577R7994K07616
5778B708005J91552K85162J44167K11232K55054K12740q1276m3685R9498K75987
5768D258436K08419L81141N69294O47179P28143Q47900J437322K326922L869105
5759A5273861Q087203J3833829J2843777K589326l761100r058417j0268476p639041
5751B1900962n633204l747281k693203j754660j321388r78051n95021m91142n38159
5742D148853j89658l88137j79611k13152k51770j66298r197L5385K97979k02671
$$ plain form
5810 1484677 1599410 1627081 1715284 1709580 1867971 1868045 1954699 2057933 2154610 2264400 2254116
5799 2254116 2235869 2378132 2496704 2735670 2852819 2865212 2555590 2503243 2635886 2545339
5789 2545339 2420525 2479845 2483011 2339269 2240460 2374489 2432274 2491972 2402395 2500389 2708005
5778 2708005 2899557 3184719 3328886 3540118 3795172 4007912 3926636 3882951 3982449 4258436
5768 4258436 4466855 4847996 5417290 6064469 6792612 7640512 9077834 11404756 15273861
5759 15273861 23361064 37194893 50038670 52627996 48866896 39808479 29540003 21900962
5751 21900962 16267758 12520477 9827274 8072614 6751226 5773175 5178154 4687012 4148853
5742 4148853 3959195 3571058 3391447 3178295 2926525 2760227 2751030 2786415 3084394 2881723
5732B881723j66153l7878r5606m9796n6005j07761j16205J07123l5144j09982
5722B214316Q0568q8659k7692J9910n4842m3636J1792j78491k42212K0281J05650
5711A816985R4328p1456l1057n0541P7743J33919P5657j19883L9158l156R6209
5700B057906m8431K0195j9391j96106P5641J03029m2338m0543q4577O9800m3567
5689A851618M4757m7897j8677r055j5737m8324l0331J1700r7738k30197K0991
5678A431110J66238K60627Q3508J44782L7141L03687J66867K78649r910q3084
5668B779615l34484K4163L6081J36737J31083r406P9512J33609J68322K29481
5658C374713J36246P5151p1057P0748K08825J8797k02341K6730J65989K39147
$$ plain form
5732 2881723 2715570 2677692 2582086 2532290 2476285 2368524 2252319 2359442 2324298 2214316
5722 2214316 2294884 2206225 2178533 2198443 2143601 2099965 2111757 1933266 1691054 1711335 1816985
5711 1816985 1911313 1839857 1808800 1758259 1836002 1969921 2045578 1925695 1964853 1961697 2057906
5700 2057906 2009475 2029670 2010279 1814173 1889814 1992843 1950505 1909962 1825385 1895185 1851618
5689 1851618 1896375 1848478 1829801 1820746 1805009 1756685 1726354 1738054 1640316 1410119 1431110
5678 1431110 1597348 1857975 1941483 2086265 2123406 2427093 2593960 2872609 2862699 2779615
5668 2779615 2445131 2469294 2505375 2642112 2773195 2763789 2843301 2976910 3145232 3374713
5658 3374713 3510959 3586110 3515053 3585801 3794626 3813423 3611082 3637812 3803801 4042948
5648D042948J57954K53797N4033j09952j40888o1822o4397n551q8883L3927K0926
5637D092092K02118L57557K76179R3170k04873o6498K511O7664K27896L00460
5627E348276R6009r469J30883K96074M13413L77011L23459K08607J00064J62285
5617G446612O8333J55225R1553J18587L21152O33574N41481N56341L72155m5691
5607A0259322n3112J85237n2278L24876J88939L05242J31328M38J62647N90823
5597A2043462N91205Q24442O61584J055860R69393R53070Q69351J536781J835165
5588B1340313K388260J477199J523153J602518K967361L464842M278896M124027
5580D3166569N781264O545694R342310J2395691K0194442L2144928O6583672J20606433
$$ plain form
5648 4042948 4200902 4454699 4508732 4398780 4257892 4196070 4131673 4126122 4037239 4071166 4092092
5637 4092092 4294210 4651767 4927946 5021116 4816243 4749745 4752256 4819920 5047816 5348276
5627 5348276 5444285 5434816 5565699 5861773 6275186 6652197 6975656 7184263 7284327 7446612
5617 7446612 7514945 7670170 7761723 7880310 8201462 8835036 9376517 9932858 10305013 10259322
5607 10259322 10206210 10391447 10339169 10664045 10852984 11158226 11289554 11289992 11452639 12043462
5597 12043462 12634667 13459109 14120693 15176553 16145946 17099016 17968367 19505148 21340313
5588 21340313 23728573 25205772 26728925 28331443 31298804 34763646 39042542 43166569
5580 43166569 48947833 55493527 64835837 77231528 97425970 129570898 196154570 316761003
5572C16761003J33741698N0011680k9073180q1407990j01201716p4750360n4715564
5565A59365571l7047849k7979019j9667222j5901190r954759p100733m688679
5558C7026120m019737k459099k443910j409341j509816n22692r01990j68613m16474
5549B3174448L21428L79276N38774L41314Q13663O68434J217687J239730J605653
5540C0300407K053353L133991M447754P693269J1791475J9678994K9621843L2966135
5532A41687221J9296603K165j5320629k4300023k4304762k0289912j5840310j2103479
5524D8826874q998774o905285n208962l574482k818068k265971j528210j079433
5516A6447689r15972r09667o77623p65700q85107o35555n26041k26730n1255k44114
$$ plain form
5572 316761003 450502701 500514381 471441201 390033211 288831495 214081135 159365571
5565 159365571 122317722 94338703 74671481 58770291 48815532 41714799 37026120
5558 37026120 33006383 30547284 28103374 26694033 25184217 24661525 23759535 23590922 23174448
5549 23174448 23495876 23875152 24413926 24755240 25568903 26237337 27455024 28694754 30300407
5540 30300407 32353760 35487751 39935505 47628774 59420249 79099243 108721086 141687221
5532 141687221 160983824 160985989 145665360 121365337 97060575 76770663 60930353 48826874
5524 48826874 39828100 32922815 27713853 24139371 21321303 19055332 17527122 16447689
5516 16447689 15531717 14622050 13944427 13178727 12293620 11658065 11132024 10905294 10854039 10609925
5506A0609925m54123m46958k01151j69743k96332l25621n19743n05758k83659
5497G406837k11050K076p711r8680l82170k43127j54078K56458J02696q3094k15071
5486F373086j08060j94117r7966O8475J37075J22184J45892R5578O0069m6745
5476F555471O1001O1908L51060L18183K32067J20816J09291L30412P05016R57548
5466I802773R72677Q81660J143181J704686K479888L616274N914490R581316J4826193
5457E0923138J7306540J0941050K40459q026593j2943844j2651247j0229150p579619
5449B7980734n804899m231506l362645k552057j747958j173844j010427q98398
5441G199000p08765n22853l03308k20208m03334j22085l35309o1660j80703j60801
$$ plain form
5506 10609925 10155802 9708844 9507693 9337950 9041618 8715997 8196254 7690496 7406837
5497 7406837 7195787 7197863 7190152 7091472 6709302 6466175 6312097 6568555 6671251 6588157 6373086
5486 6373086 6265026 6070909 5972943 6041418 6178493 6300677 6446569 6542147 6602216 6555471
5476 6555471 6616472 6678380 7029440 7347623 7579690 7700506 7809797 8140209 8845225 9802773
5466 9802773 10775450 11657110 12800291 14504977 16984865 20601139 26515629 36096945 50923138
5457 50923138 68229678 79170728 79411187 71384594 58440750 45789503 35560353 27980734
5449 27980734 22175835 17944329 14581684 12029627 10281669 9107825 8097398 7199000
5441 7199000 6490235 5967382 5664074 5443866 5040532 4918447 4583138 4521478 4340775 4179974
5431D179974l83393k23525j90214r5082n9807k39269l42260l88738j59692J03767
5421B201761J16582O0511J2478L4468m9023j27484O3190J23945L5795j52807j98826
5410B120590l0902j66827J01668M8929K607J8348R2825n1390K4434M4117J06685
5399B311084L08q7798j1089j07908j39602n7959p7257j9754P18j24221K3327o2536
5387A647313J13262j01715j72316j28798R8067K60695J68896J16061l5839Q1112
5377B046738K25168K12017J66538J78809L7199j399p7671k32400r1581r0824k87552
5366B085042j30985J9355N3740Q3495j02955N5767L28912P33660N55021K45850
5356C926902p3234l88527n85382m26926l04646k59621j92820j9283n0917J09004
$$ plain form
5431 4179974 3796581 3573056 3382842 3287760 3227953 2988684 2646424 2257686 2097994 2201761
5421 2201761 2318343 2378854 2391332 2425800 2376777 2249293 2312483 2436428 2472223 2319416 2120590
5410 2120590 2089688 1922861 2024529 2073458 2076065 2094413 2187238 2135848 2160282 2204399 2311084
5399 2311084 2311392 2223594 2212505 2104597 1964995 1907036 1829779 1810025 1810743 1686522 1709849 1647313
5387 1647313 1760575 1658860 1486544 1357746 1455813 1716508 1885404 2001465 1965626 2046738
5377 2046738 2271906 2483923 2650461 2829270 2866469 2865070 2787399 2554999 2463418 2372594 2085042
5366 2085042 1954057 1973412 2027152 2110647 2007692 2063459 2392371 3126031 3681052 3926902
5356 3926902 3853668 3465141 2879759 2452833 2148187 1888566 1695746 1676463 1625546 1734550
5346A734550M6778j35096k1216J32408J50352J47565L7854L1807K7181M2170K1058
5335B215411j06357k56226O2433q7428O9558L55874L49464J33419L05368K58430
5325C299946P06847J049880J469255J170667N23588k73574r99962j293499j177590
5316D475558r04014n19329m64239l32811k70689j10390R6288k25357q3721l8017
5306A623279j84917j66312j07168P4477k8210o5533j84817j89173q460l3868n2585
5295F76713M5588K8055N7105j32385K5967K10335J28080Q3881r0047n7312n014
5284I70966J9993P8961M3021K51555R4420K8125j20328j9097J48502J32016L13115
5273A941249K56915K74876O73459R67630J025084P23180M2813n62738o45651p34788
$$ plain form
5346 1734550 1781328 1646232 1625016 1757424 1907776 2055341 2093195 2125002 2152183 2194353 2215411
5335 2215411 2109054 1852828 1915261 1827833 1897391 2253265 2602729 2736148 3041516 3299946
5325 3299946 4006793 5056673 6525928 7696595 8220183 7946609 6946647 5653148 4475558
5316 4475558 3571544 3052215 2587976 2255165 1984476 1874086 1970374 1745017 1661296 1623279
5306 1623279 1438362 1272050 1164882 1239359 1211149 1145616 960799 771626 763166 729298 676713
5295 676713 722301 750356 807461 675076 701043 911378 1039458 1123339 1033292 975980 970966
5284 970966 990959 1069920 1112941 1364496 1458916 1487041 1366713 1347616 1496118 1628134 1941249
5273 1941249 2198164 2473040 3146499 4114129 5139213 5862393 5905206 5342468 4696817 3962029
5263C962029n41588k15396j45873M42309R07935R87759M38180P5687o22877p07450
5253D580715n78801n24685m49921k51940k91945j62538j01801l3239R8400j4233
5243B270012m7042l22611j69881J06639J18019q4226p296Q9537k5338N0145L0922
5232B008880L06367K92409J01141M531j11375R4801l472k41099k49670q8691P378
5221B121200j19944j28979k09665p5829p915J5102p2557K3454K29571L26774l3201
5210B068011J36058K28921J88735j40776p6828j80848o5021P841n5295P3484L29005
5199B513287K93261J04984N0452M1387l4582P708M3998K1530K07339J64935J85116
5188C599415K77893O23578J049676J580263K550675K299636P45682n86416j551327
$$ plain form
5263 3962029 3420441 3205045 3059172 3501481 4409416 5397175 5835355 5911042 5288165 4580715
5253 4580715 4001914 3477229 3027308 2775368 2483423 2320885 2219084 2185845 2284245 2270012
5243 2270012 2222970 1900359 1730478 1837117 1955136 1870910 1863614 1953151 1927813 1977958 2008880
5232 2008880 2315247 2607656 2708797 2713328 2601953 2696754 2693282 2452183 2202513 2113822 2121200
5221 2121200 2001256 1872277 1662612 1586783 1578868 1593970 1521413 1544867 1774438 2101212 2068011
5210 2068011 2204069 2432990 2621725 2480949 2404121 2223273 2158252 2166093 2110798 2184282 2513287
5199 2513287 2806548 2911532 2961984 3003371 2968789 2976497 3020495 3042025 3249364 3414299 3599415
5188 3599415 3877308 4500886 5550562 7130825 9681500 11981136 12726818 12140402 10589075
5179A0589075j944534j458507j320932j092487q05079m09363k32105j18332L5247
5170C242983p1524k3165N0542K75127L05755L94277K88318L0003L2412K12714
5160D737442L09006M6148J05722J29152J88894M00954Q95877J269724K440375
5151A0523294M006472M556603K464609J14746j435876k634490k279743k289176
5143A3026439j902110j425208j401787j019286p20731o43076m85991k83064N3251
5134E198437o1937N6123J52000K37218K51414K33478P2434m0141M8887M21316
5124F569229K56768O282l90264m32426o37193l83106k81146j66662j04573J02822
5114D539731P1315J49071O95573R20414P72410K85022O561m94992n01545m90232
$$ plain form
5179 10589075 8644541 7186034 5865102 4772615 3967536 3558173 3326068 3207736 3242983
5170 3242983 3171459 3148294 3198836 3473963 3779718 4173995 4462313 4492316 4524728 4737442
5160 4737442 5046448 5092596 5198318 5327470 5516364 5917318 6813195 8082919 10523294
5151 10523294 14529766 19086369 21550978 21665724 20229848 17595358 15315615 13026439
5143 13026439 11124329 9699121 8297334 7278048 6557317 5914241 5428250 5145186 5198437
5134 5198437 5136500 5192623 5344623 5581841 5833255 6066733 6139167 6099026 6147913 6569229
5124 6569229 6825997 6832279 6442015 6009589 5372396 4989290 4708144 4541482 4436909 4539731
5114 4539731 4611046 4760117 5455690 6376104 7148514 7433536 7440097 6945105 6443560 5953328
5104E953328n64185l85890k37189j65844K3955L20572K87621J98615P065j08094
5094E329954j37881O761k14200k87453j68338J09253J13888j30548J5745J04126
5084D741307K62095P21336J456504K306836J804657M10078l24102r62607j162104
5075I254000p37675q24512p62366o55228m48802l56758k86012k29101r089Q5806
5065E030263J27399N7042N4996J33575J6831k25201j97101J06974J06964j9345
5055E192397q3676l8846J82125K99593N9086O0869J60345L28815J49084L55369
5045F665161N30233O11201O99755P69822R40681R62359J176848J700818K243077
5036A6299955L057410M247895N265112N647485M657175K230651n65768k766209
$$ plain form
5104 5953328 5389143 5003253 4766064 4600220 4624175 4944747 5232368 5430983 5438048 5329954
5094 5329954 5192073 5198834 4984634 4697181 4528843 4638096 4751984 4621436 4637181 4741307
5084 4741307 5003402 5724738 7181242 9488078 11292735 11702813 11378711 10416104 9254000
5075 9254000 8516325 7691813 6929447 6274219 5825417 5468659 5182647 4953546 4944457 5030263
5065 5030263 5157662 5214704 5269700 5403275 5420106 5194905 4997804 5104778 5211742 5192397
5055 5192397 5108721 5069875 5252000 5551593 5610679 5671548 5831893 6160708 6309792 6665161
5045 6665161 7195394 7806595 8506350 9276172 10216853 11179212 12356060 14056878 16299955
5036 16299955 19357365 23605260 28870372 34517857 39175032 41405683 40839915 38073706
5028C8073706m074884m465754m068323l567605k629534j981878j356409r87960
5020A4941359q20526n72965k46904j08459J59003L82384N28922N26984P13049
5011A5502847J038957J529464K094957K472192L187006M666911P180282J0586296
5003D8258912J3596320J2991686P492129L3010o245312j0095782j0686798r562513
4995D5781652q056769o381353m898210l659322k736149k303691j767957j134814
4987A4843387q63848n09405m38615l00343K2992M44182N53254R19919J011381
4978A5682904Q34024J130313J600840K452870L525391M441455M704652L589192
4970C7961641J153645j532688l590772m532461m641416m125287l458377k709756
$$ plain form
5028 38073706 33998822 29533068 25464745 21897140 19267606 17285728 15929319 14941359
5020 14941359 14120833 13547868 13300964 13192505 13351508 13733892 14262814 14789798 15502847
5011 15502847 16541804 18071268 20166225 22638417 25825423 30492334 37672616 48258912
5003 48258912 61855232 74846918 82339047 82372057 76126745 66030963 55344165 45781652
4995 45781652 37724883 31343530 26445320 22785998 20049849 17746158 15978201 14843387
4987 14843387 13979539 13470134 13031519 12731176 12754168 13198350 13751604 14671523 15682904
4978 15682904 16516928 17647241 19248081 21700951 25226342 29667797 34372449 37961641
4970 37961641 39115286 37582598 33991826 29459365 24817949 20692662 17234285 14524529
4962A4524529k041058j731180j371747r24083p27536m26345m36184m50982m89795
4953E925619n34885l57117j84050j97235k58652k09291j24853l5565j14004l48159
4943C561808j46668j93117j52879J72435l7876j82175j82343k54916j7252j14799
4933B452218L1197j44923j72819p9622N6464N4661J0659L520j30041J2564r5172
4922A998706m5964K9306J07545j1605j3281k10645l705q455o5771p5537J10274
4911A810868k853l9272j09151n8783K3383K15788n8702j12912k6079j86326M4047
4900A500008R6264M1242r4647j26704J6657N9402J08332J7228N1133j52811N2509
4889A568613j2135m6247K03603r7799r7128n5917p3160j50728N4841J17768O8128
$$ plain form
4962 14524529 12483471 10752291 9380544 8456461 7728925 7302580 6866396 6415414 5925619
4953 5925619 5390734 5033617 4849567 4652332 4393680 4184389 4059536 4023971 3909967 3561808
4943 3561808 3415140 3222023 3069144 3241579 3203703 3021528 2839185 2584269 2567017 2452218
4933 2452218 2483415 2338492 2165673 2086051 2142515 2197176 2207835 2211355 2081314 2093878 1998706
4922 1998706 1952742 1982048 2089593 2077988 2064707 1854062 1850357 1841902 1776131 1700594 1810868
4911 1810868 1808015 1768743 1659592 1600809 1624192 1839980 1781278 1668366 1642287 1455961 1500008
4900 1500008 1596272 1637514 1542867 1416163 1432820 1492222 1600554 1617782 1668915 1516104 1568613
4889 1568613 1556478 1510231 1713834 1616035 1518907 1462990 1389830 1239102 1293943 1411711 1479839
4878A479839O8385L3495L6064L582R3098M5884o0330j47547J842J69146M2965
4867A766423j2024N1599J3084K1234j3239K55399J86094j23293j62754j5437P255
4856A974341N8620R7002O7058K0470R8026M93197N37887K53322K24192K03088
4846D027203N6751K19290J33363J43643R4680k10707l82587j62826j11815J83726
4836C990721K00174K12904L32158K82992L40939N73333J125228J873994L378972
4827A2311415O890080J0652523P343502J70619l874002p349045o668608m725917
4819A4750567l444016k411040j598028j208975q42922n06504l38045l32822j20821
4810C947394k78587k39765r2837j36998j1208o250k0289j22023j57675n3131L3996
$$ plain form
4878 1479839 1548224 1581719 1617783 1621365 1714463 1760347 1700017 1552470 1554312 1723458 1766423
4867 1766423 1754399 1805998 1819082 1840316 1827077 2082476 2268570 2145277 1982523 1967086 1974341
4856 1974341 2032961 2129963 2197021 2217491 2315517 2808714 3346601 3599923 3824115 4027203
4846 4027203 4083954 4303244 4436607 4580250 4674930 4464223 4081636 3918810 3806995 3990721
4836 3990721 4190895 4403799 4735957 5018949 5359888 5933221 7058449 8932443 12311415
4827 12311415 19201495 29854018 37197520 37368139 33494137 26145092 19476484 14750567
4819 14750567 11306551 8895511 7297483 6088508 5245586 4739082 4401037 4068215 3947394
4810 3947394 3668807 3429042 3336205 3199207 3187999 3181749 3161460 3039437 2881762 2828631 2862627
4799B862627j49785p2346j4808K8574K32700J82889J9593P2162k3666K14482K34736
4788C587158j06545q0564k20029k55376k716q1819m6696J16128J68037j4736J38635
4777C201477m3385j45923k5325P394L8933K57307J84191J18186L4903p723J80356
4766C800391o720k0495r6176p3309J19065L3678K58948J55776j34187o1284P3853
4755D049540J43576M02844J92563N2840J60842L13344K86155M34630O23961M82941
4745G143236L72283N02511P70425R62453R84514J152401J254054J706755K375615
4736A7224247L381199N120716Q651954J4695974K0358232K2308869J6959801M12283
4728A09113275j5163460j7605146j4314907j2159760r662834o992831m928385
$$ plain form
4799 2862627 2712842 2640496 2625688 2654262 2886962 3069851 3089444 3161606 3137940 3352422 3587158
4788 3587158 3480613 3400049 3180020 2924644 2921928 2840109 2793413 2909541 3077578 3062842 3201477
4777 3201477 3158092 3012169 2986844 2994238 3033171 3290478 3474669 3592855 3627758 3620035 3800391
4766 3800391 3793671 3773176 3677000 3603691 3722756 3756434 4015382 4171158 4036971 3975687 4049540
4755 4049540 4193116 4595960 4788523 4841363 5002205 5315549 5601704 6036334 6660295 7143236
4745 7143236 7515519 8018030 8788455 9750908 10735422 11887823 13141877 14848632 17224247
4736 17224247 20605446 25726162 34378116 49074090 69432322 91741191 108700992 109113275
4728 109113275 93949815 76344669 62029762 49870002 40207168 33214337 28285952
4721B8285952l653706l081540k579052k083497j591171j195734j061032p38380
4713A2301840p03564n46288m56613l35878j58216j71913l50226p8856m0768k48106
4703I211412l58L36423L18486M97118M40226M63103N95385M75270O28511Q71021
4693A3836597R15112Q40862P02106L59523L10841O7361r9344k88657n94205p84773
4683A5265423r07570o25454o61979n17506l77593l64745k36454J22851J87691
4674A1884664K31707L77295N21849P21386R03284J185130J420778K024721K779070
4665B2049884M041234O117442R238489J2813525J3556454Q589804J149782n521020
4657G2035594r820907j0498708r296933p617502n817517m601424l790851k870515
$$ plain form
4721 28285952 24632246 21550706 18971654 16888157 15296986 14101252 13040220 12301840
4713 12301840 11598276 11051988 10595375 10259497 10101281 9929368 9579142 9500286 9459518 9211412
4703 9211412 9211054 9547477 9865963 10363081 10803307 11266410 11861795 12337065 12965576 13836597
4693 13836597 14751709 15592571 16294677 16654200 16965041 17032402 16933058 16644401 16050196 15265423
4683 15265423 14357853 13732399 13070420 12552914 12175321 11810576 11574122 11696973 11884664
4674 11884664 12116371 12493666 13015515 13736901 14640185 15825315 17246093 19270814 22049884
4665 22049884 26091118 32208560 41447049 54260574 67817028 76406832 77556614 72035594
4657 72035594 62214687 51715979 42419046 34801544 28984027 24382603 20591752 17721237
4649A7721237k389674j755242j218918j089591q29444r29570o63890n29295l01192
4640H014421j58813k31651k69398k85076l95545j196l5320Q572j23996Q349M20987
4629F951334N81879J383346K637014K699360J097008o67528j646586j988800j536262
4620I510765j123111q05109o24146j92372j41378P7360L41826L69837O50889R05613
4610H970174J121669J088236O56672L22703K08851L22745P26009J351363J734968
4601A6503390J962229J309861M06329m63149o57294j75004Q25121J612980J903337
4592B3227800J546721L72208j023449j860675j887026j333556n27864K95921N28493
4583A9338573r6820r01814j646080j879920j527535j049010m76252k08830m96088
$$ plain form
4649 17721237 15331563 13576321 12357403 11267812 10438368 9508798 8844908 8315613 8014421
4640 8014421 7855608 7623957 7354559 7069483 6673938 6672742 6637422 6645994 6521998 6530347 6951334
4629 6951334 7533213 8916559 11553573 14252933 15349941 14682413 13035827 11047027 9510765
4620 9510765 8387654 7582545 6958399 6766027 6624649 6702009 7043835 7413672 8064561 8970174
4610 8970174 10091843 11180079 11836751 12159454 12368305 12691050 13417059 14768422 16503390
4601 16503390 18465619 19775480 20181809 19718660 19061366 18886362 19711483 21324463 23227800
4592 23227800 24774521 25146729 24123280 22262605 20375579 19042023 18514159 18810080 19338573
4583 19338573 19241753 18339939 16693859 14813939 13286404 12237394 11761142 11552312 11056224
4574A1056224p60970j100835j137046j098739r52152q24539o39744n59982m03234
4565C578983k37554k65637j51675k41310o5936K4812j34014j19097l7169k4152
4555B327251K2758j57680n0700n2166j47068n3383P9499r901k23789K6464M9645
4544A810930j3225k58002K2637O1539J2537n3390n0341j02620p7930j53304J25863
4533A324694l8171K3052K0910J16470O1743j46648j91659l6251J32784Q3278j39628
4522A210574P1912N6060O724L3620K7032j75526r1504q4632l4700r6294R9623
4511A022889L9173j70195k00769N5370P7199J21946J63928j61079n6963N7690
4501I49189K7117r6841l5419K5943m9567M2513J73175l859j56343j59356k33323
$$ plain form
4574 11056224 10295254 9194419 8057373 6958634 6006482 5181943 4542199 3982217 3578983
4565 3578983 3341429 3075792 2924117 2682807 2616871 2641683 2507669 2388572 2351403 2327251
4555 2327251 2350009 2192329 2141629 2089463 1942395 1889012 1968511 1958610 1734821 1761285 1810930
4544 1810930 1797705 1539703 1562340 1623879 1636416 1583026 1532685 1430065 1352135 1198831 1324694
4533 1324694 1286523 1309575 1330485 1446955 1508698 1362050 1170391 1134140 1266924 1350202 1210574
4522 1210574 1282486 1338546 1345270 1378890 1405922 1230396 1138892 1054260 1019560 923266 1022889
4511 1022889 1062062 891867 691098 746468 823667 945613 1109541 948462 891499 949189
4501 949189 976306 879465 844046 869989 820422 862935 1036110 1032251 875908 716552 483229
4490D83229j5113J72132O5319K16786j87183j02021Q5339J12671o5416j56601
4480F09142p2180J3493R2153l390J2274l3485r3791n388K0991J3900n6340P3715
4468E71094J38761l3879m0337q1586q7874j57917j4903J24363j18593j23648J10936
4457B86417m1287J785N8837O7866o38j5159j26598N1717J81961o3912l4730o5330
4445C00929p5429J57680R1064j85245p7131j6539J00704J95681P9920n7362l6348
4434D77924q7385o7171k7756J00440M2106m7521j06552P5011J78701K59024K3581
4423H20402P7419q2661M5120j77199j56619L6568O1973L7421o3326r1182N0679
4412E58595J22383k8485q6326m4540l5047N7599M9836l1081o6355J05823m7237
$$ plain form
4490 483229 468116 640248 705567 922353 735170 633149 718488 831159 765743 609142
4480 609142 536962 550455 642608 639218 651492 618007 524216 518828 539819 553719 497379 571094
4468 571094 709855 675976 635639 554053 466179 308262 293359 417722 299129 175481 286417
4457 286417 245130 246915 305752 373618 372980 357821 231223 282940 464901 400989 366259 300929
4445 300929 225500 383180 474244 288999 211868 195329 296033 491714 571634 514272 477924
4434 477924 390539 323368 295612 396052 438158 390637 284085 359096 537797 796821 820402
4423 820402 897821 815160 860280 683081 526462 563030 625003 662424 599098 507916 558595
4412 558595 680978 652493 566167 521627 486580 544179 594015 562934 496579 602402 555165
4401E55165j79475r7089R5976K0504O0207p4444k2887K3702q1941J53527m7815
4390D05430L4205o90N6886O6575O6768q5718k26413J7085K6463J6360L3460J02690
4378E13101k9154l9400j1376m7279J02729M7788M1584o1266m5362k01670J08182
4367C77877J84233R7066l1755L3242J03041r7600L0674P7899j6806j47680k5366
4356E84825J64409J30610J27976j4851j39438j68629k3130P4473Q8998n8169o5532
4345G01542J21700K8914m732N6483J50601n5046m0501j1713j0157q40J3753j25935
4333H24069l9578J5577P870l4235j99662R0362J44643J00345p0899j61675q6603
4322E90214m7173n9772J48154J69512j28983p5949J937j193P3670Q6058q9375
$$ plain form
4401 555165 375690 278601 374577 395081 455288 380844 357957 381659 299718 453245 405430
4390 405430 439635 438945 495831 562406 629174 543456 317043 334128 360591 376951 410411 513101
4378 513101 483947 444547 433171 385892 488621 536409 577993 516727 471365 269695 377877
4367 377877 562110 659176 627421 660663 763704 666104 696778 774677 757871 610191 584825
4356 584825 749234 879844 1007820 992969 853531 684902 661772 736245 825243 767074 701542
4345 701542 823242 852156 847424 903907 1054508 999462 958961 947248 937091 936251 950004 824069
4333 824069 784491 800068 807938 773703 574041 664403 809046 909391 838492 676817 590214
4322 590214 543041 483269 631423 800935 671952 596003 597940 596747 670417 756475 667100
4311F67100n9358j2413J29960J18949J7562q6096k13368L0069J19067J25105q3166
4300G53411j36908j54296j30657N8098J52895K5411n7701k01942o5909J04505
4290C46907K10686o9581n0722M6634L7428J03710k6272J56421L492p499J08508
4279H59712n5714j67634j04647O7608N2283q102l5417o1281j33385O4420O332
4268D84175K1683P0138J5586k42607l9196k6798o0888Q6846R7488q611O8312j1739
4256D54389L4045m511K7763j2587l6392R204j22733j01240J28406J63687m1890
4245D98141L1165k6471K5677Q011o6044p4002O6703J5987m9834M4292M0152k3427
4233D90350K3066M3675L6778j39592J3367J13097K57722L00227K77448J56234
$$ plain form
4311 667100 607742 595329 725289 844238 861800 775704 562336 592405 711472 836577 753411
4300 753411 616503 462207 331550 389648 542543 567954 510253 308311 242402 346907
4290 346907 557593 488012 437290 483924 521352 625062 598790 755211 758703 751204 859712
4279 859712 803998 636364 531717 599325 651608 643506 608089 546808 413423 477843 484175
4268 484175 505858 575996 591582 348975 309779 282981 222093 308939 406427 397816 466128 454389
4256 454389 488434 483923 511686 499099 462707 471911 349178 247938 376344 540031 498141
4245 498141 529306 502835 528512 536523 470479 396477 463180 479167 429333 473625 513777 490350
4233 490350 513416 557091 593869 454277 467644 580741 838463 1138690 1416138 1572372
4223A572372k72264l89400k0794o190j41216j45819j26225j07824m0809q870Q2586
4212C95547R1559j07150r980J54909Q2870l480l3900j93749k15006k1672K20224
4201C60172J54065j05349n7286M4828q6675J1679k7878M2088L2000r8470L3534
4190C02708L7332J19348k1493O679m7057O7462j69439n9706P2896N0914K2497
4179C82141P3084p673J5676q5048q4233O5048P2326J25688j71010j39620j2486
4168B33893J34270J96412m8846j20349L3299k8653K5070K0816o8586n3604N2027
4157C75749R2724j14264k0867n9580J13199M3522R4850p5685q7978J4319L0003
4146D05992O6329N0908j20791l24l6553j9108n014N7336P1991N5007J01640L2213
$$ plain form
4223 1572372 1300108 910708 889914 883724 742508 596689 470464 362640 321831 312961 395547
4212 395547 487106 379956 369976 524885 607755 604275 570375 376626 161620 139948 360172
4201 360172 514237 408888 351602 396430 309755 321434 293556 335644 367644 269174 302708
4190 302708 340040 459388 437895 444574 397517 464979 295540 235834 308730 359644 382141
4179 382141 455225 447552 463228 378180 293947 358995 431321 557009 385999 246379 233893
4168 233893 368163 564575 515729 395380 428679 400026 425096 445912 377326 323722 375749
4157 375749 468473 354209 333342 273762 386961 430483 525333 449648 361670 375989 405992
4146 405992 472321 523229 402438 402114 365561 346453 341439 398775 470766 525773 627413 659626
4134F59626k7574j49396p9835O626q7421q7761J70514J17673j24582j26278J13156
4123C84748Q2992O6654j12651j18463m8972N8547Q3461K41866o6327q5010L377
4112D90222n6548N0716J41572j21426j12611k3396O8428K13133R448j53832n8497
4101D47209N7568J40764j220M9617l7415j27994j6554J6439P1666M1917p2391
4090E69606J7611O6269L3041m9903J7482j75179J4331Q4227K0385O6910j01636
4079E63144R4571J62187j7287m2725Q5234K2173M932J06668m8491J11919J03147
4068A145472K32967R2173K81226O02451R85889J531445J594237Q46432k41869
4059G070423j101241j316565j004296p99357n72887l15173k15269j89146L8556
$$ plain form
4134 659626 632052 482656 402821 409447 322026 234265 404779 522452 397870 271592 384748
4123 384748 467740 534394 421743 303280 254308 312855 396316 638182 571855 486845 490222
4112 490222 433674 484390 625962 504536 391925 368529 436957 650090 659538 505706 447209
4101 447209 504777 645541 644321 693938 656523 528529 511975 528414 600080 641997 569606
4090 569606 587217 653486 686527 636624 654106 478927 493258 577485 597870 664780 563144
4079 563144 657715 819902 802615 759890 845124 867297 872229 978897 930406 1042325 1145472
4068 1145472 1378439 1470612 1751838 2354289 3340178 4871623 6465860 7312292 7070423
4059 7070423 5969182 4652617 3648321 2848964 2276077 1960904 1745635 1556489 1595045
4050A595045n190q1055j20313k35705n6072l401j21496k7891P7622L6992P008
4039A065544J39498m7850p0977k03495k0319k9965O944M2289r633n1016k9809
4028G91211j17945R2383K0647j53887q1511j46408N6542J37000N5244k5201l5345
4017E92730n8761J3643K7332L9525j31750L4943M2370n9461R2771P4406J54953
4006H22701j25282j80813j03574J64691O7913M0614j13653k0436J44070J6332
3996G12563P6462n6760p5366P0184O2288j0011J0886L0098m0576r149J26712K9424
3984I26755K676j42835p8384j28024K7308K20992o8282L4127M1553L8931K3442
3973H98259k338j26159J79309Q0934k29104n8325n1835J1961N0426J1455J26022
$$ plain form
4050 1595045 1589855 1508800 1388487 1152782 1096710 1093309 971813 943922 1021544 1058536 1065544
4039 1065544 1205042 1157192 1086215 882720 862401 832436 839380 881669 872036 821020 791211
4028 791211 673266 765649 786296 632409 550898 404490 461032 598032 653276 628075 592730
4017 592730 533969 547612 574944 614469 482719 517662 560032 500571 593342 667748 822701
4006 822701 697419 516606 413032 577723 645636 686250 572597 552161 696231 712563
3996 712563 789025 732265 656899 727083 789371 779360 790246 820344 779768 770619 897331 926755
3984 926755 929431 786596 708212 580188 607496 828488 760206 794333 835886 874817 898259
3973 898259 895921 769762 949071 1030005 800901 742576 690741 702702 753128 764583 890605
3962H90605L2843l4115J08276J37806K52201O1804J7790Q1970L9534K25235M76277
3951B290226J139920J684425J244143J13454n70703j011572j160644p17893o52150
3942B359206m13223k84532o5182j25324k11850L3130m7271J09651n2586j33655
3932A168364n3445J689R1387J28758Q2318l9828J1499o7262J75985K55781K38086
3921A993332M86030Q50445J485145J263362L88653k71516r69249j076595j012246
3912C137361o77466l81154k17618k02347j83057q0318j3686j60216K6685R1728
3902A339912j7891p6500r3322r6486L9233R1379O0050R1005J21354j16302l6327
3891A306105P389j100m707k2378J09151m2289q8487J50009R2500m1856k46715
$$ plain form
3962 890605 923448 889333 997609 1135415 1387616 1449420 1467210 1549180 1588714 1813949 2290226
3951 2290226 3430146 5114571 6358714 6472168 5901465 4889893 3729249 3011356 2359206
3942 2359206 1945983 1661451 1596269 1470945 1259095 1292225 1244954 1354605 1302019 1168364
3932 1168364 1114919 1116608 1207995 1336753 1419071 1379243 1390742 1323480 1499465 1755246 1993332
3921 1993332 2479362 3329807 4814952 6078314 6466967 6195451 5226202 4149607 3137361
3912 3137361 2459895 2078741 1861123 1658776 1475719 1395401 1381715 1221499 1248184 1339912
3902 1339912 1322021 1245521 1152199 1055713 1094946 1186325 1246375 1337380 1458734 1342432 1306105
3891 1306105 1313494 1312394 1307687 1285309 1394460 1352171 1263684 1413693 1506193 1464337 1217622
3880A217622k99836K27115P8920Q3822n0629r8374j75323J459J29372O4456p7593
3869A101011K2538r1879j09939J40150J07473J69766L7288j73491q6500P668M7830
3858A171915O4613Q5885L1713q5263k1472k7384l0735L5910Q7387q9250J9431
3847A242750M3341k672L344j6171j8216J3708J40718l5938L2159r7148J2531O0348
3835A378754n1313M6755M2346r9664l276q834m440j1154n776l624P682m3765Q1431
3822A325122J4070j015R2354p4093j04586o8784P236o5457L3922P6709O4964M0036
3810A340478m3894j26622k3197Q276M4732j8729Q8181m7216n2188N3740q9481
3799A134080o4738J84451K9172n9480j0613k3567O9408J01264K5940l4223j09876
$$ plain form
3880 1217622 917786 1144901 1223821 1307643 1257014 1158640 983317 984776 1114148 1178604 1101011
3869 1101011 1123549 1031670 921731 1061881 1169354 1339120 1376408 1202917 1116417 1124085 1171915
3858 1171915 1236528 1322413 1354126 1268863 1247391 1220007 1189272 1225182 1312569 1223319 1242750
3847 1242750 1286091 1283419 1286763 1270592 1252376 1266084 1406802 1370864 1403023 1305875 1318406 1378754
3835 1378754 1327441 1374196 1416542 1316878 1313602 1304768 1300328 1289174 1283398 1279774 1287456 1243691 1325122
3822 1325122 1339192 1338177 1430531 1356438 1251852 1183068 1190304 1124847 1158769 1235478 1300442 1340478
3810 1340478 1296584 1169962 1146765 1155041 1199773 1181044 1269225 1222009 1169821 1223561 1134080
3799 1134080 1069342 1253793 1282965 1223485 1212872 1189305 1258713 1359977 1385917 1351694 1241818
3788A241818j37554J6218J90454O2605P5286j33685j82039M659O2962O5178j1405
3777A254497m4402o5589Q2542J1444L7298J58256o0989k8174R7881k1197j5691
3766A405876j7370j81887k1748n087p761k8504p222J51407O065J35195K2764l5970
3754A415758o7182q5536J6085P889r9926L9377L7075J08548K12682J9280j59825
3743A444225j10466M2040K59922O654k05355j10803j25622K27871J52592N9654
3733A640712R3408j26717k18774j9276J45146P4601K8730j35083j75682P5930
3723A382995R0789k0123Q6047n9321j8404p4069K6775R4467r8472J1850Q4436
3712A506970M8780j12905J34158L981q8246J7260O6549o255r5132j29344L9157
$$ plain form
3788 1241818 1104264 1120482 1310936 1373541 1448827 1315142 1133103 1137762 1200724 1265902 1254497
3777 1254497 1210095 1144506 1227048 1238492 1275790 1434046 1373057 1344883 1442764 1421567 1405876
3766 1405876 1388506 1206619 1184871 1179784 1172023 1143519 1136297 1287704 1293769 1428964 1451728 1415758
3754 1415758 1348576 1263040 1279125 1287014 1187088 1226465 1263540 1372088 1584770 1604050 1444225
3743 1444225 1333759 1375799 1635721 1642375 1437020 1326217 1200595 1428466 1581058 1640712
3733 1640712 1734120 1607403 1388629 1369353 1514499 1589100 1617830 1482747 1307065 1382995
3723 1382995 1473784 1453661 1539708 1480387 1461983 1387914 1414689 1509156 1410684 1422534 1506970
3712 1506970 1555750 1442845 1577003 1580984 1492738 1509998 1576547 1570292 1475160 1345816 1384973
3701A384973J42673K17155J06589k26587k55113j8682N0661J74908R990j59175
3691A427392n051m1124o835J40815R8074N6797O3311n8655K9396M88q0195m5034
3679A579379Q6806K1189j33797j6314j0648N0569M2332j30944N5035J14112r4080
3668A563639N9995l6175k0424J22875n6661k5757J2598J53711k54196K1466J70738
3657A711809o0016q2255J1744l2029p9081R6044O6063J6243K06744k20870j53171
3646A481225J93887m5480P4421r3256P3994J43360J2087l1682j22511N7162j3323
3635A729884L4225M3245J05375M1851j04498L3319J0769N6248L6892j14751p1092
3624A801467M343n364J91372J99597j37262j27345n4682j72494l4167R0680Q1759
$$ plain form
3701 1384973 1527646 1744801 1851390 1624803 1369690 1351008 1401669 1576577 1586567 1427392
3691 1427392 1422341 1381217 1374382 1515197 1613271 1670068 1733379 1674724 1704120 1704608 1624413 1579379
3679 1579379 1666185 1687374 1553577 1537263 1526615 1577184 1619516 1488572 1543607 1657719 1563639
3668 1563639 1623634 1587459 1567035 1689910 1633249 1607492 1620090 1773801 1519605 1541071 1711809
3657 1711809 1651793 1569538 1581282 1549253 1470172 1566216 1632279 1648522 1855266 1634396 1481225
3646 1481225 1675112 1629632 1704053 1610797 1684791 1828151 1840238 1808556 1686045 1743207 1729884
3635 1729884 1764109 1807354 1912729 1954580 1850082 1883401 1894170 1950418 1987310 1872559 1801467
3624 1801467 1805810 1800446 1991818 2191415 2054153 1926808 1872126 1699632 1665465 1756145 1837904
3613A837904J75968P4124L1388p641M2572J46975K56600J9694M55454N42486K10424
3602C785948j39607k98665k17193k64045j35477j28206k41384L585M0431j17850
3592B287537M9652J371J76425n0789q0791Q7403J34202K26933j868l6300o3955
3581B729820j05999J42434J31239J48054J41085j2632O3814N11922Q98244J029144
3571E677125M46401n7923l40903n46593n31088m06624l88348k24302j30490p6872
3561C420383r4022Q5209Q5640K6179P8559r9063O7126j717j28959J03880p2920
3550C470295Q1043Q6511P9691J8109J62556P3695j50334l4381L57127M91274O12354
3539E247940L94465p2404j73638k08590j64441K6339L2695P713j36411j61073
$$ plain form
3613 1837904 2013872 2087996 2119384 2111743 2154315 2301290 2557890 2577584 3033038 3575524 3785948
3602 3785948 3646341 3347676 3130483 2866438 2730961 2602755 2361371 2364956 2405387 2287537
3592 2287537 2337189 2338560 2514985 2464196 2383405 2470808 2605010 2831943 2830075 2793775 2729820
3581 2729820 2623821 2766255 2897494 3045548 3186633 3174001 3237815 3749737 4647981 5677125
3571 5677125 6123526 6065603 5724700 5178107 4647019 4240395 3852047 3627745 3497255 3420383
3561 3420383 3326361 3411570 3497210 3523389 3601948 3502885 3570011 3568294 3439335 3543215 3470295
3550 3470295 3551338 3637849 3717540 3735649 3898205 3971900 3821566 3787185 4144312 4635586 5247940
3539 5247940 5642405 5570001 5396363 5187773 5023332 5049671 5082366 5090079 4953668 4792595
3529D792595K1061J73627K05172O5911N1010K20283K22993L65079N48794Q12089
3519G478614Q86509P79598M93322J30927l31887k54522n20411p16618l35235m37727
3509G172570k99513j58090p302n8960R1302j9377N146l7387J70357J91584N3021
3498G103351O7800K47945K82400P1387K7748L39472L29156L01670L71421Q15417
3488I957767R84677J351326J931924J926907J337975K38012m70524j007065j174410
3479A5076589q24710p45009n37217l53038J07799J16020M9435J38886K94022M00340
3469A3723117M97590M95695O01622N12541O92146P29105Q89053R73461P55810
3460A9870140Q09320Q02890Q33315P51480N72052J61623M8395o9850k88595p58288
$$ plain form
3529 4792595 4813656 4987283 5192455 5258366 5309376 5529659 5752652 6117731 6666525 7478614
3519 7478614 8365123 9144721 9638043 9768970 9437083 9182561 8662150 7945532 7610297 7172570
3509 7172570 6873057 6714967 6707665 6648705 6740007 6720630 6725776 6688389 6858746 7050330 7103351
3498 7103351 7171151 7419096 7701496 7772883 7800631 8140103 8469259 8770929 9142350 9957767
3488 9957767 10942444 12293770 14225694 16152601 17490576 17728588 17258064 16250999 15076589
3479 15076589 14251879 13506870 12969653 12616615 12724414 12840434 12889869 13028755 13322777 13723117
3469 13723117 14220707 14716402 15318024 15830565 16522711 17251816 18140869 19114330 19870140
3460 19870140 20679460 21482350 22315665 23067145 23639197 23800820 23849215 23779365 23490770 22732482
3450B2732482j315582j522198j757501j633313j528090j318343j158203j028464
3442A1470788o93864q10773m20885m38321l89138l81689l16092k82457k53826
3433G483743j17219k32104l59169j02464J9523j17165m4104p9618k29928j70132
3423F051363j33269j05150M1199p5678k13169J87344J54087p1775O3370j69691
3413E728631j95796j16421n9901r2304k72366j67845L69n7958R7492j17693k78118
3402D468090q9296r6962J1793o1081j55928j61620q1814J30370R3067N2807j85100
3391C924326k18600L689J72546K59148q2581J31700J51825J91306N7672K5075
3381D616106J06436k82878l15302m5002k3183k42422j35237j76033m0683l9704
$$ plain form
3450 22732482 21416900 19894702 18137201 16503888 14975798 13657455 12499252 11470788
3442 11470788 10776924 9966151 9545266 9106945 8717807 8336118 8020026 7737569 7483743
3433 7483743 7366524 7134420 6775251 6672787 6692310 6575145 6531041 6451423 6221495 6051363
3423 6051363 5918094 5812944 5854143 5778465 5565296 5752640 5906727 5834952 5898322 5728631
3413 5728631 5532835 5416414 5356513 5264209 4991843 4823998 4824367 4766409 4863901 4746208 4468090
3402 4468090 4378794 4281832 4293625 4232544 4076616 3914996 3833182 3963552 4056619 4109426 3924326
3391 3924326 3705726 3709415 3881961 4141109 4058528 4190228 4342053 4533359 4591031 4616106
3381 4616106 4722542 4439664 4124362 4079360 4056177 3813755 3678518 3502485 3461802 3422098
3371C422098M4677K1585o9367q6144J43777N2441m9421j04672n361J6428q9236
3360C296805j32516k5186j41631p4006l3776J4683K70471P6783J19341J21300
3350C492268K04254J73609j8413p4333k33283m33159l4946j81021Q2899j59530
3340B818345q0366o2819j30631J78619N3122l5108O5443J54852R7445j8928j42812
3329B897162j62984j60700m9659j6864M4151L091j50216j14693Q8463K72696K39567
3318B890014K57250O9289j58476k24277r4810j61199J22210n1799k66542j24705
3308B256955n3279k6785P5481J38083k8546j51864j34303J17768J54570J36815
3298B484895k04718R2009N8666j58071O230k1778M3154L3022j25492j84547M8107
$$ plain form
3371 3422098 3466775 3488360 3418993 3332849 3476626 3529067 3479646 3374974 3369613 3386041 3296805
3360 3296805 3164289 3139103 2997472 2923466 2889690 2904373 3174844 3251627 3370968 3492268
3350 3492268 3696522 3870131 3851718 3777385 3544102 3110943 3075997 2894976 2977875 2818345
3340 2818345 2737979 2675160 2544529 2723148 2776270 2741162 2806605 2961457 3058902 3039974 2897162
3329 2897162 2734178 2573478 2523819 2506955 2551106 2554197 2403981 2289288 2377751 2650447 2890014
3318 2890014 3147264 3216553 3058077 2833800 2738990 2577791 2700001 2648202 2381660 2256955
3308 2256955 2203676 2176891 2252372 2390455 2361909 2210045 2075742 2193510 2348080 2484895
3298 2484895 2280177 2372186 2430852 2272781 2279011 2257233 2300387 2333409 2207917 2023370 2071477
3287B071477P5110J21775R4321J0448j87470j65515J10564q0157q5052k4244j27067
3276A814190Q4314l5767J14533Q7520M315q0511j11166r6103j03625J68120J84538
3265B030358Q1186j43369M0800r5979P3611q159N2006K1956j35507o8922J6347
3254A864328k3169N3038L7847K4055l0295l0775j06112l1229J5442p0904l2081
3243A670145J10770n5874n1023M9695M2556m4379Q8887j31060j76948l080J11284
3232A610973K26707J85474n277p1926k12248j86663J09220P3242J74074n8501
3222A845075j23366L5394J11261J27469O9739n4357l0366J6909j0595L5049R1752
3211B113964O8713P8913j00914j70241N4195O8115J62186k1547J12623J40235
$$ plain form
3287 2071477 2146587 2268362 2362683 2373131 2185661 2020146 2130710 2050553 1965501 1941257 1814190
3276 1814190 1898504 1862737 1977270 2064790 2069105 1988594 1877428 1781325 1677700 1845820 2030358
3265 2030358 2111544 1968175 2008975 1912996 1986607 1978448 2030454 2052410 1916903 1847981 1864328
3254 1864328 1841159 1894197 1932044 1956099 1925804 1895029 1788917 1757688 1773130 1702226 1670145
3243 1670145 1780915 1725041 1674018 1723713 1766269 1721890 1810777 1679717 1502769 1499689 1610973
3232 1610973 1837680 2023154 2017877 1945951 1733703 1547040 1656260 1729502 1903576 1845075
3222 1845075 1721709 1757103 1868364 1995833 2065572 2011215 1980849 1997758 1987163 2022212 2113964
3211 2113964 2182677 2261590 2160676 1990435 2044630 2112745 2274931 2253384 2366007 2506242
3201B506242j24586j03329Q8669K60611m3061j26705p4991M5324n6106J3373P2054
3190B457495P84P5648J60691n7407m3680J39373J45066k0335n7091K9451K1222
3179B851217J46124O5138Q8196K44994K0754l7357o4301N0170O1174O7969o0986
3168C433092R2970K1237J17743M9482J09312K10995N1033l2790k4660L44643K37021
3157D610078J6776r6770L3257J63956Q7929J45516L2780j42432o2320J74715M7442
3146E010927P0479M5632P009N3868l4220R5585J68422J58649O0612l2194K13255
3135E818024L79953L76373L50457L14240M55317M75135L05413J15791k77303l98197
3125G915203l22418l12174j28968j66100l65864n92400l03631o6309k6527j01765
$$ plain form
3201 2506242 2381656 2278327 2366996 2627607 2584546 2457841 2382850 2428174 2372068 2385441 2457495
3190 2457495 2458279 2533927 2694618 2637211 2593531 2732904 2877970 2857635 2800544 2829995 2851217
3179 2851217 2997341 3062479 3150675 3395669 3416423 3379066 3314765 3364935 3426109 3494078 3433092
3168 3433092 3526062 3547299 3665042 3714524 3823836 4034831 4085864 4053074 4028414 4373057 4610078
3157 4610078 4626854 4530084 4563341 4727297 4815226 4960742 4993522 4851090 4788770 4963485 5010927
3146 5010927 5081406 5127038 5134047 5187915 5153695 5249280 5417702 5576351 5636963 5604769 5818024
3135 5818024 6197977 6574350 6924807 7239047 7694364 8169499 8474912 8590703 8313400 7915203
3125 7915203 7592785 7280611 7151643 6985543 6619679 6027279 5723648 5657339 5630812 5529047
3115E529047o4617p8275Q2390L7684J21603K15912N7208J5093J33244K56329M15774
3104F721392L00614J61873J36367J23874L05787K39002Q9146j02878j21101q7837
3094G766239k08130m51390m51255m53685k29025k11933l08004j53747j26521k02269
3084D970280j79078Q946J07379N4000j33508j68159m0605J5182J97461M1694n0048
3073D823544o1514l6454q2010j62685l5475j00877q1897k04049j40288r7270p82
3062C820243r6150Q0j91876j80269k80193j39222l6146j42034q1637q5115R5883
3051B683564j8486k14992j29943L4154j80605l4312K7631r1064N7584L1632N1474
3040B216637L0230j13384j14551j09998L9595j25714N4963r8769r1555K6335k9001
$$ plain form
3115 5529047 5464430 5386155 5468545 5506229 5627832 5843744 5900952 5916045 6049289 6305618 6721392
3104 6721392 7022006 7183879 7320246 7444120 7749907 7988909 8078055 7975177 7854076 7766239
3094 7766239 7558109 7106719 6655464 6201779 5972754 5760821 5452817 5299070 5172549 4970280
3084 4970280 4791202 4800148 4907527 4961527 4828019 4659860 4619255 4634437 4831898 4873592 4823544
3073 4823544 4762030 4725576 4643566 4480881 4445406 4344529 4262632 4058583 3918295 3821025 3820243
3062 3820243 3724093 3724173 3532297 3352028 3071835 2932613 2896467 2754433 2672796 2587681 2683564
3051 2683564 2665078 2450086 2320143 2354297 2173692 2139380 2167011 2075947 2133531 2165163 2216637
3040 2216637 2246867 2133483 2018932 1908934 1948529 1822815 1877778 1779009 1687454 1713789 1684788
3029A684788j0826j24893r6615j02921r204O7107j39674J37611J07503k20038
3019A292838r5406q7448O684j4355R6702j8348m283j54957l8696J19000J11460
3008A213191N9697J7243P252k20767j02112J361K1014J40780q1600r6313q121
2997I51625N8266L8438m2784k3032o7401j39676j02208J7584R0172J49225J9331
2986I49540K61r6123J7951k1348N7012R1004o4847p8219j40228k05976J23926
2975F32953J00902J58494J7445q8395j05479r1847J4671K2563K7253p6288k05269
2964D07003q4238J44163J17882k7127n4236r6019j18664J25423J32566R6210J47611
2953G90574j67094j38223K0771J4909J1465N3821j39404j2396J36981M6866N0623
$$ plain form
3029 1684788 1673962 1549069 1452454 1349533 1340329 1407436 1267762 1405373 1512876 1292838
3019 1292838 1197432 1109984 1116668 1102313 1199015 1180667 1176384 1021427 982731 1101731 1213191
3008 1213191 1272888 1290131 1297383 1076616 974504 975865 996879 1137659 1056059 959746 951625
2997 951625 1009891 1048329 1005545 982513 915112 775436 673228 690812 780984 930209 949540
2986 949540 949801 853678 871629 850281 907293 998297 933450 855231 715003 509027 632953
2975 632953 733855 892349 909794 821399 715920 624073 638744 661307 688560 612272 407003
2964 407003 322765 466928 584810 557683 503447 407428 288764 414187 546753 642963 790574
2953 790574 623480 485257 506028 520937 532402 586223 446819 434423 571404 618270 668893
2942F68893j96744j17735j8813J53129k0473j77742r4559n9582J37248J89689
2932D63311j60580j24995R576J00851q2939K65601P1199k23765k09472N8854J59752
2921C27393N1321j64172r545J2483q526J25882N1161K0946r4042r1661m1742R7205
2909B76703J1880j25623o467M6891R4053K3668j355p5304m2421l0711M0831O3632
2897B75777r7618q0833p2606M7553J90421J82648M8497j02727j84109L5692N5397
2886B98092O3413j12258q5067K2656Q5733r4314P8897j8692k07110j6150P0718
2875H5918J03468J22250N9673j69123r6018n008J13353J32134j24511j15632l2564
2864G3940P1482j7744k6030j08836Q0948R1852O2831j39856K3583q5990j08156
$$ plain form
2942 668893 472149 354414 335601 488730 468257 290515 195956 136374 273622 463311
2932 463311 302731 177736 187312 288163 205224 470825 542024 318259 108787 167641 327393
2921 327393 378714 214542 204997 217480 208954 334836 385997 406943 312901 221240 179498 276703
2909 276703 288583 162960 156493 203384 297437 321105 319750 244446 202025 171314 212145 275777
2897 275777 178159 97326 24720 72273 262694 445342 493839 391112 207003 242695 298092
2886 298092 361505 249247 164180 186836 272569 178255 257152 238460 31350 15200 85918
2875 85918 189386 311636 371309 202186 106168 101160 214513 346647 222136 106504 73940
2864 73940 145422 127678 101648 -7188 73760 165612 228443 88587 112170 26180 -81976
2853h1976j2244k3929Q9341N4722L364J098M5528J1876J283q0986n376Q8274l1086
2840E9889k4014p4266N8519K00455j9300l9663j84000k4528K39831K46926p8719
2829C61130j53715j20268J769K8295L7507m2814J12333J3259r9805r7272M9396
2818H9815O1884k1698n052K9610k9819k8862M4894M7774K5896q9727J35207n4155
2806B05767k2206M9157k07640J86J15845O9215j5415k6525k9269L4896L581K3549
2794B01141O532k4404k9213K7794k9704j28140K7802N146n482P0379O1485k02719
2782a9383r550M7347O8074R7078L7944k3564q1539j61166O8551J53055J41826
2771C18673j00681j56537j11705j38340J34217K13574R1519k45534k09314R1113
$$ plain form
2853 -81976 -94220 -118149 -28808 25914 29278 30376 75904 87780 89063 8077 2701 90975 59889
2840 59889 35875 -38391 20128 220583 201283 161620 -22380 -46908 192923 439849 361130
2829 361130 207415 87147 88916 117211 154718 111904 224237 237496 137691 40419 89815
2818 89815 151699 130001 124949 154559 124740 95878 140772 188546 214442 124715 259922 205767
2806 205767 183561 232718 25078 25264 141109 210324 194909 168384 139115 174011 177592 201141
2794 201141 207673 183269 154056 181850 152146 24006 51808 56954 51472 121851 183336 -19383
2782 -19383 -28933 18414 86488 183566 221510 197946 116407 -44759 23792 176847 318673
2771 318673 217992 61455 -50250 -188590 -54373 159201 250720 5186 -204128 -113015
2761a13015J28222K50078K3676j9234p5862j46600j20467M8076P1769k7850n9897
2750d1104r1360q5379J01811M7718J5966R3039j62125L5137K34720P5186j02030
2739A21579j47774j23523J07400K887m2680M5542J21129r6909n1080J1106K6724
2728b5599J0028Q9880r4513k6632R2149J23543j42192n7441j0419O9588n8252
2717b9860j34333j43475L616K67453J29258j9517o5251p1878j4172j9796Q4893
2706a3062n0950L0915r7744n4183J63028K0854P5465j4920p3814j02880P6804
2695d0487q1858l99n5740P3839L8405R9231r516N4088J87318j26846j5255j30533
2683g753P5814j9674l0962J38965O7827L4358j40758n6976Q2080J41507J3037
$$ plain form
2761 -113015 15207 265285 288961 269727 193865 47265 -73202 -25126 46643 18793 -41104
2750 -41104 -132464 -217843 -116032 -68314 -52348 40691 -121434 -86297 148423 223609 121579
2739 121579 -26195 -149718 -42318 -39431 -82111 -36569 84560 -12349 -63429 -52323 -25599
2728 -25599 -15571 74309 -20204 -46836 45313 168856 26664 -30777 -41196 28392 -29860
2717 -29860 -164193 -307668 -304052 -36599 92659 73142 7891 -63987 -78159 -97955 -13062
2706 -13062 -64012 -33097 -130841 -185024 -21996 -1142 74323 59403 -14411 -117291 -40487
2695 -40487 -122345 -122744 -178484 -104645 -66240 32991 23475 77563 264881 138035 122780 -7753
2683 -7753 68061 48387 17425 156390 224217 258575 117817 60841 142921 284428 297465
2672B97465j26537r6864P1902L9052j4240K7751N2229j33340n6141L4369K33142
2661C28788j06160j02825k2945k407K9823p0947n5823k4713J62404m4725J7678
2650A08148j2191l6206p6306j33485q0655J43974J22329k6141q6345J517j7118
2639i2479N9746k2259j05813P5314P4722O5767n5710l6090j44569N3635p236m3579
2627a78551M0179j2334P36R7642L3341r9777m5864l1603O7055K69417J8684p5956
2615H2969j2509r2563K8915N0101N2990p4552j41939L3257M2796L3350J50380
2604A53195p8133o1407l5759L4865K29130J85209L00125K28182P4758n795K5858
2593A050228m1487q6391j57797k82693l36162p0530o4218K9312j1256n4819k1836
$$ plain form
2672 297465 170928 74064 145966 185018 170778 198529 250758 117418 61277 95646 328788
2661 328788 222628 119803 96858 94451 124274 53327 -2496 -27209 135195 90470 108148
2650 108148 95957 59751 -16555 -150040 -230695 -86721 35608 9467 -76878 -75361 -92479
2639 -92479 -32733 -54992 -160805 -85491 -10769 54998 -712 -36802 -181371 -127736 -134972 -178551
2627 -178551 -138372 -150706 -149970 -52328 -18987 -118764 -164628 -196231 -129176 140241 158925 82969
2615 82969 70460 -22103 6812 56913 109903 35351 -106588 -73331 -30535 2815 153195
2604 153195 75062 13655 -22104 12761 241891 427100 727225 955407 1030165 1024370 1050228
2593 1050228 1008741 922350 764553 481860 145698 75168 10950 40262 29006 -25813 -47649
2582d7649J6145J01984P8867K8873j81610n9851L0596P2422N1961K55P7858j032
2570A68819j0660n0453J7609j00147m7481J51701M0233J00905n9690R2574l4260
$$ plain form
2582 -47649 -31504 70480 149347 178220 -3390 -63241 -32645 39777 91738 91993 169851 168819
2570 168819 158159 107706 125315 25168 -22313 129388 169621 270526 210836 303410 269150
$$ [...]
##END NTUPLES=NMR SPECTRUM
##END=
