##TITLE=1H_EC-3373(II)
 200.13MHz,DMSO.
 8 sc
 
 19.2.2026
##JCAMPDX= 6.0         $$ Bruker NMR JCAMP-DX V2.0
##DATA TYPE= NMR SPECTRUM
##DATA CLASS= NTUPLES
##ORIGIN= UXNMR, Bruker Analytische Messtechnik GmbH
##OWNER= pz
$$ XWIN-NMR		Version 3.5
$$ Thu Feb 19 13:29:26 2026 Russian Standard Time (UT+4h)  she@DPX200
##.OBSERVE FREQUENCY= 200.1313
##.OBSERVE NUCLEUS= ^1H
##.ACQUISITION MODE= SIMULTANEOUS
##.ACQUISITION SCHEME= undefined
##.AVERAGES= 8
##.DIGITISER RES= 18
##SPECTROMETER/DATA SYSTEM= spect
##.PULSE SEQUENCE= zg30
##.SOLVENT NAME= DMSO
##.SHIFT REFERENCE= (INTERNAL, DMSO, 0, 15.4858)
##AUDIT TRAIL= $$ (NUMBER, WHEN, WHO, WHERE, WHAT)
$$ ##TITLE= Audit trail, XWIN-NMR		Version 3.5
$$ ##JCAMPDX= 5.01
$$ ##ORIGIN= Bruker BioSpin GmbH
$$ ##OWNER= she
$$ F:/spectra/data/she/nmr/H-C/1/pdata/1/auditp.txt
$$ ##AUDIT TRAIL=  $$ (NUMBER, WHEN, WHO, WHERE, WHAT)
(   1,<2026-02-19 13:27:53.76 +0400>,<she>,<DPX200>,
      <created by zg, POWCHK disabled, PULCHK disabled
       configuration hash MD5:
       00 E9 B6 7A A2 85 ED C7 34 08 36 98 17 FE 4E 26
       data hash MD5: 16K
       E4 04 81 4F E2 91 7B 2D 26 B7 48 2F 55 6E 5A 03>)
(   2,<2026-02-19 13:27:56.40 +0400>,<she>,<DPX200>,
      <Start of raw data processing
       efp BC_mod = 2 LB = 0.25 FT_mod = 6 PKNL = 1 PHC0 = -3700.938 PHC1 = 12.39232 SI = 16K 
       data hash MD5: 16K
       C1 FE C2 12 7E A6 3A B7 C7 02 AC CF 88 D2 96 23>)
(   3,<2026-02-19 13:28:18.07 +0400>,<she>,<DPX200>,
      <pk PHC0 = -8.164887 PHC1 = 12.4 
       data hash MD5: 16K
       BD 72 AE A4 DF 1D 8A 27 4E 87 98 59 80 75 CB 01>)
(   4,<2026-02-19 13:28:21.93 +0400>,<she>,<DPX200>,
      <abs ABSG = 5 
       data hash MD5: 16K
       CF 79 13 9F 8A 1C F3 37 60 2C FB 5B 27 08 60 FF>)
$$ ##END=
$$ 
$$ hash MD5
$$ CC 7A 8C 14 80 D7 2B 84 81 CF F7 85 FF 4C 93 5A
##$RELAX= 
##$RELAX= 
##$RELAX= 
##$RELAX= 
##$RELAX= 
##$RELAX= 
$$ Bruker specific parameters
$$ --------------------------
##$DU= <F:/spectra>
##$EXPNO= 1
##$NAME= <H-C>
##$PROCNO= 1
##$TYPE= <nmr>
##$USER= <she>
##$AMP= (0..31)
100 100 100 100 100 100 100 100 100 100 100 100 100 100 100 100 100 100 
100 100 100 100 100 100 100 100 100 100 100 100 100 100 
##$AQSEQ= 0
##$AQ_mod= 1
##$AUNM= <au_zg>
##$AUTOPOS= <>
##$BF1= 200.13
##$BF2= 200.13
##$BF3= 200.13
##$BF4= 200.13
##$BF5= 200.13
##$BF6= 200.13
##$BF7= 200.13
##$BF8= 200.13
##$BYTORDA= 1
##$CFDGTYP= 0
##$CFRGTYP= 5
##$CHEMSTR= <none>
##$CNST= (0..31)
1 1 145 1 1 1 1 1 1 1 1 1 1 1 1 1 1 1 1 1 1 1 1 1 1 1 1 1 1 1 1 1 
##$CPDPRG= <>
##$CPDPRG1= <>
##$CPDPRG2= <>
##$CPDPRG3= <>
##$CPDPRG4= <mlev>
##$CPDPRG5= <mlev>
##$CPDPRG6= <mlev>
##$CPDPRG7= <mlev>
##$CPDPRG8= <mlev>
##$CPDPRGB= <>
##$CPDPRGT= <>
##$D= (0..31)
0 0.7 0 0 0 0 0 0 0 0 0 0.03 0 0 0 0 0 0 0 0 0 0 0 0 0 0 0 0 0 0 0 0 
##$DATE= 1771493273
##$DBL= (0..7)
120 120 120 120 120 120 120 120 
##$DBP= (0..7)
150 150 150 150 150 150 150 150 
##$DBP07= 0
##$DBPNAM0= <>
##$DBPNAM1= <>
##$DBPNAM2= <>
##$DBPNAM3= <>
##$DBPNAM4= <>
$$ [...]
##$SUBNAM3= <"">
##$SUBNAM4= <"">
##$SUBNAM5= <"">
##$SUBNAM6= <"">
##$SUBNAM7= <"">
##$SUBNAM8= <"">
##$SUBNAM9= <"">
##$SW= 18.0517328524113
##$SWIBOX= (0..15)
0 0 2 0 0 0 0 0 0 0 0 0 0 0 0 0 
##$SW_h= 3612.71676300578
##$TD= 16384
##$TD0= 1
##$TE= 0
##$TE2= 300
##$TE3= 300
##$TEG= 300
##$TL= (0..7)
0 120 120 120 120 120 120 120 
##$TP= (0..7)
150 150 150 150 150 150 150 150 
##$TP07= 0
##$TPNAME0= <>
##$TPNAME1= <>
##$TPNAME2= <>
##$TPNAME3= <>
##$TPNAME4= <>
##$TPNAME5= <>
##$TPNAME6= <>
##$TPNAME7= <>
##$TPOAL= (0..7)
0.5 0.5 0.5 0.5 0.5 0.5 0.5 0.5 
##$TPOFFS= (0..7)
0 0 0 0 0 0 0 0 
##$TUNHIN= 0
##$TUNHOUT= 0
##$TUNXOUT= 0
##$USERA1= <user>
##$USERA2= <user>
##$USERA3= <user>
##$USERA4= <user>
##$USERA5= <user>
##$V9= 5
##$VALIST= <valist>
##$VCLIST= <CCCCCCCCCCCCCCC>
##$VD= 0
##$VDLIST= <DDDDDDDDDDDDDDD>
##$VPLIST= <PPPPPPPPPPPPPPP>
##$VTLIST= <TTTTTTTTTTTTTTT>
##$WBST= 1024
##$WBSW= 4
##$XGAIN= (0..3)
0 0 0 0 
##$XL= 0
##$YL= 0
##$YMAX_a= 233067
##$YMIN_a= -285298
##$ZGOPTNS= <>
##$ZL1= 120
##$ZL2= 120
##$ZL3= 120
##$ZL4= 120
##$ABSF1= 15.40202
##$ABSF2= -2.649827
##$ABSG= 5
##$ABSL= 3
##$ALPHA= 0
##$AQORDER= 0
##$ASSFAC= 0
##$ASSFACI= 0
##$ASSFACX= 0
##$ASSWID= 0
##$AUNMP= <proc_1d>
##$AZFE= 0.1
##$AZFW= 0.1
##$BCFW= 0
##$BC_mod= 2
##$BYTORDP= 0
##$COROFFS= 0
##$CY= -3
##$DATMOD= 1
##$DC= 0
##$DFILT= <>
##$DTYPP= 0
##$F1P= 0
##$F2P= 0
##$FCOR= 1
##$FTSIZE= 16384
##$FT_mod= 6
##$GAMMA= 0
##$GB= 0
##$INTBC= 1
##$INTSCL= 3.241238e-09
##$ISEN= 128
##$LB= 0.25
##$LEV0= 0
##$LPBIN= 0
##$MAXI= 10000
##$MC2= 0
##$MEAN= 0
##$ME_mod= 0
##$MI= 1.114404
##$NCOEF= 0
##$NC_proc= -5
##$NLEV= 6
##$NOISF1= 3.799351
##$NOISF2= 2.8
##$NSP= 0
##$NTH_PI= 0
##$NZP= 0
##$OFFSET= 15.48576
##$PC= 1
##$PHC0= -3709.103
##$PHC1= 24.79232
##$PH_mod= 1
##$PKNL= yes
##$PPARMOD= 0
##$PSCAL= 0
##$PSIGN= 0
##$REVERSE= no
##$SF= 200.130007191892
##$SI= 16384
##$SIGF1= 3
##$SIGF2= 2
##$SINO= 0.751879
##$SIOLD= 32768
##$SREGLST= <19F.Aceton>
##$SSB= 0
##$STSI= 16384
##$STSR= 0
##$SW_p= 3612.71676300578
##$SYMM= 0
##$S_DEV= 0
##$TDeff= 16384
##$TDoff= 0
##$TI= <>
##$TILT= no
##$TM1= 0
##$TM2= 0
##$TOPLEV= 0
##$USERP1= <user>
##$USERP2= <user>
##$USERP3= <user>
##$USERP4= <user>
##$USERP5= <user>
##$WDW= 1
##$XDIM= 16384
##$YMAX_p= 459974622
##$YMIN_p= -608210
$$ End of Bruker specific parameters
$$ ---------------------------------
##NTUPLES= NMR SPECTRUM
##VAR_NAME=  FREQUENCY,     SPECTRUM/REAL,   SPECTRUM/IMAG
##SYMBOL=    X,             R,               I
##VAR_TYPE=  INDEPENDENT,   DEPENDENT,       DEPENDENT
##VAR_FORM=  AFFN,          ASDF,            ASDF
##VAR_DIM=   16384,         16384,           16384
##UNITS=     HZ,            ARBITRARY UNITS, ARBITRARY UNITS
##FACTOR=    0.220516191357247, 1,           1
##FIRST=     3099.16520715896, 0,            0
##LAST=      -513.551555846821, 0,           0
##MIN=       -513.551555846821, -608210,     0
##MAX=       3099.16520715896, 459974622,    0
$$ Real data points
##PAGE= N=1
##DATA TABLE= (X++(R..R)), XYDATA
$$ [...]
8723B326858J5461m403N2719l6179j72677o5065J4378l7398K1310m6222P3622
$$ 2326858 2342319 2337916 2390635 2354456 2181779 2116714 2131092 2093694 2115004 2068782 2142404
8712B142404j06261k8952N9970l7564k08110R906L0423P341l6888n3488j8181
$$ 2142404 2036143 2007191 2067161 2029597 1821487 1831393 1861816 1869157 1832269 1778781 1760600
8701A760600J2610j29369j40378L1085J26215j37940o7203L592r3237P2883J13384
$$ 1760600 1773210 1643841 1503463 1534548 1660763 1522823 1455620 1459212 1365975 1438858 1552242
8690A552242k6340K632n3896j1616K5780q6871P721M892p7823p6887j426m6765
$$ 1552242 1525902 1528534 1474638 1463022 1488802 1401931 1409652 1414544 1336721 1259834 1258408 1211643
8678A211643R720o47J31133n5866j46612J04559q906K347k0321j25704k298J02410
$$ 1211643 1221363 1220716 1351849 1295983 1149371 1253930 1245024 1247371 1227050 1101346 1099048 1201458
8666A201458L1781M4097r1851k70885O1329J36003q3457J14544M9451j42828j0860
$$ 1201458 1233239 1277336 1185485 914600 975929 1111932 1028475 1143019 1192470 1049642 1038782
8655A038782p1154L6803o9937q2338K4183J31697l4225r6905Q196j7836j19956
$$ 1038782 967628 1004431 934494 852156 876339 1008036 973811 876906 885102 867266 747310
8644G47310M5271J7910m5147M0822K5768k0876m2653j04654N4492M136K3667j18163
$$ 747310 792581 810491 765344 806166 831934 811058 768405 663751 718243 722379 746046 627883
8632F27883P6662k687r685Q9361r1248q172P2238M7401q6305N9988K03814j37942
$$ 627883 704545 701858 692173 781534 690286 682114 754352 801753 715448 775436 979250 841308
8620H41308j41243P2173K7990L3370q8090j8338o8005N9062O1044M2815R926j26638
$$ 841308 700065 772238 800228 833598 745508 727170 659165 718227 779271 822086 832012 705374
8608G05374J09107J53118J9260J8407O7301P7513k13524l194J38523j6967n2683
$$ 705374 814481 967599 986859 1005266 1072567 1150080 936556 933362 1071885 1054918 1002235
8597A002235J6322L0694L7503J05692J3664J64537K37276J17479M27778O94102
$$ 1002235 1018557 1049251 1086754 1192446 1206110 1370647 1607923 1725402 2153180 2847282
8587B847282Q74036J110219O00094j79184k44923o04460j156620q30399n96875
$$ 2847282 3721318 4831537 5431631 5252447 5007524 4403064 3246444 2416045 1819170
8578A819170m19461j56506k12639j48333J3448j07236m245J65333J23368l00751
$$ 1819170 1399709 1243203 1030564 882231 895679 788443 784198 949531 1072899 772148
8568G72148r9640R7894p0681m4386J32940j00214j25218k0020j37770j60946R0870
$$ 772148 672508 770402 699721 655335 788275 688061 562843 542823 405053 244107 334977
8557C34977j8086P8675R0074p1794P5090n5634m0502m5141N6633Q5321P8316p381
$$ 334977 316891 395566 485640 413846 488936 433302 392800 347659 404292 489613 567929 560548
8545E60548m9819l367j0411o3880J8341k4810J67898m5111L7424j10307j07466
$$ 560548 510729 507362 496951 433071 451412 426602 594500 549389 586813 476506 369040
8534C69040O8904p2050M38k0522J982M9433L066j29729L5749J81635n1353k7361
$$ 369040 437944 365894 366332 345810 347792 397225 400291 270562 306311 487946 436593 409232
8522D09232J26283q0321J03956L7950j25812k3935K4332J5388p0843K2890n596
$$ 409232 535515 455194 559150 597100 471288 447353 471685 487073 416230 439120 433524
8511D33524N8004R1259j25470j25878m4025Q0802J28389M8240q2837j25357l396
$$ 433524 491528 582787 457317 331439 287414 368216 496605 544845 462008 336651 333255
8500C33255J03115J76338j09296r8628N4986J24585l1786O3753J21479q3155j54328
$$ 333255 436370 612708 503412 404784 459770 584355 552569 616322 737801 654646 500318
8489E00318M2224N0300j8047J21393j01122K2283l206j52209l790L5714j3356
$$ 500318 542542 592842 574795 696188 595066 617349 614143 461934 458144 493858 480502
8478D80502N2886K8561q2396Q8978P8173M0396o2089j81930p5003J32270j25207
$$ 480502 533388 561949 479553 568531 646704 687100 625011 443081 368078 500348 375141
8467C75141Q7852L3287L3625j64361r2210J28641J34655q5534l8050o3790l2330
$$ 375141 462993 496280 529905 365544 273334 401975 536630 451096 413046 349256 316926
8456C16926J67143J44855l5869j7526K598j7573R7546o0183O2548n4026k41115
$$ 316926 484069 628924 593055 575529 578127 560554 658100 597917 660465 606439 365324
8445C65324j33253M4462J24921M4302o0726r9543K5955N0676r585R3990j20724
$$ 365324 232071 276533 401454 445756 385030 285487 311442 362118 352533 446523 325799
8434C25799L0033j4254L4149n057P406j5289K5098n0229q1786J10224J09058j33010
$$ 325799 355832 341578 375727 370670 378076 362787 387885 337656 255870 366094 475152 342142
8422C42142R7752j06114j83179N6213K24841L8517l3931M2135J0431j6211j4933
$$ 342142 439894 333780 150601 206814 431655 470172 436241 478376 488807 472596 457663
8411D57663q2274K991N1605P9705j33335n4210L4073k7122J5597N321q4742o246
$$ 457663 375389 378380 429985 509690 376355 322145 356218 329096 344693 350014 265272 259026
8399B59026J14198J11227P5619m5714j02654p7464J0459R1007R840p8715J23925
$$ 259026 373224 484451 560070 514356 411702 334238 344697 435704 445544 366829 490754
8388D90754N2809K6742j01057j59535m453J89065P1008L7183q4557j36859J5243
$$ 490754 543563 570305 469248 309713 305260 494325 565333 602516 517959 381100 396343
8377C96343P3446o4922q1575j00037l8963J17783M3295P9278K9883q6289n8635
$$ 396343 469789 404867 323292 223255 184292 302075 345370 424648 454531 368242 309607
8366C09607Q4878j0621J68668J66479p0901k29023q8543K359R0946Q3657j64194
$$ 309607 394485 383864 552532 719011 648110 419087 330544 332903 423849 507506 343312
8355C43312o4965N6241j3718O5441K03463j33300k30272O0886K3474j9516Q5419
$$ 343312 278347 334588 320870 386311 589774 456474 226202 287088 310562 291046 376465
8344C76465m6799n6940N1036K7771L4007m115k8352L7643n173j85461M2200J35622
$$ 376465 329666 272726 323762 351533 385540 381425 353073 390716 385543 200082 242282 377904
8332C77904o2355J3654L7516L5117n8401j8492Q0392J19667p8484j14461L477
$$ 377904 315549 329203 366719 401836 343435 324943 405335 525002 446518 332057 335534
8321C35534N0062o6549K7862k7798N8370o6753M1893J15668p6402j51524O8739
$$ 335534 385596 319047 346909 319111 377481 310728 352621 468289 391887 240363 309102
8310C09102J6769j36249P7450P4677M4432P6906p318j23268l6574M6931O6637
$$ 309102 325871 189622 267072 341749 386181 463087 455769 332501 295927 342858 409495
8299D09495l5586q0483j966N8875r6844J2037k7877k33987O9111J91355K8433
$$ 409495 373909 293426 291460 350335 253491 265528 237651 3664 72775 264130 292563
8288B92563k5072J06735k42378l3335J17844q5793j3699M4982m8231N4624J18035
$$ 292563 267491 374226 131848 98513 216357 130564 116865 161847 113616 168240 286275
8277B86275j51550O2117J03603j57865P3713K18493j13783m1543K92K5351k4756
$$ 286275 134725 196842 300445 142580 216293 434786 321003 279460 279752 305103 280347
8266B80347j2233J2329J01051p6839o5831O5848k39752L067K29256r3393m2740
$$ 280347 268114 280443 381494 304655 238824 304672 64920 67987 297243 203850 161110
8255A61110J2627r420J81433k6213r1556J68436l6503j06813N9253l0564k8356
$$ 161110 173737 164317 345750 319537 227981 396417 359914 253101 312354 281790 253434
8244B53434N7848Q5179r6994j10779L8551J67153j55847k29428k2254P6014j02021
$$ 253434 311282 396461 299467 188688 227239 394392 238545 9117 -13137 62877 -39144
8233c9144K6351L3276L4792n7952l6045J09473J10889J8871o0631K3842j59914
$$ -39144 -12793 20483 55275 -2677 -38722 70751 181640 200511 139880 163722 3808
8222C808j41512J52723N1864k65493J17871J32388j77831o6291L04061o875k3522
$$ 3808 -137704 15019 66883 -198610 -80739 51649 -126182 -192473 111588 104713 81191
8211H1191j06695j32831M3450R8810n4068J52146j17099j50398J20782R2434J22294
$$ 81191 -25504 -158335 -114885 -16075 -70143 82003 -35096 -185494 -64712 27722 150016
8200A50016Q6967j31728q9628j3405l5836j79774J88732k99488k74516M91244
$$ 150016 236983 105255 15627 2222 -33614 -213388 -24656 -324144 -598660 -107416
8190a07416M4390Q1038K06840k2313j61739k9139n2637M1182J23919Q6888j49253
$$ -107416 -63026 18012 224852 202539 40800 11661 -40976 206 124125 211013 61760
8179F1760J00797J2937j5191P9574K8131k04055o6198R3369J03167j49270j66087
$$ 61760 162557 175494 160303 239877 268008 63953 -2245 91124 194291 45021 -121066
8168a21066k5272J76216k245o7800J07971K9880O4935N8507k5305k21016k14780
$$ -121066 -146338 29878 27633 -40167 67804 97684 162619 221126 195821 -25195 -239975
8157b39975p15J03802J3722l6903N8723P7801k19489q6968J90427R0131r9571
$$ -239975 -240690 -136888 -123166 -160069 -101346 -23545 -243034 -330002 -139575 -49444 -149015
8146a49015J39113Q0392j23527p0053O3079L4562j13127k1379J99565m0349m200
$$ -149015 -9902 70490 -53037 -123090 -60011 -25449 -138576 -159955 39610 -739 -4939
8135d939Q202K3146j77467r8900N071J84785N9211n3883J94288L04j16304j58099
$$ -4939 3263 26409 -151058 -249958 -244887 -60102 -891 -54774 139514 139818 23514 -134585
8123a34585M9692L3153J2440J74623j70893k08808o2817N5997l6977m2621J34067
$$ -134585 -84893 -51740 -39300 135323 -35570 -244378 -307195 -251198 -288175 -330796 -196729
8112a96729J30404L9757j25121j0439J36492P8169O8666k89890p2175J62597J02518
$$ -196729 -66325 -26568 -151689 -162128 -25636 52533 121199 -168691 -240866 -78269 24249
8101B4249J20995o1600l142j15862k8810k2590m8828K1446K7420K3397j00569
$$ 24249 145244 83644 80502 -35360 -64170 -86760 -135588 -114142 -86722 -63325 -163894
8090a63894j45575J51517j3988M332k00090J05907J71211L1376p9239j43965n1638
$$ -163894 -309469 -157952 -171940 -167608 -367698 -261791 -90580 -59204 -138443 -282408 -334046
8079c34046L0620p7888R7794K7517m4740Q6333J32629j60639q8013Q5399k0166
$$ -334046 -303426 -381314 -283520 -256003 -300743 -214410 -81781 -242420 -330433 -245034 -265200
8068b65200L2550P0084J83423l4056m0080j26933J0970N2887o6800l8135J01192
$$ -265200 -232650 -162566 20857 -13199 -53279 -180212 -169242 -116355 -183155 -221290 -120098
8057a20098L030p4421k493j73399J6204O1822k7402R8991P8310p771O2733M643
$$ -120098 -117068 -191489 -193982 -367381 -351177 -289355 -316757 -217766 -139456 -147227 -84494 -79851
8045g9851j16055J7334O077K3990M0674p6862k1122N6256o5949j14235l5947J44266
$$ -79851 -195906 -178572 -172495 -148505 -107831 -184693 -205815 -149559 -215508 -329743 -365690 -221424
8033b21424J04904N6945l5656l2356j10710K4101R7505J30977m2769k34968N1848
$$ -221424 -116520 -59575 -95231 -127587 -238297 -214196 -116691 14286 -28483 -263451 -211603
8022b11603j3467l3545J05256P251j66386l14N2685J995n1303K5623n7722j69238
$$ -211603 -225070 -258615 -153359 -146108 -312494 -312808 -260123 -258128 -309431 -283808 -341530 -510768
8010e10768O7496K33991M528k16308l2326l2380O0092Q2496J03810J16156j9444
$$ -510768 -443272 -209281 -204753 -421061 -453387 -485767 -425675 -343179 -239369 -123213 -142657
7999a42657j77087j164P4760Q1220O732r6307r440o1796J42117J19176q2033J8530
$$ -142657 -319744 -320908 -246148 -164928 -158196 -254503 -263943 -325739 -183622 -64446 -146479 -127949
7987a27949n219P8635O9901q4856j8545l1996j49613p4240K6586K4150L9194Q5706
$$ -127949 -133168 -54533 15368 -69488 -88033 -120029 -269642 -343882 -317296 -293146 -253952 -168246
7975a68246l5566J03650j65104j05156J24915Q7444L4729j08521n6398k10N4757
$$ -168246 -203812 -100162 -265266 -370422 -245507 -158063 -123334 -231855 -288253 -288463 -233706
7964b33706M1585J47439j8377k17201P933N1247K0160K8922K5055j3658j46437
$$ -233706 -192121 -44682 -63059 -280260 -272327 -221080 -200920 -171998 -146943 -160601 -307038
7953c07038R2326J19083M2177j49534p6341R5941k9515p2442J1474j8813j10802
$$ -307038 -214712 -95629 -53452 -202986 -279327 -183386 -212901 -285343 -273869 -292682 -403484
7942d03484n1945J03912J34347o284N4552J16876M0595p2956L5564j06459j27195
$$ -403484 -455429 -351517 -217170 -223454 -168902 -52026 -11431 -84387 -48823 -155282 -282477
7931b82477L8635J14792m8468j21527j1027J32025j4355r0196n1109o7206K82305
$$ -282477 -243842 -129050 -177518 -299045 -310072 -178047 -192402 -282598 -333707 -400913 -118608
7920a18608l8662j60217J5871n789j12805l2974j0029N9951J89236Q1204O6890
$$ -118608 -157270 -317487 -301616 -307405 -420210 -453184 -463213 -403262 -214026 -132822 -65932
7909f5932j00114j90857J09051J32294m0786j4080K3834J79940j7371j01738j4323
$$ -65932 -166046 -356903 -247852 -115558 -156344 -170424 -146590 33350 15979 -85759 -100082
7898a00082j27903r3724n7519J17263k9647J0587O1574J6814q1769j45832Q0806
$$ -100082 -227985 -321709 -379228 -261965 -291612 -281025 -219451 -202637 -284406 -430238 -349432
7887c49432M8921P8004J71191o1106n8830j57665K1775L9332j06916Q025P7899
$$ -349432 -300511 -222507 -51316 -112422 -171252 -328917 -307142 -267810 -374726 -366701 -288802
7876b88802J38452O2304R0819p0584j36817k1197Q420Q1058o4248j07166J04946
$$ -288802 -150350 -88046 2773 -67811 -204628 -225825 -217405 -136347 -200595 -307761 -202815
7865b02815J7349o9807j43212P349k4086j2313J13206j03213m3477Q7887J38552
$$ -202815 -185466 -255273 -398485 -391136 -415222 -427535 -314329 -417542 -461019 -373132 -234580
7854b34580R5511j37520j10665M9199J11023N4175J0890L1744o9230L0696j05469
$$ -234580 -139069 -276589 -387254 -338055 -227032 -172857 -161967 -130223 -199453 -168757 -274226
7843b74226N258K9076j8305R2548k2664Q2550p3979r4627q622j06024j40814J8377
$$ -274226 -268968 -239892 -258197 -165649 -188313 -105763 -179742 -274369 -282991 -389015 -529829 -511452
7831e11452K08021J29513O2295K9332k50925O8210J2527L4640J47477L217r4615
$$ -511452 -303431 -173918 -111623 -82291 -333216 -265006 -252479 -217839 -70362 -67145 -161760
7820a61760q0284r8686m0180M8206O1330j38192J9814M5626M4229n4983L9915
$$ -161760 -242044 -340730 -380910 -332704 -271374 -409566 -389752 -344126 -299897 -354880 -314965
7809c14965J12706j31738P1727J01182J88470o370j35866M5094J1674n7036k0141
$$ -314965 -202259 -333997 -262270 -161088 27382 21012 -114854 -69760 -58086 -115122 -135263
7798a35263K0810n2781o3284L2240j38289R2532Q3682q654M7559L244P1801J79118
$$ -135263 -114453 -167234 -230518 -198278 -336567 -244035 -160353 -169007 -121448 -118204 -46403 132715
7786A32715l6673p2064J06606M7784j62798m2006k4947J672j13257j39768J5292
$$ 132715 96042 23978 130584 178368 15570 -26436 -51383 -49711 -162968 -302736 -287444
7775b87444k743Q0353J18525j48346k4604j2972J4454K0593Q5730L2564K2447
$$ -287444 -290187 -209834 -91309 -239655 -264259 -277231 -262777 -242184 -156454 -123890 -101443
7764a01443P6332n2357Q7377R6948q1258J34529J6154J4057J75091Q9498k7597
$$ -101443 -25111 -77468 9909 106857 25599 160128 176282 190339 365430 454928 427331
7753D27331j48698j70986j73545Q4806N5972j18823r3705P9249m4530j6506l0887
$$ 427331 278633 107647 -65898 18908 74880 -43943 -137648 -58399 -102929 -119435 -150322
7742a50322O20J9539m0973r9908J09363L1730M4252N9622r1695j84576j2414K14928
$$ -150322 -149702 -130163 -171136 -271044 -161681 -129951 -85699 -26077 -117772 -302348 -314762 -99834
7730i9834K6738l3140O5743J62272K03411L4270N2593p0398l8104j19808j76367
$$ -99834 -73096 -106236 -40493 121779 325190 359460 412053 341655 303551 183743 7376
7719G376K5947j11128k7700N3681o0099k1355n2429L6782k2216j3969q20M2173
$$ 7376 33323 -77805 -105505 -51824 -111923 -133278 -185707 -148925 -171141 -185110 -185930 -143757
7707a43757Q5164j4196k2761j08410R0967K3647N7784J81693p8919j9515k6601
$$ -143757 -58593 -72789 -95550 -203960 -112993 -89346 -31562 150131 71212 51697 25096
7696B5096k04644N5635J09605m8579J42457K860k61666J14940J73738j01682j77887
$$ 25096 -179548 -123913 -14308 -62887 79570 82430 -179236 -64296 109442 7760 -170127
7685a70127j33852o9534K15054O9336n5983j17710n5759o8607O1503J75918k1727
$$ -170127 -303979 -373513 -158459 -89123 -145106 -262816 -318575 -387182 -325679 -149761 -171488
7674a71488j869m099j64122k66632J54275J63100R272k5001O0890k1837j863J10570
$$ -171488 -173357 -177456 -341578 -608210 -453935 -290835 -281563 -306564 -245674 -267511 -269374 -158804
7662a58804Q9672k1624p9195o3958O3411k0515L1433o2549r4440r8218n1619K58952
$$ -158804 -69132 -90756 -169951 -233909 -170498 -191013 -159580 -222129 -316569 -414787 -466406 -207454
7650b07454J25194r494q7169m9681n5017m2357M2939J05250N4142j81547o2557
$$ -207454 -82260 -91754 -178923 -228604 -283621 -325978 -283039 -177789 -123647 -305194 -367751
7639c67751P5797o0554K1646k8511Q324Q6841p3494q796N276n7407j04483M3407
$$ -367751 -291954 -352508 -330862 -359373 -351049 -264208 -337702 -346498 -341222 -398629 -503112 -459705
7627d59705R2791N7656O1886O4390k303o6073N9167j2602n5897R172M8313M3860
$$ -459705 -366914 -309258 -247372 -182982 -185285 -251358 -192191 -204793 -260690 -251518 -203205 -159345
7615a59345R057j11627j8888R4151K0814p1157J50637l4724k1984p3515j43128
$$ -159345 -150288 -261915 -280803 -186652 -165838 -236995 -86358 -121082 -143066 -216581 -359709
7604c59709l3378K2830k2692L2929N640q3253l7796K16458Q6654j14010j27972
$$ -359709 -393087 -370257 -392949 -360020 -354380 -437633 -475429 -258971 -172317 -286327 -414299
7593d14299j9195J48126L3958Q4489m8727J844p1787Q393K5827P9744p1121J37718
$$ -414299 -433494 -285368 -251410 -166921 -215648 -213804 -285591 -277198 -251371 -171627 -242748 -105030
7581a05030j4496j01195j7223J06410L082p9886j4773L7024j9569n3463O6891
$$ -105030 -119526 -220721 -237944 -131534 -128452 -208338 -223111 -186087 -205656 -259119 -192228
7570a92228j16904N6767l3029K6204o2964J2863R920J24155K1484l1097l9039
$$ -192228 -309132 -252365 -285394 -259190 -322154 -309291 -299371 -175216 -153732 -184829 -223868
7559b23868O0767K5050Q9255M7527j63041p6755l223J98631P986r2426j34701
$$ -223868 -163101 -138051 -48796 -1269 -164310 -241065 -244288 -45657 -37671 -130097 -264798
7548b64798j16879J43011J2237J21734P963j63721r035n9611R9887Q550o1757
$$ -264798 -381677 -238666 -226429 -104695 -96732 -260453 -269488 -329099 -229212 -220662 -282419
7537b82419O9525R7309o8275k10521p299O4514R0658o5680l2259J25797K5522
$$ -282419 -212894 -115585 -183860 -394381 -401680 -337166 -246508 -312188 -344447 -218650 -193128
7526a93128P0751r9253o8349p6609p8226J24885Q5325j29977k3032N8100j29904
$$ -193128 -122377 -221630 -289979 -366588 -444814 -319929 -234604 -364581 -387613 -329513 -459417
7515d59417J04426K05246q2501K5240Q2743n8239P1746l7123o0430j03427o5690
$$ -459417 -354991 -149745 -232246 -207006 -124263 -182502 -110756 -147879 -208309 -311736 -377426
7504c77426M9546J51974J4422j11408r4242j27130K5937n3448J52739J49186r5190
$$ -377426 -327880 -175906 -161484 -272892 -367134 -494264 -468327 -521775 -369036 -219850 -315040
7493c15040j558M0502m7748J22525K5600n3773n2783L681l0749Q9276k0722Q6375
$$ -315040 -316598 -276096 -323844 -201319 -175719 -229492 -282275 -278594 -309343 -220067 -240789 -154414
7481a54414l8876j47335O2935M6718J2454P8756Q2468j60394j63839Q1145J04263
$$ -154414 -193290 -340625 -277690 -230972 -218518 -139762 -57294 -217688 -381527 -300382 -196119
7470a96119L2614p4218P1001L858k25439Q6729J85798m1327l3255j62745K5766
$$ -196119 -163505 -237723 -166722 -162864 -388303 -301574 -115776 -157103 -190358 -353103 -327337
7459c27337P0548J20662J56310l7588k98619l8879K32000K9953N7572m2279j72050
$$ -327337 -256789 -136127 20183 -17405 -316024 -354903 -122903 -92950 -35378 -77657 -249707
7448b49707j62554m1183N9609K45600n4341m2987N8369O3287n5317N4558Q769
$$ -249707 -412261 -453444 -393835 -148235 -202576 -245563 -187194 -123907 -179224 -124666 -115897
7437a15897j58674m9129J64594k859O555L8313k041j52375M59R8075J62875j5488
$$ -115897 -274571 -323700 -159106 -161965 -155410 -117097 -119138 -271513 -271054 -172979 -10104 -25592
7425b5592j67170p7306j65831J6918J36909j70950J842R4157N3621Q6173l4571
$$ -25592 -192762 -270068 -435899 -418981 -282072 -453022 -451180 -357023 -303402 -217229 -251800
7414b51800r7468k1611R1455O1182J46789p7264q9083Q1146L5114j19620k9958
$$ -251800 -349268 -370879 -279424 -218242 -71453 -148717 -237800 -156654 -121540 -241160 -271118
7403b71118K12567R222p5235J22154k1901m0809r2904k1013K0663n1968n2258
$$ -271118 -58551 -49329 -124564 -2410 -24311 -65120 -158024 -179037 -158374 -210342 -262600
7392b62600M3621l1103r3163J87781J0394j65872J37728r035n362o3505l0662
$$ -262600 -218979 -250082 -343245 -155464 -145070 -310942 -173214 -182249 -187611 -251116 -281778
7381b81778O0924R8634K0028j7558R8245k7225N9536q1891m3963k5985q9188J82261
$$ -281778 -220854 -122220 -102192 -119750 -21505 -48730 10806 -71085 -115048 -141033 -230221 -47960
7369d7960K332m5992M9352l9186J8366K4554P3803L0666P4655p5668q6844J20489
$$ -47960 -45628 -91620 -42268 -81454 -63088 -38534 35269 65935 140590 64922 -21922 98567
7357I8567k57294r0090J27156R4285j28776j16611P5197J05800k919p6355p7452
$$ 98567 -158727 -248817 -121661 -27376 -156152 -272763 -197566 -91766 -94685 -171040 -248492
7346b48492J61774J41668J22510j18799j77865N9002J38881P6318j99202J07361
$$ -248492 -86718 54950 177460 58661 -119204 -60202 78679 154997 -44205 63156
7336F3156J35177R5086r8706j52116J69502R5206l5238J56578J24934J41663M93479
$$ 63156 198333 293419 194713 42597 212099 307305 272067 428645 553579 695242 1188721
7325A188721Q24808O86129P38490N70280m9166j25377n71398r12081p67693n61386
$$ 1188721 2013529 2699658 3438148 4008428 3959262 3833885 3262487 2350406 1582713 1021327
7315A021327m46582k49931L9496k52480j9038J07125l1784j88181o6112p125j16229
$$ 1021327 574745 324814 364310 111830 92792 199917 168133 -20048 -86160 -93285 -209514
7304b09514J23180J58280n2790j02411j3781J18816O7616n9136J8m2005j31432
$$ -209514 -86334 71946 19156 -83255 -97036 21780 89396 30260 30278 -11727 -143159
7293a43159q1417K52876o1358j41604J5668o1231P2409R0499n3561k0516P9761
$$ -143159 -224576 28300 -33058 -174662 -158994 -220225 -147816 -57317 -110878 -131394 -51633
7282e1633j54025P833M4967O0812J62261o7857j14717M0934r0177J21065N9258
$$ -51633 -205658 -197825 -152858 -92046 70215 2358 -112359 -71425 -161602 -40537 18721
7271A8721j14544J0701N2641k01337P6394J54927J15325p363j83922p1454K8073
$$ 18721 -95823 -85122 -32481 -233818 -157424 -2497 112828 105465 -78457 -149911 -121838
7260a21838m0725l1318j00788j18010J50614N1349Q1171j8125K2119Q8501l2452
$$ -121838 -162563 -193881 -294669 -412679 -262065 -210716 -129545 -147670 -125551 -37050 -69502
7249f9502r7356K5618j3297l974l5424o1721Q6030k346l7701J56582l6323K429
$$ -69502 -166858 -141240 -154537 -158511 -193935 -255656 -169626 -171972 -209673 -53091 -89414 -86985
7237h6985L0752k26564l7883L20156M347j47637j551j25403P6011J32286k33077
$$ -86985 -56233 -282797 -320680 -524 3823 -143814 -145365 -270768 -194757 -62471 -295548
7226b95548O9079R4169q0485N090J0214q1868j21879J06451J74381M9622L4065
$$ -295548 -226469 -132300 -212785 -207695 -197481 -279349 -401228 -294777 -120396 -70774 -36709
7215c6709k9552K7471p3804k9272Q3101l5253j2218Q4911j2109o0548O8738j04328
$$ -36709 -66261 -38790 -112594 -141866 -58765 -94018 -106236 -21325 -33434 -93982 -25244 -129572
7203a29572q4482Q3582j4957n5098m5703J7646R1688j72794K8664Q0024N8622
$$ -129572 -214054 -130472 -145429 -200527 -246230 -228584 -136896 -309690 -281026 -201002 -142380
7192a42380J36726p344p6089P1580N9204k12667l2545n3258J07566J81397j55893
$$ -142380 -5654 -12998 -89087 -17507 41697 -170970 -203515 -256773 -149207 32190 -123703
7181a23703k17899R9418J17144K2736r3022j08906J6894k3540K9930P6705l5886
$$ -123703 -341602 -242184 -125040 -102304 -195326 -304232 -287338 -310878 -280948 -204243 -240129
7170b40129J2045o3835O5116J62998k31022P6513J93252k18121M5324J74840p4220
$$ -240129 -228084 -291919 -226803 -63805 -294827 -218314 -25062 -243183 -197859 -23019 -97239
7159i7239J2875R8999P0607J4826j22621o0263J00480p0330j01211J25933j80640
$$ -97239 -84364 14635 85242 100068 -22553 -82816 17664 -52666 -153877 -27944 -208584
7148b08584l3117J01660N2577L1074j42427Q0199Q0079k6978j24553k7675R1885
$$ -208584 -241701 -140041 -87464 -56390 -198817 -118618 -38539 -65517 -190070 -217745 -125860
7137a25860M895J505l9524K2118j33429P8325J35621p3714K2985j25482O7274
$$ -125860 -120965 -119460 -158984 -136866 -270295 -191970 -56349 -130063 -107078 -232560 -165286
7126a65286J29386p9502N4390k8863j63603R5779K24368M2546o2606k3698o1258
$$ -165286 -35900 -115402 -61012 -89875 -253478 -157699 66669 109215 46609 22911 -38347
7115c8347J16912J2818r0525L7928j1029j39290M6977J13616M001j68609K980
$$ -38347 78565 91383 858 38786 27757 -111533 -64556 49060 53061 -115548 -112568
7104a12568q220j98485L5182K64696m9567j6723N5246q490j20752J9596L0854
$$ -112568 -120788 -319273 -284091 -19395 -68962 -85685 -30439 -38929 -159681 -140085 -109231
7093a09231L1127o5219J7308Q0112L1937n3359q6337J7525J05975l667J746M9865
$$ -109231 -78104 -143323 -126015 -45903 -13966 -67325 -153662 -136137 -30162 -33829 -32083 17782
7081A7782q6485j18829j9763R7738j5494j3483P2216k925j50802K592J39549N5864
$$ 17782 -68703 -187532 -207295 -109557 -125051 -138534 -66318 -69243 -220045 -217453 -77904 -22040
7069b2040j05308K6327L724O746K4040R6141j02450j6049J85736R0848j81407
$$ -22040 -127348 -101021 -97297 -90551 -66511 29630 -72820 -88869 96867 187715 6308
7058F308j07227j9256O5773p0515L1753l2602l3796M9978j02024j7932J82929
$$ 6308 -100919 -120175 -54402 -124917 -93164 -125766 -159562 -109584 -211608 -229540 -46611
7047d6611J23299n5478o1580N3315O6898P4290P9379j76783M1569J10730m65j25990
$$ -46611 76688 21210 -40370 12945 79843 154133 233512 56729 98298 209028 208563 82573
7035H2573J45966k7900j30919o7916n6305j6898n6766l8J09000k2238l8464J40833
$$ 82573 228539 200639 69720 1804 -54501 -71399 -128165 -128203 -19203 -41441 -79905 60928
7023F0928K6881r0768N3611J21560j17568n1983R6J01514K9642j34269K7297m9037
$$ 60928 87809 -2959 50652 172212 54644 2661 2757 104271 133913 -356 26941 -22096
7011b2096j53201P3722J23239n1115O2409k5927q8592M2357Q5326j252N844r8388
$$ -22096 -175297 -101575 21664 -29451 32958 7031 -81561 -39204 46122 44870 50714 -47674
6999d7674j09185J16529P097m054Q1490m6485k52269L718J06483J75592M9249
$$ -47674 -156859 -40330 -33233 -37287 44203 -2282 -254551 -250833 -144350 31242 80491
6988H0491q0053r9575J21373J8169J4888J27628o6648L1111Q4213l0229r0678
$$ 80491 438 -99137 22236 40405 55293 182921 116273 147384 231597 201368 110690
6977A10690N9917o4380q962q5983l680Q4508J7500j81086p1851P7934r2368M1593
$$ 110690 170607 106227 97265 11282 7602 92110 109610 -71476 -143327 -65393 -157761 -116168
6965a16168L1256J38118L6300L2668M1543J27831j7475l309K2059M8400j67171
$$ -116168 -84912 53206 89506 122174 163717 291548 274073 270764 292823 341223 174052
6954A74052N0594J17532k01237j21706j579J7593K5271J0230O3054L0408n8021
$$ 174052 224646 342178 140941 19235 17656 35249 60520 70750 133804 164212 106191
6943A06191l6895j4122J04302L3097n0892j33609P306O0673R8061J01164j35745
$$ 106191 69296 55174 159476 192573 141681 8072 15378 76051 174112 275276 139531
6932A39531m4991J09230n8838j76100J10959P6645r0119K1435J12584m810P2053
$$ 139531 94540 203770 144932 -31168 79791 156436 66317 87752 200336 195526 267579
6921B67579n5583l9824l4916j31025M4939J75499j17904l8457J00376o3447m7356
$$ 267579 211996 172172 137256 6231 51170 226669 108765 70308 170684 107237 59881
6910E9881J10993J42410n4642k5531j38579J0502N9381J1173r1627o377m085J16945
$$ 59881 170874 313284 258642 233111 94532 105034 164415 175588 83961 77584 73499 190444
6898A90444J07522j930n2374J19848L7735k2877r7027r6294R8490p5262r4838
$$ 190444 297966 296036 243662 363510 401245 378368 281341 185047 283537 208275 113437
6887A13437O9466l6467j08224N6628J67745j31684O1823K7826J00287m3463j11565
$$ 113437 182903 146436 38212 94840 262585 130901 192724 220550 320837 277374 165809
6876A65809J05508M6887j02680M1058J02068j6205O2711J8884r8209j3874j25217
$$ 165809 271317 318204 215524 256582 358650 342445 405156 424040 325831 311957 186740
6865A86740r9800l4973q4035m103O8848J24634o9900p26J54944J7511p0349J308
$$ 186740 86940 51967 -32068 -36171 32677 157311 87411 86685 241629 259140 188791 190099
6853A90099M9470M020M387K8632k422j00080n0820J52505o1499j4072L13777m2934
$$ 190099 239569 243589 247976 276608 274186 174106 123286 275791 214292 200220 513997 471063
6841D71063q2667l6892o4061N2551N6972M2884M936L77P4386R1098j8344r8423
$$ 471063 388396 351504 287443 339994 396966 439850 444786 445163 519549 610647 592303 493880
6829D93880j25869J4569J54434O7005k07500o9397q9975J36843J93590n4008j36765
$$ 493880 368011 382580 537014 604019 396519 327122 237147 373990 567580 513572 376807
6818C76807l7450J84425O4348k11767j94481Q0787M8903R5792M1379j12543K1267
$$ 376807 339357 523782 588130 376363 181882 262669 311572 407364 448743 336200 357467
6807C57467O7066j4125p0128q0160L7340l5965P0190N374m8298n0516j27044J6860
$$ 357467 424533 410408 340280 260120 297460 261495 331685 337059 288761 238245 111201 128061
6795A28061J19835R4209r724r530o4199J4680k4387M6206p9355j3185K0878J51311
$$ 128061 247896 342105 332381 322851 258652 273332 248945 295151 215796 202611 223489 374800
6783C74800J1797l1375j4480L4874q0367j05080j7192J09784q0265K5770l054
$$ 374800 386597 355222 340742 375616 295249 190169 172977 282761 202496 228266 225212
6772B25212o2793N2268L3764m9846n5022O2108J44119Q9160l2865j0881r5992
$$ 225212 162419 214687 248451 198605 143583 205691 349810 438970 406105 395224 299232
6761B99232j00675L2645J60328J07017k8799l2328M9139j57294n3029O8856J0547
$$ 299232 198557 231202 391530 498547 469748 437420 486559 329265 276236 345092 355639
6750C55639Q976K1522J8380r773J5569q3027n5873j4608p6751J80285J10483j44163
$$ 355639 364615 386137 404517 394744 410313 327286 271413 256805 180054 360339 470822 326659
6738C26659k0568N3054m396p6589R0971J87281N8212p8643j8755J02777n9862
$$ 326659 306091 359145 354749 278160 369131 556412 614624 535981 517226 620003 560141
6727E60141j24766J07772J47001p5775m7613J22927j49998j61521m047M4742P3240
$$ 560141 435375 543147 690148 614373 566760 689687 539689 378168 374121 418863 492103
6716D92103R1501L7830M2173k3428p1283J85787l2835j38470K10949N3470p4697
$$ 492103 583604 621434 663607 640179 568896 754683 721848 583378 794327 847797 773100
6705G73100O0746r1463o8560M0526J0830o5785J50864L6245m1100n737K1728M1715
$$ 773100 833846 742383 673823 714349 725179 659394 810258 846503 805403 799666 821394 863109
6693H63109P777J40455N8480m4074J488n8660j47505J02035J0305p946J55689
$$ 863109 870886 1011341 1069821 1025747 1027235 968575 821070 923105 933410 925464 1081153
6682A081153J37154j28066m2893J24255N8309L7268l6129K2439r2889N1400K1652
$$ 1081153 1218307 1090241 1047348 1171603 1229912 1267180 1231051 1253490 1160601 1212001 1233653
6671A233653N8744j02830P1319N3068J32859R0905J14695N6262p7137L6774Q7631
$$ 1233653 1292397 1189567 1260886 1313954 1446813 1537718 1652413 1708675 1631538 1668312 1755943
6660A755943N8125L9090J0298k6054J37754k6581p1037J27248K68222J08929J28977
$$ 1755943 1814068 1853158 1863456 1837402 1975156 1948575 1877538 2004786 2273008 2381937 2510914
6649B510914J39351P829J50329J9132J15224L07366L03085K12557L54118K91292
$$ 2510914 2650265 2658094 2808423 2827555 2942779 3250145 3553230 3765787 4119905 4411197
6639D411197N86125O41507N85627O82140J093764J278219J142325Q62730L80305
$$ 4411197 4997322 5638829 6224456 6906596 8000360 9278579 10420904 11283634 11663939
6630A1663939k2959l99348o12801q54136q45355r33458q27648m33928k74551l62478
$$ 11663939 11640980 11241632 10628831 9774695 8929340 7995882 7168234 6734306 6459755 6097277
6620F097277j54239M8499R9737P6253L1840J00251K14819J91630M16653N72290
$$ 6097277 5943038 5991537 6091274 6167527 6199367 6299618 6514437 6706067 7122720 7695010
6610G695010N46591Q19514R11219J250524J554418J951899K488295K647850K322339
$$ 7695010 8241601 9061115 9972334 11222858 12777276 14729175 17217470 19865320 22187659
6601B2187659J639715N83729o66359j614467k304080k325349j948219j723936
$$ 22187659 23827374 24411103 23744744 22130277 19826197 17500848 15552629 13828693
6593A3828693j366020q85370o88080l40480l5925Q272p0367N0428J87817K80551
$$ 13828693 12462673 11577303 10889223 10548743 10512818 10521090 10450723 10501151 10688968 10969519
6583A0969519K18401N8909O883l6388L8835K30594L07963L77878N62208P98123
$$ 10969519 11187920 11246829 11253712 11217324 11256159 11486753 11794716 12172594 12734802 13532925
6573A3532925R11300Q99545P60330L52231j38870o59061j003580j049584j057812
$$ 13532925 14444225 15343770 16104100 16456331 16317461 15658400 14654820 13605236 12547424
6564A2547424p31901o24639m12659k91284p6671J66675L49281L15859M37491M06496
$$ 12547424 11815523 11190884 10778225 10486941 10410270 10576945 10926226 11242085 11679576 12086072
6554A2086072N19091M11148L95639J41564p8303k29378l97563m66483n52851n60609
$$ 12086072 12605163 13016311 13411950 13553514 13475211 13245833 12848270 12381787 11828936 11268327
6544A1268327o71572o58252o48421p31823m98432m99375m70645j47956j99428
$$ 11268327 10596755 9938503 9290082 8558259 8059827 7560452 7089807 6941851 6742423
6535F742423l54602k50649j19141o3662j60024m0359j6274k8073N7137J41837
$$ 6742423 6387821 6137172 6018031 5954369 5794345 5753986 5737712 5709639 5766776 5908613
6525E908613L21564P0406J89041K31710K03819K48326O0871J47537j79121m04771
$$ 5908613 6230177 6300583 6489624 6721334 6925153 7173479 7234350 7381887 7202766 6797995
6515F797995k29682k99261m20865m66161k90254k47228l34717l79696j72625r8616
$$ 6797995 6568313 6269052 5848187 5382026 5091772 4844544 4509827 4130131 3957506 3858890
6505C858890k54034j47947m2935k36718j23668j67922k37018l08427j88569o0666
$$ 3858890 3604856 3456909 3413974 3177256 3053588 2885666 2648648 2340221 2151652 2090986
6495B090986j19528j83084j32012J09540k1882j07819j74769K8581k7674k8111
$$ 2090986 1971458 1788374 1656362 1765902 1744020 1636201 1461432 1490013 1462339 1434228
6485A434228J65391k2322j52918l586j13391j36252o0499l5159J20601n8410k7331
$$ 1434228 1599619 1577297 1424379 1420793 1307402 1171150 1110651 1075492 1196093 1137683 1110352
6474A110352m0889P405p0974R3773O4307K2120N2709l3041J7456J59969k94180
$$ 1110352 1069463 1076868 1005894 1099667 1163974 1186094 1238803 1205762 1223218 1383187 1089007
6463A089007k54236k1441Q6017J36294p4736k25196j86635k0364r7421M8480J242
$$ 1089007 834771 813330 899347 1035641 960905 735709 549074 528710 431289 479769 481011
6452D81011j55571J00522J05479q1102j6816j17527K2842n4652P6482O5423L681
$$ 481011 325440 425962 531441 450339 433523 315996 338838 284186 360668 426091 429772
6441D29772k6964j15541N1148Q4561J9970p4512O7738m8545O372P2589O3431n4902
$$ 429772 402808 287267 338415 422976 442946 368434 436172 387627 393999 466588 530019 475117
6429D75117J58135o5024N1780r3727p2673P458K8508K2718O8992K242Q8540q0329
$$ 475117 633252 568228 620008 526281 453608 461066 489574 512292 581284 583526 672066 591737
6417E91737j34290Q5976P3195K665M2932J14501q2316j40326r4451l5508K5814
$$ 591737 457447 543423 616618 619283 662215 776716 694400 554074 459623 424115 449929
6406D49929j38295J40963K79421j21479n6396K9436o524J658n738m66J63501k977
$$ 449929 311634 452597 732018 610539 554143 583579 577055 578713 572975 572509 736010 733033
6394G33033m1336J48208N9932j87837J54383J83089P7137R5338J61702J40678
$$ 733033 691697 839905 899837 712000 866383 1049472 1126609 1221947 1383649 1524327
6384A524327O5792K753J81000K27290L60111M48974P27290R08994J154326J260962
$$ 1524327 1590119 1592872 1773872 2001162 2361273 2810247 3537537 4446531 5600857 6861819
6374F861819J020249K30861l98947n84665j167762j314347q64824o37287n32639
$$ 6861819 7882068 8112929 7713982 7129317 5961555 4647208 3782384 3145097 2612458
6365B612458m10845k69069n5962n7401o5486J40296Q1723j92264j26211o6518
$$ 2612458 2201613 1932544 1876582 1819181 1753695 1893991 1975714 1783450 1657239 1590721
6355A590721j7024o9258p7168M5365m2049j39969J3277J17393P0016L9166O903
$$ 1590721 1573697 1504439 1427271 1472636 1430587 1290618 1303895 1421288 1491304 1530470 1537373
6344A537373l5389n9132k834K06280K04892M105Q2277q0719p5683P428J92750
$$ 1537373 1501984 1442852 1440018 1646298 1851190 1855295 1937572 1856853 1781170 1788598 1981348
6333A981348q4535j65945n7701K37869J88972M685n2854N6768N0535J39256J07023
$$ 1981348 1896813 1730868 1673167 1911036 2100008 2104693 2051839 2108607 2159142 2298398 2405421
6322B405421J32512K43365K79501J44272K93721J49935J46734J57878j08262k00877
$$ 2405421 2537933 2781298 3060799 3205071 3498792 3648727 3795461 3953339 3845077 3644200
6312C644200k34002l18642m00973k11303K58976K41827J98846K00165L2702J9537
$$ 3644200 3410198 3091556 2690583 2479280 2738256 2980083 3178929 3379094 3411796 3431333
6302C431333n3777o9680l48793k34135k97117j60142P867r9338j89290k43429
$$ 3431333 3377556 3307876 2959083 2724948 2427831 2267689 2275556 2176218 1986928 1743499
6292A743499j83795j00881j06371J58065N1042j6842k24224m9383P0636k5394
$$ 1743499 1559704 1458823 1352452 1510517 1561559 1544717 1320493 1271110 1341746 1316352
6282A316352k6503o1769K8529J1465j56003k2584N547J25291j9332q4624j8070
$$ 1316352 1289849 1228080 1256609 1268074 1112071 1089487 1095034 1220325 1200993 1116369 1098299
6271A098299J8687n9649j67269p2594L1965K2117o8622j3251J35173K02619K66353
$$ 1098299 1116986 1057337 890068 817474 849439 871556 802934 789683 924856 1127475 1393828
6260A393828N8723k11578R3884J29276J6923p558j26817k17607j44264j3862p6483
$$ 1393828 1452551 1240973 1334857 1464133 1481056 1473498 1346681 1129074 984810 970948 894465
6249H94465L0043m9744n9730l096P4738k44860m1263M1735p5200o2671P7409M9070
$$ 894465 924508 874764 815034 811938 886676 641816 600553 642288 567088 504417 581826 630896
6237F30896n8859r7503J38931R1829o5243l0679q4225N6611Q0877Q0504n4580
$$ 630896 572037 474534 613465 705294 640051 609372 525147 581758 662635 743139 688559
6226F88559p6558j72999N6324J27344J27493J56706j02718n5510J08153j42195
$$ 688559 612001 439002 495326 622670 750163 906869 804151 748641 856794 714599
6216G14599Q5573J27406m2537L4690J6995o329K05192m9269k17173o8444m2328
$$ 714599 800172 927578 885041 919731 936726 930397 1135589 1086320 869147 800703 758375
6205G58375n2487K52004J23692Q4494j5606r2458J48894L1311K41512K81542J60339
$$ 758375 705888 957892 1081584 1166078 1150472 1058014 1206908 1238219 1479731 1761273 1921612
6194A921612J31668L24140L19231L05285q2017j45099k68338n32961l56961q8953
$$ 1921612 2053280 2377420 2696651 3001936 2919919 2774820 2506482 1973521 1616560 1527607
6184A527607k64219k86629j84092R233L7223n3108L3675N2704j69115j42350J28346
$$ 1527607 1263388 976759 792667 801900 839123 786015 819690 872394 703279 560929 689275
6173F89275O1403l9455n2616N7864o0219k0753J1926J58478N7133M4019o8848
$$ 689275 750678 711223 658607 716471 656252 635499 647425 805903 863036 907055 838207
6162H38207l1124j63008O9703K9495J3736J2051j2731j21729m5151L620q2477
$$ 838207 807083 644075 713778 743273 757009 769060 756329 634600 589449 593069 510592
6151E10592p1534j51675j6117J75456k8892k9603o1395n3106R8672M4879R8308
$$ 510592 439058 287383 271266 446722 417830 388227 326832 273726 372398 417277 515585
6140E15585k4094L0967j03810k0269j73071j83660N8737J1723M5411J24668K1038
$$ 515585 491491 522458 418648 398379 225308 41648 100385 112108 157519 282187 303225
6129C03225O3067j8892N9698N239j6665L6959o4693n200J25144p3470j58245q0655
$$ 303225 366292 347400 407098 412337 395672 432631 367938 362738 487882 414412 256167 175512
6117A75512j55777M0740J54213j64308M2006J22948n4584J10338K526p1541J55791
$$ 175512 19735 60475 214688 50380 92386 215334 160750 271088 273614 202073 357864
6106C57864j64341r8331J29385L3409Q5131L9001j17551j7997O7370j27270n479
$$ 357864 193523 95192 224577 257986 343117 382118 264567 246570 313940 186670 181191
6095A81191m9058n8338m6999P1635k5904j40199m0682p621j21146m5635J54303
$$ 181191 132133 73795 26796 98431 72527 -67672 -108354 -115975 -237121 -282756 -128453
6084a28453k2829l9654M5452N4931J15036l092O8037R0331m5905q2464K0925j59786
$$ -128453 -151282 -190936 -145484 -90553 24483 21391 89428 179759 133854 51390 72315 -87471
6072h7471j39376L2608j1093Q2230j10906j7035J87697Q3373Q0626J09363o131
$$ -87471 -226847 -194239 -205332 -123102 -234008 -251043 -63346 20027 100653 210016 203885
6061B03885n8668q362K2233J8290L963j28189o7167M0557m6430K9268L7818m8524
$$ 203885 145217 136855 159088 177378 181341 53152 -14015 26542 -19888 9380 47198 -1326
6049a326k22447l8270J41713J9635K3695Q5126l1126m1858Q8256J82242k0019
$$ -1326 -223773 -262043 -120330 -100695 -77000 8126 -23000 -64858 23398 205640 185621
6038A85621q518q1284O7149n394q8457M2900j9789q1770m2100o3792j1725Q370
$$ 185621 177103 95819 162968 157574 69117 112017 92228 10458 -31642 -95434 -107159 -98789
6026i8789n0959r0201q0958o1258M9780O9737K2149L0974J27509J46231O9544
$$ -98789 -149748 -239949 -320907 -382165 -332385 -262648 -240499 -209525 -82016 64215 133759
6015A33759j15977Q0460K18649o3436l6351k6964p9847O0410L9053q8134J04316
$$ 133759 17782 98242 316891 253455 217104 190140 110293 170703 209756 121622 225938
6004B25938Q0473l6093K674J21961m5811j01101O6002j3652j63075J131J9392
$$ 225938 306411 270318 272992 394953 349142 248041 314043 300391 137316 138447 157839
5993A57839N58M9789K0878j01623j6465P7951r007J15874N0973j26176m9556J6675
$$ 157839 158397 208186 229064 127441 110976 188927 179920 295794 346767 220591 171035 187710
5981A87710K0878j35047M565J48890p2528j18967J16767k4419j06606Q9402J45273
$$ 187710 208588 73541 78106 226996 154468 35501 152268 127849 21243 110645 255918
5970B55918n3697J04109L16p9012l8017J43410J38544K2465n9471o4232r874J72879
$$ 255918 202221 306330 306646 227634 189617 333027 471571 494036 434565 370333 360459 533338
5958E33338N9541j29704j26907Q6779R3336J38549J42376R4172J79967K89863
$$ 533338 592879 463175 336268 423047 516383 654932 797308 891480 1071447 1361310
5948A361310K40895R6337L7695j33717l88640k46237j76180r7858j29013j02949
$$ 1361310 1602205 1698542 1736237 1602520 1213880 967643 791463 693605 564592 461643
5938D61643Q1862J27813j41644j24888J07114p1823j7578J35347M8509K3043L40987
$$ 461643 543505 671318 529674 404786 511900 440077 422499 557846 606355 629398 970385
5927I70385K75287J99363P7124J893l670J0178k26649k13707j48547j52692j12399
$$ 970385 1245672 1445035 1522159 1524052 1520382 1530560 1303911 1090204 941657 788965 676566
5916F76566N6713l844q1897J73301K57173k2107n9249o9377j11336j97541k00155
$$ 676566 733279 729435 647538 820839 1078012 1055905 996656 927279 815943 618402 418247
5905D18247J26564J12399j3347J5597J08721p0719j700J59736J09008n7033m6598
$$ 418247 544811 657210 643863 659460 768181 697462 695762 855498 964506 907473 860875
5894H60875J71166J10438Q78Q8854K6406k1065k6870m980o3484r0854k42670o6805
$$ 860875 1032041 1142479 1143357 1232211 1258617 1237552 1210682 1205702 1142218 1051364 808694 741889
5882G41889j46982r6633p2885J16418p2874k6726J41392r6507J2625J63968J70512
$$ 741889 594907 498274 425389 541807 468933 442207 583599 487092 499717 663685 834197
5871H34197N4293J56268k13829j08487n6901j18482m3454K12126j39458P6994
$$ 834197 888490 1044758 830929 722442 665541 547059 503605 715731 576273 653267
5861F53267J8648r0937m6755M8202j97882Q5844J66979P8368L4077K01112L9512
$$ 653267 671915 580978 534223 582425 384543 470387 637366 715734 749811 950923 990435
5850I90435l3770j34884p5805M4222J0570q2773M118N9527j46631l2979K944j11691
$$ 990435 956665 821781 745976 790198 800768 717995 722113 781640 635009 602030 604974 493283
5838D93283j08253J14374N4901j24366j25281j5235n9746J6643J85989K36413
$$ 493283 385030 499404 554305 429939 304658 289423 229677 246320 432309 668722
5828F68722j25121J6667K13108N3643r1799K1219l3231p6374j3881J19688J33532
$$ 668722 543601 560268 773376 827019 735220 756439 723208 646834 632953 752641 886173
5817H86173K00740r4420j4751n4311j96187q8773P4902M4369r7939p2060P168
$$ 886173 1086913 992493 977742 923431 727244 638471 713373 757742 659803 587743 594911
5806E94911J6570o4537K5981Q1369L4852N9803K68991M3191J18175J37406J12485
$$ 594911 611481 546944 572925 654294 689146 748949 1017940 1061131 1179306 1316712 1429197
5795A429197m4404J51117R9710P9142O1560o9759k36954j36016q0243O6230k0882
$$ 1429197 1384793 1535910 1635620 1714762 1776322 1706563 1469609 1333593 1253350 1319580 1298698
5784A298698K2630J41211P4331Q4214R5539J55923Q8643M1350K20411J27073J97645
$$ 1298698 1321328 1462539 1536870 1621084 1716623 1872546 1961189 2002539 2222950 2350023 2547668
5773B547668J78364N0323J6450J97618K36915P5591K86457M09100M85346N62524
$$ 2547668 2726032 2776355 2792805 2990423 3227338 3302929 3589386 3998486 4483832 5046356
5763E046356P13121J368120K612156M194651M572337L228861N91557o60674j799446
$$ 5046356 5759477 7127597 9739753 13934404 18506741 21735602 22327159 21666485 19867039
5754A9867039m593694m028078k841245j900404j365039j003851q60793n65969
$$ 19867039 15273345 11245267 8404022 6503618 5138579 4134728 3273935 2707966
5746B707966j83204P879j86439J3944p7572N260j03869k33011k58690j23847k7402
$$ 2707966 2524762 2532641 2346202 2360146 2282574 2287834 2183965 1950954 1692264 1568417 1541015
5735A541015j15493j23480J8712R3891Q8868p1565R5108R6832J82564K279j45661
$$ 1541015 1425522 1302042 1320754 1414645 1503513 1431948 1527056 1623888 1806452 1808731 1663070
5724A663070n7297J57486j00840r6230l6185n3627l60129k5403m0220N0181O6463
$$ 1663070 1605773 1763259 1662419 1566189 1530004 1476377 1116248 1090845 1050625 1100806 1167269
5713A167269K00297M5456p7854L3881J49129J05976Q784q7984l2664P9337L6845
$$ 1167269 1367566 1413022 1335168 1369049 1518178 1624154 1632938 1544954 1512290 1591627 1628472
5702A628472L5799o8679L8080K35762K50233r792P4315J00103k309k48007k94115
$$ 1628472 1664271 1595592 1633672 1869434 2119667 2109875 2184190 2284293 2281984 2033977 1739862
5691A739862q4871J59199r9256P1709J80084p0157k41758K3600N1850J08977K25262
$$ 1739862 1654991 1814190 1714934 1786643 1966727 1896570 1654812 1678412 1730262 1839239 2064501
5680B064501R4592j53148L345J45698R6820j2022L7430o2729L7179K0252m4319
$$ 2064501 2159093 2005945 2009290 2154988 2251808 2239786 2277216 2214487 2251666 2271918 2227599
5669B227599M8997K0823l29218l6246J10740L492J4471K01396N9339J2509J29359
$$ 2227599 2276596 2297419 1968201 1931955 2042695 2046187 2060658 2262054 2321393 2333902 2463261
5658B463261J01610K74332L28109K32473K15402j07933p3522O5842L6034M9974
$$ 2463261 2564871 2839203 3167312 3399785 3615187 3507254 3433732 3499574 3535608 3585582
5648C585582K6393j48048R0969K2277L0912Q4592K19642j0491m1341L3455K73571
$$ 3585582 3611975 3463927 3554896 3577173 3608085 3692677 3912319 3901828 3860487 3893942 4167513
5637D167513N9032K28655N9053J0813m7761J12442Q2973K46823J45235K88890
$$ 4167513 4226545 4455200 4514253 4525066 4477305 4589747 4672720 4919543 5064778 5353668
5627E353668L14917J46965n8744K53345q7874L9519J67241M08426M35858N63495
$$ 5353668 5668585 5815550 5756806 6010151 5922277 5961796 6129037 6537463 6973321 7536816
5617G536816K39866K79022J31768Q7925j63818K46153J34162J49035P9182J67896
$$ 7536816 7776682 8055704 8187472 8275397 8111579 8357732 8491894 8640929 8720111 8888007
5607H888007Q2644L59162M81555N00828K98993L79254L27319L79000J74349L40566
$$ 8888007 8970651 9329813 9811368 10312196 10611189 10990443 11317762 11696762 11871111 12211677
5597A2211677P38736J567683J757361J819478K072211K116829J687426J867971
$$ 12211677 12950413 14518096 16275457 18094935 20167146 22283975 23971401 25839372
5589B5839372J810613J672186J685725K070143K288159L169047L859637N285339
$$ 25839372 27649985 29322171 31007896 33078039 35366198 38535245 42394882 47680221
5581D7680221N902960P883569R822001J2930164J7157855K6286688M5297518P8858497
$$ 47680221 53583181 61466750 71288751 84218915 101376770 127663458 172960976 251819473
5573B51819473R8004928Q0706310K9443911j3042462j8754948p6821686r7562527
$$ 251819473 349824401 430530711 459974622 446932160 428177212 351355526 253792999
5566B53792999o7363158m7018846l2541222k4116455j6657449j1617771p437371
$$ 253792999 186429841 139410995 106869773 82753318 66095869 54478098 47040727
5559D7040727n487974l846776l333883k673169k919482k510733k141614j174600
$$ 47040727 41552753 37705977 34372094 31698925 28779443 26268710 24127096 22952496
5551B2952496j157305n61648m34489j68780j94737K44022M39184Q72998O07628
$$ 22952496 21795191 21233543 20799054 20630274 20435537 20679559 21118743 21991741 22599369
5542B2599369Q30782O41823O06959J113819K124799L298047N726420P525799P357661
$$ 22599369 23430151 24071974 24678933 25792752 27917551 31215598 36942018 44467817 51825478
5533E1825478M394103P57835k159320n049859p770053p269532o091884m726988
$$ 51825478 56219581 56977416 54818096 49768237 41998184 34728652 28636768 23909780
5525B3909780l608101k597466k200885j665127j349350q71276q42341o17924m74613
$$ 23909780 20301679 17704213 15503328 13838201 12488851 11617575 10775234 10157310 9682697
5516I682697m59981n29729k21501k74209k72096m59275m92216l28059k27472k00338
$$ 9682697 9222716 8692987 8471486 8197277 7925181 7465906 6973690 6645631 6418159 6217821
5506F217821J23295p3712p478j17100M9423O3906j80164l16141J97585j15547
$$ 6217821 6341116 6267404 6259926 6142826 6192249 6256155 6075991 5759850 5957435 5841888
5496E841888k25236k29052k61725k78666j1529k62982k44599p9362j3880K8890
$$ 5841888 5616652 5387600 5125875 4847209 4835680 4572698 4328099 4248737 4234857 4263747
5486D263747L9889R8254J73255P1368K00786O8646n4809J12294q9938k50525m0826
$$ 4263747 4303636 4401890 4575145 4646513 4847299 4915945 4861136 4973430 4883492 4632967 4592141
5475D592141L7486K5237J08438J62149L3434P2221J75460L78603M74279L64699
$$ 4592141 4629627 4654864 4763302 4925451 4958885 5031106 5206566 5585169 6059448 6424147
5465F424147N04891Q70008J290779J764486K480133L892324M159144L324628J605064
$$ 6424147 6929038 7799046 9089825 10854311 13334444 17226768 21385912 24710540 26315604
5456B6315604k86580j796794l372308l977517l415027k590986j774007j462815
$$ 26315604 26029024 24232230 20859922 16882405 13467378 10876392 9102385 7639570
5448G639570j132412q54755o53156o09975m36912q1204m1125j20890k18457j93920
$$ 7639570 6507158 5652403 4999247 4389272 3952360 3871156 3830031 3709141 3490684 3296764
5438C296764j56850j13794j06398r8744j60843j60493j15503j6739J4928L8696
$$ 3296764 3139914 3026120 2919722 2820978 2660135 2499642 2384139 2367400 2382328 2421024
5428B421024M5585M6807P5041J95967k253j71000l59134j58543j15717k28781
$$ 2421024 2466609 2513416 2588457 2784424 2782171 2611171 2252037 2093494 1977777 1748996
5418A748996j31393m766r1514j05973P9113R9831J03887R1654J4779J34532j74924
$$ 1748996 1617603 1612837 1521323 1415350 1494463 1594294 1698181 1789835 1804614 1939146 1764222
5407A764222j47659n3546j44360j41435P619j32228l2718N0200J84481K2492N0123
$$ 1764222 1616563 1563017 1418657 1277222 1284841 1152613 1119895 1170095 1354576 1377068 1427191
5396A427191j6742m8392m7643K2337j24324l7066j07836K127K34524K58217j8633
$$ 1427191 1410449 1362057 1314414 1336751 1212427 1175361 1067525 1069652 1304176 1562393 1543760
5385A543760o7606p0340l7745o0945n5426k3309J46199Q2729J45943L07159K13798
$$ 1543760 1476154 1405814 1368069 1307124 1251698 1228389 1374588 1457317 1603260 1910419 2124217
5374B124217N5883l8009l3104N2598k7778k37781k00206j72311q9510j18562j82301
$$ 2124217 2180100 2142091 2108987 2161585 2133807 1896026 1695820 1523509 1433999 1315437 1133136
5363A133136M4323j833R3485R3005J20086K12502K76458O9145Q6294j16536q0398
$$ 1133136 1177459 1175626 1269111 1362116 1482202 1694704 1971162 2040307 2126601 2010065 1929667
5352A929667j64017j57054n4129O5004j83058o9366O5184J4116J91244R6954j26679
$$ 1929667 1765650 1608596 1554467 1619471 1436413 1367047 1432231 1446347 1637591 1734545 1607866
5341A607866N9048J91049R3263j03034j7592p1893j08694o1183J31458P9629j28144
$$ 1607866 1666914 1857963 1951226 1848192 1830600 1758707 1650013 1588830 1720288 1799917 1671773
5330A671773J94685K48205J31141L46029M67484N97506Q30480O58884M08597M2377
$$ 1671773 1866458 2114663 2245804 2591833 3059317 3656823 4487303 5146187 5554784 5597161
5320E597161k78187n15951o73361r48835p48334l86038j98525l57658j87065j36755
$$ 5597161 5318974 4803023 4129662 3180827 2432493 2046455 1847930 1490272 1303207 1166452
5310A166452j36606k87089R6792k0773N0979M869N8103J78051o651j06582L1566
$$ 1166452 1029846 742757 839549 818776 869755 874624 932727 1110778 1104127 997545 1029111
5299A029111K6068o9155p4899k6938R0631K16745J04194l2034j72838j0076K85886
$$ 1029111 1055179 986024 911125 884187 974818 1191563 1295757 1263723 1090885 1080809 1366695
5288A366695K4248k76961m2437R5217O7226k7251j61092J5001m6744J08477J16036
$$ 1366695 1390943 1113982 1071545 1166762 1233988 1206737 1045645 1060646 1013902 1122379 1238415
5277A238415L7762J01081J590j3531K29603K02413J58180L72846K15497J89001
$$ 1238415 1276177 1377258 1378848 1365317 1594920 1797333 1955513 2328359 2543856 2732857
5267B732857K7780j33837j12037q4461k48622K09128J86935P7543L19634L01790
$$ 2732857 2760637 2626800 2514763 2430302 2181680 2390808 2577743 2655286 2974920 3276710
5257C276710J08044J8390j54481l18643m07622k12211j90940j76258o1327l2854
$$ 3276710 3384754 3403144 3248663 2930020 2522398 2310187 2119247 1942989 1881662 1848808
5247A848808j32384Q5395L0460L5994J23028l6202k3102J21678K8411k5669M6939
$$ 1848808 1716424 1801819 1832279 1868273 1991301 1955099 1931997 2053675 2082086 2056417 2103356
5236B103356J3736J03143m09J2704J10756O9072K35354L08834J92865N134j15095
$$ 2103356 2117092 2220235 2219826 2232530 2343286 2412358 2647712 2956546 3149411 3154545 3039450
5225C039450n372j18912k73596j41997l86998k03401j9953J3598j16133J48877
$$ 3039450 3034078 2915166 2641570 2499573 2112575 1909174 1889221 1902819 1786686 1935563
5215A935563R6722j11619K6404O7441K25939j5600J01397J99830p2904O7042J09802
$$ 1935563 2032285 1920666 1947070 2014511 2240450 2224850 2326247 2526077 2453173 2520215 2630017
5204B630017P0357J30366j19522J24758N5885j78532J91914L79819j22863J0637
$$ 2630017 2700374 2830740 2711218 2835976 2891861 2713329 2905243 3285062 3162199 3172836
5194C172836L59620J95136K74832K25976L73210N41229O28198J088923J824162
$$ 3172836 3532456 3727592 4002424 4228400 4601610 5142839 5771037 6859960 8684122
5185H684122K540109K125575J118879Q9941o25536j674490k002070j921655j641406
$$ 8684122 11224231 13349806 14468685 14558626 13933090 12258600 10256530 8334875 6693469
5176F693469j051696n83537n59010k28585j86974k9921n1628O484K44999K23474
$$ 6693469 5641773 5058236 4499226 4270641 4083667 4053746 4002118 4008602 4253601 4477075
5166D477075O3146K45061J63308k8311J07589O0352J6683m749K8916M02895M19251
$$ 4477075 4540221 4785282 4948590 4920279 5027868 5088220 5104903 5100154 5129070 5531965 5951216
5155E951216M40567R70819J222498J638658J556455P82968K95679j41213p03107
$$ 5951216 6391783 7362602 8585100 10223758 11780213 12563181 12858860 12717647 12014540
5146A2014540j259223j329192j055665p42560o38023n61509l85945l19585r9758
$$ 12014540 10755317 9426125 8370460 7627900 6989877 6428368 6042423 5722838 5623080
5137E623080M9520J54941K17645K08873L03944J71434N0235R3403j40182j09851
$$ 5623080 5672600 5827541 6045186 6254059 6558003 6729437 6779672 6873075 6732893 6623042
5127F623042j26413k75932j1481m4809k19661N9734L4223j81541P4115J18533
$$ 6623042 6496629 6220697 6209216 6164407 5944746 6004480 6038703 5857162 5931277 6049810
5117F049810K50585K07530K38856J48332K99911L21873L80485l4043k28450l79329
$$ 6049810 6300395 6507925 6746781 6895113 7195024 7516897 7897382 7863339 7634889 7255560
5107G255560m28464m01999l67686k12216j27261J41159K02112J39410K13107R704
$$ 7255560 6827096 6425097 6057411 5845195 5717934 5859093 6061205 6200615 6413722 6423426
5097F423426l02278k22560m56292n93310l48298j39813k14196j51083k85081m3016
$$ 6423426 6121148 5898588 5442296 4848986 4500688 4360875 4146679 3995596 3710515 3667499
5087C667499P9379l0399P5390K15616N9031K16767L91075N60282M19698K55778
$$ 3667499 3746878 3716479 3791869 4007485 4066516 4283283 4674358 5234640 5654338 5910116
5077E910116j86883R860k24760m01952j98034m34140m45273k90564j08396o4197
$$ 5910116 5723233 5733093 5508333 5106381 4908347 4474207 4028934 3738370 3629974 3565777
5067C565777J95007K54657k9664r2390j60662r8381j1176j05413k25920k993L1921
$$ 3565777 3760784 4015441 3985777 3893387 3732725 3634344 3623168 3517755 3291835 3288842 3320763
5056C320763k19545J682K38869Q4867k0714o7638J62030L39179K88677K57439
$$ 3320763 3101218 3102900 3341769 3426636 3405922 3338284 3500314 3839493 4128170 4385609
5046D385609J25921k0981J76320M35872N10024L56612N40381P48518Q69140J084031
$$ 4385609 4511530 4490549 4666869 5102741 5612765 5969377 6509758 7258276 8127416 9211447
5036I211447J318996J320294J098892L92937p618l70754r34675j096800j006132
$$ 9211447 10530443 11850737 12949629 13342566 13334948 12964194 12029519 10932719 9926587
5027I926587r24226o65061m50766k57662k09675j59148L4640p3406l39220q6488
$$ 9926587 9002361 8337300 7886534 7628872 7419197 7260049 7294689 7221283 6882063 6795575
5017F795575K1338m6353m1948J92842M36723M31860O31692P81416J124762J577327
$$ 6795575 6816913 6770560 6728612 6921454 7358177 7790037 8421729 9203145 10327907 11905234
5007A1905234K345938K883671L033718K591528J501193J87392j222211k378419
$$ 11905234 14251172 17134843 20168561 22760089 24261282 24448674 23226463 20848044
4999B0848044k924413k895429k486928j846178j328900j085829r02841o01547
$$ 20848044 17923631 15028202 12541274 10695096 9366196 8280367 7377526 6775979
4991F775979n09816l91481k08853m7547m733j36664n5727J26845L29488J98616
$$ 6775979 6266163 5874682 5665829 5618282 5613549 5476885 5421158 5548003 5877491 6076107
4981F076107M92685N76181M12645P18740R33299Q79552R92785Q04455N55111K19733
$$ 6076107 6568792 7144973 7557618 8276358 9209657 10089209 11081994 11886449 12441560 12661293
4971A2661293l76352q64275j171167j279824j005674r19856r00923o28110m15343
$$ 12661293 12284941 11420666 10249499 8969675 7964001 7044145 6143222 5515112 5099769
4962E099769l71649l59185m06677j30974o7064k48794j05638j60553k99068j52402
$$ 5099769 4728120 4368935 3962258 3831284 3764220 3515426 3409788 3249235 2950167 2797765
4952B797765k83871j52748r2818j08939j014M1658l2191k4387j3866k14528k22352
$$ 2797765 2513894 2361146 2268328 2159389 2158375 2200033 2167842 2143455 2129589 1915061 1692709
4941A692709J537j45142p1350j27942Q2282N1886N210N0051k52750l8531l1030
$$ 1692709 1694246 1549104 1477754 1349812 1432094 1483980 1489190 1539241 1286491 1247960 1216930
4930A216930M8520O3007n9600r9265l9236J6855p1887N3328L4736j90286Q1095
$$ 1216930 1265450 1328457 1268857 1169592 1130356 1147211 1075324 1128652 1163388 973102 1054197
4919A054197r9765P2205L6781Q8374J6591j6262P7745j2571P4148J03483J48143
$$ 1054197 954432 1026637 1063418 1151792 1168383 1152121 1229866 1217295 1291443 1394926 1543069
4908A543069Q1587j58608k42211M2174J03606K656j15980q750l6487R8509o5890
$$ 1543069 1624656 1466048 1223837 1266011 1369617 1372273 1256293 1247543 1211056 1309565 1243675
4897A243675L5893p141j33865k8966n7813K245J06307K02543n1241j08721j0904
$$ 1243675 1279568 1272427 1138562 1109596 1051783 1054028 1160335 1362878 1311637 1202916 1192012
4886A192012j9194K15001O1448m2946R5292K0538J19629L8107k4855k7822N2639
$$ 1192012 1172818 1387819 1449267 1406321 1501613 1522151 1641780 1679887 1655032 1627210 1679849
4875A679849J1002K7079R4213r2406m8899q2621j00858j39105n1489L0788P0123
$$ 1679849 1690851 1717930 1812143 1719737 1670838 1588217 1487359 1348254 1296765 1327553 1397676
4864A397676K7570Q6726R8865j22645j15776J00969J62591k9559m0164J11861
$$ 1397676 1425246 1511972 1610837 1488192 1372416 1473385 1635976 1606417 1566253 1678114
4854A678114L1880J32363K89301J45064K40009J73452J93297K61660J16393l5181
$$ 1678114 1709994 1842357 2131658 2276722 2516731 2690183 2883480 3145140 3261533 3226352
4844C226352O0041l8176k84911r1689J4456m7994j06813J40349K24767J05532
$$ 3226352 3286393 3248217 2963306 2871617 2886073 2838079 2731266 2871615 3096382 3201914
4834C201914J77231L41433K99329M10364Q34820J515867K626433L199538K701571
$$ 3201914 3379145 3720578 4019907 4430271 5265091 6780958 9407391 12606929 15308500
4825A5308500R49263m47482q54349k839380l403547k219061j493492r69070o08667
$$ 15308500 16257763 15810281 14955932 12116552 8713005 6493944 5000452 4031382 3422715
4816C422715n16595k98816k45824k19945O1046j97810r5579J06802O7884j76027
$$ 3422715 2906120 2607304 2361480 2141535 2202581 2004771 1909192 2015994 2083878 1907851
4806A907851j46034n912P2981p0304j89604p3373k4114n3815K50501j8370j27093
$$ 1907851 1761817 1755905 1828886 1758582 1568978 1495605 1471491 1417676 1668177 1649807 1522714
4795A522714j7349J79724J31554J18497J66021M30507K70971K58833N26069P29687
$$ 1522714 1505365 1685089 1816643 1935140 2101161 2531668 2802639 3061472 3587541 4317228
4785D317228N52399M78534K81267L3625k18322m36714m72711n95826o26322l37970
$$ 4317228 4869627 5348161 5629428 5663053 5444731 5008017 4535306 3939480 3313158 2975188
4775B975188m39449m15146R054J51632j9984j92574O069P9215j6607j08314J02905
$$ 2975188 2535739 2120593 2129647 2281279 2261295 2068721 2074790 2154005 2137398 2029084 2131989
4764B131989m4341m8608q0845Q4064L9280j18406N9212J14502j50606L133K87218
$$ 2131989 2087648 2039040 1958195 2042259 2081539 1963133 2022345 2136847 1986241 1989374 2276592
4753B276592m0884k3557K16511K3859M8646J74556l4423J5939K10799R5038l7764
$$ 2276592 2235708 2212151 2428662 2452521 2501167 2675723 2641300 2657239 2868038 2963076 2925312
4742B925312P9590M1243J18519K12274J43692J37844M65457K98042K01980K93610
$$ 2925312 3004902 3046145 3164664 3376938 3520630 3658474 4123931 4421973 4623953 4917563
4732D917563K64142N09208L93480L52683L69757N67351Q23615P31924O63609M26532
$$ 4917563 5181705 5690913 6084393 6437076 6806833 7374184 8197799 8929723 9593332 10019864
4722A0019864L90438K64923K93944K18373j12460m0222J49688L69951M76022M57605
$$ 10019864 10410302 10675225 10969169 11187542 11075082 11034860 11184548 11554499 12030521 12488126
4712A2488126N56306J030009J408582J843052K445106L632937N837123R109477
$$ 12488126 13044432 14074441 15483023 17326075 19771181 23404118 29241241 38350718
4704C8350718J0918594R045349L628336k15438j499157n494014r185410q345488
$$ 38350718 49269312 58314661 61942997 61727559 60228402 54734388 45548978 37203490
4696C7203490o160816m253690k906141j988166j242441o64729n18804o07960o82867
$$ 37203490 31042674 26788984 23882843 21894677 20652236 19987507 19468703 18860743 18177876
4687A8177876n99340q81335r94445r50443q81403q76593p31349o48433n80118
$$ 18177876 17578536 16697201 15702756 14752313 13870910 12994317 12262968 11614535 11034417
4678A1034417n71285k05135O6457J29085N4694Q7277J87778J12260k666L41027
$$ 11034417 10463132 10257997 10324454 10453539 10508233 10595510 10783288 10895548 10892882 11233909
4668A1233909L92552L56464O73458P86171Q44287J146891J449131J636550K095639
$$ 11233909 11626461 11982925 12656383 13442554 14286841 15433732 16882863 18519413 20615052
4659B0615052K460748L491511M953613O632109Q656346Q783789O186968K146060
$$ 20615052 23075800 26567311 31520924 38153033 46809379 55593168 61780136 63926196
4651F3926196j429795m319489p815654r141951p839067o212313m923944l730479
$$ 63926196 62496401 58176912 50361258 41219307 33380240 27167927 22243983 18513504
4643A8513504k717958k242590j575797j123164r73649o86378o16182o67371n70800
$$ 18513504 15795546 13552956 11977159 10853995 9880346 9193968 8577786 7910415 7339615
4634G339615l34711j29298k39582j13702P6583J47690M71867P51932P11429N88977
$$ 7339615 7004904 6875606 6636024 6522322 6598905 6746595 7218462 7970394 8681823 9270800
4624I270800K2245k88316n98450j003130q40811n07439m09351m13959M0085O8115
$$ 9270800 9293045 9004729 8406279 7403149 6562338 6054899 5645548 5231589 5271674 5339789
4614E339789P3218J2130K26576L79707M07389K41134L93789J81412J68794J34769
$$ 5339789 5413007 5425137 5651713 6031420 6438809 6679943 7073732 7255144 7423938 7558707
4604G558707L31860L92395O18074P68627N87937K40266J04828L1907L167J08896
$$ 7558707 7890567 8282962 8901036 9669663 10257600 10497866 10602694 10634601 10637768 10746664
4594A0746664O06572O64283M68758K16810j44736m07476o82246o80253m71689
$$ 10746664 11353236 12017519 12486277 12703087 12558351 12150875 11468629 10788376 10316687
4585A0316687k55294j4620k1165k40892o09418o49336p36741o50803m43704l78980
$$ 10316687 10061393 10046773 10025608 9784716 9175298 8525962 7789221 7138418 6694714 6315734
4575F315734k81247l06333m68934m84853m94405n34453m37329l34659l28549k12930
$$ 6315734 6034487 5728154 5259220 4774367 4279962 3745509 3308180 2973521 2644972 2432042
4565B432042o0048l6131q0744j91758K0694k60103j47178K6115N0537m0183j53848
$$ 2432042 2371994 2335863 2255119 2063361 2084055 1823952 1676774 1702889 1753426 1713243 1559395
4554A559395k45568j6105J19927k91j05538j48511Q665j8100K7488n120p6158
$$ 1559395 1313827 1297722 1417649 1417358 1311820 1163309 1171974 1153874 1181362 1176242 1100084
4543A100084j26774m2742n8663M3205J86600r9574l2209p8054j09735p158K2477
$$ 1100084 973310 930568 871905 915110 1101710 1002136 969927 891873 782138 774980 797457
4532G97457p3583J00485M6968o3687N446j1114N4128N5255k05832m5439J24445
$$ 797457 723874 824359 871327 807640 813086 801972 856100 911355 705523 660084 784529
4521G84529J30596J21110j55192k10602r3192M0435P3640j06595o8693J11265
$$ 784529 915125 1036235 881043 670441 577249 617684 691324 584729 516036 627301
4511F27301m5364N0630R5243K1969k9694P5072n947m2954P0883j20116j25758
$$ 627301 581937 632567 727810 749779 720085 795157 789210 746256 817139 697023 571265
4500E71265j79791l9617k3000K4059J4391Q63j34705J19623J16827L467j35182
$$ 571265 391474 351857 328857 352916 367307 368170 233465 353088 469915 473382 338200
4489C38200j04838P6682J18558o3035j03553N1057n9254J03368K6158j01938k8122
$$ 338200 233362 310044 428602 365567 262014 313071 253817 357185 383343 281405 253283
4478B53283l9321J6977r2808m1660l5545J2609Q4299R9083J25369j2535m1973
$$ 253283 213962 230939 138131 96471 60926 73535 157834 256917 382286 369751 327778
4467C27778P7870M0518j43008J395J84410j46204o0182Q2497K4922J59049q5149
$$ 327778 405648 446166 303158 304553 488963 342759 282577 365074 389996 549045 463896
4456D63896p1626k2315n9515M8820J0443j44752j12918J38054K1438M3636J2012
$$ 463896 392270 369955 310440 359260 369703 224951 112033 250087 271525 315161 327173
4445C27173j43557J10970l2301n3454J67816o7262k39093K8060J64423l5793j63878
$$ 327173 183616 294586 262285 208831 376647 309385 70292 98352 262775 226982 63104
4434F3104k3581J4740j4328N5385J28046r5984n8087J9234M1430J14231j3649
$$ 63104 39523 54263 39935 95320 223366 127382 69295 88529 129959 244190 230541
4423B30541j1795J3753n1147Q0681M3175M7686p7936j52967N8636N0171r79J48017
$$ 230541 218746 232499 181352 262033 305208 352894 274958 121991 180627 230798 229819 377836
4411C77836O8379k26024L5255J33259j21829J50562j4346j20922J04131r7770
$$ 377836 446215 220191 255446 388705 266876 417438 403092 282170 386301 288531
4401B88531N111M270J7169p676Q3374K9657p108P4466J2410o3568r1972j25704
$$ 288531 293642 297912 315081 307405 390779 420436 413328 487794 500204 436636 344664 218960
4389B18960J08968P416J09038K4526j32624o6494j05511O3199K6677Q4765l8376
$$ 218960 327928 335344 444382 468908 336284 269790 164279 227478 254155 338920 300544
4378C00544j25069K4172J21991n5239k3616j33007j13169J88018K99812j89422
$$ 300544 175475 199647 321638 266399 242783 109776 -3393 184625 484437 295015
4368B95015m5551j4678o1538J1143Q6537m7231j20134O9105K44842p9846j42513
$$ 295015 249464 234786 173248 184391 270928 223697 103563 172668 417510 337664 195151
4357A95151N2375J29608p0961M1823J38624P8163M9185j55170j53854l0623J10389
$$ 195151 247526 377134 306173 347996 486620 564783 613968 458798 304944 274321 384710
4346C84710l1736n4968M769k3469K13368J35856j52017J3808J1566k7076J4540
$$ 384710 352974 298006 302775 279306 492674 628530 476513 490321 501887 474811 489351
4335D89351P0790l5454j5898p1119o1735k9912k3367j13133j45974j2176J04580
$$ 489351 560141 524687 508789 437670 375935 346023 322656 209523 63549 51373 155953
4324A55953Q0000j6660r1448K239J48929L0226K3417o7426l1047J50648J29220
$$ 155953 235953 219293 127845 130084 279013 309239 332656 265230 234183 384831 514051
4313E14051j54839j37787k6903q6897j4641j12241j8193J28890k8954N6412Q7022
$$ 514051 359212 221425 194522 107625 92984 -19257 -37450 91440 62486 118898 205920
4302B05920j09808J39649P8730j16576M3225O5469o5025j52044K2013j09698J13122
$$ 205920 96112 235761 314491 197915 241140 306609 241584 89540 111553 1855 114977
4291A14977P2127n6287n5959N3577J35021o9856o147M0328J2857O2365l4088J7068
$$ 114977 187104 130817 74858 128435 263456 193600 187453 227781 240638 303003 268915 285983
4279B85983P7697L7861p7969k02559l3247l1356K10985p0520k335L5406O4622
$$ 285983 363680 401541 323572 121013 87766 56410 267395 196875 194540 229946 294568
4268B94568P9060k01674J0027Q5556q7636J20581K8443l6718j37237N6315j8636
$$ 294568 373628 171954 181981 267537 179901 300482 328925 292207 154970 211285 192649
4257A92649l5987q0088q8255J22117R970L1308P7752j32608o1033o0478J64657
$$ 192649 156662 76574 -11681 110436 120406 151714 229466 96858 35825 -24653 140004
4246A40004J24375j20847j29171J17129K9774l7246m4382q3805m8002K2422J59211
$$ 140004 264379 143532 14361 131490 161264 124018 79636 -4169 -52171 -29749 129462
4235A29462N1524k65323J34765J24639p5175l4409N6838M6544J3149R8817N1788
$$ 129462 180986 -84337 50428 175067 99892 65483 122321 168865 182014 280831 332619
4224C32619k2480j59401L8875K8669p7021p6511j1215K4672K1264k21472O5724
$$ 332619 310139 150738 189613 218282 141261 64750 53535 78207 99471 -122001 -56277
4213e6277Q6946n3019j899J16829M2044O1988N4141n0921M3335q5650O0762q937
$$ -56277 30669 -22350 -24249 92580 134624 196612 250753 199832 243167 157517 218279 209342
4201B09342j63736k9105j3339n2821L7690J62781R1428r5072j52769N9456J77351
$$ 209342 45606 16501 3162 -49659 -11969 150812 242240 147168 -5601 53855 231206
4190B31206L9883p9237K4378j7943M9743K3815j5129j66224n5186l2550Q331K2204
$$ 231206 271089 191852 216230 198287 248030 271845 256716 90492 35306 2756 11087 33291
4178C3291q2483k9179n6280j6159Q3017J5820K22709J2392j0657P11q629m4311
$$ 33291 -49192 -78371 -134651 -150810 -67793 -51973 170736 183128 172471 173182 164553 120242
4166A20242R47M7677O3984q4537q9437k51849n0854P6357K33904R456p8770m3232
$$ 120242 121189 168866 232850 148313 58876 -192973 -243827 -167470 66434 75890 -2880 -46112
4154d6112L139P7555j02991j27641J01433J23512R715P1856M4275J63308n0080
$$ -46112 -42973 34582 -68409 -196050 -94617 28895 38610 110466 154741 318049 267969
4143B67969j13000j30404J7708Q5655J88084K186k28960k7956q7826l9656K04475
$$ 267969 154969 24565 42273 127928 316012 318198 89238 61282 -26544 -66200 138275
4132A38275J15926m4128L0298p8081j03458K4611O4671K7403R1194q177p0887
$$ 138275 254201 210073 240371 162290 58832 83443 148114 175517 266711 258534 187647
4121A87647Q5005l5097j11075L0561k6003o7882J25734P8083p2587L8614q9404
$$ 187647 272652 237555 126480 157041 131038 63156 188890 266973 194386 233000 143596
4110A43596j59801K4182L7533P1824J02144o101l3556O5598j04585o4807J7145
$$ 143596 -16205 7977 45510 117334 219478 213377 179821 245419 140834 76027 93172
4099I3172M4338P6109J44184j07394M8936N5448p5434q6626j5939j42683n6674
$$ 93172 137510 213619 357803 250409 299345 354793 279359 192733 176794 34111 -22563
4088b2563K01819O9102j11971j05109k4813J68688P1496J19553P0894l0022j10012
$$ -22563 179256 248358 136387 31278 6465 175153 246649 366202 437096 407074 297062
4077B97062O3141J46626j39348j99296P2319J43989J51908m054J50910N8651p7537
$$ 297062 360203 506829 367481 168185 240504 384493 536401 532347 683257 741908 664371
4066F64371J01874M46296M84326L97891O18647K32278q9313j53515m27210m92950
$$ 664371 766245 1212541 1696867 2094758 2713405 2945683 2856370 2702855 2275645 1782695
4056A782695n23276k52474M1762k20016j21361l4279Q790j15504j52652k1112
$$ 1782695 1259419 1006945 1048707 828691 707330 673051 681841 566337 413685 392573
4046C92573J20998l5714l30872O6086L7418j66126Q3589J18156Q2398k8487L0478
$$ 392573 513571 477857 146985 213071 250489 84363 167952 286108 368506 340019 370497
4035C70497O5238j21224j13458N1889K40701r4237r6866O1437p377j56338j11458
$$ 370497 435735 314511 201053 252942 493643 399406 302540 363977 356600 200262 88804
4024H8804J17674o6165o5109J00316j0170J08226m4594j37293n9953q5874R9103
$$ 88804 206478 140313 75204 175520 165350 273576 228982 91689 31736 -54138 44965
4013D4965K08616k7923k10757o7338J61313L3315O445r3813J2655J73539q4126
$$ 44965 253581 225658 14901 -52437 108876 142191 148636 54823 67478 241017 156891
4002A56891R236N2935K481k2342K9743K3251J5410L6543l2440j30487M9299m6885
$$ 156891 166127 219062 221543 199201 228944 252195 267605 304148 271708 141221 190520 143635
3990A43635R4909l2771QQ5686K5588r7438n3384p4556k2799R0624L6214q3195
$$ 143635 238544 205773 205781 291467 317055 219617 166233 91677 68878 159502 195716 112521
3978A12521J5183K7295O1697r6256J4628M5615P650J03985p1610j0515J69474
$$ 112521 127704 154999 216696 120440 135068 180683 188333 292318 220708 210193 379667
3967C79667k7999n3683l7004M4907n7245K5237J25628O2908j14416J44699P6997
$$ 379667 351668 297985 260981 305888 248643 273880 399508 462416 348000 492699 569696
3956E69696j7894K36418R6730O1537N05653N26592M02703K36398j74037r3779
$$ 569696 551802 788220 884950 946487 1452140 1978732 2381435 2617833 2443796 2350017
3946B350017l99634n74918k74117j67510j23288Q6098p6196r6189l5259j84704
$$ 2350017 1950383 1375465 1101348 933838 810550 896648 820452 724263 689004 504300
3936E04300j86266K30345P8517j06284n8924k6127K4098P1420M0607O2951m4992
$$ 504300 318034 548379 626896 520612 461688 435561 459659 531079 571686 634637 589645
3925E89645K1244J95296J58625K47145L83445O01919K56842R5552J06158L231
$$ 589645 610889 806185 964810 1211955 1595400 2197319 2454161 2549713 2655871 2659102
3915B659102m86066m10342m20164m35134j55773j52124R1242j17004l9089L0188
$$ 2659102 2173036 1762694 1342530 907396 751623 599499 690741 573737 534648 564836
3905E64836n3354r6323L5738l1390k7695j75718m611J9028J43193j0975R9654
$$ 564836 511482 415159 450897 419507 391812 216094 211483 230511 373704 362729 462383
3894D62383k2881p0437J9611L3858R3804O2646O180j37305j26180J7462L2854
$$ 462383 439502 369065 388676 422534 516338 578984 585164 447859 321679 339141 371995
3883C71995p2155O6130p6742P25o5250O2861J19339J18058l14788j02549J13455
$$ 371995 299840 365970 289228 289953 224703 287564 406903 524961 210173 107624 221079
3872B21079m8978J57873P6931p2879l3512P4953P1423P1263j28517l8119P4314
$$ 221079 172101 329974 406905 334026 300514 375467 446890 518153 389636 351517 425831
3861D25831R45o5400R2210r0707j3771o6582M5528p5494n1927N2005J66311J3870
$$ 425831 426776 361376 453586 362879 349108 282526 328054 252560 200633 252638 418949 432819
3849D32819R418m5513j07461J41316m1995q1384J40182K3643r5608L2598n8241
$$ 432819 442237 396724 289263 430579 388584 307200 447382 471025 375417 408015 349774
3838C49774J116p3861N4705k1548J42897L1593o591r915j03188n1035K1635R6365
$$ 349774 350890 277029 331734 310186 453083 484676 478085 468170 364982 313947 335582 431947
3826D31947n3103J32371O8173P4958q7779q8885p024q7018K8410O9199o6066L6158
$$ 431947 378844 511215 579388 654346 566567 477682 470658 383640 412050 481249 415183 451341
3814D51341J9653p8126m3671r6254N9023K37052J12993k78075L5603k5297j6072
$$ 451341 470994 392868 349197 252943 311966 549018 662011 383936 419539 394242 378170
3803C78170K08930k0594r1869K7922M001J34633j60322r7762Q7453L3066o4989
$$ 378170 587100 566506 474637 502559 506560 641193 480871 383109 470562 503628 438639
3792D38639J25292P980o2447N2944j24132j45379P1879P3921L1488J6917J12067
$$ 438639 563931 571911 509464 562408 438276 292897 364776 438697 470185 487102 599169
3781E99169k06991j95060Q3244J02105P1120Q3884j13892j89693J68039J12264
$$ 599169 392178 197118 280362 382467 453587 537471 423579 233886 401925 514189
3771E14189o7907J68624j18417j24579J97728q1664j3952l7358J18682J73800
$$ 514189 446282 614906 496489 371910 569638 487974 474022 436664 555346 729146
3761G29146j56737j69155J68637Q8446n6440j64905j96944L5379J82940o2010
$$ 729146 572409 403254 571891 660337 603897 438992 242048 277427 460367 398357
3751C98357N5877l8440j76131O7274N8222O0567K12048J61813j01561j64024n7296
$$ 398357 454234 415794 239663 306937 365159 425726 637774 799587 698026 534002 476706
3740D76706J972P5111M6503j02972N9372r0237j98514N5555J42458N4873o8219
$$ 476706 478678 553789 600292 497320 556692 466455 267941 323496 465954 520827 452608
3729D52608Q0876N6010Q1099l5978r7599l6326n8738j0000P5362L8124L5249m233
$$ 452608 533484 589494 670593 634615 537016 500690 441952 431952 507314 545438 580687 576454
3717E76454q7470k8692M8014N0089P1489N5729j37397j6652q4643j6378Q8340
$$ 576454 488984 460292 508306 558395 629884 685613 548216 531564 446921 430543 518883
3706E18883K1094j828J42786O4746j48521m9303j50008k1036J53103J15277j71945
$$ 518883 539977 538149 680935 745681 597160 547857 397849 376813 529916 645193 473248
3695D73248r1976N2471l8820k703J10390n2873k8884P9618K35852J4387j29903
$$ 473248 381272 433743 394923 392220 502610 449737 420853 500471 736323 750710 620807
3684F20807j68596o1473O7124J18822J31677Q2573J2478l24850o3711J42216p0572
$$ 620807 452211 390738 457862 576684 708361 790934 803412 478562 414851 557067 486495
3673D86495p8970K53413O7653j82364P3836j17178j54402J77001J6580J4787J11146
$$ 486495 407525 660938 728591 546227 620063 502885 348483 525484 542064 556851 667997
3662F67997M8543R8175r0674l11064K4081J46837j35194M0460K29099P8l6199
$$ 667997 716540 814715 724041 412977 437058 583895 448701 489161 718260 718338 682139
3651F82139j16249L7769K6708j18295J12584J26043m0470j34661J01720p4907
$$ 682139 565890 603659 630367 512072 624656 750699 710229 575568 677288 602381
3641F02381q3211N2609o7682O4766J57402M7707o4571j20947m2913j07477J27451
$$ 602381 519170 571779 504097 568863 726265 773972 709401 588454 545541 438064 565515
3630E65515R826j11634J97023N1168n3355K44985l1744k66344p4271J02942J50678
$$ 565515 575341 463707 660730 711898 658543 903528 871784 605440 531169 634111 784789
3619G84789M1563r5967j39361m6943O5734J62199n9881o248m2639L8777J63444
$$ 784789 826352 730385 591024 544081 609815 772014 712133 705885 663246 702023 865467
3608H65467p98p8906j73155k6901J96701J08199m032J83938J37905k11286m3648
$$ 865467 864669 785763 612608 585707 782408 890607 886575 1070513 1208418 997132 953484
3597I53484o2424K6340Q3495m4376q4033M3251n7750O6626q0100K0406J19125
$$ 953484 891060 917400 1000895 956519 872486 915737 857987 924613 844513 864919 984044
3586I84044k4849l3817J74432N078N422O9352j09456N0753O4331p896J29947R0789
$$ 984044 959195 925378 1099810 1104888 1110310 1179662 1070206 1120959 1185290 1177394 1307341 1398130
3574A398130j5953j2728n4200J84771k691J22529k8471k62991p9543O1705m7791
$$ 1398130 1382177 1369449 1315249 1500020 1497329 1619858 1591387 1328396 1248853 1310558 1262767
3563A262767M2265l4818K8631P3960K0909J37076P6800p2085J13825J81613j30897
$$ 1262767 1305032 1270214 1298845 1372805 1393714 1530790 1607590 1535505 1649330 1830943 1700046
3552A700046J4751j9555m5011l4596r5784K5823R4131k9098M8704J05804j5526
$$ 1700046 1714797 1695242 1650231 1615635 1519851 1545674 1639805 1610707 1659411 1765215 1749689
3541A749689p164K45528J64051k9063R9743J99848j73831N7825J40008j18749
$$ 1749689 1742525 1988053 2152104 2123041 2222784 2422632 2248801 2306626 2446634 2327885
3531B327885j37376J72293J66141J17554N715o2746J35339J30583J23693J76113
$$ 2327885 2190509 2362802 2528943 2646497 2652212 2589466 2724805 2855388 2979081 3155194
3521C155194J35547L9923J11819K34594L29069L7922M63559O07600M54479P01688
$$ 3155194 3290741 3330664 3442483 3677077 4006146 4044068 4507627 5115227 5569706 6271394
3511F271394R77823J061670R68093O64386K93559j7505m99452q55520q57513o99786
$$ 6271394 7249217 8310887 9278980 9943366 10236925 10219420 9719968 8864448 8006935 7307149
3501G307149n66970o40189m10028k6409r1476j4535P2276k22445O24R3397M3451
$$ 7307149 6740179 6099990 5689962 5663553 5572077 5557542 5629818 5407373 5407997 5501394 5544845
3490E544845O3404K64840J40196L58354K20747K53616N09986M40747M71799Q60324
$$ 5544845 5608249 5873089 6013285 6371639 6592386 6846002 7355988 7796735 8268534 9128858
3480I128858J103477J508080J992710K347504K158681J318443N82870j36839j032027
$$ 9128858 10232335 11740415 13733125 16080629 18239310 19557753 20140623 20003784 18971757
3471A8971757j770355j607250j415172j022056q49335l84815j92995j27409K05074
$$ 18971757 17201402 15594152 14178980 13156924 12307589 11922774 11729779 11602370 11807444
3462A1807444L40789J44657K61028K65619P2945K3202L0496Q231l65789m61729
$$ 11807444 12148233 12292890 12553918 12819537 12892482 12915684 12946180 12954411 12588622 12126893
3452A2126893l81105l50718o83550n16089j95028j22497K05787N12065M82563
$$ 12126893 11745788 11395070 10711520 10195431 10000403 9877906 10083693 10595758 11078321
3443A1078321M57884K86164l0026m71097p61772r57160r48827q83229p77467n58829
$$ 11078321 11536205 11822369 11792343 11321246 10559474 9602314 8653487 7770258 6992791 6433962
3433F433962m64584m73611o50314k14938K8343k60522k8583p2545l95282k27416
$$ 6433962 5969378 5495767 4845453 4630515 4658858 4398336 4369753 4297208 3901926 3674510
3423C674510J39935R5889k63637n1456P3758j31750j51140J24921J17801k24646
$$ 3674510 3814445 3910334 3646697 3595241 3668999 3537249 3386109 3511030 3628831 3404185
3413C404185j09784K150j6309O1393k27402k90069j20280O998N9731J0152q5641
$$ 3404185 3294401 3296551 3280242 3341635 3114233 2824164 2703884 2710882 2770613 2780765 2695124
3402B695124r8952L4018o1802j16503n2113k1521n9509j66148j07130q6759K3475
$$ 2695124 2596172 2630190 2568388 2451885 2399772 2378251 2318742 2152594 2045464 1958705 1982180
3391A982180N4077N4434m3942q2751K00364P5033p0490J17430m2359O4190r308
$$ 1982180 2036257 2090691 2046749 1963998 2164362 2239395 2168905 2286335 2243976 2308166 2298858
3380B298858l2975j52797J2669j33977j50132l6986p7330n9864J43115k2190o1332
$$ 2298858 2265883 2113086 2125755 1991778 1841646 1804660 1727330 1667466 1810581 1788391 1727059
3369A727059q9818J03235L3983L7395J17288n605j39486j55713j9898M021J9369
$$ 1727059 1637241 1740476 1774459 1811854 1929142 1923537 1784051 1628338 1608440 1612461 1631830
3358A631830j73978M3559r3895j52742P5752R8622R6645L4541k28278K02140J88616
$$ 1631830 1457852 1501411 1407516 1254774 1330526 1429148 1525793 1560334 1332056 1534196 1722812
3347A722812l1053o1279l3618r2629j06941n6956l8192N4950r562K14871Q8943
$$ 1722812 1691759 1630480 1596862 1504233 1397292 1340336 1302144 1357094 1347532 1562403 1651346
3336A651346k46675j4710q4904K4455P4623k4462q2199o5573o0540K2732j14062
$$ 1651346 1404671 1389961 1305057 1329512 1404135 1379673 1297474 1231901 1171361 1194093 1080031
3325A080031q749n1296l4988K3122J74603J05968J5790j15162j43169q502l1639
$$ 1080031 1071282 1019986 984998 1008120 1182723 1288691 1304481 1189319 1046150 1037648 1006009
3314A006009N1301P146q8482j23298J8916q1037J6788O1634j24186M1746J73606
$$ 1006009 1057310 1064456 975974 852676 871592 790555 807343 868977 744791 786537 960143
3303I60143J5420Q0852j19739l8644J25613J12281k5082K7482r0029r0222J05081
$$ 960143 975563 1056415 936676 898032 1023645 1135926 1110844 1138326 1048297 958075 1063156
3292A063156n9957j01306j10101j33222J29479J28609Q7347j32834j61115j9973
$$ 1063156 1003199 901893 791792 658570 788049 916658 1004005 871171 710056 690083
3282F90083K5389Q9056j0727N5225o8641k1646J2453l5089J5261o1400n3834J33722
$$ 690083 715472 804528 793801 849026 780385 758739 771192 736103 751364 689964 636130 769852
3270G69852Q3675n0148p5540J91057Q082l8088m9072m2261o5220K2531J12229
$$ 769852 853527 803379 727839 918896 926978 888890 839818 797557 732337 754868 867097
3259H67097o5665J9591L5822j17726q0159J34735J35017j09520j06544j46288
$$ 867097 801432 821023 856845 739119 658960 793695 928712 819192 712648 566360
3249E66360n2076Q2576k2286l0912R8736k6670K4862m0664M9373J17446o5068
$$ 566360 514284 596860 574574 543662 642398 615728 640590 599926 649299 766745 701677
3238G01677r2957K8048J9857R9803K20499J7124m8443n7619l6672P149M9735m6259
$$ 701677 608720 636768 656625 756428 976927 994051 945608 887989 851317 858466 908201 861942
3226H61942J26160p9838n7230k13953K5413J41427j17126J465K02859o2255j28237
$$ 861942 988102 908264 851034 637081 662494 803921 686795 688260 891119 828864 700627
3215G00627J54224N2810j6024k5195j67479J44084J19576k07201J54343k1276
$$ 700627 854851 907661 891637 866442 698963 843047 962623 755422 909765 888489
3205H88489l2330O7197Q5339R216l83j7546o539R4315L9229M9379j1376j5395
$$ 888489 856159 923356 1008695 1017911 1017528 999982 993443 1087758 1126987 1176366 1164990 1149595
3193A149595N7167Q3091j64845k5464K5050P9635K3983M6922O974n9870k0482
$$ 1149595 1206762 1289853 1125008 1099544 1124594 1204229 1228212 1275134 1282108 1222238 1201756
3182A201756J1286k1244J25312J29926j3724q78o2495J22988n1390q2078J60788
$$ 1201756 1213042 1191798 1317110 1447036 1433312 1432434 1369939 1492927 1441537 1359459 1520247
3171A520247J47235n6268P9780Q7646p8458l0954j30250J0331J34240P0728r075
$$ 1520247 1667482 1611214 1690994 1778640 1700182 1669228 1538978 1549309 1683549 1754277 1745202
3160A745202J22251o2845l1324j0282O5221P2039K06224K52796p1582j07562o1953
$$ 1745202 1867453 1804608 1773284 1763002 1828223 1900262 2106486 2359282 2287700 2180138 2118185
3149B118185J10080j527L1945k6445q5448m6383P5674J36814J4118P3357n5582
$$ 2118185 2228265 2226738 2258683 2232238 2146790 2100407 2176081 2312895 2327013 2400370 2344788
3138B344788r7079J28905L35543J80162J61238J19833N2945R2599J86205K26163
$$ 2344788 2247709 2376614 2712157 2892319 3053557 3173390 3226335 3318934 3505139 3731302
3128C731302R5490j21573l23442p5186j88979j78416J1027M234k47084k26765
$$ 3731302 3826792 3705219 3381777 3306591 3117612 2939196 2950223 2954457 2707373 2480608
3118B480608j2069K0985L7832L6124m831o1665Q230P2695O0236K9072J17539K7141
$$ 2480608 2468539 2489524 2527356 2563480 2558649 2496984 2505214 2577909 2638145 2667217 2784756 2811897
3106B811897K1293P9196J96794J49532K01718J21763P46J8052j60717o2639M4605
$$ 2811897 2833190 2912386 3109180 3258712 3460430 3582193 3582939 3600991 3440274 3377635 3422240
3095C422240p0103l64216k06845j60185J18405j84413j02396N2258o6915j66789
$$ 3422240 3352137 2987921 2781076 2620891 2739296 2554883 2452487 2504745 2437830 2271041
3085B271041R64r3026j15251K0371k62503l1203O9690M3688J79102J61744p5780
$$ 2271041 2272005 2178979 2063728 2084099 1821596 1790393 1860083 1903771 2082873 2244617 2168837
3074B168837j05339M4908J09927j62109k1552m3927n7727p8873j22008k6839j30986
$$ 2168837 2063498 2108406 2218333 2056224 2034672 1990745 1933018 1854145 1732137 1705298 1574312
3063A574312j76230R4452J44653k99269p5080J08114j61452j22206o1775o21k4928
$$ 1574312 1398082 1492534 1637187 1337918 1262838 1370952 1209500 1087294 1025519 1024898 999970
3052I99970r9195J19627Q4125j647O840m2558K6876r2919k6560R0049o7758j24722
$$ 999970 900775 1020402 1104527 1102880 1109720 1067162 1094038 1001119 974559 1064608 996850 872128
3040H72128R3635J4152j20873m7532r9504J17845K3806k16568L0422l1240l2423
$$ 872128 965763 979915 859042 811510 712006 829851 853657 637089 667511 636271 603848
3029F03848J22797p0468j09012N3568O173K5666L0443j72091Q2571k3332q5330
$$ 603848 726645 656177 547165 600733 606906 632572 663015 490924 573495 550163 464833
3018D64833Q6220L259k7513q056p2723n4486j2578J23906p30Q8682K4099j36067
$$ 464833 551053 554312 526799 518743 446020 391534 378956 502862 502132 590814 614913 478846
3006D78846m2066L8992Q1646r1141J7431j22131j22700P718p357Q0332N7168o9296
$$ 478846 436780 475772 557418 466277 483708 361577 238877 246595 239238 319570 376738 307442
2994C07442O5542j05204M7499Q4357j1610M5122j1628o2895j8749J06971J04062
$$ 307442 372984 267780 315279 399636 388026 433148 421520 358625 339876 446847 550909
2983E50909j1241j02313n3519J3137m0886L2389j48852j19061j42217N9643K02167
$$ 550909 539668 437355 383836 396973 356087 388476 239624 120563 -21654 37989 240156
2972B40156k9433k68858M8463R0319J8068L2349N8641j560l4794O639R3275k7479
$$ 240156 210723 -58135 -9672 80647 98715 131064 189705 188145 153351 159990 253265 225786
2960B25786q4035K1970l7635M9620q501L9683K4790P153j37450P5845n0511n5624
$$ 225786 141751 163721 126086 175706 167205 206888 231678 238831 101381 177226 126715 71091
2948G1091R4333J01131K7728p1358p3347J21454l7642j0355K7992o2307q6885
$$ 71091 165424 266555 294283 222925 149578 271032 233390 223035 251027 188720 101835
2937A01835J3628r9040J34030J1776p4785j9493K2810R8117j529o7281q017j41098
$$ 101835 115463 16423 150453 162229 87444 67951 90761 188878 187349 120068 112051 -29047
2925b9047n3510J11666k4077o092J3152J18053j7859j28682o9873K29249N0230
$$ -29047 -82557 29109 5032 -1060 12092 130145 112286 -16396 -86269 142980 193210
2914A93210N7240n7439q5246O8412K07102k7930q7640j69997n3055J48229l2584
$$ 193210 250450 193011 107765 176177 383279 355349 267709 97712 44657 192886 160302
2903A60302j53613k9839k1266q3412k988K43707R1765j21333K042L118k8475N1798
$$ 160302 6689 -23150 -44416 -127828 -130816 112891 204656 83323 85365 88483 60008 111806
2891A11806M1406r2688o7705K2145J54590j9998k21664J8764M074r5172J89549
$$ 111806 153212 60524 -7181 14964 169554 149556 -72108 -53344 -49270 -144442 45107
2880D5107j9273L9690j1050o5894R9082j26968P0833J36543r5212r4834N8824
$$ 45107 25834 65524 54474 -11420 87662 -39306 31527 168070 72858 -21976 36848
2869C6848N5207P8009N1773k05240n372M5126R564Q2315j12779p6910O0719m8085
$$ 36848 92055 170064 221837 16597 11225 56351 65915 148230 35451 -41459 19260 -28825
2857b8825q400M590L1156K7153J3802o4408m3446j71953N230J74725J23548n5109
$$ -28825 -37225 -32635 -1479 25674 39476 -24932 -68378 -240331 -235101 -60376 63172 8063
2845H063j15947n046j9591N5656M763M892n0887L5265J7373O8941n8234j435l8391
$$ 8063 -107884 -112930 -132521 -76865 -72102 -67210 -118097 -82832 -65459 3482 -54752 -56187 -94578
2832i4578N1159K938K6586L9766q1908p800j39304J6430J2807M8798J6765J3280
$$ -94578 -43419 -40481 -13895 25871 -56037 -63837 -203141 -186711 -173904 -125106 -108341 -95061
2820i5061o704K6793j5513J35640J03733N7754j0638j25684p2926m2553l3500
$$ -95061 -101765 -74972 -90485 45155 148888 206642 196004 70320 -2606 -45159 -78659
2809g8659p3625l2891P3329J88452q2658k24504R5007P5022n2782J15049J5815
$$ -78659 -152284 -185175 -111846 76606 -6052 -230556 -135549 -60527 -113309 1740 17555
2798A7555m0882N1902O663J12730j22223j58181q7834O7820k777j4357N0269k9421
$$ 17555 -23327 28575 35238 147968 25745 -132436 -220270 -152450 -155227 -169584 -119315 -148736
2786a48736j54811N2401J23398J52768O3972l2516j3158N458K2872j76499J5045
$$ -148736 -303547 -251146 -127748 25020 88992 56476 43318 48776 71648 -104851 -89806
2775h9806j13132m6031J71648j08311o6631J24368R3489r1974M069J03042l0300
$$ -89806 -202938 -248969 -77321 -185632 -252263 -127895 -34406 -126380 -122311 -19269 -49569
2764d9569K6980N2940l7409r691o7673o0250N71N6163J41460O3114n9967o6373
$$ -49569 -22589 30351 -7058 -16749 -84422 -144672 -144101 -87938 53522 116636 56669 -9704
2752i704n8934q3212R2002P0868m9366j78184L2107R2362R6985q201o4536n8776
$$ -9704 -68638 -151850 -59848 11020 -38346 -216530 -184423 -92061 4924 -3277 -67813 -126589
2740a26589j37959J1350J69018r0012p7685j21966O1051J44547J18985P3366O3759
$$ -126589 -264548 -253198 -84180 -174192 -251877 -373843 -312792 -168245 -49260 24106 87865
2729H7865p4870q603o7619j02822K270N7634l5860J0132l7616O0195O2240k582
$$ 87865 12995 4392 -63227 -166049 -163779 -106145 -142005 -131873 -169489 -109294 -47054 -49636
2717d9636l7367M9205Q9488l2967j32619j7103q7675r9496M3795j4920j0690J23300
$$ -49636 -87003 -37798 51690 18723 -113896 -130999 -218674 -318170 -274375 -289295 -299985 -176685
2705a76685K8894L9442J08778m7799j06665m5118L0782J24360J0194r2495r8794
$$ -176685 -147791 -108349 429 -47370 -154035 -199153 -168371 -44011 -33817 -126312 -225106
2694b25106m7496P2782J53110p1254M2194P9226j10146J8620j09163o0390P2655
$$ -225106 -272602 -199820 -46710 -117964 -75770 3456 -106690 -88070 -197233 -257623 -184968
2683a84968L4574R335L6750j51936Q6012P1965J12055o0348j12905O6806j813
$$ -184968 -150394 -141059 -104309 -256245 -170233 -98268 13787 -46561 -159466 -92660 -94473
2672i4473n0617N7405j4641j13401K18259O050r5625K7526M6726R8621j03658
$$ -94473 -145090 -87685 -102326 -215727 2532 8582 -87043 -59517 -12791 85830 -17828
2661a7828j06251R5601O2583m3507L1504n7213p11j11944k4187m1804N0360j82769
$$ -17828 -124079 -28478 34105 -9402 22102 -35111 -35822 -147766 -171953 -213757 -163397 -346166
2649c46166M0948K4456k6190k0593O3003p931J2725K0641J38044m6928l7217M0547
$$ -346166 -305218 -280762 -306952 -327545 -264542 -272473 -259748 -239107 -101063 -147991 -185208 -144661
2637a44661j327n7384j11673m4850J79769L3851j1871N566r8192P4517K92683
$$ -144661 -145988 -203372 -315045 -359895 -180126 -146275 -158146 -152580 -250772 -176255 116428
2626A16428k7242j20214j19647m5688K61766j3102q2250l2814L5124J5332J6345
$$ 116428 89186 -31028 -150675 -196363 65403 52301 -29949 -62763 -27639 -12307 4038
2615D038m7727l0930r8021J41326Q1780o2387j245R0659o9945l6152k2795q2066
$$ 4038 -43689 -74619 -172640 -31314 50466 -11921 -13166 77493 7548 -28604 -51399 -133465
2603a33465j0808L8417J26870N6012j39978N9452K98735L7415J781K5702j02753
$$ -133465 -144273 -105856 21014 77026 -62952 -3500 295235 332650 334431 360133 257380
2592B57380k4743k5576j49412n6498n1178p2880Q5777Q7307j32842j03409L1849
$$ 257380 232637 207061 57649 1151 -50027 -122907 -37130 50177 -82665 -186074 -154225
2581a54225J154j6230n8831O9979J378r8979J18484L5811k76185o0631J82106
$$ -154225 -153071 -169301 -228132 -158153 -156775 -255754 -137270 -101459 -377644 -438275 -256169
2570b56169j8430j12878J48731r226l3240l164n600J8760K1972p0817R3493m2879
$$ -256169 -274599 -387477 -238746 -247972 -281212 -284376 -289976 -271216 -249244 -320061 -226568 -269447
2558b69447p7519O8972J66020n7372M3937N6431k7318Q5006O2703n1313L0648
$$ -269447 -346966 -277994 -111974 -169346 -125409 -68978 -96296 -11290 51413 100 30748
2547C0748j49582j27393J49304O0035j60536l4613q20L1872J43543q1422k5233
$$ 30748 -118834 -246227 -96923 -36888 -197424 -232037 -232857 -200985 -57442 -138864 -164097
2536a64097L6374n1146L7220J12467n1844O8331N2571q897k7642n5975p5229R1320
$$ -164097 -127723 -178869 -141649 -29182 -81026 -12695 39876 30979 3337 -52638 -127867 -36547
2524c6547J82272l0385j46718j66548J7854J08872K1779n5687j41481j0304J19123
$$ -36547 145725 115340 -31378 -197926 -180072 -71200 -49421 -105108 -246589 -256893 -137770
2513a37770J86011k6591j48465J1975m1610j57125N1420N8269j76787j3395P0479
$$ -137770 48241 21650 -126815 -114840 -156450 -313575 -262155 -203886 -380673 -394068 -323589
2502c23589P307l0451J27322M0909Q8728n5362O6950o9615L2843N5395o5466K115
$$ -323589 -316282 -346733 -219411 -178502 -89774 -145136 -78186 -147801 -114958 -59563 -125029 -122914
$$ [...]
##END NTUPLES=NMR SPECTRUM
##END=
