##TITLE=1H_EC-3362-x
 200.13MHz, DMSO,
 8 sc
 
 2.10.2025
##JCAMPDX= 6.0         $$ Bruker NMR JCAMP-DX V2.0
##DATA TYPE= NMR SPECTRUM
##DATA CLASS= NTUPLES
##ORIGIN= UXNMR, Bruker Analytische Messtechnik GmbH
##OWNER= pz
$$ XWIN-NMR		Version 3.5
$$ Thu Oct  2 15:56:44 2025 Russian Standard Time (UT+4h)  she@DPX200
##.OBSERVE FREQUENCY= 200.1313
##.OBSERVE NUCLEUS= ^1H
##.ACQUISITION MODE= SIMULTANEOUS
##.ACQUISITION SCHEME= undefined
##.AVERAGES= 8
##.DIGITISER RES= 18
##SPECTROMETER/DATA SYSTEM= spect
##.PULSE SEQUENCE= zg30
##.SOLVENT NAME= DMSO
##.SHIFT REFERENCE= (INTERNAL, DMSO, 0, 15.3612)
##AUDIT TRAIL= $$ (NUMBER, WHEN, WHO, WHERE, WHAT)
$$ ##TITLE= Audit trail, XWIN-NMR		Version 3.5
$$ ##JCAMPDX= 5.01
$$ ##ORIGIN= Bruker BioSpin GmbH
$$ ##OWNER= she
$$ F:/spectra/data/she/nmr/H-C/1/pdata/1/auditp.txt
$$ ##AUDIT TRAIL=  $$ (NUMBER, WHEN, WHO, WHERE, WHAT)
(   1,<2025-10-02 15:55:30.03 +0400>,<she>,<DPX200>,
      <created by zg, POWCHK disabled, PULCHK disabled
       configuration hash MD5:
       00 E9 B6 7A A2 85 ED C7 34 08 36 98 17 FE 4E 26
       data hash MD5: 16K
       5F 47 AE 7A 76 A2 8D F5 93 8A E1 4B 3F 46 9E 9A>)
(   2,<2025-10-02 15:55:32.29 +0400>,<she>,<DPX200>,
      <Start of raw data processing
       efp BC_mod = 2 LB = 0.25 FT_mod = 6 PKNL = 1 PHC0 = -2060.073 PHC1 = 3.192242 SI = 16K 
       data hash MD5: 16K
       FC 63 57 CE D0 84 AD F1 BC 9E 21 72 E2 FD 74 09>)
(   3,<2025-10-02 15:55:53.79 +0400>,<she>,<DPX200>,
      <pk PHC0 = 7.358335 PHC1 = -23.6 
       data hash MD5: 16K
       06 E3 E5 F0 9E F5 32 0B 1B 08 AE 55 2E FF E1 47>)
(   4,<2025-10-02 15:55:59.04 +0400>,<she>,<DPX200>,
      <abs ABSG = 5 
       data hash MD5: 16K
       89 25 29 DB 7D DC 6A E7 FB CC 67 F3 BA 64 20 50>)
$$ ##END=
$$ 
$$ hash MD5
$$ A3 91 43 A0 2B 7E 55 BD 94 03 3D 0D B2 DB 91 F6
##$RELAX= 
##$RELAX= 
##$RELAX= 
##$RELAX= 
##$RELAX= 
##$RELAX= 
$$ Bruker specific parameters
$$ --------------------------
##$DU= <F:/spectra>
##$EXPNO= 1
##$NAME= <H-C>
##$PROCNO= 1
##$TYPE= <nmr>
##$USER= <she>
##$AMP= (0..31)
100 100 100 100 100 100 100 100 100 100 100 100 100 100 100 100 100 100 
100 100 100 100 100 100 100 100 100 100 100 100 100 100 
##$AQSEQ= 0
##$AQ_mod= 1
##$AUNM= <au_zg>
##$AUTOPOS= <>
##$BF1= 200.13
##$BF2= 200.13
##$BF3= 200.13
##$BF4= 200.13
##$BF5= 200.13
##$BF6= 200.13
##$BF7= 200.13
##$BF8= 200.13
##$BYTORDA= 1
##$CFDGTYP= 0
##$CFRGTYP= 5
##$CHEMSTR= <none>
##$CNST= (0..31)
1 1 145 1 1 1 1 1 1 1 1 1 1 1 1 1 1 1 1 1 1 1 1 1 1 1 1 1 1 1 1 1 
##$CPDPRG= <>
##$CPDPRG1= <>
##$CPDPRG2= <>
##$CPDPRG3= <>
##$CPDPRG4= <mlev>
##$CPDPRG5= <mlev>
##$CPDPRG6= <mlev>
##$CPDPRG7= <mlev>
##$CPDPRG8= <mlev>
##$CPDPRGB= <>
##$CPDPRGT= <>
##$D= (0..31)
0 0.7 0 0 0 0 0 0 0 0 0 0.03 0 0 0 0 0 0 0 0 0 0 0 0 0 0 0 0 0 0 0 0 
##$DATE= 1759406129
##$DBL= (0..7)
120 120 120 120 120 120 120 120 
##$DBP= (0..7)
150 150 150 150 150 150 150 150 
##$DBP07= 0
##$DBPNAM0= <>
##$DBPNAM1= <>
##$DBPNAM2= <>
##$DBPNAM3= <>
##$DBPNAM4= <>
$$ [...]
##$SUBNAM3= <"">
##$SUBNAM4= <"">
##$SUBNAM5= <"">
##$SUBNAM6= <"">
##$SUBNAM7= <"">
##$SUBNAM8= <"">
##$SUBNAM9= <"">
##$SW= 18.0517328524113
##$SWIBOX= (0..15)
0 0 2 0 0 0 0 0 0 0 0 0 0 0 0 0 
##$SW_h= 3612.71676300578
##$TD= 16384
##$TD0= 1
##$TE= 0
##$TE2= 300
##$TE3= 300
##$TEG= 300
##$TL= (0..7)
0 120 120 120 120 120 120 120 
##$TP= (0..7)
150 150 150 150 150 150 150 150 
##$TP07= 0
##$TPNAME0= <>
##$TPNAME1= <>
##$TPNAME2= <>
##$TPNAME3= <>
##$TPNAME4= <>
##$TPNAME5= <>
##$TPNAME6= <>
##$TPNAME7= <>
##$TPOAL= (0..7)
0.5 0.5 0.5 0.5 0.5 0.5 0.5 0.5 
##$TPOFFS= (0..7)
0 0 0 0 0 0 0 0 
##$TUNHIN= 0
##$TUNHOUT= 0
##$TUNXOUT= 0
##$USERA1= <user>
##$USERA2= <user>
##$USERA3= <user>
##$USERA4= <user>
##$USERA5= <user>
##$V9= 5
##$VALIST= <valist>
##$VCLIST= <CCCCCCCCCCCCCCC>
##$VD= 0
##$VDLIST= <DDDDDDDDDDDDDDD>
##$VPLIST= <PPPPPPPPPPPPPPP>
##$VTLIST= <TTTTTTTTTTTTTTT>
##$WBST= 1024
##$WBSW= 4
##$XGAIN= (0..3)
0 0 0 0 
##$XL= 0
##$YL= 0
##$YMAX_a= 165856
##$YMIN_a= -133839
##$ZGOPTNS= <>
##$ZL1= 120
##$ZL2= 120
##$ZL3= 120
##$ZL4= 120
##$ABSF1= 15.36125
##$ABSF2= -2.690598
##$ABSG= 5
##$ABSL= 3
##$ALPHA= 0
##$AQORDER= 0
##$ASSFAC= 0
##$ASSFACI= 0
##$ASSFACX= 0
##$ASSWID= 0
##$AUNMP= <proc_1d>
##$AZFE= 0.1
##$AZFW= 0.1
##$BCFW= 0
##$BC_mod= 2
##$BYTORDP= 0
##$COROFFS= 0
##$CY= -3
##$DATMOD= 1
##$DC= 0
##$DFILT= <>
##$DTYPP= 0
##$F1P= 0
##$F2P= 0
##$FCOR= 1
##$FTSIZE= 16384
##$FT_mod= 6
##$GAMMA= 0
##$GB= 0
##$INTBC= 1
##$INTSCL= 3.241238e-09
##$ISEN= 128
##$LB= 0.25
##$LEV0= 0
##$LPBIN= 0
##$MAXI= 10000
##$MC2= 0
##$MEAN= 0
##$ME_mod= 0
##$MI= 1.114404
##$NCOEF= 0
##$NC_proc= -9
##$NLEV= 6
##$NOISF1= 3.799351
##$NOISF2= 2.8
##$NSP= 0
##$NTH_PI= 0
##$NZP= 0
##$OFFSET= 15.36125
##$PC= 1
##$PHC0= -2052.715
##$PHC1= -20.40776
##$PH_mod= 1
##$PKNL= yes
##$PPARMOD= 0
##$PSCAL= 0
##$PSIGN= 0
##$REVERSE= no
##$SF= 200.130032110116
##$SI= 16384
##$SIGF1= 3
##$SIGF2= 2
##$SINO= 0.751879
##$SIOLD= 32768
##$SREGLST= <19F.Aceton>
##$SSB= 0
##$STSI= 16384
##$STSR= 0
##$SW_p= 3612.71676300578
##$SYMM= 0
##$S_DEV= 0
##$TDeff= 16384
##$TDoff= 0
##$TI= <>
##$TILT= no
##$TM1= 0
##$TM2= 0
##$TOPLEV= 0
##$USERP1= <user>
##$USERP2= <user>
##$USERP3= <user>
##$USERP4= <user>
##$USERP5= <user>
##$WDW= 1
##$XDIM= 16384
##$YMAX_p= 312477519
##$YMIN_p= -10685647
$$ End of Bruker specific parameters
$$ ---------------------------------
##NTUPLES= NMR SPECTRUM
##VAR_NAME=  FREQUENCY,     SPECTRUM/REAL,   SPECTRUM/IMAG
##SYMBOL=    X,             R,               I
##VAR_TYPE=  INDEPENDENT,   DEPENDENT,       DEPENDENT
##VAR_FORM=  AFFN,          ASDF,            ASDF
##VAR_DIM=   16384,         16384,           16384
##UNITS=     HZ,            ARBITRARY UNITS, ARBITRARY UNITS
##FACTOR=    0.220516191357247, 1,           1
##FIRST=     3074.24744048281, 0,            0
##LAST=      -538.469322522971, 0,           0
##MIN=       -538.469322522971, -10685647,   0
##MAX=       3074.24744048281, 312477519,    0
$$ Real data points
##PAGE= N=1
##DATA TABLE= (X++(R..R)), XYDATA
$$ [...]
9016 17425445 17474660 17770386 17787189 17941394 17742086 17222017 17809593 18003043 18560521 18651142
9006 18651142 18393907 18689190 18936256 18912184 18507267 18435438 19118784 19884510 19870709 19600677
8996 19600677 19683470 20148896 19863736 19823266 20521377 20626501 21368643 21333245 21406667 22193183
8986 22193183 22400962 22378968 22905640 23722749 23864036 23492307 24368952 25356409 25710983 26072465
8976 26072465 26480317 27057818 27978663 28013529 28489827 29633308 30635523 31698572 32317527
8967 32317527 33219709 33553284 33938504 34573982 35581654 36178306 36726976 37493555 37651323
8958 37651323 37684017 38103168 38929954 39488506 39992649 40325330 39854548 40295976 40420913 39846226
8948 39846226 39989739 39976296 40219516 39968873 39285617 39522186 39572305 39940652 39349517 39356846
8938 39356846 39939010 39896578 39709852 39579372 39369636 39110201 39113055 38912776 38645406 38868445
8928 38868445 39070625 39262896 39939167 40050247 40820773 40911540 41070002 41716342 41684957 42182555
8918 42182555 42191742 41514939 41416439 41962230 42186852 42693730 42698082 42187599 42221769 42783931
8908 42783931 43011662 42301057 41959084 41150915 40248542 39426179 39362015 38872064 37982688 37686791
8898 37686791 37389228 36611660 36459996 36545204 35615016 35022939 34381746 33628144 32660284 32040330
8888 32040330 31551167 31094424 29824593 29370244 29506048 29117349 28821901 28135823 27630063
8879 27630063 27188987 26911848 26139357 25583670 25874960 25347127 25460510 24818251 24206621
8870 24206621 23697530 23228502 22497577 22561360 22762634 22834811 22110058 22201413 22283062 21392262
8860 21392262 21213457 21465033 21020540 20744841 20802177 20367725 19964921 19796500 20437992 19917639
8850 19917639 19468185 19041073 18983951 19087103 19224268 18813682 18585727 18534309 18533454 18029197
8840 18029197 18007515 17926522 17929106 17670949 17708975 17532368 17456153 17429176 17366001 17583742 17303786
8829 17303786 17198753 17089057 16609043 16499936 16150114 16568138 16614512 16891273 16977594 16822789
8819 16822789 16719169 16238320 16293608 16285252 16011807 16039131 15921963 16062890 15555965 15650916
8809 15650916 15631090 14922743 15076338 14920023 15685955 16051419 15690918 15859778 15889388 15428156
8799 15428156 15338232 15188795 15551451 15586762 15723850 15746120 15643615 15511752 15887744 16227968
8789 16227968 15968137 15955538 15584901 15814648 15771942 16218019 16312628 16001116 16052579 16984119
8779 16984119 17210488 17056479 17521702 17230315 17230082 17275444 17527240 17481129 17700549 17763682
8769 17763682 18069969 17885957 18223790 19219766 19602769 19530810 19697466 20037938 20466787 20914393
8759 20914393 21783591 22632041 22963210 22867488 23467265 23831400 23655097 23724968 24533866 24640606
8749 24640606 24925856 25336443 25809339 25934473 26200740 26100599 26546737 27197221 27252168 27374629
8739 27374629 27791198 27687068 27557657 27464751 26855514 27304744 27922003 27665914 27449344 27930662
8729 27930662 27842543 27761651 28405353 28753757 28690973 28898017 29695493 30432887 30070319 30009697
8719 30009697 30159243 31064642 31244966 31070649 31416782 31861779 32150116 33614696 33664466
8710 33664466 33927565 34073553 34528192 35540512 35631260 34692972 35017883 35808913 35562700
8701 35562700 35638930 35783996 35842340 35922115 35880222 35932243 35393478 35444977 35047677 34375639
8691 34375639 34138576 34386883 34328235 33990334 33763312 33122321 32838873 32252079 31995255 31490641
8681 31490641 31555225 31937089 31121443 30436932 30399566 29951962 29824694 29907828 30248912 29945109
8671 29945109 30074067 29367144 29070844 29107490 28799764 28817468 28154178 27960243 28353820 28410040
8661 28410040 28582051 27465070 27739038 27140319 27088586 27857867 27139547 26581147 25986851
8652 25986851 26415188 25889342 25047208 24984968 24596125 23990883 24100202 23642242 23473571 23295047
8642 23295047 22410489 22590745 22211811 21872212 21138604 20737508 20241789 19999576 20105931
8633 20105931 19579654 19078357 19124478 19510637 18676361 18081198 18229202 18420857 18124677 17237569
8623 17237569 16912255 16671657 16417034 16097399 16161091 16343544 16237823 16581489 16026779 15845783
8613 15845783 15257134 15082767 15139921 14913476 14730318 14558922 14610678 13857054 13391903 13828230
8603 13828230 13500929 13200234 13340883 13511457 13589352 13378327 13040958 12991147 13248551 12583190
8593 12583190 12698295 12861466 12829980 13211878 12722639 12152500 11604583 11391509 11688918 11709600
8583 11709600 11413750 12141295 11878137 10767836 11040318 11138742 11277276 10997925 11094160 11479998
8573 11479998 11105234 10711109 10416670 10607688 10508051 10720748 10559803 9865815 9588212 9702163
8563 9702163 9825052 9557781 9489614 9585611 9431304 9188073 8468832 7951735 8040259 7834731
8553 7834731 7919039 7920225 7736890 7980402 8419097 8297926 8293051 8294698 8166135 8453635 8336187
8542 8336187 8257800 7407625 7102067 6987758 7187020 7193956 7226913 6795399 6947661 6306492
8532 6306492 6184510 6829071 6419355 6437724 6623799 6038104 5813553 6197801 6054627 5801849
8522 5801849 5694165 6091285 6219169 5843965 5778849 6312016 6274833 5968608 5091666 5010292
8512 5010292 5034463 5331663 5335975 5384352 4907599 4832029 5089238 4847322 5240847 5098498
8502 5098498 4996825 4445950 4791625 5427657 4856137 4717242 4464683 4678394 4776039 4416137
8492 4416137 4285338 4194420 4271288 4458843 4387498 4369170 3815757 3771851 3599904 4333514
8482 4333514 4334323 4202718 4180843 3951269 3849723 4263409 3877094 3453983 3851435 3627725
8472 3627725 4008335 3823371 3506968 3229805 2775280 3069633 3149531 3292255 3190095 3267035
8462 3267035 3166991 3553014 3689394 3214143 3158826 3048081 3172737 2844183 2962297 2994974
8452 2994974 3209483 3061485 2499627 2632171 2546273 2372393 2696831 2154652 2493314 3116545
8442 3116545 3506419 2839634 2781281 2490644 2025733 2299678 2624968 2447265 2365823 1691150
8432 1691150 1788603 2647914 3047463 2422485 2564791 2895497 2241849 1857754 1840805 2104596
8422 2104596 2206535 1815154 1615685 1806165 1941471 2055285 2089869 2149030 1935023 1723713
8412 1723713 1455013 1821803 1597339 1978790 1667404 1846049 1727946 1117187 1234204 1569816
8402 1569816 2080752 2040175 2401280 1937563 1577802 1623288 1385089 1395903 1521484 1285674
8392 1285674 1058177 1865864 1480254 1525688 1211268 1031568 1191827 1481480 1579645 1236983
8382 1236983 1195117 1177216 1546843 1780903 1259226 1067255 1233908 1050007 896047 1206670
8372 1206670 1214543 790373 1280521 1116855 1262385 1174677 1212136 1138741 1062567 1649834 1911142
8361 1911142 1323467 1387370 1149141 1231062 1134275 938295 1042266 1430030 1282749 635555
8351 635555 950754 1227510 1819640 1893673 1508905 1421276 1073609 1124834 1240282 1521050
8341 1521050 1398493 695030 747855 727172 1149892 1464991 801983 1031473 1233950 690825
8331 690825 669807 1363313 1512531 1341910 1131338 1094267 884158 418591 889614 1001467
8321 1001467 681033 517781 1267097 1312261 1427826 1092059 193585 79759 271361 385108
8311 385108 968315 576774 679633 770770 499454 472585 697295 838162 835496 1144973
8301 1144973 946025 483943 -238650 -457209 -59707 -1018 760717 1412600 1211949 990188
8291 990188 921490 532512 -34315 421484 559092 611314 823448 865729 659295 733327
8281 733327 773547 809742 539465 372071 695352 4372 305541 753039 1892 138603
8271 138603 24688 -133468 -237336 89357 262057 282794 176244 587334 539469 148274
8261 148274 -72597 280244 432196 -43713 595306 584096 533729 92015 190996 275925
8251 275925 102327 98065 346595 381471 40342 -39210 94316 362092 850763 290743
8241 290743 217244 124192 195786 394720 -34502 226039 309487 -31003 -461026 -165545
8231 -165545 181340 539759 69112 341977 111663 289397 -167912 106758 264085 -25953
8221 -25953 -250606 69061 -168350 -93057 -285758 -3764 9418 112782 173853 499103
8211 499103 486924 275375 110605 -222714 -165893 136302 -127164 292385 691796 282802
8201 282802 32798 434089 570575 855627 660131 49780 312325 719685 -1041534 -10685647
8191 -10685647 -6433394 -2204991 -1428364 -774618 -760536 -279200 -177086 -333535 -1090059
8182 -1090059 -453870 -491327 -631293 -765691 -38022 -400049 -320017 -100530 -128225 -622796
8172 -622796 -489778 -102671 -126554 -27999 -136664 -767864 -744045 -375838 -719819 -628382
8162 -628382 648016 -23689 357865 206286 69995 362562 -261522 -656809 -497043 -762324
8152 -762324 -325102 -986787 -621331 -207100 63887 -239379 -172169 182373 -316526 -323156
8142 -323156 -292891 -348839 -322408 -566380 -595860 -525928 -419047 -617999 -430841 -399426 -305435
8131 -305435 -291294 -411812 -287258 -640239 -769867 -752252 -188533 141555 -617935 -634876
8121 -634876 -634371 -669247 -397512 -406688 -629490 -846636 -895879 -518291 -190943 -563462 -455851
8110 -455851 -107067 -139007 -548912 -351891 -870544 -616377 -837054 -1279483 -928932 -496797
8100 -496797 -412061 -392201 -1091692 -419599 -56763 23598 205626 -375416 -991725 -423487
8090 -423487 -112689 -787858 -727093 -618262 -458122 -554167 -1094083 -964470 -1107060 -980457
8080 -980457 -702152 -623190 -1162363 -832170 -565641 -425313 343943 -211324 -322346 4742
8070 4742 22350 -686607 -808317 -316835 -543567 -910600 -936869 -834228 -438047 -946331
8060 -946331 -930253 -615751 -436819 -644264 -413495 -771705 -1022940 -940689 -718773 -613218
8050 -613218 -450182 -372839 -867736 -1357568 -1021130 -709150 -837542 -899123 -1172433 -1241285
8040 -1241285 -658724 -694248 -513127 -304015 -353335 -698838 -1352013 -987379 -989082 -1083624
8030 -1083624 -904182 -1024032 -966631 -862743 -1123137 -1044599 -534099 -667831 -772454 -352201
8020 -352201 -824899 -872019 -868663 -759137 -499091 -406215 -778042 -1146218 -867508 -301886
8010 -301886 -666522 -644166 -369131 -953003 -726296 -850226 -667587 -568265 -722002 -1152465
8000 -1152465 -1261924 -924066 -950741 -864814 -873174 -949199 -1083664 -1136748 -1537054 -1359247 -1059037
7989 -1059037 -973603 -998858 -771190 -1206567 -1133809 -1200155 -1333185 -1163955 -609982 -499362
7979 -499362 -821619 -774085 -618682 -619776 -533751 -936852 -842385 -600574 -41118 -566450 -1298823
7968 -1298823 -852211 -844751 -864759 -931931 157153 -225956 -548005 -654184 -1100165 -1134950
7958 -1134950 -1168942 -872402 -1425649 -1670924 -1241369 -957391 -748443 -788580 -959513 -592184
7948 -592184 -670943 -1557684 -1360777 -916569 -1373748 -1123220 -311119 -227912 -57983 -285038
7938 -285038 -317855 -467914 -809358 -637034 -818181 -1192219 -1071097 -869591 -777387 -907123
7928 -907123 -850404 -891928 -849190 -732680 -237877 -91934 -658266 -382793 -239878 -65441
7918 -65441 -362781 -473209 -486333 -715066 -383285 -161815 -528622 -818968 -388229 -609270
7908 -609270 -266061 -498065 -1038422 -921147 -439278 -824695 -1016055 -1136828 -691411 -829606
7898 -829606 -657402 -1121936 -875376 33288 -353193 -248897 -673768 -426049 -268092 -372535
7888 -372535 -605203 -430415 -578691 -715244 -406415 -410751 53339 523947 281812 249320
7878 249320 433097 532770 760321 616849 601334 209476 -424300 -140190 507450 643085
7868 643085 733821 795668 329270 57728 607300 542161 336337 600647 422031 704170
7858 704170 67700 -357053 -470460 -195161 -286174 -541197 -552674 15096 -118951 -379251
7848 -379251 175738 -21059 5462 638951 502959 91746 -19734 -726178 -541487 99627
7838 99627 -699359 -405123 -720791 -338175 71490 -397022 -507123 -84831 -33694 -229070
7828 -229070 -602500 -831293 -395355 -484837 -744435 -809745 -847972 -1037065 -510930 -307205
7818 -307205 -360389 -657435 -749971 -955950 -742672 -654763 -1158017 -422597 -355887 -851450
7808 -851450 -357137 39247 83379 -91349 -594669 -2308344 -1625822 -1027086 -916854 -649907
7798 -649907 -747729 -543450 -592354 -897735 -727918 -685221 -312341 88712 -158786 -303647
7788 -303647 -525060 -791515 -748972 -493626 -612427 -75556 -800182 -772911 -551783 -938249
7778 -938249 -729487 -653382 -281558 -203366 -407984 -431847 -248164 -722678 -636901 -641333 -547434
7767 -547434 -541246 -763573 -728551 -391657 -522387 -734665 -1047270 -1550231 -1062563 -887580
7757 -887580 -1327333 -1156357 -967327 -893392 -174275 -413316 -663298 -895519 -1068465 -689512
7747 -689512 -206286 136069 -4459 -330265 -622672 -640208 -631276 -897354 -429073 -533056
7737 -533056 -311281 27766 -769893 -1001125 -1010536 -953066 -998323 -925990 -219529 -401854 -430526
7726 -430526 -292557 -970276 -824769 -912230 -354048 79605 148864 -330118 -784285 -764546
7716 -764546 -701153 -520806 -814205 -162118 93413 20738 -292283 -285475 136091 278231
7706 278231 -580616 -671040 -138793 -392369 -386986 -419128 -951801 -966653 -1189580 -1222380 -1276188
7695 -1276188 -1384890 -1070915 -905923 -930015 -908075 -182116 -46373 -273210 -502940 -898146
7685 -898146 -793864 -925983 -1192227 -592979 -268711 -583239 -748876 -549728 -283078 -397999
7675 -397999 -714329 -1045146 -1136077 -587635 -1500271 -1315598 -998886 -865177 -314221 -240343
7665 -240343 -421497 -256155 -592020 -930329 -836234 -885788 -746017 -707842 -548523 -458482
7655 -458482 -66904 -175591 -489516 -608619 -116342 367981 225407 154951 203735 149704
7645 149704 360897 221869 423421 -53621 -148317 26099 -151648 -317123 -10103 -634364
7635 -634364 -522039 -104546 -475522 -337677 -94178 -67610 -548411 -530204 -651793 -682290
7625 -682290 -792430 -189163 183116 178218 7373 -313634 -797482 -794551 -324751 -237849 -273600
7614 -273600 -373092 -161425 -143241 -26304 -83762 -170385 -285196 -478461 -624088 113956
7604 113956 11005 -429161 -229926 -680007 -1162049 -1148551 -702503 -524171 -439666 -24057
7594 -24057 -202055 40163 656753 197899 446593 395633 18010 -26888 109334 379087
7584 379087 340549 -4311 -174310 227306 -172872 76 41524 -135569 62704 377875
7574 377875 139804 124559 -52834 -367941 -77332 -269149 -91244 348194 244855 -480948
7564 -480948 -183282 -180108 337261 550550 443499 341217 600471 369358 575199 192642
7554 192642 -75749 126942 288391 648598 1204024 978040 472234 374208 897646 680441
7544 680441 416475 598144 765342 687034 115052 476077 208776 210167 518680 545760
7534 545760 359401 334263 274756 598568 131617 -157480 -276885 172587 188570 301960
7524 301960 570414 737915 568509 267885 351265 797775 722915 471625 630820 518770
7514 518770 950032 754921 448251 969533 1229968 1001282 1217554 1030528 461880 656962
7504 656962 536175 654519 455628 1058737 1494145 1135504 1311643 1009268 1118080 745239
7494 745239 202243 261789 585712 261706 332610 719479 519575 1026067 893281 998473
7484 998473 972383 1253759 1205848 300886 794598 1109688 913026 1112116 896723 682690
7474 682690 1333034 1086697 982819 1153306 1147992 1578004 1515220 1443373 1327264 1000502
7464 1000502 813510 1001864 1126287 1540575 1503183 1209003 1330533 1634988 1601858 1740927
7454 1740927 1616956 1350207 1534788 1581102 1317056 1715011 1930422 1856813 1773585 1506158
7444 1506158 1664090 1711570 1914399 1883530 1878714 1781555 2468029 2304433 2501862 2497547 2250536
7433 2250536 2113259 2112753 2520453 3016460 3148373 2805884 2562586 2502861 2921958 3235275
7423 3235275 2808588 2196722 2649930 2479598 2262156 2802269 3131220 3156715 3067872 3560435
7413 3560435 3674892 3266919 3429636 3550765 3304490 3438176 3790868 4124705 3318023 3026736
7403 3026736 3090951 3362227 4045617 3856750 3568545 3956448 3966076 3681840 3872981 3631795
7393 3631795 3446101 3686645 4163577 3915916 4086374 4101115 4094804 4366473 4375031 4624947
7383 4624947 4567755 4320708 4551792 4809364 4975506 5260808 5175497 5163060 5268484 5289302
7373 5289302 5371552 4869467 4943551 4782613 5137096 5439406 5479623 4859080 4897549 5404402
7363 5404402 5805101 6214224 6126095 5923365 5972022 5962934 6116740 6160326 6018708 6149429
7353 6149429 5804302 5140266 5372746 5905198 6290172 6408004 5806373 6091716 6553580 6169424
7343 6169424 6334931 6500975 6341541 6077317 5678195 6660193 6531303 6494983 7060480 7129724
7333 7129724 6601919 6534181 6517417 6763012 6925934 7235899 7391484 7228257 6962377 7397267
7323 7397267 7069257 6896226 7217746 7662683 7381801 7156741 7075980 7322541 7024121 7132837
7313 7132837 7103078 7006468 7080322 6876381 7324008 7339997 7476773 7618756 7889950 7568866
7303 7568866 7830595 7506689 7472849 7518464 7516355 7308621 7423740 7341328 7778179 7878069 7761107
7292 7761107 7723151 7911283 8449807 8475773 8596525 8263223 8210792 8495018 9100653 8910900
7282 8910900 8977874 8374868 8352097 8703830 8724481 8748492 8408498 8801416 8663844 8465114
7272 8465114 8494574 8688982 8547196 8879724 8767399 8734420 8688638 9247082 9046505 8681683
7262 8681683 8974084 9085580 8902831 9110600 9037217 9238164 8939730 9098215 9500992 9377998
7252 9377998 9336500 9066928 9260401 9427340 9635851 9595070 9537257 9872011 10210895 9788595
7242 9788595 9931630 10108021 9964110 10241443 10495538 10583635 10282441 9942190 10242754 10154026
7232 10154026 9799223 10280385 10789463 10816822 10610772 10508534 10678075 10336480 10943951 10937897
7222 10937897 10414870 10757061 10620155 10415558 10894070 11209209 11692727 11499094 11802082
7213 11802082 11990872 11779557 11815215 12044868 12005999 11669544 11542847 11639660 11735652 11915386
7203 11915386 12053021 12293109 12269195 11708419 11968010 12355109 12514071 11944584 11668125 11983108
7193 11983108 12453966 12354715 12209913 12581369 12642929 12494020 12717646 12546175 12665832 12930592
7183 12930592 12920451 12537742 12644645 12549369 12430589 12578560 12729285 13276520 13459527 13433837
7173 13433837 13207240 13254949 13490761 13866926 14057401 13720839 13479739 13258587 13374649 13385897
7163 13385897 12986345 13452450 13978710 13145996 13308499 13619969 13807345 14182207 13700602
7154 13700602 14191171 14499020 14326035 14118367 14485562 14732606 14673071 14618232 14227705 14089641
7144 14089641 14677311 14655682 14270243 14485947 14753579 15299449 14923925 14982586 15226479 14808310
7134 14808310 14636871 14506466 14486730 14903303 14956979 15362352 15699001 14829923 14916622 15257636
7124 15257636 15913616 15988292 16048524 15680633 15747280 15942501 16068151 16234223 15817847 15658523
7114 15658523 16209842 16374963 16616924 16429629 16224235 16708450 16879327 16585441 16694611
7105 16694611 16502555 17184182 16753044 16543408 16482133 16516339 16706393 16601365 16972542 16539403
7095 16539403 16431501 16392980 16124384 16392795 16732383 16261686 17170538 18151635 18369592 18287782
7085 18287782 17904105 17320430 17687109 17861386 17781983 17765399 17895575 18040348 17890436 17539066
7075 17539066 17302148 17318700 18006102 17809529 17823014 17682056 17919368 18219551 17968754 17676380
7065 17676380 17951507 18125903 18313182 18532580 18397453 18058571 18190265 17892416 17192016
7056 17192016 17884164 18539990 18934799 18865901 18584447 19010402 18584060 18618478 18692412 18589241
7046 18589241 19012058 19627454 18954801 19426668 19610053 19666396 19538647 19171293 19618814 19966335
7036 19966335 20188252 19858624 20058856 20234093 20562922 20573258 20616240 20546225 20915400 20469795
7026 20469795 20434767 21086663 21465161 21456508 20774892 21233984 21384636 21383953 21645597 21514019
7016 21514019 21681059 21571898 21736394 21710359 21984869 21896304 22092849 22131534 22045644 22436295
7006 22436295 22245451 22249095 22317691 21860814 22312012 22831169 22857242 22708435 22737647 22485085
6996 22485085 22500497 23040953 23340559 23225331 23272112 23607611 24028611 24157772 23482276 23376590
6986 23376590 24033704 24450153 24914745 24953848 24335826 24176870 24234593 24641484 24678855 24590136
6976 24590136 24508827 24256342 24389126 24108668 24475951 24982562 25151915 24891457 25537813 24991072
6966 24991072 24748310 24890220 24850113 25124499 25326969 25227011 25199813 25705685 25807756 26392913
6956 26392913 26670332 26541024 26402531 26404674 26891895 26489246 26568941 26913355 26852411 26405896
6946 26405896 26766588 27399909 27072373 27279613 27325757 27299657 27289500 27377257 27419533 27793795
6936 27793795 27980408 27736903 27503510 27789612 28492714 28733052 28524348 28543713 28094027 28705695
6926 28705695 28702490 28451588 28484079 29246893 29531621 29396468 29153633 28601187 28462279 29475357
6916 29475357 29200685 29273979 29684827 29798077 29159711 29953276 30346403 29764550 29903206 29821174
6906 29821174 30411835 30540509 30429482 30497431 30809578 30615861 30653021 30956728 31424015 30594863
6896 30594863 30355914 30244345 30541124 31070055 32034773 31756478 31781878 32172347 31354532 31251501
6886 31251501 31962130 31938665 31986021 31884784 31904926 31885852 32080021 32535881 32318786 32577076
6876 32577076 33224861 32953710 32704184 32760025 32939530 33282301 33572986 33675094 33539572 33849372
6866 33849372 33760948 33617536 34325016 34604236 34331915 34548134 34621343 34573155 35130824 35141289
6856 35141289 34760473 35089586 35175760 35355341 35437915 35993165 35989313 36252134 36458749 36582675
6846 36582675 36544992 37286476 37656411 37209074 37392840 37662375 37950659 38129699 38357752 38527521
6836 38527521 38392961 38344731 37908490 37909075 38231506 38573677 39080315 39447337 40159517 39603912
6826 39603912 39612437 40209965 40435560 40310169 40529296 41169286 41551098 41473539 41525847 41774590
6816 41774590 42151523 41816259 41944368 42291526 42783214 43418775 43325226 43585922 43783891 44036007
6806 44036007 44625770 44375682 44597136 44881450 44692509 44846340 45037654 45726135 46143348
6797 46143348 46279166 45669734 45921389 46245275 46839285 47497280 47862744 47560259 47837092
6788 47837092 48568726 49116284 49238976 49157574 49451620 50152320 50526954 50554863 51096959 51487197
6778 51487197 51430142 51381060 51834632 52440989 52991429 52780451 53154985 53209752 53345350 54424947
6768 54424947 55548716 55673289 55552120 55901121 56476542 57302556 56719659 56660294 57247279
6759 57247279 57759205 58298923 58670633 59318419 59686533 60610554 61090255 61272804 61310817 61536412
6749 61536412 62200810 62797805 63205872 63594287 63539813 64012139 64856485 65624200 66016908 66035759
6739 66035759 66424515 66955554 68038136 68971559 69777679 70111236 70401719 70813586 71302729
6730 71302729 71907615 72491294 73342978 74172810 74665247 75809604 76622333 77195228 77567269
6721 77567269 78585969 79005262 79359277 80457018 81303155 82142808 82740336 83285453 84305725
6712 84305725 85337620 85815567 87144164 88489664 88954739 89705965 90851439 91306654 91766893
6703 91766893 92427601 93606863 93981932 95656823 96978018 97226819 98184660 99208186 100329750
6694 100329750 101324037 101990162 103123966 104279106 105395232 106526713 107618229 108773254
6686 108773254 109480842 110528212 111357052 112043803 112995838 114140670 114581333 115282594 115962022
6677 115962022 116359555 117122873 118123934 119132439 119776376 120483379 120788365 121404876 121538678
6668 121538678 122020492 122454758 123230198 123750449 123782604 123910504 123469537 123465673 123991015 124089494
6658 124089494 124834592 125243319 124828119 124407321 124273418 123644550 123089072 122432467 122049492
6649 122049492 121389840 120729728 120181181 119547326 119200398 118524975 118014223 117596971 116614249
6640 116614249 115434621 114887921 114368953 113427930 112072847 111876426 110393409 109283074 108639085
6631 108639085 108425728 107300550 106167534 105424239 104690067 103629777 102517503 102195286 101716443
6622 101716443 100641315 99550189 98433356 97521482 96624105 95631834 95121575 93931580 92920198
6613 92920198 92475777 91419651 90787269 89888370 89334023 88311426 87547670 86920590 86259061
6604 86259061 85296204 84873797 84242097 83134329 82929259 81816143 81173782 80368004 79728597
6595 79728597 79452400 79035111 78078837 77439837 76993050 76039950 75021085 74952962 74577252
6586 74577252 74211984 73918890 73500304 73151180 73192578 72637376 71900924 71365022 71346019 71135270
6576 71135270 71050746 71236591 70667546 70349782 69980376 69740894 69491205 69692847 69178299 68714061
6566 68714061 68709537 68649957 68434550 68319762 68126948 68070113 68426466 68600684 68238006 67926333
6556 67926333 67992677 68398008 68551547 68985374 69206842 69092502 69055964 68858701 68573477 69218114
6546 69218114 69553439 69242335 69797731 69862490 69794474 70244683 70769054 71247773 71261983 71427241
6536 71427241 71661852 71031592 71737086 71948998 71821870 72161875 72384106 72103736 72487315
6527 72487315 72447209 72392836 72750606 73350501 73727356 73423760 73903436 74134402 74790538 74825628
6517 74825628 74797050 75032024 75467693 75232888 75512028 75695499 75876259 76002450 75856327 76153878
6507 76153878 76208852 76421682 76667979 76810645 77173978 76817936 76375537 77042731 76905990 76774903
6497 76774903 76137116 75682122 75771581 75779115 75368452 75006252 74660610 74420942 74264778 73910147
6487 73910147 73333095 73203933 73243199 72898099 72370839 72407610 72783296 72698988 71914082 71544673
6477 71544673 71284827 70790897 70612523 70518623 70308026 69731698 69625239 69414136 69151108 68963464
6467 68963464 68871773 69087127 68474878 68355745 68639569 68157428 67869178 67667651 67214935 67142185
6457 67142185 66966156 66395409 65866891 66062302 65600415 64817051 64613606 64527517 64204738 64064117
6447 64064117 64210569 63622885 62926896 62755332 62682746 62246815 61085805 60439890 59547405
6438 59547405 59359016 59102717 58409229 58043619 57237887 56534438 55963364 55656281 55498384
6429 55498384 54939564 54611690 53854939 53520020 53308225 52392127 51970125 52084693 52060842 51260740
6419 51260740 50978841 50254153 50276981 50190086 49767532 49182151 49183540 48948315 49512750 49823761
6409 49823761 49761013 49669808 48923578 49093555 49847298 49966331 49953358 50159375 50238465 50514681
6399 50514681 51224828 51362289 51507189 51745808 51829206 51737508 52242738 51935526 52326013 52513487
6389 52513487 52616166 53255699 52907885 53021935 53090824 53187294 53392048 53159641 52861996 52748108
6379 52748108 52529071 52675373 52165897 51853118 51691758 51506516 50591598 49870388 49616347
6370 49616347 48670550 47889235 47637584 47216589 46556553 46125075 44902320 44067369 43653792
6361 43653792 43587985 42944641 42220826 41032351 39998444 39750011 39392801 38794781 38262782
6352 38262782 37216848 36741206 36669048 35798316 35233877 34978218 34469642 33883948 33573313
6343 33573313 33316770 33035038 31913863 31269936 31537275 31231247 30929687 30646275 30044256
6334 30044256 30484250 30131481 29714767 28977134 28833262 28850870 28848454 28739548 28550614 28028557
6324 28028557 27825072 27515943 27834967 27626704 27062498 26835698 26877907 27451592 26867244 25938313
6314 25938313 26148251 25837457 25435947 25724065 25817502 25893656 25568943 25151040 25182851 25341991
6304 25341991 25172725 25247371 25158859 24699474 24783545 24693525 24393481 24511022 24280582 24295417
6294 24295417 24277886 24517802 24432592 24069341 24028036 23821030 24080624 24232886 23837993 24280863
6284 24280863 24638454 24679769 24221900 23900015 24203328 24521660 23935717 23538519 23735173 23721038
6274 23721038 23476146 23374873 23569705 23457576 23690962 23543396 23565802 24179987 24079492 24657346
6264 24657346 25147729 25062842 25129973 25018842 24849386 24581731 24140473 25311200 25518076 25088570
6254 25088570 25568899 25136095 25188292 25127839 25401565 25686422 25974764 26314448 26980713 26487458
6244 26487458 26411579 26750190 26907307 26938478 26750252 26577621 26805757 27447700 28192047 28205601
6234 28205601 28751660 28812268 28845738 29289409 29495693 30473478 30921574 31750487 31770044 31603203
6224 31603203 32259237 32919346 32647804 32853956 33485922 34278339 34718911 34852566 34940438 35850483
6214 35850483 36564639 36825349 37395866 37519320 37907179 37940942 38243228 38430998 38793582 39172928
6204 39172928 39641963 39868809 39999995 40284747 40324261 41193627 41625817 41712185 41943393 41843900
6194 41843900 41518123 41886642 42644939 42567188 42501666 43280141 43213496 43833796 43987275 44359491
6184 44359491 44257051 43972722 44180839 44481351 44674566 44516076 44541248 44805501 45214460 45100505
6174 45100505 44868722 45073115 45230914 44679267 44258725 44808184 45268484 44603912 44236117
6165 44236117 44241562 44285160 44076522 44536581 44145688 43754765 43825819 43615986 42812129 42862666
6155 42862666 42762188 42297001 42553118 42421180 42309735 42158566 42092966 41689708 42319521 41793453
6145 41793453 41439784 41042133 40571377 40401678 40549517 40556425 40601625 40724564 39921893 39509220
6135 39509220 38757233 38509372 38422472 38043695 38310908 38534325 37971662 37730324 37354099 37197281
6125 37197281 37088933 36431025 35939608 36525674 36757497 36154037 35884957 36014317 35956145 35456877
6115 35456877 35342174 35108313 34778149 34338965 33608189 33493094 33756021 33526074 33664212
6106 33664212 32806990 32791057 32428154 31407627 31879028 31678282 31089851 30509679 30073806
6097 30073806 30003516 30223528 29729998 29324103 28900472 28933996 28937498 28078892 27298431 26804714
6087 26804714 26512053 27183341 27188109 26174379 25679250 25912714 25806013 25390624 25318019 25557124
6077 25557124 25415611 24785919 24465101 24476105 24046652 23813228 22695450 22452858 22760654
6068 22760654 22364887 22047985 21961166 21999695 22078313 22244296 22114855 21985326 21570393 21449326
6058 21449326 21305233 21509296 21203696 20477445 20683348 21141549 21052332 20919697 21192941 21268847
6048 21268847 21408353 21179607 20583431 20150456 20034880 19568246 19456319 19742487 19669935 19339089
6038 19339089 18904636 19121893 19292236 19400160 19420111 19119202 19529320 19757361 19315813 19090686
6028 19090686 19765434 19627234 19452140 19281334 19509798 19868062 19547067 19570437 19315187 19650348
6018 19650348 20347099 20035959 19429593 19425214 19362295 19262777 18950165 19328866 19604704 19738796
6008 19738796 19286338 19489685 19443763 19373804 19702658 19560160 19723101 19762925 19728762 19310190
5998 19310190 19315453 19025499 18499225 19107965 19343721 18779787 19024145 19002162 19046971 19113854
5988 19113854 19315478 19366553 19026722 19616120 19596505 19611625 19297212 19197857 19263118 19503123
5978 19503123 18805341 19053917 19323257 19196616 19058574 18905814 19403012 19455884 19099821 19539214
5968 19539214 19560969 19165929 19197411 19007652 19437372 19605514 19507433 19879860 20126718 19723870
5958 19723870 20055201 19545419 19362285 19035180 19554117 20086601 19489370 19442247 19250231 19529392
5948 19529392 20124122 19682612 19534951 19732329 19797740 20131057 20006552 20237505 20606967 20701545
5938 20701545 20682164 20855606 20611780 20697811 20904560 20820733 20958924 21154772 20809694 21064950
5928 21064950 20590587 19933449 20668530 20891630 20959319 20953942 21164230 21085440 20892008 20711295
5918 20711295 20848528 21266452 21375031 21420066 21194736 21285636 21253095 21092772 21457809 22024590
5908 22024590 22156215 22101712 21700213 22203300 22089370 22026229 21648998 22425733 23240571 22504406
5898 22504406 22280253 22510847 22659475 22703243 22746366 22958242 23258250 23214083 23274920 22758790
5888 22758790 22377416 22809650 23403035 23267304 23469446 23945675 23983107 23511994 23791571 23423476
5878 23423476 23643309 24206526 23924212 24062122 24024348 24195154 24018354 23769490 23852369 23652903
5868 23652903 23520085 23653474 24199512 24268854 24577769 24072047 24250862 24308941 24793957 24797980
5858 24797980 24750398 25164200 25393425 25188216 25118932 25031525 24978260 25031961 25304196 25110775
5848 25110775 25436002 25423308 25511463 26156092 26245461 25743860 25654897 25143830 25320663 25747601
5838 25747601 25836351 26302696 26133967 26173143 26163105 26813459 26828995 27086217 26764447 26264064
5828 26264064 26434256 26687752 26453041 26357001 26933631 26977643 26412902 26751179 27056142 27381412
5818 27381412 27177238 27431479 27494917 27459030 27504965 27380639 28046005 28616562 28729049 28767259
5808 28767259 28326513 28594148 28470546 28798869 29244301 28525376 28672234 28634143 29051144 30075434
5798 30075434 30042579 30134216 29952167 30074666 30281179 29780009 30217369 30040738 30086379 30723969
5788 30723969 31480944 31848818 31527239 31661393 31669336 32092258 31716769 32098147 32357532 32393744
5778 32393744 32437263 32598823 32924636 33234044 33718532 33448044 33361851 34045195 34448365 34923012
5768 34923012 35160699 35116173 35085361 35394479 35531704 36180392 36460310 36965601 37212813 37695559
5758 37695559 37578527 37692257 37842121 37958923 38850393 39207031 39586408 40075388 40876912
5749 40876912 40735818 40862141 41110844 41377443 41985094 42182871 42629722 43157460 43262818
5740 43262818 43319330 43838938 44398323 44442374 44735390 45076804 45624403 46017039 46447154 46625084
5730 46625084 47242445 47454843 47971400 47869674 47915423 48358682 48808016 49183023 49754239 49716310
5720 49716310 50078436 50217985 50325848 50586335 50722790 51088457 51009527 50678481 51157139 51361843
5710 51361843 51854855 51789748 51772704 52239766 53131624 53403588 52787412 53208963 53530936 53717745
5700 53717745 54268318 54917892 54897284 54342408 54577461 54827256 55402923 55901726 55606915 55558685
5690 55558685 55902825 56013503 55545159 56063867 56530158 56753478 57369496 57246806 57259274 57844121
5680 57844121 57876956 57693703 57716100 57673996 57466142 58450108 58455573 58280817 58291048 58702489
5670 58702489 59193213 59202707 58911735 58953731 59037024 58845222 58663822 58950244 58758354 58665084
5660 58665084 58434558 57621339 57354141 57409787 57325036 57463382 56921188 56646221 56764033 56512013
5650 56512013 56402273 55948311 56075037 55582343 55010642 55188990 55047880 54692751 54841376
5641 54841376 54353733 54382391 54034071 53967262 53766918 53095647 53310795 53418376 52805091 53069042
5631 53069042 53033152 52089732 51970178 51859624 51929556 51898495 51825278 51954364 51081455 50348591
5621 50348591 50442634 50203618 50544457 50525379 50375040 50303062 50558787 50308322 49418223 48869180
5611 48869180 49164626 49081887 49282600 49322049 49152713 48986780 48826820 48867409 49148089 49185282
5601 49185282 48912500 49369621 49341220 48999911 48961564 48413223 48521506 49011157 49058707 49343714
5591 49343714 48977014 49310794 49551993 49365563 50298399 50561693 50254228 50481266 50203947
5582 50203947 49837825 50760094 50859700 50499561 50490000 50356193 50939900 51115867 51240349 51358894
5572 51358894 51514489 51832985 52034104 52225866 52605804 52535435 52915820 53049437 52568273 52927202
5562 52927202 52598715 53440003 54087025 54064177 54434894 54110581 54472453 54657088 55295487 54957148
5552 54957148 54746590 55172863 55746612 55609247 55931518 56708027 56180848 56204049 56608809 56844114
5542 56844114 57301213 57053920 57775103 57895079 57847932 57534071 57416073 58516932 58997669
5533 58997669 58979373 58884204 59283826 59430441 59468196 59471157 59723117 59814127 60140553 60415265
5523 60415265 60404057 60772136 60039397 59820275 60299126 60267683 60325893 60348316 60817750 61242990
5513 61242990 61385108 61416282 61939776 61740991 61799210 62340891 62712188 62399353 62222869 62318638
5503 62318638 62924030 62579889 62578561 62990141 62706652 63080414 63095535 63269590 62646898 62479020
5493 62479020 63283236 63632085 63527716 63541462 63897496 63799216 63618735 63351616 63497133 64463228
5483 64463228 64375927 64365956 64070729 64011729 64093486 64149313 64398213 63966627 63800065 63885794 63922927
5472 63922927 63782136 64386767 64041134 64176597 64141715 64172848 64453485 64158963 63282689 63262544
5462 63262544 63622041 63846308 63880301 63457859 63107273 63019965 63348152 62984291 63033705 62920077
5452 62920077 62575155 62657092 62714887 62461324 62220645 61799717 61915930 62137311 61773209 61595127
5442 61595127 61099187 61705315 62020615 61740831 61339960 61343114 61770604 61121639 60541996 60841828
5432 60841828 60634983 60426485 60587109 60667560 60573533 60014645 59658443 59522374 59083807 58880497
5422 58880497 58911540 58950140 59445806 59297814 58750091 58203667 58679664 58484883 57955871 57965244
5412 57965244 57816124 57232913 57481789 58008032 57746157 56848933 57109478 57041242 56834274 57059178
5402 57059178 57017950 56842632 56713057 56472002 56581400 55774261 55858895 56079251 56138810 56294930
5392 56294930 55322006 55521220 55188657 55794345 55984843 55725845 55398843 55078713 54900331
5383 54900331 54798743 54946605 55054100 54909491 54917043 55206490 54805630 54678525 54504996 54902751
5373 54902751 54289791 54157042 54327414 55051290 55077451 55138239 54920793 53775579 53749442 53908746
5363 53908746 54297823 54098412 54154235 54326361 54226601 54055689 54418418 54444542 54277425 54423408
5353 54423408 54284540 54588376 54732972 54605236 54788278 55425636 55374467 55164883 54772997 54796881
5343 54796881 55647448 55855169 56058413 55911279 55892886 55627561 56007912 55753683 55790661 56204870
5333 56204870 56896967 56782013 56881266 56119522 55971754 56257579 56801155 57643409 57362419 56938402
5323 56938402 56897242 57233873 58095151 58028784 57448722 58156715 58180547 58035444 58400419 58331928
5313 58331928 58463354 58922556 59121457 59069751 59556379 59877828 60055012 60630361 60892635 60685637
5303 60685637 60667789 61296508 61740161 62089607 62016707 62672963 63342948 63814727 64178259 64541205
5293 64541205 64986170 65023872 65231346 65821382 66057478 66389674 66984610 67452022 67799819 68117080
5283 68117080 69140740 69551136 69497030 70728783 71932575 72259527 72270857 73038221 73696974
5274 73696974 74385578 74871548 75478790 75800656 76792960 77541910 78433642 78949242 79645633
5265 79645633 80926908 81363091 82444171 83002775 83619962 84355148 85215844 86057444 86904841
5256 86904841 87850940 88887430 90003099 89836055 90347096 90924810 92113440 92444063 93250503
5247 93250503 94508189 94585239 94992430 95133800 96358672 96940519 97318417 97538129 97857923
5238 97857923 98409604 98236222 98453669 98934635 99537786 99830338 100531597 100554047 100088696 100594251
5228 100594251 100396255 100365452 100252991 99810766 99945991 100050526 99787274 99479185 99412955 99665994
5218 99665994 99785783 99470630 98475004 97576550 97063340 96666204 96663967 96395484 95982033 95308195
5208 95308195 94970071 94179229 93549895 92892193 92224297 92458033 92137692 91078360 90470329
5199 90470329 90062012 89813464 88969512 88015339 87784783 87234205 86780197 86101168 85312042
5190 85312042 84704377 84216741 83790684 83302918 82872638 82294176 82044968 81988898 81185206 80478721
5180 80478721 79819618 79966754 79610069 78785134 78385183 77669137 76865816 77009024 76820185
5171 76820185 76634865 76081242 75941234 75493681 75541027 75293105 75118212 74528358 74055773 74265980
5161 74265980 74356984 73760493 73886574 73584434 73234736 73530034 73767263 73484910 73276908 73180283
5151 73180283 72635962 72996276 72739415 72537630 72611069 72599875 71941368 72005624 72592451 72401292
5141 72401292 71970849 72456721 71850287 72248659 72508499 72387115 72186475 72225959 72331711 72334954
5131 72334954 72800717 72968835 72727775 72627949 73133172 73495303 73087595 73025468 72898348 72813493
5121 72813493 73046815 73861942 73830921 73209199 73303413 73614892 73628592 73994848 74229240 74528252
5111 74528252 74802635 74930104 74802412 74612246 74899897 74626203 74761179 75339941 75617181
5102 75617181 75334337 74940543 75279480 75683146 75686321 75929764 76276645 76402006 76243388 76528084
5092 76528084 76567454 76472798 76696199 77159906 77434357 77281945 77632538 77555130 77157505 77501009
5082 77501009 77260902 77576110 77819509 77698757 77365788 77634866 78230530 78215292 78476096 78910719
5072 78910719 79052702 79359536 79175179 78943157 79091415 79132131 79310833 79785244 79714053 79615999
5062 79615999 80107273 79928234 80112278 80459980 80685148 80974222 81935976 81888709 81743486 82100415
5052 82100415 82630385 82592322 82500101 82614001 83089538 83506454 83946547 84121934 84701813 85918037
5042 85918037 85884542 86248944 86232504 86414854 86891649 87821232 88484517 88489642 88737901 88915608
5032 88915608 89676129 90089855 90527063 90485775 91372160 92476162 92831139 92860625 93965318
5023 93965318 94944961 95399070 96169506 96834104 98061775 98347467 99548556 100997781 101662890
5014 101662890 103167577 104602068 105128604 106481042 108169151 109923096 111085082 113576748
5006 113576748 115399716 117170410 118622132 120244382 122573011 124726326 126662846 128698152
4998 128698152 130873115 133137669 136116846 138812208 140703330 142995727 144873364 146405955
4990 146405955 148287225 150327791 151962572 153317636 155244323 156792711 158186397 159362627
4982 159362627 160364889 161321283 162492073 163356898 164105625 164100936 164825898 164705415 164498539
4973 164498539 164142293 164036261 163268877 161976221 161366303 159999535 158110620 156814781 155731967
4964 155731967 153777667 151700176 149470394 147486074 145330399 143166422 139976769 137676761
4956 137676761 135443458 132825097 130076770 127349325 124483554 121297447 118451903 115606630
4948 115606630 113260219 110804688 108327073 105785303 102898278 100469016 97767365 95643653
4940 95643653 93800091 91564341 89316118 87088645 85203378 82827580 81429703 79631145
4932 79631145 77612162 75989188 74292550 73292988 71929737 70236033 68909137 67714272
4924 67714272 66558571 65661033 64601214 63406585 62330893 61394510 60114124 60072872 59467045
4915 59467045 58346499 57829241 56874500 56159606 55217079 54439154 54016667 53477486 52714974
4906 52714974 52273955 51918102 51641226 51260400 50476762 49826693 49109815 49033796 48516311 47750342
4896 47750342 47613158 47392464 47010247 45943311 45265116 44860645 44871839 44718448 44688315 43658109
4886 43658109 43529588 43560730 42760731 42164782 42166219 42427412 42326428 41704865 41614097 41290399
4876 41290399 41426164 41482590 41058010 40783594 40121114 40383745 40451918 39873609 39878982 39550366
4866 39550366 39654117 39375019 39047190 38805782 38840634 38636451 38690165 39501864 39045005 38342843
4856 38342843 38278637 37949662 37931576 37556934 37662433 37872640 37807748 37430449 37257373 37216942
4846 37216942 36906941 37081145 36646855 36838492 37086486 37522376 37409974 36872512 36582725
4837 36582725 36363471 36352128 36095327 36400989 36354736 36217624 36432056 35589366 35999308 36258124
4827 36258124 36037340 35639086 35929177 36207737 36160569 35835116 35916269 36178903 35854165 35537023
4817 35537023 35673876 35638751 35253086 35081625 35367587 35381372 35193594 35106332 34865257 35197836
4807 35197836 35473278 35431963 35623218 35394113 35607985 35246270 35117508 35425889 35582798 35305359
4797 35305359 35105158 35572777 35380566 35011253 35414394 35046835 35111823 34886092 34611120 34655919
4787 34655919 35465304 35589224 35278467 35492514 35824862 35858904 35022181 34630001 35378848 35318703
4777 35318703 35172146 35425121 35343931 35579982 35280230 36079881 36113737 35604186 36376791 36743652
4767 36743652 36066604 35971374 36317518 36343571 36492014 37052113 36824996 36677337 36818042 36845885
4757 36845885 37072673 37564618 37546666 37157740 37464444 37532091 37775357 37894551 37629336 38193376
4747 38193376 38144450 38622016 38843387 38872435 39104113 38614428 38717393 38673587 38717654 38959135
4737 38959135 39561831 39445690 39421974 39762816 39848032 39964905 39669894 40202567 40626605 41090629
4727 41090629 40713651 40235642 40681359 41239214 41011061 41151209 41098228 41449522 41832737 42280541
4717 42280541 42060853 42166993 42431310 42305909 42494167 42155474 42621125 42805074 42821527 42998482
4707 42998482 43229577 43933582 44271555 43863508 43936887 44190006 43661868 44211743 44918998 44575456
4697 44575456 44900102 44821186 45081646 45430421 45285069 45542361 45709577 45643993 45750624 45933779
4687 45933779 46215443 46221845 46389013 46801029 47335273 47262096 46622154 46526321 46837061 47522130
4677 47522130 47560389 48144039 48716338 48856263 48632867 48994756 48840553 48784894 48868984 48757304
4667 48757304 48911071 49351165 49984994 50766970 50755194 51375378 51151940 51159802 51409332 51346279
4657 51346279 51456384 52050598 51958067 51991455 52452230 52507743 52578206 52655937 53076346 53055503
4647 53055503 53951454 54238573 54613121 54426073 55401119 55920182 55623321 56362192 56632257
4638 56632257 56827235 57923718 57864729 57921399 58630648 58337156 58412877 58790968 59354841 60036446
4628 60036446 59970615 59888939 61110398 62007023 62920285 64012730 64947371 65817769 65971976
4619 65971976 67245594 67943062 69493619 70565629 71985626 72807020 74224300 75632505
4611 75632505 77080622 79172113 81671228 83661558 85610006 87982441 89719463 92335608
4603 92335608 94708630 96628871 98327951 99984728 102037291 105705714 108430891 110283355
4595 110283355 112403480 114609491 116777384 118215108 120017110 121716381 123288019 124606269
4587 124606269 125703716 125847109 126330062 126793234 127488546 127741738 127229604 126359778 125480870
4578 125480870 124646258 123862950 122798170 122079529 121398534 119257918 116998455 114814022 112671740
4569 112671740 110712522 108741172 106650819 104904579 102444362 99713282 97951719 95658461
4561 95658461 93195142 90660694 88249219 86150372 84277643 82294692 80116350 78537690
4553 78537690 76578167 75440670 72956892 71373500 69874045 68668024 67299377 66018587
4545 66018587 64900491 63594902 62062474 61525744 61266064 60724880 60252456 59502514 58549267
4536 58549267 57658746 57478064 57135746 56601050 55854964 56038011 55419215 54875656 54907546 54605754
4526 54605754 54517822 54704766 54103458 53662708 53541174 53096699 53007453 52934557 53288879 52873458
4516 52873458 52816250 52485508 51860165 51911812 52087866 51556708 51560987 51769725 51656818 51502651
4506 51502651 51273922 51749747 51494340 51825623 51870347 52040076 52342905 52277759 52416065 52581529
4496 52581529 52573344 52557744 52647838 52572281 52692397 52793220 52834062 52633151 52962803 52741209
4486 52741209 52805009 53694032 54296871 53879276 53744572 53746351 53799447 53909201 54551811 54884101
4476 54884101 55409408 55157137 54937519 54774725 54509661 54729042 54474083 54518618 54703813 54863659
4466 54863659 54797026 55042077 54812260 54887542 54579745 55083515 55447215 55554709 55035144 55286862
4456 55286862 55167115 55383803 55800413 55423912 55936980 56668596 56774424 56482785 56659286
4447 56659286 57106109 57175072 57102330 57055617 56906305 57106606 58069839 57943770 57523514 58046883
4437 58046883 57972453 58482149 58949226 58947703 59030539 58830594 58569741 58609510 59410498 59827537
4427 59827537 59504678 59411313 59475492 59780733 60034024 60197437 60198820 60192664 60600800 61181141
4417 61181141 60963506 60579061 60832532 60804550 60819670 61696032 61732396 61826704 62004704 62161326
4407 62161326 62153603 62170731 62207785 62443962 62683287 62503720 62685522 62654625 62973266 62720573
4397 62720573 62620457 63283899 63439032 64100704 64577440 64460659 64380611 64650527 64888612 64780692
4387 64780692 64411084 64662321 65497682 65828891 65674622 65620717 65817419 66664482 66492357 66358450
4377 66358450 66919337 67070849 66968234 67234063 67381912 66970073 67593594 67360414 68031870
4368 68031870 68019857 68500860 68999613 68834451 69338941 69612256 69401895 69932904 70349348 70352311
4358 70352311 70724747 70805271 71067736 71337598 71850590 72369478 72417434 72669678 73372323 73684751
4348 73684751 73817287 73800584 74290607 75204302 75511489 75967766 76113895 76311595 76741867 77237091
4338 77237091 77644367 78058249 77917073 78244723 78682903 78688996 79248262 79632203 79792602 80079637
4328 80079637 80377394 80805942 81796760 81872649 81768785 82556175 82587559 83256050 83904959 83588708
4318 83588708 83722793 84124522 84448373 85123093 85720704 85765978 86288641 86857614 87201253 87745577
4308 87745577 88239664 87893618 88667409 89353566 88951563 89527587 90552498 90993268 91377338
4299 91377338 91857349 92295311 92409889 93052593 93305394 93090761 94107280 95007468 94847494
4290 94847494 95008513 95419880 96219121 96665957 97416865 98070845 98471445 99527769 100216060
4281 100216060 100308304 100469325 101136313 101912859 102279388 102557865 102353699 103297186 104371247
4272 104371247 104798942 105689660 106888220 106595007 107595171 108780072 109268934 109776121 110339322
4263 110339322 110975183 111565627 112566546 113373512 114429465 114807584 115796378 117074857 117772478
4254 117772478 118900602 119619399 120785879 122221738 122606543 124068333 125091995 126259198
4246 126259198 127585757 128687929 130513932 132117808 133474819 134488405 135869828 137935301
4238 137935301 139475252 140714329 142654242 144885253 147241389 149293393 151550014 153769892
4230 153769892 156114851 158523749 161061107 164067789 166663584 169447565 172942042 176037887
4222 176037887 179328510 183299196 187582682 192440935 197502100 202472684 207962193 213989828
4214 213989828 219951232 226019938 231842373 237809982 243700214 249796045 255402307 261781031
4206 261781031 268362148 274563413 280632284 288687259 297836830 306343152 312006913 312477519
4198 312477519 309285240 307141357 306457283 304879245 301952820 299901892 298193271 296219679
4190 296219679 295936569 297631970 300871335 302343087 300528789 295723293 288700892 281798736
4182 281798736 276034519 270248539 263846061 257298079 250838679 245363805 240676221 236359463
4174 236359463 232564804 228284057 224153761 219938586 216261199 211981692 208410556 204483086
4166 204483086 200217911 196941519 193666703 190450775 187160028 184137522 181118985 178387531
4158 178387531 175668864 172934272 170299275 167977757 166136789 164299266 161645328 159796377
4150 159796377 157579208 155123155 153662251 152024608 150263465 149355645 146916698 144921252
4142 144921252 143666245 142698398 141784696 140572610 139577972 138741968 137846755 136288366 135511661
4133 135511661 135152524 134266709 134075923 133576398 133190234 133006877 132573011 132504445 132127397
4124 132127397 131905694 132006848 131724614 132448567 133181897 133500584 133608123 133687164 133888782
4115 133888782 134098376 134411898 134668997 135570773 136330202 137213552 137813163 139001049 140221314
4106 140221314 141195171 142353119 143650945 144986868 146990373 148136290 149980689 151473791
4098 151473791 153831803 155655451 157748613 159716660 162399301 164685121 167426458 170153331
4090 170153331 172453745 175623362 178988397 182293052 185204423 188650865 191749331 194716999
4082 194716999 197985159 201156853 204453756 207618623 210916067 213605413 216014223 218718610
4074 218718610 220925823 223114647 225451224 226850678 228514306 230144152 231052763 232115891
4066 232115891 232646896 233361179 233030497 232975463 232084045 231077485 230148821 228673401 226886990
4057 226886990 224807671 222419670 220518620 218071371 214994164 212117567 208763806 205271280
4049 205271280 201899023 198421644 195286905 191469714 187531006 183731389 180242276 177021687
4041 177021687 173111690 169193950 165778097 161768449 158245417 154721892 151159339 148311181
4033 148311181 145403521 142263911 139454057 136497498 133924508 131095147 128375763 126193352
4025 126193352 123517291 120884114 118620018 117071572 114900514 112834456 110847997 108730851
4017 108730851 106756498 105269227 103559091 101727581 100485848 99288499 98085316 96758499
4009 96758499 95680201 94308664 93015325 91802601 91106903 90012654 89410126 88508450 88064232
4000 88064232 87286076 86710534 86190302 85297138 84920556 84006378 82923766 82162590 82450501
3991 82450501 81751063 81176548 81329619 80994992 80690418 80708732 79818983 79722010 79845769 79706976
3981 79706976 80070510 79764925 79676186 79936272 80192421 80005479 79832879 79875260 80082444 80405929
3971 80405929 80328273 80745732 81208931 82021801 82374758 82815010 83047256 83540814 84451599 84446880
3961 84446880 84707558 85696051 86230947 86833725 87532109 88005641 87876139 88262317 88368831
3952 88368831 88733397 88893194 89220446 89495348 89534621 89943312 90132581 89685342 89724988 88925160
3942 88925160 88439789 88566000 87779149 86755914 86509100 86332120 84746519 84825907 84187767
3933 84187767 83320027 81915880 80512710 79697485 79264421 78723378 78165637 76570181 75523366
3924 75523366 74727214 73459230 72705246 72284191 71484405 70245498 69672159 68911534 68181777
3915 68181777 67664530 67161421 66730125 66576729 65862002 65379391 64802747 64132170 64083309 64456050
3905 64456050 63854065 63511890 63398161 63549059 63211015 63177871 63086093 62613149 62764807 62699966
3895 62699966 62986761 62422575 62134802 62524184 62279293 61537789 61933257 62387274 63064216
3886 63064216 63208371 63060154 63132737 63548635 63493769 63248397 63547123 63840694 63726683 63932916
3876 63932916 64578005 64890253 65255261 65333145 65178427 65606254 66002914 66266893 66612167 66182518
3866 66182518 66473817 67227598 68325230 68503943 68733900 69198924 69423569 69854970 70194836
3857 70194836 71126802 71390776 72112051 72859932 73395528 74036848 74731345 75291733 75616720
3848 75616720 76165041 76652091 78065396 78417247 79357175 80766688 81639690 82186130 82436646
3839 82436646 83463828 84745016 85803249 86020915 86616533 87443348 87955749 88885756 90018589
3830 90018589 91022078 92078343 91928605 92597404 93931591 94650198 95046369 95818917 97281526
3821 97281526 98186991 98183468 98344593 99188707 99661305 100472394 101265798 101757981 102266581 103261626
3811 103261626 104206561 105364238 106010142 106312106 107286967 108179260 109203466 110024011 111065495
3802 111065495 111830408 112857672 114203478 115675942 116741751 117806885 119448986 121120920
3794 121120920 123711236 125661976 126889960 128025366 129870324 132413259 134309798 135573358
3786 135573358 137261182 139617797 141823119 143669008 146039088 148377570 150886430 153607571
3778 153607571 155384237 157790251 159895835 161166073 162824685 164541512 167041821 168518584
3770 168518584 170096784 171784911 173032378 174931542 176259643 177340765 179036462 180273098
3762 180273098 180848532 181324064 181475213 182398997 183193785 183954106 183815980 183558068 183705507
3753 183705507 184039864 184623942 184272520 183520111 182928612 182695149 181712873 181405038 180593647
3744 180593647 179620636 178645265 177648025 176643672 175695367 174707257 172812599 171211864 169514656
3735 169514656 168161745 166626411 164473793 162498217 160222575 158267809 156087808 153712905
3727 153712905 151261044 148958931 147160127 144751249 142161551 139368718 136708359 134201635
3719 134201635 131546410 128463341 125885597 123765871 120891139 118490800 115959398 113704983
3711 113704983 111189316 108690453 106164410 103940170 102064113 99956717 97999319 95917412
3703 95917412 94219998 92376536 90232335 88195985 86578165 84468441 82923898 82134694
3695 82134694 80963784 79302783 77897217 76847483 75787578 74588985 74160812 72537154
3687 72537154 71338363 70094737 69381005 68373077 67797208 66802788 65499357 65007633 63946826
3678 63946826 63134457 61754799 61024981 60274199 59236759 58596431 57863295 56289301 55444498
3669 55444498 54654868 53679420 52356555 51259114 51018073 50051906 48952597 48090095 47558001
3660 47558001 46193647 44999715 43737605 42765455 41747336 41410164 41201555 40044088 38747437
3651 38747437 37938306 36676065 36292750 35445862 34736531 34375347 33773339 33174760 32308981
3642 32308981 32045225 31575979 30490857 30163117 29639724 28639178 28817484 27660617 27083122
3633 27083122 26600341 26242117 25695829 25674258 25487591 24634693 24056308 23862081 23457946 23152713
3623 23152713 23107280 22972901 22128147 21925897 21726561 21491223 21074812 20676995 20406452 19695454
3613 19695454 20122102 20288357 19548287 18956232 19065723 19330079 19132149 18707362 18616797 19016063
3603 19016063 18293289 17633691 18169069 17793084 17703655 17545719 17498667 17528130 16953581 17130442
3593 17130442 17443655 17124461 16848508 16866800 16288731 15589424 15854744 15596190 15055768 14990737
3583 14990737 14642903 14966322 14876790 15040270 14680012 14338140 14146677 14441056 14297693 14233654
3573 14233654 14104479 14001117 14068938 13674942 13597152 13740339 13622809 14070124 13660775 13667799
3563 13667799 13414278 13758760 13733979 13445128 13342321 13630909 13644960 13076707 12816809 12491887
3553 12491887 12571790 12449134 12622523 12349080 12173896 12027831 11831298 11727336 11929156 11862198
3543 11862198 12215081 12346824 12713032 12799016 12693361 12117084 12169656 11410103 11798448 11874058
3533 11874058 11634449 11896341 11497350 11120922 11221887 11533267 12175096 11902471 11735937
3524 11735937 11306399 11455917 11496727 11421765 11197152 11262437 11100315 11160688 10894677 11147187
3514 11147187 11639165 11054886 10857618 11014226 11412891 11365172 11524581 11580793 11789226 11704814
3504 11704814 11546587 11455207 11646978 11831952 12180001 12325120 11895909 10982007 11190914 11675515
3494 11675515 11595143 11686212 11456580 11583181 12085836 11184695 11470572 12029488 12034158 12138902
3484 12138902 11505092 11133002 11197359 11706348 12365684 12225577 12207094 12289303 12492027 12125611
3474 12125611 12024715 12057305 12176760 11948814 11825173 12067321 11992875 12010326 11633924 11814505
3464 11814505 11922126 11524913 11664618 11866152 11378490 11764253 12022255 11599017 11548890 11409932
3454 11409932 11704032 12109518 11994486 11941838 11906956 12554920 12480211 12090631 12325709 12154056
3444 12154056 11504655 12132789 12718009 12599903 12270515 12018603 12460296 12505989 12587297 12897232
3434 12897232 12341076 12336750 13118626 12566819 11855991 12113732 12567019 12600399 12938433 13232292
3424 13232292 12908417 12212657 12518592 13162181 13275916 13329630 14050336 13526523 13003249 13573106
3414 13573106 13444628 13516392 13441192 13396657 13333706 13024887 12999423 13338137 13179996 13147942
3404 13147942 13229820 12966086 13047835 12962748 12811730 12391995 12576136 13024832 12753840 12469320
3394 12469320 12995755 13290390 13279648 13102591 12874008 12755780 13089226 13342348 13356735 13504349
3384 13504349 13369097 12970440 13004424 12831224 12939955 13520519 14159744 14016299 13882428 14128238
3374 14128238 13912501 13550696 13572622 14094016 14104753 14191386 13801289 13039633 13119677 13572006
3364 13572006 12944320 13318546 13061504 13027331 12949201 13236314 13143186 13145630 13284141 13012038
3354 13012038 13119754 13172021 12947838 13056014 13009314 12516149 12702498 12389274 12195459 12682892
3344 12682892 12688060 12975732 13485141 12617276 12381986 12135833 11784715 11697305 12467171 12365282
3334 12365282 11835423 11117085 11290522 11102713 11592553 11673638 11435283 11382926 11044509 10826517
3324 10826517 10650249 10844427 10361112 10515079 10630697 10558902 10379027 9871825 9686805 9952654
3314 9952654 10191571 9725319 9492761 9053804 9002246 9393583 8995689 8882577 9082187 9001623
3304 9001623 8897964 8846674 8711178 9090397 8915393 9242063 9026550 8882840 8980269 9177621
3294 9177621 8634228 8177267 8224738 8519403 8328497 8574111 8881460 8696256 9150832 8935583
3284 8935583 8920194 8933044 8684369 8566857 8212233 8169315 8137564 8168645 8400094 8509341
3274 8509341 8256624 8255710 8676204 8944295 8902804 8487612 8810104 8647547 8497457 8887466
3264 8887466 8569261 8515135 9054701 9012455 8690849 8564580 8755696 9177008 9440914 9137390
3254 9137390 8712028 8964654 8992252 9239198 9056570 8867569 8837725 9242126 9086777 9034619
3244 9034619 9183731 9564547 9753632 9717935 9355709 9187941 9694208 9790110 9660950 9605459
3234 9605459 9771470 10095251 10117444 9846126 9727992 10006586 9993101 9531831 9727386 9381857
3224 9381857 10246450 11069999 11170436 12087181 12342202 11989274 12105118 12203283 12542415 12928766
3214 12928766 13552025 13392869 13413447 13682388 14022195 14631865 14683246 15153102 16403108 16925220
3204 16925220 16784833 16257423 16855395 16742425 17000362 17390637 17040447 17232554 17568725
3195 17568725 17974487 18159103 18815185 19147211 19729203 20013447 20272263 20162535 19975841
3186 19975841 20595670 20993008 21266416 21745775 21874553 21870732 22170117 22635196 22662074 22488313
3176 22488313 22151771 21808528 22173008 22159051 22030260 21864254 21286657 20930137 20461751 20257358
3166 20257358 20821823 21007465 20958904 21110168 21035732 20857270 20349363 19583779 19413360 18610507
3156 18610507 18684428 18448615 18218205 17960881 17443773 17657048 17229222 17244711 16417543 15661205
3146 15661205 15436508 15114559 14872818 14605816 14286720 13887075 13167664 13050495 12785616
3137 12785616 12481287 12297810 11396687 11056289 11080254 11227464 10843708 9714068 9272844
3128 9272844 9048456 8680027 8469473 8481992 8583546 8185020 8050602 7821005 7538693 7165582
3118 7165582 6848835 6978690 7243213 6896454 6681346 6731221 6689808 6435964 6069393 6139747
3108 6139747 5948490 5766658 5801385 5459157 5406818 6005826 5359284 5325358 5077814 5212313
3098 5212313 5676342 5429838 5425713 5937321 5475590 5728530 5733375 5372853 5293068 5082266
3088 5082266 5198805 4883471 5187969 5252380 5171628 4941543 4140167 4445148 4669985 4655323
3078 4655323 4557617 4068914 4696843 4721982 4635797 4709738 4602118 4936992 4640456 4791988
3068 4791988 4803593 4747414 4821229 4073966 4185609 4886415 4553735 4464945 4427069 4254191
3058 4254191 4609926 4575829 4493588 4646951 5201377 4902335 4807985 4878105 4249843 4383511
3048 4383511 4313608 4510391 4686949 4458287 4958186 4995178 4302434 4793667 4987848 4585175
3038 4585175 4633908 4559079 4950259 4824075 4954957 5244807 5281233 5119838 4945034 4118830
3028 4118830 4286080 4222334 4301247 4139444 4222865 4687246 4007566 3756120 4080025 4369357
3018 4369357 4308479 4566847 4740911 5068120 4450126 3998834 4483225 4166072 4351740 4042648
3008 4042648 3973728 3920725 4264721 4354873 4632016 4287456 3808020 4239463 3858329 3776340
2998 3776340 3423864 3829344 3997957 3923613 4364130 3777844 3665028 3761988 3915262 4282842
2988 4282842 3937551 3629465 3863059 3866047 3441886 2868491 2988929 3194696 3392795 3729500
2978 3729500 2939323 2752066 2754629 2359694 2610064 2766849 2191706 2320581 2255870 2184505
2968 2184505 2792532 2949584 2899309 2598206 2513727 2286707 2409351 2088207 2060671 1845234
2958 1845234 1704250 1827786 1862965 2064913 1413022 1805194 1437927 1568882 1282372 1265747
2948 1265747 943219 726860 1064883 1378076 1860720 1654549 1362826 1611670 1509254 1670680
2938 1670680 1653467 1438363 1266363 1687987 1321333 1013881 1376127 1494620 1391202 976350
2928 976350 608359 737985 1127787 1332647 1119467 552867 685731 1174573 1232529 792462
2918 792462 667223 401295 396683 315096 29864 359930 688397 757327 771589 631051 260076
2907 260076 -17043 357897 353927 715847 949583 1074669 772514 563784 337339 88838
2897 88838 -164809 -322860 143060 206492 679408 437644 -347380 -107737 189249 -3973
2887 -3973 44799 247499 -47812 259673 469734 129489 293034 495352 458574 746669
2877 746669 608704 375509 38234 -448171 250705 284087 -141344 -139723 166217 697012
2867 697012 -192551 -357059 226705 263395 268814 151887 -77814 -154867 179557 115270 -161361
2856 -161361 -8694 -16372 -204145 -160858 -337390 -420198 -279150 -861019 -448875 -207766
2846 -207766 -486525 -642344 -428845 -437225 -335099 -318112 82222 41653 -345415 -80210
2836 -80210 -12982 -34460 161048 121130 -45099 -12593 -155586 69404 -141036 -762646 -82887
2825 -82887 -75153 -154679 238243 -19466 -476114 -665530 -588826 -696967 -592722 203505 196497
2814 196497 202212 -206117 -618946 -221356 -230625 -448879 -702540 -390190 -539377 -295726
2804 -295726 195474 -13856 -386346 -161126 -80998 -4927 -461102 -681074 -81642 832215
2794 832215 680035 1138019 1166227 284281 373849 45272 105298 132250 -482274 -261977
2784 -261977 -18437 254113 268542 -76977 -269543 -135216 -147770 -351441 -149003 48659
2774 48659 -77550 -86589 -161381 -745840 -1084615 -788682 -553160 -257158 -495571 -963388
2764 -963388 -512814 -320927 -643561 -222886 -74841 -242688 -668147 -177808 -129744 -362063
2754 -362063 -488799 -554196 -454764 -40922 148003 141632 292252 -107742 -422575 -584656
2744 -584656 -111952 266396 -68729 -221039 -282817 -539046 -516832 -590445 -471484 -636931
2734 -636931 -400840 -222212 -89553 191644 221995 170650 -290369 183709 -32312 121783
2724 121783 375255 -95849 -489684 -208913 -697190 -781624 -433175 -761569 -1083343 -876961
2714 -876961 -411238 -667374 -63248 69695 -310151 -346229 22892 -104380 -52091 -461360
2704 -461360 -442423 -437315 -678680 -304137 128671 -297426 -312555 -355765 -306083 13838 149001
2693 149001 160301 -162267 -336371 -241154 -168970 184420 -311185 -234146 -47071 -586733
2683 -586733 -728339 -560773 -503679 -124053 -164057 -648448 -584241 -171380 -247151 -537420
2673 -537420 -396850 -361131 -216386 -292449 -600651 -412851 -354138 -541182 -129864 27019
2663 27019 -321752 -564806 -640628 -519347 -468269 -587961 -148701 -256620 -456223 -485385
2653 -485385 -460807 -478675 -474097 -469775 -164225 -149801 -736193 -943666 -614174 -128164 534479
2642 534479 406124 -272832 -519420 41723 -78829 -395480 -301206 -180407 -361547 -1253058
2632 -1253058 -1181557 -594289 -518495 -237218 161434 -38229 39886 -151730 -488563 -604561
2622 -604561 -750379 -634701 -296366 -710878 -951066 -719494 -289919 -298459 -445470 -1078175
2612 -1078175 -994133 -551028 -61526 51145 -637604 -806351 -285505 -98935 -455122 -521343
2602 -521343 -450411 -105678 -271540 -515594 -627763 -368263 -273665 -194718 293337 138411
2592 138411 364580 -400119 -373483 102587 -156839 170260 -158265 -259414 -543910 -327044
2582 -327044 -108926 148341 139096 -340674 -143339 75687 -377556 -782267 -795028 -758848
2572 -758848 -744716 -697276 -547145 161588 -178886 -767662 -1016598 -403359 -117355 -196219
2562 -196219 104454 -450918 -696555 -910477 -907601 -414145 -194060 -93276 -856361 -777910
2552 -777910 -577684 -244779 -95585 15983 -68313 -490050 -616190 -538768 -75055 -453407
2542 -453407 -848927 -211950 -22393 -275313 -616308 -979707 -273052 -279550 -719391 -775661
2532 -775661 -453279 -45728 9911 -614414 -873256 -850773 -554056 -522086 -199171 -309772
2522 -309772 -486575 -1121404 -789320 129701 -377774 -509836 -508566 -446301 -389521 -632014
2512 -632014 -769766 -502144 -716707 -628484 -420665 -437178 -946291 -487576 -497476 -694777
2502 -694777 -950549 -1132202 -477005 -639636 -81480 193925 -392367 -31593 349710 214004
2492 214004 -46933 81974 -415420 -269728 -405511 -699951 -691901 -479092 -533007 -748335
2482 -748335 -600551 -284270 -312695 -532795 -755927 -199760 53348 -314139 -233206 -605509
2472 -605509 -254102 -361641 -90671 -566501 -1245833 -1031090 -485466 38155 306994 -141981
2462 -141981 -228972 -198069 -293513 153880 337851 347393 -208222 -531941 -431972 -496517 -331273
2451 -331273 -11066 -296187 -856952 -826671 -500515 -334942 65126 384809 -176397 -317400
2441 -317400 10646 488580 186942 149432 -290956 -431395 -8408 706906 643498 -75469
2431 -75469 -490662 -276124 62691 9894 -516128 -807969 -853301 -646754 -766193 -131358
2421 -131358 83810 -380229 -576977 -829610 -522060 -10063 102937 -220231 -439038 -230299
2411 -230299 -391984 -416083 -66283 272258 -119778 -414206 -463885 -319162 388947 825265
2401 825265 452926 109961 785181 569821 283876 200531 -22580 155046 -147281 -340402
2391 -340402 -194176 -342146 -650249 -497289 -819189 -107249 -157485 -746967 -795842 -693758
2381 -693758 -504344 -683312 -295700 -758852 -486743 -372012 -317992 -555982 -396866 -609827
2371 -609827 -632109 -792229 -388309 -487880 -88260 -370935 -286756 278876 267019 45328
2361 45328 -54844 48194 129216 -471429 -140769 -244318 326346 150143 -161003 -454101
2351 -454101 -1400939 -817637 -946636 -460730 -108158 -519680 -403623 -229608 -176511 -53154
2341 -53154 -224652 -560159 -340266 103161 -118959 -593234 -139389 95150 292763 544138
2331 544138 109219 -275630 -634780 -329781 -416024 -567125 -1033310 -1011208 -949176 -1165101
2321 -1165101 -1036112 -423462 -169901 -371935 -216228 15521 62810 103261 -224708 -353078
2311 -353078 -302705 -571911 -930838 -83986 -26884 -383474 -296004 17654 -276312 -474410
2301 -474410 154100 135965 -440941 -630465 -421614 -423330 -684183 -441191 -706128 -998134
2291 -998134 -1175853 -902475 -419145 -465758 -696632 -493349 -497901 -233526 -230111 -575200 -605436
2280 -605436 -744938 -330308 -239826 500011 1221065 783306 12568 4671 -197904 62490
2270 62490 208394 -185527 -272475 76089 594833 855541 69950 310565 445637 -267504
2260 -267504 -385399 -363537 -597088 -463142 264528 185907 -83119 -813026 -443436 37686
2250 37686 9976 -135433 -626939 -864769 -232126 -137806 -360897 31820 -222499 -551532
2240 -551532 -671877 -328617 -494620 -717709 9493 188728 -149912 -120780 -217413 312586
2230 312586 -198130 -602605 -522088 -915718 -488093 -498075 -233383 -165975 -339801 -736968
2220 -736968 -431174 341124 162853 84425 -32230 33903 112530 -39866 -543290 -636114
2210 -636114 -503834 -608282 -699144 -680075 -449670 -758622 -1160130 -1055752 -307267 -253997
2200 -253997 -52930 -336278 -276298 -504514 -724385 -1020828 -990367 -535778 -102453 -473838
2190 -473838 -791592 -400166 -253299 -190692 -52115 741311 304739 269463 -249552 -453990
2180 -453990 -108033 -319395 -253688 -205671 45525 75246 -365165 -644723 -375022 -525784
2170 -525784 -605082 -612122 62608 -16585 -118837 43774 -372987 -215241 -70661 380405
2160 380405 -612931 -827076 -470692 -708530 -284520 -318086 -715533 -275089 270959 387723
2150 387723 -254092 -272986 -263590 -171134 -159009 -121039 -520150 -557408 -456622 -249995 -118530
2139 -118530 -135775 -228847 -132844 -38067 -340793 -436288 -124630 -30292 188154 716373 741103
2128 741103 238797 -182645 -372191 527 -250793 -691349 -463769 -424087 -281484 -362482
2118 -362482 -164420 -442859 -584172 -469668 -403941 -81001 616619 482068 495058 357974
2108 357974 55925 -237578 -274276 -157940 -214664 3090 -245767 -579383 -765247 -468111
2098 -468111 108537 179919 -220826 -599491 -353323 37014 122858 -138195 272561 35315
2088 35315 70313 -448080 -743302 -498606 33315 349081 90646 -53058 173765 59245
2078 59245 -264562 -94956 -45337 322107 344896 599704 99807 -648845 -468813 -435388
2068 -435388 -97235 -342195 -453589 -248378 -447111 -84496 40240 454923 382176 545113
2058 545113 162764 71036 213421 28999 -564940 -612899 -349169 -560472 -716772 -542275
2048 -542275 -731224 -81350 -73346 -198983 169124 27006 228593 504667 175919 -317949
2038 -317949 175888 174515 302511 -217058 -51924 272549 241330 -182015 153715 358539
2028 358539 -96128 -189484 -403806 -473903 -736963 -352013 -416845 -497969 16849 377477
2018 377477 -239680 -678453 -539023 -683871 -527267 -218867 -306021 -31528 526551 580933
2008 580933 268772 -325715 -334039 -206381 309855 327790 165345 332380 -128831 -156141
1998 -156141 84300 -453480 -488264 -93073 -74667 -339064 -7106 392770 384790 374380 458661
1987 458661 497333 295045 428142 43728 62276 268235 300779 15546 -302758 523194
1977 523194 289085 -274202 -226525 433643 552826 -82855 -339244 -286483 -118757 90250
1967 90250 340890 -183389 -568409 -697629 -562931 -515537 -386285 88073 -273815 -283649
1957 -283649 326014 -95231 -256510 6846 692669 409711 907549 313481 -82423 257330
1947 257330 -346588 -442168 -888226 -366914 145240 -4180 -92025 526932 272712 81756
1937 81756 -263569 -210464 -221401 -229515 -23591 -380669 -305657 -91992 -415046 -12328 109508
1926 109508 -109745 532752 440146 29155 19022 333893 507123 402090 -95743 -263871
1916 -263871 -177599 -451043 -200602 -294801 -263356 -123050 -336670 -51431 134575 -454108
1906 -454108 -167929 -141049 230007 293989 -54661 -26740 11220 -17301 -498197 -482729 -542189
1895 -542189 -760388 -139483 -74204 -502518 -475217 -567796 -314012 -486760 -211534 327160
1885 327160 84538 114501 -30137 -229495 26623 -299951 122785 250850 44394 -276510
1875 -276510 -1105447 -887740 -2234 239068 -219303 41057 429069 -52614 -369306 -319554
1865 -319554 -445377 -562150 -229696 -622154 -449137 13032 -102576 -481045 -257948 -94661
1855 -94661 -261684 -43472 592915 467429 610309 294956 23668 -36980 -134297 -329686
1845 -329686 -213968 -381479 -298476 -330278 -269142 -511870 175336 -285682 -769731 -562234
1835 -562234 -650373 -363565 -59662 446549 -40350 -140011 -149326 -205576 180082 678992 617900
1824 617900 102906 -5980 36686 -220971 -113596 -16621 284929 -333865 -367549 -320078
1814 -320078 26418 66411 539996 564850 -421637 -628258 272626 -147700 -90897 -409699
1804 -409699 -890753 -178100 -493256 -387554 -227427 -16128 232131 -59372 -141541 -195511
1794 -195511 -114119 -108793 50028 110341 217723 151370 -165030 -140997 105587 -135951 -194586
1783 -194586 -85996 -93995 90413 -6962 60574 -54685 113426 118437 -207234 -336158 -245016
1772 -245016 49721 132857 125846 620641 583147 -282092 -266764 -178796 251970 280578 427442
1761 427442 -125838 -498513 -56507 -130186 -80490 446758 688203 204371 -72070 -292021
1751 -292021 -161546 432923 211820 -121682 -352139 -100241 496781 510759 433840 253285
1741 253285 -236323 -275736 -104219 165591 -67935 74822 619812 999870 243760 -80986
1731 -80986 -80580 -405903 32095 -74146 -539351 -365494 595932 -477333 -742434 -629365
1721 -629365 -372618 -187943 -229075 -559864 -275985 80617 -389902 -609253 -406352 408128
1711 408128 659641 410055 302412 576293 370208 -234272 -301818 -149537 -441921 -439225
1701 -439225 -129687 316099 708681 279580 -424647 -455417 -492679 -519235 -50237 -373880
1691 -373880 -175261 -74610 -289767 -322985 9290 200551 183742 131867 -341879 -532100
1681 -532100 -590055 -366482 250852 -75369 -130618 -418450 -654390 -177988 784 -494098
1671 -494098 -256575 20221 110560 -16508 -13351 -275521 27931 286768 -92714 -326453
1661 -326453 -201732 127358 -739310 -701018 -438225 -308619 -587387 -656487 104035 95352
1651 95352 121182 689637 39847 2805 -130619 -70788 389406 555530 496874 179866 -372344
1640 -372344 -219179 -168203 86541 -111364 -298152 -356085 -539501 -506616 -734649 -462737
1630 -462737 -560815 -121127 -250392 -155066 -13318 116477 -19302 -12344 295905 -70643
1620 -70643 -111737 146299 180603 -188924 476864 551636 363446 497733 448767 220307 149532
1609 149532 205904 -4554 286482 295681 -59657 -375200 85404 582188 357017 -172942
1599 -172942 -483182 -741678 -347520 335746 -102837 -350322 -494911 -278060 273521 -63348
1589 -63348 -76608 174847 595411 243245 -305461 151328 77411 -47128 245250 495880
1579 495880 302461 -134811 -101572 775321 957992 596260 625410 342892 -300854 -204133
1569 -204133 82489 377220 3655 -56893 -50137 -188743 165898 348709 235496 -100706
1559 -100706 -206416 -179724 96963 452101 471697 209655 -429914 -528685 56461 -93766
1549 -93766 2972 147770 -110364 142484 253274 -64894 -180085 -477286 -551038 77457
1539 77457 120617 1243 591897 463574 218116 281635 796256 65711 39563 118462 474151
1528 474151 731595 445132 80544 -61872 -324126 -868079 -1116649 -838445 -287619 -84607
1518 -84607 -236710 34182 603238 664529 396378 115864 78122 -706577 -548331 -29919
1508 -29919 117845 699975 1238694 780217 787224 299619 87159 181437 163871 569810 351938
1497 351938 -85831 383104 199442 367776 410013 405658 290475 -79194 207653 845234
1487 845234 552626 434868 59642 -654950 -542499 -441957 -31577 504938 293150 -174807
1477 -174807 -6342 604573 461847 709720 807860 86692 439161 733594 -70511 -242793
1467 -242793 -528129 -352125 15299 98188 197261 -47103 -463434 -665175 -167938 312114
1457 312114 170389 73876 384113 249729 327056 289133 823089 551282 -46819 -423815
1447 -423815 -122852 -14850 52339 486349 804599 623330 231395 394692 814101 519098
1437 519098 -138098 -112405 322044 159389 499371 649539 548825 254304 149903 60607
1427 60607 -95378 -477853 -225225 -185571 -146582 -27702 -87173 329227 358573 91255 105519
1416 105519 161175 -111990 -459174 -225693 -275741 -544983 -50293 -91028 -447267 -353421
1406 -353421 138031 279213 329837 279981 -468599 -581313 -87774 141120 241364 -187352
1396 -187352 5462 19980 227509 26044 143544 -176518 -68269 134918 -344564 -554889
1386 -554889 -564661 -75793 -130325 -392640 -599042 -130735 13801 -176994 -264339 -39762
1376 -39762 118843 86534 215041 258955 -135078 253575 400456 -195266 -549262 -102007
1366 -102007 542808 877445 565174 328393 352503 625233 250577 -75664 52342 -108118
1356 -108118 66341 -464673 -606266 -313615 -190600 -241613 87782 326607 -119352 -669438
1346 -669438 -1042076 -562843 1862 131960 509546 -115266 26930 169323 -311073 146053
1336 146053 -59424 291317 400759 483475 688707 402317 422311 -114379 -161477 62450
1326 62450 -12212 158016 193391 298096 518018 326603 724544 1055307 903100 203007
1316 203007 -112875 -166600 -165841 812989 471313 -96532 27858 -212218 321430 491862
1306 491862 421818 431170 633356 363740 38642 575331 81900 -219854 824865 440758
1296 440758 563282 376258 529960 605813 705701 175297 216979 562004 325590 10119
1286 10119 -199624 46627 367258 -56574 -256002 108500 -39227 -17196 378855 757397
1276 757397 619638 491560 192752 312426 438708 489419 113217 -277754 -52952 276940
1266 276940 302604 -83830 34962 390647 123811 114574 339597 -433882 -737795 -99103
1256 -99103 290393 471726 577063 880201 269297 -223947 -351133 -173856 -20270 140454
1246 140454 -409785 152620 93301 -109324 112629 155077 -219741 131172 -144134 -119680
1236 -119680 239713 -17557 281587 521527 216209 236637 562498 14710 -128683 3738
1226 3738 77914 50307 254605 41204 363775 379169 300293 479211 64796 362423 217035
1215 217035 -160840 -355520 -203325 -69240 -98103 -170107 -116261 -221672 396705 661089
1205 661089 309086 588539 219683 -19893 -193861 -163790 -553290 -311711 -51863 165916
1195 165916 990678 676932 538778 364115 -164143 22430 348383 297292 273402 -6095
1185 -6095 109840 183737 250171 681244 528595 136508 68154 200542 -279497 -437656 -121725
1174 -121725 131090 -73493 -30542 114298 20248 122088 -132350 -196169 367074 139702
1164 139702 -235548 -123846 -44609 128606 185104 638883 510478 528449 978264 918146
1154 918146 483480 430237 731433 461050 312035 435855 632642 127195 -281065 400185
1144 400185 -67580 95792 -72071 -167306 448133 -16524 -186514 -362488 -652999 -634638
1134 -634638 255229 947649 921463 506075 389292 474050 -45186 -516627 -139213 45542
1124 45542 314418 -95678 -718070 -233809 -1425 192484 177209 297422 448218 -155016
1114 -155016 80191 175153 -295652 -320631 65959 -56641 55613 -9400 -161826 -310078
1104 -310078 134458 480219 624938 672497 401913 184078 268802 278853 161968 316326
1094 316326 83667 141316 213879 -67628 -54944 532866 264284 -474296 -592778 -359961
1084 -359961 312271 -59442 203778 378482 166369 388589 91636 429422 638727 -26230
1074 -26230 -1060411 -504460 -146951 314553 -65494 -381647 -188009 -221503 240107 71106
1064 71106 -412631 -518448 -407521 -329214 267918 676732 715452 481571 183362 742758
1054 742758 1046270 698607 1065932 1024329 932664 732369 556309 310753 516766 49773
1044 49773 666025 634368 92682 371685 366221 412068 751681 1002873 281657 5472 -231684
1033 -231684 -148498 414765 41574 -169763 199532 159654 -176293 -79364 424027 243375
1023 243375 -259030 -394750 -438529 -222240 535051 332486 -32420 -212886 -333089 -159798
1013 -159798 -227762 -172629 118047 144979 -196386 -521912 -390748 437373 576573 438949
1003 438949 370125 3127 -139442 -116240 490816 226573 166006 -372889 -203543 -54523
993 -54523 -397551 -392411 152739 225709 861520 416973 235863 58644 537423 602918 80317
982 80317 634756 204449 112171 -155889 -313964 125270 411389 507458 272504 -68439
972 -68439 559852 124856 287183 293395 651055 311052 -586194 -765628 -560424 -491545 -351384
961 -351384 307055 -18176 24234 122542 111069 262778 72477 -432605 -442734 -165565 554206
950 554206 645179 639248 642401 -129140 -362456 32341 794062 1052235 1180559 800297 532574
939 532574 369631 308500 630082 137288 41497 -1292 415911 447345 384059 38986 343188
928 343188 542674 291456 10938 -138805 30637 -46273 303652 498664 857049 883196
918 883196 316216 55788 314146 299540 552385 928705 562923 -173844 255590 11042
908 11042 -103754 217100 22741 -181202 74532 229581 -192424 1640 167521 91694
898 91694 -275569 554292 325300 -99403 171003 206129 393884 351892 362184 538452 513570
887 513570 43696 2799 -134777 231543 230158 -170676 -179697 -102489 -326379 206113 83782
876 83782 864455 615800 201553 -121866 -116375 477916 -9986 66923 379539 -5495 -173875
865 -173875 -228087 216514 173143 -80695 -340337 123055 490254 78595 -193776 -177078
855 -177078 204864 271565 196147 668914 489758 299394 477572 -43660 358956 654203
845 654203 544395 780091 402586 331826 280599 133340 159058 -273453 -35471 190597
835 190597 389281 385510 624805 392893 193614 99060 151033 496526 -49847 -55930 403568
824 403568 192545 391905 600809 319393 268159 102192 -588470 -563352 -383121 -328132
814 -328132 174529 -65740 -323149 -311100 -136267 248438 220942 228481 87010 147360 -236856
803 -236856 -274160 -805793 -391545 481120 585752 -75783 -371544 178170 909795 426731
793 426731 278700 742228 282042 339200 233716 232599 182556 233884 131340 -152300 -83225
782 -83225 392450 521869 395782 24544 442531 472792 532736 174028 -633787 -88909
772 -88909 554739 58936 -260065 75332 67267 175061 -176224 93893 251550 69603
762 69603 16685 259916 62582 -187898 -59432 -36708 -530418 -133892 99425 98475 -23461
751 -23461 15335 185262 328237 -6397 -287227 -61801 -786555 -173753 469160 653663
741 653663 447519 184988 -50580 -131768 -123109 -328099 -498810 -761827 -524781 -8743
731 -8743 -66428 -117202 -291175 -652752 -639090 -233073 204659 -925087 -256059 -323008 -17267
720 -17267 531889 -198309 133213 183088 -132026 50007 111893 -40956 76456 -135072
710 -135072 -180027 -85512 -367738 -844084 -898231 -270650 -260125 -7758 423953 201944 -356815
699 -356815 -67869 362852 19870 335077 377720 237693 73787 440153 294511 308187
689 308187 460910 -35170 -505546 -91423 436303 275854 226353 78184 -427304 -300131
679 -300131 1354 136224 -90394 124419 257935 389450 229968 313948 132790 351119
669 351119 339516 -194307 -233547 139349 -139788 -401540 -410374 -125459 -423932 -518404 -321144
658 -321144 28899 610522 712477 911765 819928 217330 13493 74281 52301 -136594
648 -136594 159318 172225 -22068 267464 -89371 -334044 -574823 -85015 -112000 -27150
638 -27150 -101113 -81158 -365551 -702171 164721 119027 460971 363588 205625 59193 60355
627 60355 147893 128948 1006393 260664 -172755 -442139 -80742 291330 -81184 31066
617 31066 516050 513245 109668 36652 105990 -56241 -398832 -648240 -874856 -706200 -414998
606 -414998 196349 -164783 -186548 145761 131873 451126 214705 -57366 -180915 -500763
596 -500763 -153999 -222222 -468680 -38694 9450 -274604 -28503 273865 -356747 -474799
586 -474799 -524716 -157119 -70098 -227598 -53392 28671 -5498 -82452 383113 94036 -86304
575 -86304 -492533 -83946 377494 254463 136138 -334017 -243596 -79713 -550870 -363837
565 -363837 -155270 -124096 130584 -370713 -144687 -144764 37886 -294165 -580478 -242083 -28055
554 -28055 -21931 -430695 -121157 357213 84071 218240 -182190 296302 623496 63335
544 63335 216390 501927 412053 477955 298164 17399 165648 -33956 -331804 -349497 -285427
533 -285427 -7451 116570 -87666 -136170 22444 -46069 -286800 -670087 -370616 34259
523 34259 -313111 -355896 -121514 514367 438687 347676 37521 -362326 -727748 -258381 403811
512 403811 468946 239480 -221157 234002 31345 -98758 239745 45457 -206741 302888
502 302888 126364 200994 -98872 -76360 232355 182672 435835 201135 -104022 -244076
492 -244076 -433029 -116624 -27451 -345647 -16473 185550 475616 504040 -424419 332763
482 332763 228283 118708 -286538 -119757 48619 385421 374985 399940 390438 259948 503672
471 503672 -130750 43116 220789 335848 84766 399522 563615 420255 26152 150642
461 150642 -2445 75930 -532660 -642644 -38783 -263406 -820847 -9681 386761 484046
451 484046 530624 -189729 -592922 -8147 -92528 -102517 -220822 87864 24421 -381188 -978985
440 -978985 -641916 -890256 -998744 -398969 -421867 18984 604558 229699 593753 134916
430 134916 -114050 -579760 -660623 -198081 -114878 -159532 -323459 -148915 123455 11031
420 11031 261902 338394 -312119 -614466 -241225 76803 -14056 -315561 -872475 -218473
410 -218473 -249703 -696310 -536589 -321480 -584599 -27842 131067 -315055 -352269 -62079
400 -62079 -538470 -821137 -301988 -133805 -40406 125195 -746801 -828654 -541940 272497
390 272497 134248 -13113 -427458 -89348 -172371 -707439 -458286 -547664 40043 -94899
380 -94899 -93925 -33715 18749 96715 -43592 -143216 -188242 65565 -86866 -28782 -311152 -376870
368 -376870 -453214 -603949 -381512 -599797 -129121 -565394 -368880 186753 -138280 -869150
358 -869150 -409971 -166515 -700673 -485388 -316383 -253781 -549544 149995 49708 -562317
348 -562317 -224525 -254220 -731493 -598355 -734593 -786788 -539221 -102172 -42875 -23777 -86628
337 -86628 -99485 258489 -275382 -332949 -389731 -665224 -491410 -497327 103724 256272 58651
326 58651 -453203 -626926 -402276 -464296 -706448 -749538 -940668 -595247 -468704 -281248
316 -281248 -729825 -838901 -661889 -949794 -573270 -242545 -206786 -576562 -184937 -32171
306 -32171 -292025 464379 937292 608848 441703 -235136 -404560 -391505 -450733 72550
296 72550 -46674 -313767 -244879 -182034 -446065 -553134 -17379 -174509 -371616 -891953
286 -891953 -679627 16889 141932 -19823 -565523 -408767 -388613 -295668 -203266 -263764 -264119
275 -264119 26564 159612 -236482 -393031 -563894 -487398 -975624 -727196 32361 -580890
265 -580890 -550868 -490986 -670700 -301900 -69464 -458927 -238922 -22294 -263450 -472844
255 -472844 -307986 -187473 -355072 -610308 -581873 70586 195267 330180 128811 -26969
245 -26969 -359348 -61528 133492 93422 302265 -151130 23785 -237441 -802130 -801552 -620469
234 -620469 -276029 -19966 -122780 108551 18159 -539354 -372413 -483632 -523078 -458908
224 -458908 -550831 -633706 -432291 20181 449687 -64332 -467861 -880815 -412638 -16801
214 -16801 -30014 -469296 -837172 -700798 -337530 -676732 -320265 -399075 10543 82639 -277834
203 -277834 -709880 -835672 -485622 -1009998 -423969 112056 -323345 -712695 -1242292 -968571
193 -968571 -118768 -576648 -369095 -117183 -344472 -322218 -348608 -303179 -805395 -779174 -744496
182 -744496 -656047 -533470 160143 404179 -345895 -289954 28595 34688 -60188 -782527 -970830
171 -970830 -739864 -813551 -384811 -412962 -689517 -346645 26278 -385946 -577372 -546991
161 -546991 -342508 3629 -571474 -693087 -212284 9579 -88463 -466937 -444075 -91576
151 -91576 15894 -100484 -45160 -32321 131148 -252301 -560611 -723285 -565624 -608450 -496648
140 -496648 111034 32383 -443184 -419972 -600404 -148948 132008 -163987 -829608 -595063
130 -595063 -771993 -796932 -965614 -805300 -339058 68221 8117 78597 -122826 -386414
120 -386414 -373573 -460991 -632896 -194681 -39042 -75038 -103883 -220682 -236036 318371 42572
109 42572 58534 -14137 -351644 -154391 138564 -265939 -530320 -464463 -347054 -373147 -554936
98 -554936 -370296 -335535 -520950 -627876 -623828 -569536 -268089 -664059 -652377 -256284 -318236
87 -318236 160756 204818 146701 -322137 -464255 -460385 -808217 -229630 -235203 -63665 -82990
76 -82990 -490355 -740305 -533380 -518755 -437477 -503364 -427151 -384139 -447089 -789788 -251945
65 -251945 -232404 -537994 -456877 -106795 -378644 -551314 -516826 15155 -408115 -538688 -279265
54 -279265 14707 13361 -360540 -487399 -234824 -349202 -648812 -600276 -380879 -590138 -472435
43 -472435 -629230 -695973 -306613 -318837 -500044 -222305 -335469 -381607 -369506 -372645 -157942
32 -157942 133116 -181520 -566619 -605719 -929555 -849832 -406015 -536825 -854510 -748495
22 -748495 -309235 -202926 -408843 -403352 -520265 -209288 -126111 -143304 -699 -152255 -478863
11 -478863 -410337 -634096 -342344 -557068 -459458 -128759 -547888 -403569 79098 -83696
1 -83696 -331069
0 -331069
$$ Imaginary data points
##PAGE= N=2
##DATA TABLE= (X++(I..I)), XYDATA
16383 -4194577 -4228127 -4346102 -4361177 -4233257 -3862692 -3938117 -3738267 -3600931 -3491869 -3487092
16373 -3487092 -3697241 -3688866 -3328026 -3199552 -2887176 -2864142 -3039758 -2878803 -3086510 -2527092
16363 -2527092 -2249331 -2210991 -2015305 -2191879 -2525736 -2423401 -2502023 -2239876 -1680465 -1799686
16353 -1799686 -2037708 -2361114 -1610194 -1585490 -1410126 -1318709 -1619312 -1829752 -1196120 -914004
16343 -914004 -1249625 -1132346 -889679 -547778 -304418 -96917 -128688 -306428 -568176 -99614
16333 -99614 20676 94604 -4958 275556 312721 667609 412052 500627 266019 432441
16323 432441 864187 487402 1003716 1481802 1339474 996641 961778 1148144 1589667 1785885
16313 1785885 2081329 1830581 2235104 2393757 2103333 1861841 1601753 2083813 2151823 1977729
16303 1977729 2119327 1751302 2249716 2602232 2516881 2391580 2857686 3406610 3244418 3272296
16293 3272296 2987252 3018833 3637613 3909332 3578733 3531359 3816515 3657357 3778683 4209755
16283 4209755 4719336 4277990 3865873 4339886 4345729 4385674 4541600 4382413 3792268 3931857
16273 3931857 3935844 3904196 4778732 5014089 4679477 4873843 4703147 4474615 4988677 4684817
16263 4684817 4767596 5007456 5078522 5111640 5509481 5873446 5747522 6003426 6097195 5768795
16253 5768795 5672912 5699225 6081248 6098137 6346034 6303340 6027703 6248516 6349059 6803838
16243 6803838 6671847 5995029 6001289 5757104 5904187 6187841 6303213 6315892 6311699 6960437
16233 6960437 7014202 7569479 7381684 6758149 6570812 7016222 6964135 7054108 7197765 7090995
16223 7090995 7202458 7016164 7332792 7410079 7994081 8021011 7490758 7025812 6697314 6725656
16213 6725656 7167661 7560767 7662528 7576442 7897465 7988393 7719072 8025007 8180135 7979076
16203 7979076 7773003 8105526 8155282 8163661 8035062 8012859 8188664 8906545 8667992 8274611
16193 8274611 8235099 8464062 8308353 8298225 8453500 8270832 8244767 8131874 7935942 8152989
16183 8152989 7843608 8082360 8883750 8552644 8452994 8629117 8768768 8979933 9514679 8713480
16173 8713480 8787125 9203630 8868036 9139428 9606900 9231052 9201639 9139564 9089852 9037054
16163 9037054 9262404 9111854 8727986 8525726 8606617 8798259 8970847 8742974 8854205 9164813
16153 9164813 9092876 9572609 8945255 9150042 9542135 9804810 10126824 9795390 9214056 9310572
16143 9310572 9517232 9606748 10039581 9891198 9995730 10245515 9694980 9679825 9822862 9890486
16133 9890486 9022350 9003358 9047887 9180985 9351042 9590807 9662956 9453551 9315317 9427212
16123 9427212 9749739 9370198 9560069 8979573 9179669 9595089 9807285 9360696 9142089
16114 9142089 9009292 9184596 9599643 9609359 9891109 10189139 9464489 9408951 9961915 10007900
16104 10007900 9970581 9947709 10583915 10359975 10051265 9575296 10004175 10030322 10030008 9867667
16094 9867667 9452865 9498617 9996835 9830197 9719424 9775236 9919959 10265897 10254025 10499100
16084 10499100 10565569 10216543 9965917 10232514 9926645 10109981 10156420 9917250 9732328 9962302
16074 9962302 9581437 9388784 9239378 9687689 10108726 10008109 10319620 10425657 10274119
16065 10274119 9828529 9602726 9618054 10013155 10217313 9675900 10042749 9901759 9920613 10395453
16055 10395453 11164289 10735252 10305217 9780115 9906198 10508669 10279502 10787376 10097295
16046 10097295 9718240 9904342 9960944 9905665 10102217 9803897 9819896 10082293 10378993 9995199
16036 9995199 10222440 10798985 10967242 10524910 10023191 9794783 10026244 10101393 9952948 9807643
16026 9807643 9676824 9795676 9880065 9663546 9828594 10028463 10067119 10243687 10585267 10613212
16016 10613212 10240779 9411265 9647285 9933885 9845866 9907899 10267374 10249281 10419041 10558895
16006 10558895 10426116 10696354 10375659 10721038 10562413 10371625 9951271 9836849 10142289
15997 10142289 10609334 10437138 10404094 10584475 10912016 10370597 10326349 10431150 10445716 10451550
15987 10451550 10805141 10481255 9924603 9889368 10177768 10320222 10396927 10240575 10188517 10142954
15977 10142954 9631678 9719612 10096158 10741948 10755592 10014421 9812700 9895514 10401680 10467917
15967 10467917 10014502 9830235 9771955 9765410 9767478 10224727 9949765 9954143 9935731 10109360 10719432
15956 10719432 10978362 10800195 10684265 10367694 10189368 10545398 10585085 10010282 10201597
15947 10201597 10154840 10347298 10004566 9950350 10325297 10352658 10118734 10253079 10271766 9968668
15937 9968668 10162809 10087235 10568996 10509104 10115779 10158670 10542227 10129922 9716248 10199046
15927 10199046 10698622 10874722 10289948 9848822 10602011 11256426 10982878 10638296 10043196
15918 10043196 10189023 9893064 9856100 10558055 10545318 10710461 10651505 10478596 10277056 9928197
15908 9928197 10043123 10461693 10464242 10596330 10326512 10329382 10115242 9908241 9828595 10263093
15898 10263093 9926264 10034444 10351100 10355190 10392833 10388074 10700640 10482275 9913763 10125305
15888 10125305 10011332 10207985 10415672 10109115 10379005 10775833 10682597 10431702 10560762
15879 10560762 10533139 10556919 10652902 10596223 10121652 9954871 10143731 10756683 10968117 11221922
15869 11221922 11103635 10730045 10722406 10730882 10459494 10654845 10627806 10586956 10451414 10593979
15859 10593979 10194350 10242750 10245339 10210403 10068645 10587642 11050425 10848027 10645168 10566611
15849 10566611 10155432 10238956 10250091 11046199 11135792 10499413 10265468 10554666 10438480 10561101
15839 10561101 10705627 10537496 10149427 10112966 10533729 10337260 10797677 10758553 10644189 10934014
15829 10934014 11041743 11002805 10634175 10715233 10525409 10729850 10759494 10453788 10717451 10215383
15819 10215383 10344209 10800725 10539783 9967466 10839685 10931570 10918083 10955762 10915280 10699366
15809 10699366 10726135 10797998 10734172 10830935 10606215 10468584 10653412 10532798 10657709 10838118
15799 10838118 11384062 11092085 11026901 10950491 11118669 10984876 10482945 11076355 11278120 10482947
15789 10482947 10719909 10963627 10839507 10930595 10715808 10822274 10714125 10250252 10566150
15780 10566150 10877847 11287364 10982187 10968901 10050669 9926332 10110539 10455355 10308373
15771 10308373 10008796 10908409 11084072 10795553 10499421 10464556 10905241 11215905 10782701
15762 10782701 10976286 10905232 10964237 11120059 10956773 11015259 10930878 10653875 10708829 10647281
15752 10647281 10432934 10324992 10284074 10235930 10644256 10697274 10734587 10731345 10675138 11046666
15742 11046666 11335159 10483575 10510391 10559159 10293724 10603777 10379931 10410285 10557824 10584736
15732 10584736 10611393 10309428 10765209 10620850 10143379 9960580 10421626 10775933 10857798 10205256
15722 10205256 9931705 9819321 9821555 10301856 10632131 10367592 9864295 10450220 10936205 10616174
$$ [...]
##END NTUPLES=NMR SPECTRUM
##END=
