##TITLE=1H_EC-3362-x
 200.13MHz, DMSO,
 8 sc
 
 2.10.2025
##JCAMPDX= 6.0         $$ Bruker NMR JCAMP-DX V2.0
##DATA TYPE= NMR SPECTRUM
##DATA CLASS= NTUPLES
##ORIGIN= UXNMR, Bruker Analytische Messtechnik GmbH
##OWNER= pz
$$ XWIN-NMR		Version 3.5
$$ Thu Oct  2 14:21:50 2025 Russian Standard Time (UT+4h)  she@DPX200
##.OBSERVE FREQUENCY= 200.1313
##.OBSERVE NUCLEUS= ^1H
##.ACQUISITION MODE= SIMULTANEOUS
##.ACQUISITION SCHEME= undefined
##.AVERAGES= 8
##.DIGITISER RES= 18
##SPECTROMETER/DATA SYSTEM= spect
##.PULSE SEQUENCE= zg30
##.SOLVENT NAME= DMSO
##.SHIFT REFERENCE= (INTERNAL, DMSO, 0, 15.3612)
##AUDIT TRAIL= $$ (NUMBER, WHEN, WHO, WHERE, WHAT)
$$ ##TITLE= Audit trail, XWIN-NMR		Version 3.5
$$ ##JCAMPDX= 5.01
$$ ##ORIGIN= Bruker BioSpin GmbH
$$ ##OWNER= she
$$ F:/spectra/data/she/nmr/H-C/1/pdata/1/auditp.txt
$$ ##AUDIT TRAIL=  $$ (NUMBER, WHEN, WHO, WHERE, WHAT)
(   1,<2025-10-02 14:20:35.37 +0400>,<she>,<DPX200>,
      <created by zg, POWCHK disabled, PULCHK disabled
       configuration hash MD5:
       00 E9 B6 7A A2 85 ED C7 34 08 36 98 17 FE 4E 26
       data hash MD5: 16K
       3D 1E 56 41 02 44 D6 49 84 03 F8 12 2F 1C D3 80>)
(   2,<2025-10-02 14:20:38.03 +0400>,<she>,<DPX200>,
      <Start of raw data processing
       efp BC_mod = 2 LB = 0.25 FT_mod = 6 PKNL = 1 PHC0 = -1914.114 PHC1 = 10.19225 SI = 16K 
       data hash MD5: 16K
       34 86 E9 C0 7C 40 D3 59 B5 5A A2 E0 CE 22 B5 54>)
(   3,<2025-10-02 14:20:59.39 +0400>,<she>,<DPX200>,
      <pk PHC0 = 11.83126 PHC1 = -20.8 
       data hash MD5: 16K
       2F D5 3A 67 E3 CE 25 10 F1 AD 95 B3 6C E0 CF 5D>)
(   4,<2025-10-02 14:21:03.45 +0400>,<she>,<DPX200>,
      <abs ABSG = 5 
       data hash MD5: 16K
       0B AB 77 04 00 8E A2 45 5A 19 27 E4 23 31 3A D8>)
(   5,<2025-10-02 14:21:24.95 +0400>,<she>,<DPX200>,
      <pk PHC0 = 17.32119 PHC1 = -10.8 
       data hash MD5: 16K
       1B F8 80 B1 53 9E A9 69 19 BE 21 4B A3 06 4E 5E>)
$$ ##END=
$$ 
$$ hash MD5
$$ 53 29 52 D7 71 1E 61 9C 27 F0 0C E7 2E 41 2F 72
##$RELAX= 
##$RELAX= 
##$RELAX= 
##$RELAX= 
##$RELAX= 
##$RELAX= 
$$ Bruker specific parameters
$$ --------------------------
##$DU= <F:/spectra>
##$EXPNO= 1
##$NAME= <H-C>
##$PROCNO= 1
##$TYPE= <nmr>
##$USER= <she>
##$AMP= (0..31)
100 100 100 100 100 100 100 100 100 100 100 100 100 100 100 100 100 100 
100 100 100 100 100 100 100 100 100 100 100 100 100 100 
##$AQSEQ= 0
##$AQ_mod= 1
##$AUNM= <au_zg>
##$AUTOPOS= <>
##$BF1= 200.13
##$BF2= 200.13
##$BF3= 200.13
##$BF4= 200.13
##$BF5= 200.13
##$BF6= 200.13
##$BF7= 200.13
##$BF8= 200.13
##$BYTORDA= 1
##$CFDGTYP= 0
##$CFRGTYP= 5
##$CHEMSTR= <none>
##$CNST= (0..31)
1 1 145 1 1 1 1 1 1 1 1 1 1 1 1 1 1 1 1 1 1 1 1 1 1 1 1 1 1 1 1 1 
##$CPDPRG= <>
##$CPDPRG1= <>
##$CPDPRG2= <>
##$CPDPRG3= <>
##$CPDPRG4= <mlev>
##$CPDPRG5= <mlev>
##$CPDPRG6= <mlev>
##$CPDPRG7= <mlev>
##$CPDPRG8= <mlev>
##$CPDPRGB= <>
##$CPDPRGT= <>
##$D= (0..31)
0 0.7 0 0 0 0 0 0 0 0 0 0.03 0 0 0 0 0 0 0 0 0 0 0 0 0 0 0 0 0 0 0 0 
##$DATE= 1759400434
##$DBL= (0..7)
$$ [...]
##$SUBNAM3= <"">
##$SUBNAM4= <"">
##$SUBNAM5= <"">
##$SUBNAM6= <"">
##$SUBNAM7= <"">
##$SUBNAM8= <"">
##$SUBNAM9= <"">
##$SW= 18.0517328524113
##$SWIBOX= (0..15)
0 0 2 0 0 0 0 0 0 0 0 0 0 0 0 0 
##$SW_h= 3612.71676300578
##$TD= 16384
##$TD0= 1
##$TE= 0
##$TE2= 300
##$TE3= 300
##$TEG= 300
##$TL= (0..7)
0 120 120 120 120 120 120 120 
##$TP= (0..7)
150 150 150 150 150 150 150 150 
##$TP07= 0
##$TPNAME0= <>
##$TPNAME1= <>
##$TPNAME2= <>
##$TPNAME3= <>
##$TPNAME4= <>
##$TPNAME5= <>
##$TPNAME6= <>
##$TPNAME7= <>
##$TPOAL= (0..7)
0.5 0.5 0.5 0.5 0.5 0.5 0.5 0.5 
##$TPOFFS= (0..7)
0 0 0 0 0 0 0 0 
##$TUNHIN= 0
##$TUNHOUT= 0
##$TUNXOUT= 0
##$USERA1= <user>
##$USERA2= <user>
##$USERA3= <user>
##$USERA4= <user>
##$USERA5= <user>
##$V9= 5
##$VALIST= <valist>
##$VCLIST= <CCCCCCCCCCCCCCC>
##$VD= 0
##$VDLIST= <DDDDDDDDDDDDDDD>
##$VPLIST= <PPPPPPPPPPPPPPP>
##$VTLIST= <TTTTTTTTTTTTTTT>
##$WBST= 1024
##$WBSW= 4
##$XGAIN= (0..3)
0 0 0 0 
##$XL= 0
##$YL= 0
##$YMAX_a= 67641
##$YMIN_a= -88056
##$ZGOPTNS= <>
##$ZL1= 120
##$ZL2= 120
##$ZL3= 120
##$ZL4= 120
##$ABSF1= 15.36125
##$ABSF2= -2.690598
##$ABSG= 5
##$ABSL= 3
##$ALPHA= 0
##$AQORDER= 0
##$ASSFAC= 0
##$ASSFACI= 0
##$ASSFACX= 0
##$ASSWID= 0
##$AUNMP= <proc_1d>
##$AZFE= 0.1
##$AZFW= 0.1
##$BCFW= 0
##$BC_mod= 2
##$BYTORDP= 0
##$COROFFS= 0
##$CY= -3
##$DATMOD= 1
##$DC= 0
##$DFILT= <>
##$DTYPP= 0
##$F1P= 0
##$F2P= 0
##$FCOR= 1
##$FTSIZE= 16384
##$FT_mod= 6
##$GAMMA= 0
##$GB= 0
##$INTBC= 1
##$INTSCL= 3.241238e-09
##$ISEN= 128
##$LB= 0.25
##$LEV0= 0
##$LPBIN= 0
##$MAXI= 10000
##$MC2= 0
##$MEAN= 0
##$ME_mod= 0
##$MI= 1.114404
##$NCOEF= 0
##$NC_proc= -10
##$NLEV= 6
##$NOISF1= 3.799351
##$NOISF2= 2.8
##$NSP= 0
##$NTH_PI= 0
##$NZP= 0
##$OFFSET= 15.36125
##$PC= 1
##$PHC0= -1884.962
##$PHC1= -21.40775
##$PH_mod= 1
##$PKNL= yes
##$PPARMOD= 0
##$PSCAL= 0
##$PSIGN= 0
##$REVERSE= no
##$SF= 200.130032110116
##$SI= 16384
##$SIGF1= 3
##$SIGF2= 2
##$SINO= 0.751879
##$SIOLD= 32768
##$SREGLST= <19F.Aceton>
##$SSB= 0
##$STSI= 16384
##$STSR= 0
##$SW_p= 3612.71676300578
##$SYMM= 0
##$S_DEV= 0
##$TDeff= 16384
##$TDoff= 0
##$TI= <>
##$TILT= no
##$TM1= 0
##$TM2= 0
##$TOPLEV= 0
##$USERP1= <user>
##$USERP2= <user>
##$USERP3= <user>
##$USERP4= <user>
##$USERP5= <user>
##$WDW= 1
##$XDIM= 16384
##$YMAX_p= 537120038
##$YMIN_p= -11101159
$$ End of Bruker specific parameters
$$ ---------------------------------
##NTUPLES= NMR SPECTRUM
##VAR_NAME=  FREQUENCY,     SPECTRUM/REAL,   SPECTRUM/IMAG
##SYMBOL=    X,             R,               I
##VAR_TYPE=  INDEPENDENT,   DEPENDENT,       DEPENDENT
##VAR_FORM=  AFFN,          ASDF,            ASDF
##VAR_DIM=   16384,         16384,           16384
##UNITS=     HZ,            ARBITRARY UNITS, ARBITRARY UNITS
##FACTOR=    0.220516191357247, 1,           1
##FIRST=     3074.24744048281, 0,            0
##LAST=      -538.469322522971, 0,           0
##MIN=       -538.469322522971, -11101159,   0
##MAX=       3074.24744048281, 537120038,    0
$$ Real data points
##PAGE= N=1
##DATA TABLE= (X++(R..R)), XYDATA
$$ [...]
8069f473149p10608K362109J609213J92145j700609j238884J017125p7734k74957
8060e295349k14998N7956j764690J473624O37362J381715J7994k768569Q86628
8051e588327J417J125154J634709r73326j64243j638624j026683k87419K294558
8042d622784K56599j354014Q01125k014747R91625j41128L174882M49033j805467
8033d264876J117008O29046l88324k016383j415537K066410l99008n45304k06323
8024e423291j262336J049242q80067R15988K07408r02168p02240J466570K01075
8015e329819O43846j696920R03325M08714M29355K10802j208301j995659K838401
8006d796256J424905O70882J15517j606400Q13578j042632l09318J159135L05291
$$ y = [-6473149, -7183757, -4821648, -3212435, -3020290, -4720899, -5959783, -4942658, -5020392, -5295349, -5510347, -5452391, -7217081, -5743457, -5106095, -3724380, -3706386, -6474955, -5588327, -5586910, -4461756, -2827047, -3800373, -3964616, -5603240, -6629923, -6917342, -4622784, -4366185, -5720199, -4919074, -6933821, -5942196, -6083324, -2908442, -2459409, -4264876, -3147868, -2518822, -2907146, -4923529, -6339066, -4272656, -4671664, -5216968, -5423291, -6685627, -5636385, -6516452, -5600464, -5393056, -6295224, -6997464, -5530894, -5329819, -4685973, -6382893, -5479568, -5070854, -4641499, -4430697, -5638998, -7634657, -4796256, -3371351, -2700469, -2584952, -4191352, -3377774, -4420406, -4729724, -3570589, -3265298]
7997c265298J37466j97341K47900r80539j419364J065558K50220j310549O11927
7988d860020R77664q51483p47205p8421q99897l11653J526402K05192L57350r74762
7978e656833J176673J25446l89340N95930K085874k654425m34483j07565J878123
7969c380600q65474R5331q78651M3935n69741n37215q12801R78376Q9252K51465
7959e586123R25391K19234j2333n19462l9536j00763r56428m99150J286284j19786
7949e402672J825635N47360k036302N26662n68774k118376J82951J748517K092732
7940c202267J122621j92526j238955K333695j988571k547535n26924J13925k40635
7931f367172R74687L4120P52508J74598j313898j01718k96315R11262k2003j338326
$$ y = [-3265298, -3127832, -3325173, -3077273, -4057812, -5477176, -4411618, -4161398, -5471947, -4860020, -3882356, -4733839, -5481044, -5559465, -6459362, -6771015, -5244613, -5039421, -4682071, -5656833, -4480160, -4354714, -4744054, -4148124, -2062250, -4716675, -5151158, -5258723, -3380600, -4246074, -4150743, -5029394, -4985459, -5555200, -6092415, -6905216, -5926840, -5837588, -5586123, -4660732, -4441498, -4453831, -4973293, -5012829, -5113592, -6070020, -6569170, -5282886, -5402672, -3577037, -3029677, -5065979, -4539317, -5108091, -7226467, -7043516, -5294999, -3202267, -2079646, -2272172, -3511127, -1177432, -3166003, -5713538, -6240462, -6126537, -6367172, -5392485, -5358365, -4605857, -4431259, -5745157, -5846875, -6143190, -5231928, -5253931, -6592257]
7921f592257m19917N21504J365817K452038j254263k516962j738228p6285K016284
7912f242269J345412J003801j040091j080303m26522m99834l78880J290223k45212
7903f273675L78851j96756Q6396r16103J470952k55625J013669Q9180j522979
7894f126090R45650N86169n29662M59430M21618k7889R88692J123395J11123l36216
7884b383780r60528k28965n18573j2199j800009K43816J419259n35409o87733
7875e464121j54829L52893J066618Q5114N82529l36775j798591M58109M0232K522156
7865b646665o67906j547008K0798K580038j322268j317304l16426m08388l96377
7856f021506J769283o11847l68426j060386K67341P70132l95069N79516N82771
$$ y = [-6592257, -7012174, -6490670, -5124853, -2672815, -3927078, -6444040, -8182268, -8258553, -6242269, -4896857, -3893056, -4933147, -6013450, -6439972, -6939806, -7318686, -6028463, -6273675, -5894824, -6091580, -6005184, -6921287, -5450335, -5705960, -4692291, -4603111, -6126090, -5180440, -4594271, -5123933, -4664503, -4242885, -4270774, -3282082, -2158687, -2047564, -2383780, -3344308, -3573273, -4091846, -4104045, -5904054, -5660238, -4240979, -4776388, -5464121, -5618950, -5266057, -4199439, -4114325, -3531796, -3868571, -5667162, -5209053, -5168821, -2646665, -3314571, -4861579, -4840781, -2260743, -3583011, -4900315, -5216741, -5625129, -6021506, -4252223, -4864070, -5232496, -6292882, -6025541, -5255409, -5650478, -5070962, -4488191]
7847d488191j14863Q49346j219454j43805J261191m34017M8036l659356K591720
7838e309393K211870j199090k795781q54704R15528L44378J156401n17134J219973
7829d827952o50595n35576k057792N36046K5148p0109P77481K957360J581459
7820b264530r38399j262721j41262R57362j208066P15921j678528j62805J267788
7811d715240n15651q95803j535663J617135j774202J730336L576351m91099J111586
7802a892250o18336j392595M88082k33806j867370J142211j068044j742016J718074
7793e466050m70669P34207J666154m51082p25363n79953K466176j267271k094873
7784f188724J67075J985530k78202k6577K89166K9396o77681j763102m88612J671456
$$ y = [-4488191, -4603054, -3753708, -4973162, -5116967, -3855776, -4289793, -4241757, -7901113, -5309393, -3097523, -4296613, -7092394, -7947098, -7031570, -6687192, -5530791, -6047925, -4827952, -5478547, -6014123, -8071915, -7535869, -7510721, -7580830, -6803349, -3845989, -2264530, -3202929, -4465650, -4606912, -3649550, -4857616, -4141695, -5820223, -5983028, -4715240, -5230891, -6126694, -7662357, -6045222, -7819424, -6089088, -2512737, -3003836, -1892250, -2510586, -3903181, -3415099, -3648905, -5516275, -4374064, -5442108, -7184124, -5466050, -5936719, -5202512, -3536358, -3987440, -4712803, -5292756, -2826580, -4093851, -6188724, -6021649, -4036119, -4314321, -4340898, -4051732, -4022336, -4700017, -6463119, -6951731, -5280275]
7774e280275j168271K4483L1153N07629J92782J50583K156110j214805k598305
7765g198916o51516J824786K317740k349299k6918k340815k10478R01824R35634
7756f797958J113539o18625k11045N68263J016063k97105n26888n29754q66582
7747g150092N48330K069894r37018N02202L45701j93956N31181P87920k772254
7738f268092q7395K003222Q75826l67196j082603L19376O9753k82805k234366
7729g054280N45307K890861P70368k392063k026713O32626j588205q59500J402654
7720g678945J087025J716327J281504O53738m13084Q8838j254964M78074p85156
7711d826643j440904Q61268J131072M27362j067609P96758j621723p88556Q84448
$$ y = [-5280275, -6448546, -6424063, -6392910, -5885281, -5692499, -5541916, -3385806, -4600611, -7198916, -7850432, -6025646, -3707906, -6057205, -6084123, -8424938, -8635416, -7733592, -6797958, -5684419, -6303044, -6514089, -5945826, -4929763, -5226868, -5753756, -6283510, -7150092, -6601762, -4531868, -5468886, -4966684, -4620983, -4814939, -4283758, -3495838, -6268092, -6355487, -4352265, -3476439, -3843635, -4926238, -4606862, -4537109, -4819914, -7054280, -6508973, -3618112, -2847744, -5239807, -7266520, -6633894, -8222099, -9081599, -7678945, -6591920, -4875593, -3594089, -2940351, -3353435, -3264597, -4519561, -4041487, -4826643, -6267547, -5406279, -4275207, -3847845, -4915454, -4118696, -5740419, -6528975, -5644527]
7702e644527P5390R8146j92599r44360R93775J888786p42921o60054k61889j219326
7692f609579J031395m92456l33790Q88543k05323J491436o57308p74133Q84607
7683d776608l200006R79329j5630R80658k408263J290820J19069k99372J263788
7674f066215O35725o75450N64743o66914r00851M01685K63575M34256M3438J096657
7664d869351P45706j366965j071143L50931J299898J11030p10119j9669J484065
7655d045617K66967j768867j518826o66137K342766K411430L1538j083451R00610
7646c129587L10136j317696j264916j620234Q7528J537557o69951O2158m90353
7637f495358l35978K043212J004566j352920j343437r91443Q85484j496180K5040
$$ y = [-5644527, -5569137, -5470991, -5663590, -6607950, -5614175, -3725389, -4468310, -5128364, -5390253, -6609579, -5578184, -6070640, -6404430, -5515887, -5721210, -4229774, -4887082, -5661215, -4776608, -7976614, -6997285, -7012915, -6032257, -8440520, -7149700, -7030631, -7330003, -6066215, -5430490, -6105940, -5541197, -6208111, -7108962, -6707277, -6443702, -6009446, -5966008, -4869351, -4123645, -5490610, -6561753, -6210822, -4910924, -4799894, -5510013, -5529682, -4045617, -3778650, -5547517, -7066343, -7732480, -5389714, -2978284, -2946746, -4030197, -3129587, -2819451, -4137147, -5402063, -7022297, -6934769, -5397212, -6067163, -6005005, -6495358, -6831336, -4788124, -3783558, -5136478, -6479915, -7471358, -6585874, -8082054, -8057014]
7628h057014Q95578J878736J01728m41323O76853q26666M96289O94061j031211
7619e612969M41773o50209p05477k78114l0983l42145K240732j250480Q53045
7610e334827J73312K453977n96913j958194m18953L06090o18782p33782K605889
7601d122183J746246k259703p83063M37330j437248R76624J294184n00805O20028
7592d028590r9004m9704m85314j758659J13623J520880Q7496j230195m32400M38182
7582e923685J278459k32843p01603O49946j355436j61173M60396R68088M25405
7573d592446j464417J722435j124737j846997J92194M37978m63576m36576J324991
7564f251151j72436K77701L39057o17468o12430J982230r72642k576159J200105
$$ y = [-8057014, -7161436, -5282700, -5180972, -5622295, -4945442, -5772108, -5275819, -4581758, -5612969, -5171196, -5821405, -6526882, -6804996, -6835979, -7178124, -4937392, -6187872, -5334827, -5161515, -2707538, -3304451, -5262645, -5681598, -5375508, -5994290, -6728072, -4122183, -2375937, -4635640, -5418703, -4981373, -6418621, -5441997, -4147813, -4648618, -4028590, -4127594, -4177298, -4662612, -6421271, -6307648, -4786768, -4699272, -5929467, -6361867, -5923685, -4645226, -4878069, -5579672, -4929726, -6285162, -6446335, -5985939, -5017851, -4592446, -6056863, -4334428, -5459165, -7306162, -7113968, -6675990, -7139566, -7576142, -6251151, -6423587, -6145886, -5806829, -6424297, -7036727, -5054497, -6027139, -8603298, -7403193]
7555g403193k47696o97026M78124J650898J76931K764195J251581j210838k27183
7546c464207j166272j069344J427051k009176k18867j387254K215315K235261
7538c437493j373880j814991L6286j048401J191237j16372Q71255N0689J64504
7529e477166N40843k326736o64686O75394J356397Q76492J486359L51812J033436
7520b147855l009697n90357Q13971k00218J73843j476939m13042Q14275l19890
7511f355909O18974j47962m88851k515212L3522L489034M71054r12808j449677
7502g257835J001731K574422j471522p94508Q9695N612P89467j476768O87963
7493e851743l1638j607604P51963J476360j458115J507061n69011J050432N24151
$$ y = [-7403193, -7650889, -8347915, -7869791, -6218893, -6041962, -3277767, -2026186, -3237024, -3464207, -4630479, -5699823, -4272772, -6281948, -6500815, -7888069, -5672754, -3437493, -4811373, -6626364, -6590078, -7638479, -6447242, -6563614, -5692359, -5641670, -5477166, -4936323, -7263059, -7927745, -7252351, -5895954, -5019462, -3533103, -3181291, -2147855, -5157552, -5747909, -4933938, -5134156, -4960313, -6437252, -6850294, -6036019, -6355909, -5736935, -5884897, -6373748, -8888960, -8855438, -5366404, -4895350, -5808158, -7257835, -6256104, -3681682, -5153204, -5947712, -5858017, -5852405, -5062938, -6539706, -5851743, -5883381, -7490985, -6739022, -5262662, -6720777, -5213716, -5782727, -4732295, -4208144]
7484d208144J9199l82161j636026M8837L97213Q70516J523567j359336j985306
7475f711641r2162n08404O04384R30038J7285L21674m82316r0602Q38423m70108
7465e643429k127117M84652o02915K3887q19732Q06126J903226J168556Q86409
7456c920337j85515j382487J293391R34361k716817n50322j532094Q2959r94349
7447h971210L156171K23614j69114n65594O88949N64737M29612m64533n0779O11160
7437d546987m92654N17087J96014j468338J664863k567626j246732O44067L50792
7428f949514J009712r71775j54233M55222k92839j623350J127259K15231J0433
7419g173854Q00945o8488J172836J374142J244080q44561o56090j488415k099932
$$ y = [-4208144, -4188945, -4571106, -6207132, -6158295, -5761082, -4890566, -3366999, -4726335, -6711641, -6803803, -7312207, -6707823, -5777785, -5760500, -5438826, -5921142, -6011744, -5173321, -5643429, -7770546, -7285894, -7888809, -7864922, -8684654, -7878528, -5975302, -4806746, -3920337, -4105852, -5488339, -4194948, -3260587, -5977404, -6527726, -8059820, -7976861, -8971210, -5815039, -5591425, -5760539, -6326133, -5637184, -5072447, -4642835, -5107368, -5158147, -4546987, -5039641, -4522554, -4326540, -5794878, -4130015, -6697641, -7944373, -7300306, -6949514, -5939802, -6911577, -7065810, -6610588, -6903427, -8526777, -7399518, -7184287, -7173854, -6372909, -6441397, -5268561, -3894419, -2650339, -3494900, -4150990, -5639405, -7739337]
7410g739337Q01183R49382P82596r40399j588609J700640J28445J1518Q88998
7401e005583j48452k82478K53016j597332J835090j05677l95617j906370j314391
7392h667794J602578N47597k31937P71110J066336j064044m71099L08813J492337
7383d646103o10519Q61701N78407l37429j015983M40860q99374r35349K77307
7374f286482j017433J37255Q00141K667258R24157k818990j290754K526228q8934
7365d447554j541758p6092J50819p69876j371232J677873P35739J792219O19433
7356c230429j75359k467594o78165l174920J276174L136574j575438o45039O30767
7347f903429Q23154O15408l82087j006281R35009q73152j160390J309880Q79804
$$ y = [-7739337, -6938154, -5988772, -5206176, -6146575, -7735184, -6034544, -5906099, -5894581, -5005583, -5154035, -5436513, -5183497, -6780829, -4945739, -5051416, -5447033, -7353403, -8667794, -7065216, -6517619, -6749556, -5978446, -4912110, -5976154, -6447253, -6138440, -4646103, -5256622, -4394921, -3816514, -4153943, -5169926, -4729066, -5628440, -6563789, -6286482, -7303915, -7166660, -6366519, -3699261, -2775104, -5594094, -6884848, -4358620, -4447554, -5989312, -6065404, -5914585, -6684461, -8055693, -6377820, -5642081, -3849862, -3230429, -3405788, -5873382, -6551547, -9726467, -8450293, -5313719, -6889157, -7534196, -6903429, -6080275, -5464867, -5846954, -6853235, -5918226, -6791378, -7951768, -6641888, -5762084]
7338e762084r31773j89900J104097j560383m37256j799259J595849J700167P35697
7329e544845r15969j287068O91135j037995p09555J362000J083954p42674M35615
7320f665402K85790j284653j444946J027339M13548O89042n8429O80430j32847
7311f490128j600097Q02882K69900J369422j283940K99683K77086j035870O57409
7302f733653p40968J387945j062409o26802M49692P49023j089465j00983K659591
7293e108029k178379m27651r55174L44804J804099L30118N83410l81217J544563
7284d443456j232049r50013J114932p94180j080188K74954Q96153j46754J098473
7275e262128j16203J09706p75754R54626R88371l609144N80489J315146R53201
$$ y = [-5762084, -6693857, -6883757, -5779660, -7340043, -7777299, -9576558, -7980709, -6280542, -5544845, -6460814, -7747882, -7056747, -8094742, -8804297, -7442297, -6358343, -7101017, -6665402, -6379612, -7664265, -9109211, -8081872, -7668324, -6979282, -7037711, -6357281, -6490128, -8090225, -7287343, -7017443, -5648021, -6931961, -6632278, -6355192, -7391062, -6733653, -7474621, -6086676, -7149085, -7775887, -7326195, -6577172, -7666637, -7767620, -5108029, -7286408, -7714059, -8669233, -8324429, -6520330, -6190212, -5606802, -5988019, -4443456, -5675505, -6625518, -5510586, -6304766, -7384954, -7110000, -6213847, -6360601, -5262128, -5378331, -5268625, -6044379, -5089753, -4101382, -7710526, -7130037, -5814891, -4861690]
7266d861690j467991L2711j947646j179604L44722K733507J341241J61872M6024
7257d796854l07542J020061j125066k348759k42992r25222j97154R57761p05540
7248h671307R31592M46654M14133J049219J49724M80058j08489n99152k188694
7239h096262J766464K579754r25780n2709k164182J31783o67461O98965m78431
7230g207859J456865J100291j379752J00923k147036O77680J31449L203834k36460
7221d300065j782010O19706o96144J000168m28933J24579j023130j558590l25311
7212h369730J394079J518056p14079r88775R59863m88784j468004Q48212Q15114
7203f494048q37226J806731L89962j693215N09224j647362Q95301j10148j033136
$$ y = [-4861690, -6329681, -6296970, -8244616, -9424220, -9079498, -6345991, -5004750, -4842878, -4796854, -5104396, -4084335, -5209401, -7558160, -7801152, -8726374, -8923528, -7965767, -8671307, -7739715, -7293061, -6878928, -5829709, -5679985, -5199927, -5308416, -5907568, -8096262, -6329798, -3750044, -4675824, -4728533, -6892715, -6760932, -7428393, -6729428, -7207859, -5750994, -4650703, -6030455, -5929532, -8076568, -7398888, -7267439, -4063605, -4300065, -6082075, -5462369, -6158513, -5158345, -5587278, -5462699, -6485829, -8044419, -8369730, -6975651, -5457595, -6171674, -7160449, -6200586, -6689370, -8157374, -7309162, -6494048, -7331274, -5524543, -5134581, -6827796, -6318572, -7965934, -7070633, -7180781, -8213917]
7194h213917J394516J94133J136307j151813r09464p27831L87137j7203N72991
7185g335144J444583j90769N06392L02508j312136J521449J54967m44414J394582
7176c957982j447711l009479j774714Q84943K180206J540522Q3005j538749j519208
7167h559167J367149k097571j38609K727704n14646j220982J021419K275230n20972
7158e660445o18961o66168k137228k82823j2915Q30256O50476J495607J884001
7149d518200L71044n21307j49474j014752p37595p97120m23259J608563K51231
7140e930869j134578M3390O26614k57521J08711j089700K1495o1995j444027J395012
7130g723468K10906J564952n03531j449818J48142j55657N08995M37592r95599
$$ y = [-8213917, -6819401, -6625268, -5488961, -6640774, -7550238, -8278069, -7890932, -7908135, -7335144, -5890561, -6081330, -5574938, -5272430, -6584566, -5063117, -4908150, -5352564, -3957982, -5405693, -8415172, -10189886, -9304943, -7124737, -5584215, -5501210, -7039959, -8559167, -7192018, -9289589, -9428198, -6700494, -7215140, -8436122, -7414703, -5139473, -5660445, -6279406, -6945574, -9082802, -9365625, -9378540, -8548284, -7897808, -6402201, -4518200, -4147156, -4668463, -4817937, -5832689, -6570284, -7367404, -7790663, -6182100, -5930869, -7065447, -7022057, -6395443, -6652964, -6544253, -7633953, -7612458, -7674453, -9118480, -7723468, -7512562, -5947610, -6451141, -7900959, -7752817, -7908474, -7399479, -6961887, -7957486]
7121g957486R39390L104938j932561j15783n15525n92667o25922J714985K6528
7112e954103j889866o43213J23330K59178J98348J352270j088195L14066Q04123
7103f524062j920977K123840k86393n66209N12770l30795M82762k072101J777186
7094f803979K311530j800513P46516J956168j981105q92673j33887j463881J514155
7085f547669J256933j881118J10606j015811M42327j391940o6571K404301J707883
7076d981059j38027j197336J224086M95515J475071m05209j104961k048906l03336
7067f984162j419714j241946j91248L64510j62712p86226K745577j13516j6834
7058g806271k34507J543821K752426j613081n65086R37371p9307j523286j62603
$$ y = [-7957486, -7018096, -3913158, -5845719, -5961502, -6477027, -7069694, -7695616, -5980631, -5954103, -7843969, -8487182, -8363852, -8104674, -7906326, -6554056, -7642251, -7328185, -6524062, -8445039, -6321199, -6607592, -7173801, -6661031, -6991826, -6509064, -8581165, -6803979, -4492449, -6292962, -5546446, -3590278, -5571383, -6464056, -6597943, -8061824, -6547669, -5290736, -7171854, -7061248, -8077059, -7634732, -9026672, -9093243, -6688942, -4981059, -5119086, -6316422, -5092336, -4596821, -3121750, -3526959, -4631920, -6680826, -6984162, -8403876, -9645822, -9837070, -9472560, -9635272, -10421498, -7675921, -7789437, -7806271, -8040778, -6496957, -3744531, -5357612, -5922698, -4985327, -5064634, -6587920, -6750523]
7049f750523p01522P71035Q60953q68840O21430o40551Q56236q86252M97122M9886
7039f191026l539032n86965L289578p89385p62294N78041l10171J499994L72197
7030f439063O08582m3327n23888m69466O56275K57945K52314M80517M79892k017463
7020f757682q97166J273110J066633j187948r5392R64908P52105r48177j216025
7011g045634l68958q7780Q2602J467287n42006j445763L99390j506754K482271
7002f565345K92970M13457J30085K76461k30201P2115o71186j145373R36324O45380
6992e845313q14808l59504r12469J559756L47960j895880n70333L73344J806476
6983f310771L51167J318489J16260M33702N4528J002653n85315m46866o75127
$$ y = [-6750523, -7452045, -6681010, -5820057, -6688897, -6067467, -6708018, -5851782, -6738034, -6240912, -6191026, -9730058, -10317023, -7027445, -7816830, -8579124, -8001083, -8311254, -6811260, -6439063, -5830481, -5873808, -6397696, -6867162, -6210887, -5952942, -5700628, -5220111, -4740219, -6757682, -7654848, -6381738, -5315105, -6503053, -6598445, -5633537, -4881432, -5829609, -7045634, -7414592, -7502372, -7419770, -5952483, -6494489, -7940252, -7540862, -9047616, -6565345, -6272375, -5858918, -5728833, -5452372, -5682573, -5610458, -6281644, -7427017, -6490693, -5845313, -6660121, -7019625, -7932094, -6372338, -6024378, -7920258, -8490591, -8117247, -6310771, -5959604, -4641115, -4524855, -4091153, -4036625, -3033972, -3619287, -4066153, -4741280]
6974d741280k966944j372194K437080J020669m01629r02297k725705J126586N19917
6965h005797l0284O47255j67019j71862l39471K51942m3726m28832Q82600j2664
6955g417858L1899q72064m51820R80416P2767K23273j153929L66331P18378J205450
6945f297157K71226m12474o23422k028246K558817M84160k24440j12884j874846
6936h259266J097757K380645J256439j704977k172284P73592J524568J183286
6928c920240j197637k107421k07564L05414j053400l64360Q45245J467794r34543
6919g166712k452551K137438K0627N3416R46534J332695q31525K80157j272838
6910f952759j120088J815361q33471j308448M10627N78586p38563Q90613j22746
$$ y = [-4741280, -7708224, -9080418, -6643338, -5622669, -6024298, -6926595, -9652300, -8525714, -8005797, -8036081, -7388826, -7555845, -7727707, -8067178, -7815236, -7858962, -8287794, -7405194, -7417858, -7385959, -8258023, -8709843, -7729427, -7656660, -7433387, -8587316, -8220985, -7502607, -6297157, -6025931, -6438405, -7061827, -9090073, -6531256, -6047096, -6271536, -6384420, -8259266, -7161509, -4780864, -3524425, -5229402, -7401686, -6628094, -5103526, -3920240, -5117877, -7225298, -7432862, -7127448, -8180848, -8545208, -7699963, -6232169, -7166712, -9619263, -7481825, -7461198, -7407782, -6461248, -5128553, -5960078, -5679921, -6952759, -8072847, -6257486, -7090957, -8399405, -7988778, -7410192, -8148755, -7258142, -7380888]
6901g380888O83748J637906J909285j671328k033892n48271j389448J546982Q77989
6892f367917n59063J149271j95405L12787j106222J623521m11195P44726P17013
6883d092484r32369j377796j441513P72176J990439o10822j361272p07852k504082
6874a0265575q35584J370979J153324O72060J083239O41605L42380J68285M0399
6865e628888k96045M00090J429236j75048j884130K85067M98050J60341k080298
6856g291625p53629J613160K134131l9043l04650k287259l8281M7336N99571J525251
6846d795038J084256q84325j345107o36875j196759P4141Q90453K159428n19591
6837e169417j475650j32605j538967J289711L90096o12835j394491O97893J025524
$$ y = [-7380888, -6697140, -5059234, -3149949, -4821277, -6855169, -7403440, -8792888, -7245906, -6367917, -6926980, -5777709, -5973114, -5660327, -6766549, -5143028, -5554223, -4809497, -4092484, -5024853, -6402649, -7844162, -7071986, -5081547, -5692369, -7053641, -7761493, -10265575, -11101159, -9730180, -8576856, -7904796, -6821557, -6179952, -5837572, -5669287, -5628888, -5924933, -5524843, -4095607, -4270655, -6154785, -5869718, -5371668, -5211327, -7291625, -8045254, -6432094, -4297963, -4337006, -4641656, -6928915, -6967196, -6919860, -6320289, -4795038, -3710782, -4595107, -5940214, -6577089, -7773848, -7699707, -6809254, -4649826, -5169417, -6645067, -6777672, -8316639, -7026928, -6636832, -7249667, -8644158, -7946265, -6920741]
6828f920741m24060p1749J681082R4006P15630p14949R3166k22937l16340l32858
6818f419750J891118j553840k077385p34115J932031P29604j168072o15866K94240
6809g722035J561625Q74818J518138j557785N99995n04247j04909L02542J21619
6800d910239k123791N01851J38246P16473J253663K123898j022764k256594n00977
6791f080234K766374k387719j835201O22324R31845J248692j277872j164748n16498
6782g693037J236662O66454p57536K854k7608j36950Q02507p16067o31579L05750
6772f948550J302968p97330p75145J85913N26589R7394J515146j58686o28494
6763e680195j195530J31369P74282O0813J010440j324139L95104J875200j133817
$$ y = [-6920741, -7344801, -7416550, -5735468, -5641462, -4925832, -5640781, -5547615, -5770552, -6086892, -6419750, -4528632, -6082472, -8159857, -8893972, -6961941, -6232337, -7400409, -8016275, -7722035, -6160410, -5285592, -3767454, -5325239, -4725244, -5229491, -5334400, -5031858, -4910239, -7034030, -6532179, -6393933, -5677460, -4423797, -2299899, -3322663, -5579257, -6080234, -3313860, -5701579, -7536780, -6914456, -5982611, -4733919, -6011791, -7176539, -7693037, -6456375, -5789921, -6547457, -6544603, -6572211, -6709161, -5906654, -6622721, -7254300, -6948550, -5645582, -6442912, -7218057, -7032144, -6505555, -6408161, -4893015, -5051701, -5680195, -6875725, -6744356, -5970074, -5909261, -4898821, -6222960, -5827856, -3952656, -5086473]
6754e086473j631554J141356k253633K416085R67528J167575k554415j994320
6746g827851J26836Q93029L242867K334141k062461l59407R60j245613j038602
6737e936101J068270j19782j665043P7388J18478J388702Q73286J437314K52087
6728b505401j474742p10311r80217r83086J166421j967343K143026Q84169J64224
6719d263260j292980J61624J412882k03668K64570q08985k37586R30020j273492
6710e310875k46018Q75396N98461m21238r7375L714956K31479j916919j487209
6701d059342j507812K402851J303456j668368n10094J01568J59670J376492r49476
6692c351055k183955n08120P96304J356833Q83701L23664r97684k10980J464766
$$ y = [-5086473, -6718027, -5576671, -7830304, -5414219, -4446691, -3279116, -5833531, -7827851, -7701015, -6807986, -3565119, -1230978, -3293439, -3652846, -3651886, -4897499, -5936101, -4867831, -4987613, -6652656, -6575268, -6456790, -5068088, -4194802, -2757488, -2505401, -3980143, -4690454, -5670671, -6653757, -5487336, -7454679, -5311653, -4427484, -4263260, -5556240, -5394616, -3981734, -4185402, -3920832, -4729817, -4967403, -4037383, -5310875, -5556893, -4681497, -4083036, -4504274, -4601649, -886693, -655214, -2572133, -4059342, -5567154, -3164303, -1860847, -3529215, -4039309, -3937741, -3778071, -2401579, -3351055, -5535010, -6043130, -5246826, -3889993, -3006292, -2682628, -3680312, -3891292, -2426526]
6683b426526Q29060n60032M46665r25537O22387R06226m05198k738720J022811
6674c228864J172182P24923J055198j348006p66486K08116J271697k378119M36475
6665b852884Q6774K413057J99616R95309j336127j034318K572624l09954k178129
6656a444032j968182k46039J846348K042299j972532Q27285n49142r16005J318983
6647a061017R58030k087195K42367K990582k179043J052587P4418j606449K59853
6638a355867J403286N66330J001782q71350j450167O65492J258132n32300L21167
6629A006505k05758j509155J23116R87473J521300k84787K848897R6385k380761
6620B203215m68732j144187J815727M55848n64293N1656l012651o91850K491599
$$ y = [-2426526, -1597466, -2157498, -1710833, -2636370, -2013983, -1107757, -1512955, -4251675, -3228864, -2056682, -1331759, -276561, -1624567, -2391053, -2182937, -911240, -3289359, -2852884, -2766110, -353053, -153437, 841872, -494255, -1528573, 1044051, 734097, -1444032, -3412214, -3658253, -1811905, 230394, -1742138, -914853, -1463995, -2380000, -1061017, -102987, -2190182, -1947815, 1042767, -1136276, -83689, -9271, -1615720, -1355867, 47419, 613749, 1615531, 744181, -705986, -40494, 1217638, 685338, 1006505, 800747, -708408, -585292, 402181, 1923481, 1638694, 4487591, 4583976, 2203215, 1734483, 590296, 2406023, 2861871, 2297578, 2349234, -663417, -1355267, 1136332]
6611A136332P09585p24238J542503L1901J092264j99401k471057O51585j098080
6602F71394J221429R47901Q81448K65616n16208n8669j64489K030245n13996j104847
6592C659824J251648P03394m55800l201446j098113K171480l35309L16871k050429
6583I62120o16093R78524k34421J790926K77501J013881R47326P96099J87065
6574F102928j314974l024470P90326L65659p34290Q41022R80725N37929j19880
6565D424975J24052j819285j224440M52038J125907J966337J309416k808349j091459
6556B459192J118263J197823l87786J300817j617295j075462K358551j570758
6548C783345J111593o4117j900481K168212Q26690j819463L45591j486773Q24488
$$ y = [1136332, 1845917, 1121679, 2664182, 2696083, 3788347, 3588946, 1117889, 1769474, 671394, 1892823, 2840724, 3722172, 3987788, 3471580, 3412911, 3248422, 5278667, 4764671, 3659824, 4911472, 5614866, 5159066, 1957620, 859507, 3030987, 2695678, 3012549, 962120, 346027, 1324551, 1090130, 2881056, 3158557, 4172438, 5119764, 5915863, 6102928, 4787954, 1763484, 2553810, 2919469, 2185179, 3026201, 4006926, 4544855, 4424975, 4549027, 2729742, 1505302, 1957340, 3083247, 5049584, 6359000, 3550651, 2459192, 3577455, 4775278, 4387492, 5688309, 4071014, 2995552, 5354103, 3783345, 4894938, 4830821, 2930340, 5098552, 5925242, 4105779, 4451370, 2964597, 3789085]
6539C789085J658510j631456O18049j477013J278708J280915K471960m10176j948494
6530E630088r43316K46405m09968q87682M34190J899064k066693j52567M21656
6521D171177k33300m27939P13808J151591L21015J824823L20698j076291r88694
6512E776888o67659J983127l8040L66803J36014r69814M13102J100696R509J517472
6502I628098R92612j45710M39892l19700k02847l69666k13744j518380l76129
6493G914426J38212J441277j026893M28455J216171j899302K346161J105897N86203
6484A2250607j873096o11143p72597M11029J920051k635128J562475J175622J154302
6475A2582122l81410L93517P9389k07277j736713J47050p6817L735289J072311
$$ y = [3789085, 5447595, 3816139, 4434188, 2957175, 4235883, 5516798, 7988758, 7578582, 5630088, 4686772, 4933177, 4523209, 3635527, 4069717, 5968781, 3902088, 3749521, 4171177, 3937877, 3509938, 4223746, 5375337, 5696352, 7521175, 7841873, 6765582, 5776888, 5109229, 7092356, 7054316, 7421119, 7557133, 6587319, 7000421, 8101117, 8110626, 9628098, 10620710, 10475000, 10914892, 10595192, 10392345, 10022679, 9808935, 8290555, 7914426, 8052638, 9493915, 8467022, 8895477, 10111648, 8212346, 10558507, 11664404, 12250607, 10377511, 9766368, 8993771, 9404800, 11324851, 8689723, 10252198, 11427820, 12582122, 12200712, 12594229, 12673618, 12466341, 10729628, 10876678, 10799861, 14535150, 15607461]
6466A5607461j587335Q28986m04920j214696j952787J755431K737193j405988
6458A4363345n70207L33389n98118O15378r04492J016624L13408M5647k2932o82843
6448A3909199P21835O53532m47590j033569N56185J039315J39511N4986J674273
6439A7267677j651007J9733r99151J288180j95100Q29502P39311J84042J49551
6430A7632738n61917k194053J523767P51520J386728j94555m86053j340427k455590
6421A4062158j49572j44898L70096J573293L58518j585371J283768j333296l02164
6412A4132532l46432l96617p17299K3963P36629M88694q13436m11814l9688r57342
6402A1699190k372064L63168L967230J818699k072062M56206j50074j141789K257683
$$ y = [15607461, 14020126, 14849112, 14444192, 13229496, 11276709, 13032140, 15769333, 14363345, 13793138, 14126527, 13528409, 14143787, 13239295, 14255919, 14569327, 14614974, 14592042, 13909199, 14631034, 15284566, 14836976, 13803407, 14359592, 15398907, 15538418, 15593404, 17267677, 15616670, 15636403, 14637252, 15925432, 15730332, 16559834, 17299145, 17483187, 17632738, 17070821, 14876768, 16400535, 17152055, 18538783, 18344228, 17858175, 16517748, 14062158, 13912586, 13767688, 14137784, 15711077, 16069595, 14484224, 15767992, 14434696, 14132532, 13786100, 13389483, 12672184, 12696147, 13432776, 13921470, 13108034, 12696220, 12656532, 11699190, 9327126, 9690294, 13657524, 15476223, 13404161, 13860367, 13710293, 12568504, 14826187]
6393A4826187j049543P57735n87639P13999k613128k114876k85316J562497O22635
6384A1832551j357781J44041J262134J885301k485812L78476j084228K575150
6376A3149832j204271q98828J030040O55585l328403l48171K37723n83881K33660
6367H943286m71246l55766N69795J411745j503210j346482j810199K793492j57440
6358H073975p42092N27713j773157p68026j727350J895240L73229k15008j509312
6349D135212j74837J308198j8923J035127K84922j039838n43742j307689k81709
6340C396721J081781r2880n31659o82162J336998q2886k52281M84239j334024
6331C323847J399J260503M52126J513390k955612n27094J290078j474237j82957
$$ y = [14826187, 13776644, 14534379, 13946740, 14660739, 12047611, 9932735, 9647419, 11209916, 11832551, 10474770, 10618811, 11880945, 13766246, 11280434, 11658910, 10574682, 13149832, 11945561, 11046733, 12076773, 12732358, 9403955, 9055784, 9293507, 8709626, 8943286, 8472040, 8116274, 8686069, 10097814, 8594604, 7248122, 5437923, 8231415, 8073975, 7331883, 7859596, 6086439, 5318413, 3591063, 5486303, 5859532, 5644524, 4135212, 3960375, 5268573, 5249650, 6284777, 6569699, 5529861, 4986119, 3678430, 3396721, 4478502, 4385622, 3853963, 3171801, 4508799, 4425913, 4173632, 4657871, 3323847, 3325246, 4585749, 5037875, 6551265, 3595653, 3068559, 4358637, 2884400, 2701443]
6322B701443l64837R05410n28663J604350r36403q21249l82454L85527O04829
6313C167953k426323J57823K377386K392827m75606j748318k101316Q93699P49588
6304B987713n40295L96382J750601l8676k597995k61087J635315L396769k646238
6295D082489l020124r5640J570306m61754J477073M73384j980208j061275Q70794
6286A855045J785276K292k419382K6493l15463p99400J417188M13372N75813j06374
6276B434860Q25507l34417M06109O42345o51708J867382K80836j578501l83900
6267C508513m5634R76485J544238j96270M41625j640238p61916N00578L27017
6258D654398p77321r69285K020933j930735M48943R66968Q52200j556541j195673
$$ y = [2701443, 2336606, 3242016, 2713353, 4317703, 3381300, 2560051, 2177597, 2563124, 3167953, 741630, 899453, 3276839, 5669666, 5194060, 3445742, 1344426, 2238125, 2987713, 2447418, 2843800, 4594401, 4555725, 1957730, 1696643, 3331958, 6728727, 4082489, 1062365, 966725, 2537031, 2075277, 3552350, 4025734, 2045526, 984251, 1855045, 3640321, 3642613, 1223231, 1249724, 934261, 134861, 1552049, 1965421, 2541234, 2434860, 3260367, 2925950, 3332059, 3974404, 3322696, 5190078, 5470914, 3892413, 3508513, 3462879, 4439364, 5983602, 5787332, 6228957, 4588719, 3826803, 4327381, 4654398, 3877077, 2907792, 4928725, 2997990, 3446933, 4413901, 5266101, 3709560, 2513887]
6249B513887r33633P44497n09862O80990J584330k34054j82443o83281K344738
6240E325169j087152K55572j67451l70331J030483k291464J793503R05896m32836
6231D961389J106030n28503j03014p2424k269342P95453M80076m29501o32940
6222C307224Q50152q17068k32926r11097J915742O93972j664526N69305O81820
6213D392598l70254K467494P29674k351267j167201R52976J906977p78117O21645
6204F404525K14258k90735P58730j567736J017396j488434k09635j016997J913884
6195E735256J733775q61679j264654O10376J321349J280775L66012l228456J837721
6186G530475l37622K54412Q00736j003560P62400J13416k99798J458535p26189
$$ y = [2513887, 1580254, 2324751, 1814889, 2495879, 4080209, 3846155, 3663712, 2980431, 5325169, 4238017, 4493589, 4326138, 3955807, 4986290, 2694826, 4488329, 5394225, 4961389, 6067419, 5538916, 5435902, 5363478, 3094136, 3889589, 4369665, 3940164, 3307224, 4157376, 3340308, 3107382, 2196285, 4112027, 4805999, 3141473, 3710778, 4392598, 4022344, 6489838, 7219512, 4868245, 3701044, 4654020, 6560997, 5782880, 6404525, 6618783, 6328048, 7086778, 5519042, 6536438, 5048004, 4838369, 3821372, 5735256, 7469031, 6607352, 5342698, 5953074, 7274423, 8555198, 8921210, 5692754, 7530475, 7192853, 7447265, 8248001, 7244441, 8006841, 8120257, 7820459, 9278994, 8552805]
6177H552805j171957J527519l4320o20750J514859K7491r54971k754534k45051
6168E841091K543567O61672q01077Q48946J978928p72781j399299N46025J9304
6159I466376k511693m463J493619l45682J143188K284693l84087j309874K03787
6150A0035864L23343N1014j898237k006530J17719J617104J343466K1579j604216
6141H001106O75025J247780q405q96870J134153j119550J123984j131693k80745
6132H744785k00193Q15575m79752N99007k25573N67481L1482j659290q9440j284636
6122F819446J976473J636227k221641J137093n31052k124404Q51926R53843n06146
6113G991765N64059J503375k60513r11580p7473j562874j057046J138107L076748
$$ y = [8552805, 7380848, 8908367, 8874047, 8253297, 9768156, 9795647, 8840676, 6086142, 5841091, 8384658, 9046330, 8245253, 9094199, 11073127, 10300346, 8901047, 9447072, 9466376, 6954683, 6950220, 8443839, 8098157, 9241345, 11526038, 11141951, 9832077, 10035864, 10359207, 10410221, 8511984, 6505454, 6623173, 8240277, 9583743, 9605322, 8001106, 8676131, 9923911, 9915506, 9018636, 10152789, 9033239, 10157223, 9025530, 8744785, 8544592, 9360167, 8880415, 9479422, 9253849, 9821330, 9852812, 8193522, 8104082, 6819446, 8795919, 10432146, 8210505, 9347598, 8816546, 6692142, 7544068, 8497911, 7991765, 8555824, 10059199, 9798686, 8887106, 8809633, 7246759, 6189713, 7327820, 10404568]
6104A0404568K2964j271480n34714R51545J68732j134574p56163j389382O9237
6095F530733k67049M91270l04782J575335Q08668k021284o91516j785016J950496
6086F286855J086889j172307j454134m91336R30304M83991K674750k084369q99887
6077E360756J693219K860738R3912p73200k110001r77474P11308p48640j205480
6068D905138J374220P99207j808388N67756j20341R27786J01979k498016L38179
6059D587520M01125j655927K172937J932930R47643N36474j999779M99488k883378
6050D539033j803312J875001R23497k598306L594671J72517m04634j232078l73668
6041D692721p06996p6984r9817J876104p73270j562102L752007Q78868N55427
$$ y = [10404568, 10427532, 9156052, 8621338, 9572883, 9741615, 8607041, 7850878, 6461496, 6530733, 6263684, 6754954, 6450172, 8025507, 8834175, 6812891, 6121375, 4336359, 6286855, 7373744, 6201437, 4747303, 4255967, 5186271, 5670262, 8345012, 6260643, 5360756, 7053975, 9914713, 10008625, 9235425, 7125424, 6147950, 6859258, 6110618, 4905138, 6279358, 7078565, 5270177, 5837933, 5717592, 6645378, 6747357, 4249341, 4587520, 4988645, 3332718, 5505655, 7438585, 8386228, 8922702, 6922923, 7422411, 4539033, 2735721, 4610722, 5534219, 2935913, 6530584, 6703101, 6298467, 5066389, 4692721, 3985725, 3908741, 3808924, 5685028, 4911758, 3349656, 7101663, 7980531, 8535958]
6032H535958k148844k473574j468987K935080L091209o65160J139402J25976k753653
6023F317407q32996q56868L38570R17671K240762p80720j814722j174021R24823
6014E279906O43142J175945r87919o91903l55288J499162r35002j389723P79059
6005E017379J22718J396840j111067J260718J41644O74877p88435K318805j477015
5996G556464l646333J389276M66963j58692L20072J543937j75149k555596J719709
5987F460651J337583M37108N55830k391618N15819K102353k141222k583659K922956
5978G215801l24805K6763J252837K12435q9930K669859N18975l596472j80417
5969G705046P92595r1706J014194P20379j655261j423986j18359P2937J730684
$$ y = [8535958, 6387114, 3913540, 2444553, 5379633, 8470842, 7805682, 8945084, 9071060, 6317407, 5484411, 4627543, 4966113, 5883784, 8124546, 7343826, 5529104, 4355083, 5279906, 5923048, 7098993, 6111074, 5419171, 5063883, 6563045, 5628043, 4238320, 5017379, 5140097, 6536937, 5425870, 6686588, 6828232, 7503109, 6714674, 9033479, 7556464, 3910131, 5299407, 5766370, 5607678, 5927750, 7471687, 7296538, 4740942, 6460651, 7798234, 8235342, 8791172, 6399554, 6915373, 9017726, 6876504, 4292845, 7215801, 6890996, 6917759, 8170596, 8383031, 8293101, 10962960, 11481935, 7885463, 7705046, 8497641, 8405935, 9420129, 10140508, 8485247, 7061261, 6942902, 7015839, 8746523]
5960H746523j414135j710324J346300J021788J165762K016185R42817r79525R15543
5951A2050934j365740J317394m83754q09943j671018j83215J733462J450437j242005
5942A0796552p47765k42964r19792J811223M99373j164691R47037k06895J70193
5933A0942271J870114k646349j165885L8263J75149O28259N1744K530367K491639
5924A4915572o92250j157313M78005o98793q32836p23792j128519L238557Q18060
5915A4216691j443510j210477K012005O64904o26101k22658m35810l49560J890844
5906A4496328k81989N42288P7759K381410K257986k538438l798491P76640J348577
5897A5262070r92689l34428K295602J539961j873800J120680n90228j253661M19456
$$ y = [8746523, 7332388, 5622064, 6968364, 7990152, 9155914, 11172099, 12114916, 11135391, 12050934, 10685194, 12002588, 11518834, 10708891, 9037873, 8854658, 10588120, 12038557, 10796552, 10048787, 9805823, 8886031, 10697254, 11196627, 10031936, 10978973, 10772078, 10942271, 12812385, 10166036, 9000151, 9038414, 9213563, 9841822, 9893566, 12423933, 14915572, 14223322, 13066009, 13544014, 12845221, 12012385, 11288593, 10160074, 13398631, 14216691, 12773181, 11562704, 13574709, 14239613, 13613512, 13390854, 12955044, 12605484, 14496328, 14214339, 14756627, 14834386, 17215796, 19473782, 16935344, 13136853, 13913493, 15262070, 14269381, 13934953, 16230555, 17770516, 15896716, 17017396, 16427168, 15173507, 15592963]
5888A5592963j61838J356425q7396Q6923l97340m91381M9637K572003n49252n44331
5878A7426413l22962L50077K003268J247526N35673j294540Q77861j513548k339055
5869A6970713j197853Q79887J90165J971237m85055p66544J045059L84033K13936
5860A9205578k016478M82752Q94344q10289J060549J006194m60868j07445J655695
5851B0910032j849728k30946O51459r93657L118105J660267r43422L5666k082192
5842B0275584J18200J848136N79071n03274Q29073N82894l46743N65954J067792
5833B5016687j415836j729015R25268L85501P73582P67132P50516J19877j298883
5824B4294829r70665L04610J297282N65190N29854K372522j113180n23344k030785
$$ y = [15592963, 15431125, 16787550, 16700154, 16787077, 16389737, 15898356, 15947993, 18519996, 17970744, 17426413, 17103451, 17453528, 19456796, 20704322, 21239995, 19945455, 20823316, 19309768, 16970713, 15772860, 16652747, 16842912, 18814149, 18329094, 17562550, 18607609, 18991642, 19205578, 17189100, 17671852, 18566196, 17755907, 18816456, 19822650, 19361782, 19254337, 20910032, 19060304, 18829358, 19480817, 18487160, 21605265, 23265532, 22322110, 22357776, 20275584, 20393784, 22241920, 22820991, 22317717, 23146790, 23729684, 23382941, 23948895, 25016687, 23600851, 21871836, 22797104, 23182605, 23956187, 24723319, 25473835, 25593712, 24294829, 23324164, 23628774, 24926056, 25491246, 26021100, 28393622, 27280442, 26757098, 24726313]
5815B4726313o92143J958505L93921J601110r64817j339591J641843J810289j807898
5806B7327532j157397K067084O2795q14816J28799j160432K899225q99401P77416
5797B9230805P58575K55268J271704J41581R4002J026125J292104K19355L35749
5788C4625268J587101J706316k051048k021711r86595L412382J124564K080330
5780C9476607j561096N24034J787426k548638R04173M41249J130066K914120L49372
5771D3417313j709122K24832J754880Q02535Q27365j550830l11243J559854R41528
5762D5957112P4111K160218O68325j628019J824240j254598J741769L034491L642855
5753E6220504K85864o81950Q44278J316980J632021k68933r77N62551K189320
$$ y = [24726313, 24034170, 25992675, 26386596, 27987706, 27022889, 25683298, 27325141, 29135430, 27327532, 26170135, 28237219, 28300014, 27485198, 27613997, 26453565, 29352790, 28453389, 29230805, 29989380, 30244648, 31516352, 31657933, 31751935, 32778060, 34070164, 34289519, 34625268, 36212369, 37918685, 35867637, 33845926, 32859331, 36271713, 37396277, 39476607, 37915511, 38439545, 40226971, 37678333, 38582506, 39023755, 40153821, 43067941, 43417313, 41708191, 41933023, 43687903, 44490438, 45317803, 43766973, 43455730, 45015584, 45957112, 46031223, 48191441, 48859766, 47231747, 49055987, 47801389, 49543158, 52577649, 56220504, 56506368, 55824418, 56668696, 57985676, 59617697, 59348764, 59347787, 59910338, 62099658]
5744F2099658J38878m86299L839170K019136K305672O93795O48782J921412N78958
5735G3759162N68755m25785M25377L455269Q16971M293958J743300j70548L170632
5726H7637091N00621l91713m30396L143455J430330K515094K642429L62034M19111
5717I7828056J811021K070127j39879M32983K189572K493119L146053p96495J675540
5708A10710097J335311k291971K561596K925611J056342O84578J1028K002631
5700A18995223J495826P52595K196917R14095K966368J936555q36090J014543
5692A29436032o22244J266901O93268m85288J215523K730614R00440J682929K82518
5683A37100693M5042O28872J378178K124356N04311P24489j30334J105240Q95581
$$ y = [62099658, 62238536, 61752237, 65591407, 67610543, 69916215, 70610010, 71258792, 73180204, 73759162, 74327917, 73902132, 74327509, 77782778, 78599749, 82893707, 84637007, 84466459, 87637091, 88137712, 87745999, 87315603, 90459058, 91889388, 94404482, 97046911, 97408945, 97828056, 99639077, 101709204, 101569325, 102002308, 104191880, 106684999, 109831052, 109034557, 110710097, 112045408, 109753437, 112315033, 115240644, 116296986, 116981564, 116992592, 118995223, 120491049, 121243644, 123440561, 124354656, 127321024, 129257579, 128421489, 129436032, 128813788, 130080689, 130773957, 130288669, 131504192, 134234806, 135135246, 136818175, 137100693, 137145735, 137774607, 139152785, 141277141, 141781452, 142505941, 142375607, 143480847, 144376428]
5674A44376428J628894L33998J343200K81955J142924M98884n18246J721381L307133
5665A54116551J833991L42106l30574q98277M303140J722780Q11923P59784K742523
5656A65403947Q15900J080147J667519N24662J722144J170125j178059J337096
5648A72543481L307606K86137J088852J986684K63615J227006K075218j179647
5640A81598952N58976K015071K944961J787089J11969M24673J34247J731079p83243
5631A90523774R26326J650873J208850J833780q00479J017036M04730n56735K756893
5622A98965048J462258L30452Q9141K901928K154150o93755R55429m80695k77464
5613B05406492K162331L503435M84369N1785k90668J115138Q48903k54765L776237
$$ y = [144376428, 146005322, 146339320, 147682520, 147964475, 149107399, 149606283, 149088037, 150809418, 154116551, 155950542, 156292648, 155962074, 155063797, 159366937, 161089717, 161901640, 162661424, 165403947, 166219847, 167299994, 168967513, 169492175, 171214319, 172384444, 171206385, 172543481, 175851087, 176137224, 177226076, 179212760, 179476375, 180703381, 182778599, 181598952, 182157928, 184172999, 187117960, 188905049, 189017018, 189441691, 189575938, 191307017, 190523774, 191450100, 193100973, 194309823, 196143603, 195343124, 196360160, 196764890, 196208155, 198965048, 200427306, 200757758, 200846899, 203748827, 205902977, 205209222, 206164651, 205683956, 205406492, 207568823, 211072258, 211556627, 211608412, 211317744, 212432882, 213281785, 213027020, 216803257]
5604B16803257J684143K72980N62976q47238L85947J846347Q85759J646950o3954
5595B23177167m54696K596017J036814J169218Q98942l75486K983405J653187
5587B32684568l4096K147466J668921n05178K106999M52971K051608N74385n41264
5578B40606380J334580R80213J884466M11355N18064L833519J230757o33608K196158
5569B52361884P09753K261024l84362K800767r8343k8839Q84182L165449K818840
5560B64490355K015661J334677K441617J179730K226445K229964L39021J792023
5552B78049493K403776O07048K424173O91836K468026L051946K676708K657354
5544B95030360o30594L071351K927151J491453N98404L543415L38841K557313
$$ y = [216803257, 218487400, 218760380, 219323356, 218476118, 218862065, 220708412, 221594171, 223241121, 223177167, 222722471, 225318488, 226355302, 227524520, 228423462, 228047976, 231031381, 232684568, 232650472, 234797938, 236466859, 235961681, 238068680, 238521651, 240573259, 241147644, 240606380, 241940960, 242921173, 244805639, 245216994, 245735058, 249568577, 250799334, 250165726, 252361884, 253071637, 255332661, 254948299, 257749066, 257650723, 257621884, 258506066, 261671515, 264490355, 266506016, 267840693, 270282310, 271462040, 273688485, 275918449, 276257470, 278049493, 280453269, 281060317, 283484490, 284176326, 286644352, 289696298, 292373006, 295030360, 294399766, 297471117, 300398268, 301889721, 302488125, 306031540, 306370381, 308927694]
5536C08927694M294686K304020M070522K14791J199155K223973L916954J439223
5528C28591018L379152K752146N040670K393227L261252L766197L361715L450296
5520C55995673J912142M459693M372518K602197M875862P018703M310202L862564
5512C89409554J716514L976075M355443N257840M179147M697402N286810M445212
5504D23323997M883913P508485M154194P124698M491229O840384N168031K751089
5496D66246020O479684M049286M772558O632619M641640N983505M527185M442856
5488E07775353N837301N045954M180223K725616K116498L776602J669646J886747
5480E35013940j361682J855661J612119r28993k554378j951990k41360k356799
$$ y = [308927694, 313222380, 315526400, 319596922, 319811713, 321010868, 323234841, 327151795, 328591018, 331970170, 334722316, 339762986, 342156213, 345417465, 349183662, 352545377, 355995673, 357907815, 362367508, 366740026, 369342223, 374218085, 381236788, 385546990, 389409554, 391126068, 395102143, 399457586, 404715426, 408894573, 413591975, 418878785, 423323997, 428207910, 435716395, 439870589, 446995287, 451486516, 458326900, 463494931, 466246020, 472725704, 476774990, 481547548, 488180167, 492821807, 498805312, 503332497, 507775353, 513612654, 518658608, 522838831, 525564447, 527680945, 531457547, 533127193, 535013940, 533652258, 535507919, 537120038, 536191045, 533636667, 531684677, 531443317, 529086518]
5472E29086518l882133k664805n779797o633563o297317o673351n132157q383069
5464D83640326q425645o512585o861611r125050m328257q819615p924554j0270835
5456D21372174r105627q352013o480510q578062q877038o812651r115613q550458
5448C55500202r423007r086826p801494m031160o386306n927752q276935q361056
5440B96205666p072332m822206p566001p413143l675302p546229o591025n053953
5432B46465475n526311l598557m693028m613995l916203o260353m702039l651790
5424B09503199l664553m521737q70163m649943m215634m347744o272863j061015
5416A79899547n111873k068964j647569l469557l626280l214362k458775l118751
$$ y = [529086518, 525204385, 522539580, 516759783, 510126220, 503828903, 497155552, 492023395, 483640326, 475214681, 468702096, 461840485, 452715435, 448387178, 439567563, 431643009, 421372174, 412266547, 403914534, 397434024, 388855962, 379978924, 373166273, 364050660, 355500202, 346077195, 336990369, 329188875, 325157715, 318771409, 312843657, 304566722, 296205666, 289133334, 284311128, 276745127, 269331984, 265656682, 258110453, 251519428, 246465475, 240939164, 237340607, 232647579, 228033584, 224117381, 217857028, 213154989, 209503199, 205838646, 201316909, 200446746, 195796803, 191581169, 187233425, 180960562, 179899547, 174787674, 172718710, 171071141, 167601584, 163975304, 160760942, 158302167, 155183416]
5408A55183416j484867k803044l290679k182299k030753j751738k143404l026156
5400A36470476k492125j625319j347021k584272j957341j064492k417101k869752
5392A20113053j166098n65089j515548r74866k881517j102284o23359j820652
5384A09463640j56404q99154k263092j546484n15048k730316k400954j952743
5376I6999445j296487P50703J05121k511955j270010P92717j201267j499151p79374
5367I0089742k829733o88253o91151J739517j768890l005753L27108L4101j18353
5358H3088335l43173j400963k079857k40769O20592j678999k519612j079766P37592
5349G5103380j079695r25958r85048r05085O56837j65699j037123j516632J120117
$$ y = [155183416, 153698549, 150895505, 147604826, 145422527, 143391774, 141640036, 139496632, 136470476, 133978351, 132353032, 131006011, 128421739, 126464398, 125399906, 122982805, 120113053, 118946955, 118381866, 116866318, 115891452, 113009935, 111907651, 111284292, 109463640, 109307236, 108408082, 106144990, 104598506, 104083458, 101353142, 98952188, 96999445, 95702958, 96453661, 96558782, 94046827, 92776817, 93569534, 92368267, 90869116, 90089742, 87260009, 86571756, 85880605, 87620122, 85851232, 82845479, 83172587, 83206688, 83088335, 82745162, 81344199, 79264342, 79023573, 79644165, 77965166, 75445554, 74365788, 75103380, 74023685, 73097727, 72112679, 71207594, 71864431, 71698732, 70661609, 69144977, 70265094]
5340G0265094L35645j343233j617376j16931N63926j787441K461230J410602j789606
5331F8381910k284233n73071K5101q41634q27331k03914q58220K81142j537053
5322F1562697r16448J060088j210360J434704k010201r8144K364669n33909j822348
5313E9830748k295672L10449J571720j659334j153309k56410j424871j602034
5305E3321287j1655J828297K155409q38355J114594j035923j795531j085847j32624
5296E3519652J864124O84155m61880N77529L56093J003489j405520j206098q84573
5287E4046971j852280J580853k59285k054654L37552J242215Q68601M72270j037053
5278E3345190j69356k65261m42031p03299M15299n43443O97494J6248j264518
$$ y = [70265094, 70600739, 69257506, 67640130, 67523199, 68087125, 66299684, 68760914, 70171516, 68381910, 66097677, 65524606, 65549707, 64708073, 63880742, 63676828, 62818608, 63099750, 61562697, 60646249, 61706337, 60495977, 61930681, 59920480, 59822336, 62187005, 61653096, 59830748, 57535076, 57845525, 59417245, 57757911, 56604602, 56348192, 54923321, 53321287, 53309632, 55137929, 57293338, 56454983, 57569577, 56533654, 54738123, 53652276, 53519652, 55383776, 56067931, 55606051, 56183580, 56539673, 57543162, 56137642, 54931544, 54046971, 52194691, 53775544, 53516259, 51461605, 51799157, 53041372, 53909973, 54382243, 53345190, 53175834, 52910573, 52468542, 51765243, 52180542, 51637099, 52334593, 52350841, 51086323]
5269E1086323j77643r35900P10386j56836r07135J081916J689348O80495j242367
5260E1828587q41723k57347J38476j91041j173078K44957j45964J929066j789891
5251D9742042J945496K7847j229767Q57250r68315Q76590j37404J029082j780405
5242E0362416n16989J71975J659158P13821j118169J184274J555500J93849O13989
5233E4819824k06386k086169j488477M87760J120978j347129J621593K331452
5225E5253446k142767l0718R1167M7153J735224j228548k009941N88997j289974
5216E1014039O81696l0526l691K245991j631369k70972K289622J223011o41650
5207E4876151J171050j938530N26460J361066j762164j228730n8222o9042j815896
$$ y = [51086323, 50908680, 49972780, 50683166, 50526330, 49619195, 50701111, 52390459, 53070954, 51828587, 50986864, 50729517, 50867993, 50676952, 49503874, 49748831, 49602867, 51531933, 49742042, 51687538, 51715385, 50485618, 51342868, 50374553, 51251143, 51113739, 52142821, 50362416, 49845427, 50017402, 51676560, 52390381, 51272212, 52456486, 54011986, 54205835, 54819824, 54613438, 52527269, 51038792, 51526552, 52647530, 51300401, 52921994, 55253446, 53110679, 53079961, 53171128, 53218281, 54953505, 53724957, 51715016, 52304013, 51014039, 51695735, 51665209, 51661518, 53907509, 52276140, 52005168, 54294790, 55517801, 54876151, 56047201, 54108671, 54635131, 55996197, 54234033, 53005303, 52947081, 52878039, 51062143]
5198E1062143J579682J520481m64965k162564J32208j366869M68973m31037l66159
5189D9971893J451047l61203j574213J573972J181236j766678j096576k14870
5181D9164608J663734J0195J64400n12830j184349j990217j660584J511897j10257
5172D7056597P90544q41793j491211J003554n92624n11480J60262J077562j92439
5163D6458972p02248j03454n40970L74036J322562k277717o57845K648113o29572
5154D5891877O46628K6470k397392k36927j217976J062672J39874J049856j766205
5145D3198877n5238L574572O02098j722233j623190O43306N98667R87298p95422
5136D5408735j910699N46185J178523j356857n10618n27405n45220N91445J377597
$$ y = [51062143, 52641825, 54162306, 53697341, 51534777, 51666985, 50300116, 50769089, 50338052, 49971893, 51422940, 51061737, 49487524, 51061496, 52242732, 50476054, 49379478, 49164608, 50828342, 50838537, 51002937, 50490107, 49305758, 47315541, 45654957, 47166854, 47056597, 47847141, 47005348, 45514137, 46517691, 45925067, 45413587, 45573849, 46651411, 46458972, 45756724, 45653270, 45112300, 45486336, 46808898, 44531181, 43873336, 46521449, 45891877, 46538505, 46564975, 44167583, 43930656, 42712680, 43775352, 43915226, 44965082, 43198877, 43143639, 46718211, 47320309, 45598076, 43974886, 44618192, 45216859, 46204157, 45408735, 43498036, 44044221, 45222744, 43865887, 43355269, 42827864, 42282644, 42874089, 44251686]
5127D4251686O15636L74173J674149k031276j385956J505240r32748j399045m7825
5118D2624034l94635M69882K352371J055541J413413P35145j779789j153760k16916
5109D5105286o28652m57003J944388j285402J170101p31479j661654J016940J029111
5100D5501636j913903N76212J93802j082237j102660L37445K06972j749271M77930
5091D1445926j85199J530529j263841Q54812O29724O92027K8168K14533j140958
5082D2805721k54162M8730J063470j305301l58258J135912K010896j899263J72834
5073D3420579J233103m79794L39830j912302k49916N1371K546265j547972n66951
5064D2834213j210201Q55187L97284o37001j27891J973591Q46385j213609M60611
$$ y = [44251686, 44867322, 45241495, 46915644, 44884368, 43498412, 45003652, 44070904, 42671859, 42624034, 42229399, 42699281, 45051652, 46107193, 47520606, 48255751, 46475962, 45322202, 45105286, 44476634, 44019631, 45964019, 44678617, 45848718, 45117239, 43455585, 44472525, 45501636, 43587733, 44163945, 44357747, 43275510, 42172850, 42510295, 42717267, 40967996, 41445926, 41260727, 42791256, 41527415, 42382227, 43011951, 43703978, 43732146, 43946679, 42805721, 42551559, 42600289, 43663759, 42358458, 42000200, 43136112, 45147008, 43247745, 43420579, 44653682, 44173888, 44513718, 42601416, 42351500, 42402871, 44949136, 43401164, 42834213, 41624012, 42479199, 42876483, 42239482, 42111591, 44085182, 44931567, 43717958, 44178569]
5055D4178569j861998J397456M14348n43360O48286M6341m60648M53979j231065
5046D3041908j65959o97831l17804J123154q84328k71859M46803K533852j5580
5037D4792356p46156k68932m99847R78650k20009P92231j592618j179056j50841
5028D1905778J316834P98378K275014m46838k592548Q39391l5659k896011J098023
5019D2262362K518781J267395N09015J33162m29636j966406q45681N56620J407779
5010D5413391j461116Q88129K224323m71635j920434J535106j05148m95135K185826
5001D7793307k6869j137239N13571l30357K368431l00387O31992j3085p82458
4992D8716906N97156Q73381J809418J040486N56043J275077J670259k94872J408713
$$ y = [44178569, 42316571, 43714027, 44128375, 43585015, 44233301, 44279642, 43818994, 44272973, 43041908, 42875949, 42178118, 41860314, 42983468, 42099140, 41827281, 42274084, 44807936, 44792356, 44046200, 43777268, 43277421, 44256071, 44036062, 44828293, 43235675, 42056619, 41905778, 43222612, 44020990, 46296004, 45849166, 43256618, 44096009, 44060350, 41164339, 42262362, 44781143, 46048538, 46557553, 46690715, 46261079, 44294673, 43448992, 44005612, 45413391, 43952275, 44840404, 47064727, 46593092, 44672658, 46207764, 46102616, 45607481, 47793307, 47766438, 46629199, 47142770, 46812413, 49180844, 48880457, 49512449, 49499364, 48716906, 49314062, 50187443, 51996861, 53037347, 53593390, 54868467, 56538726, 56243854, 57652567]
4983E7652567k93802j176013k063066m11853N89652J442081J313167l01636p6681
4974E6674416l57964O91501o22363M58085r7786o09009J893090M59486m581900
4965E3907556j46320R32836Q2568j92809k018731J422625l06572j010520j922967
4956E0747666j393346M89604R43431n22990k125478k372664R32487j001148J002905
4947D6700467j588359j885340j022227k304034J713069j06948l07002k564103
4939C8635523r93030J194016j268982j133334K481274k148603k250629j177023
4931C3339212N09423J37738K085728k418187p16876K2411Q07811j032138j86849
4922C2548273k07842o64706j075960J053184M40061l294497J084808J500214n53174
$$ y = [57652567, 57358765, 56182752, 54119686, 53707833, 54297485, 55739566, 57052733, 56751097, 56674416, 56316452, 57007953, 56385590, 56843675, 56745889, 56136880, 58029970, 58489456, 53907556, 53761236, 54694072, 54776640, 54583831, 52565100, 53987725, 53681153, 52670633, 50747666, 49354320, 49843924, 50787355, 50264365, 48138887, 45766223, 46698710, 45697562, 46700467, 45112108, 43226768, 42204541, 39900507, 41613576, 41506628, 41199626, 38635523, 37642493, 38836509, 37567527, 36434193, 38915467, 36766864, 34516235, 33339212, 33848635, 33986373, 36072101, 33653914, 32937038, 32959449, 33767260, 32735122, 32548273, 32340431, 31675725, 30599765, 31652949, 32093010, 28798513, 29883321, 31383535, 30830361]
4913C0830361k55735J930224L00028o15524j258427j864187q065j309798j99426
4904B7549451Q89183o39000J402227j205668m12453j478688P97277j927947R78774
4895B5953156m39999J488533m51627j170016n82614J602193o52998K200430j811324
4886B6135734r88660J7368o14766k632305J035795K936050q08043L60617m20498
4877B5021292j69698q98118k056614R86207j36817m08252M39039j934361n34119
4868B0308559j094234J88547K977462l61306j486566O08450j337815R76452k099795
4859A8679754J027449J19975J559661L37774j389245R26503J162791o70762N9459
4850B1813359l18236o27394J865667R73128k488570J499688m42304J032687j405406
$$ y = [30830361, 30574626, 32504850, 32804878, 32189354, 30930927, 29066740, 29058675, 27748877, 27549451, 28438634, 27799634, 29201861, 27996193, 27583740, 26105052, 26902329, 24974382, 25953156, 25513157, 27001690, 26550063, 25380047, 24797433, 26399626, 25746628, 27947058, 26135734, 25147074, 25164442, 24549676, 21917371, 22953166, 25889216, 25081173, 25441790, 25021292, 24851594, 23953476, 21896862, 22883069, 22746252, 22338000, 22777039, 20842678, 20308559, 19214325, 19402872, 22380334, 22019028, 20532462, 21140912, 19803097, 20779549, 18679754, 19707203, 19827178, 21386839, 21724613, 20335368, 21261871, 22424662, 21753900, 21813359, 21495123, 20867729, 22733396, 23706524, 21217954, 22717642, 22275338, 23308025, 21902619]
4841B1902619n3059J052197M61931j246281p96652J127207M42499J749687j48998
4832B4491150r57927J872983p13715j517336m17372o58148J290794J455089K351037
4823B7196555m52694P58425j88959k292902P56545J184952J78535k06641j78713
4814B6755103J293471l11795k281664j072682J272467K116648J191755j174630
4806B7788673J76165L92028M0949O5096Q41518n67630j584163J399736K70719
4797B8823091J29002J276205R34676M24273l00656O01834K404824o42359k173800
4788C1477090Q35251O30657j03289l23288l66740p59692j38906R78380k44434
4779C1985029L22605J58956L79203J402354j421981J241539Q8471j509532J263923
$$ y = [21902619, 21849560, 22901757, 23363688, 22117407, 21320755, 22447962, 22890461, 24640148, 24491150, 23533223, 25406206, 24692491, 23175155, 22757783, 22099635, 23390429, 24845518, 27196555, 26743861, 27502286, 27313327, 25020425, 25776970, 26961922, 27140457, 26933816, 26755103, 28048574, 27736779, 25455115, 24382433, 25654900, 27771548, 28963303, 27788673, 27964838, 28356866, 28397815, 28462911, 29304429, 28736799, 27152636, 28552372, 28823091, 28952093, 30228298, 31162974, 31587247, 31286591, 31888425, 34293249, 33650890, 31477090, 32312341, 32942998, 32839709, 32516421, 32149681, 31389989, 31251083, 32229463, 31985029, 32307634, 32466590, 32845793, 34248147, 32826166, 34067705, 34156176, 32646644, 33910567]
4770C3910567K066305L00328o60312p45314j493224o0043K342652m3680q69973
4761C4747306L89737J966943K9097j552316k88954J516035p0623N6581k28327
4752C6565479j314369Q97995j069881j78410J409568J286765j448485o20876P56915
4743C6284701Q30853j00354o20952K29914l80085K067404J367649R25923r96509
4734C9608544O46109J11924q04636N77177k09744n86670m53621K21794J490331
4725D0601208m45759j244911j65511Q487J168596k107281O81413N00997J075980
4716D0073219J892586q35737o33304J144935J47394p64643J459925p80101J406241
4707D3110515k99857J659055J00487k212535N23173R9676o52205L95977N54442
$$ y = [33910567, 35976872, 36277200, 35616888, 34871574, 33378350, 33318307, 35660959, 35617279, 34747306, 35137043, 37103986, 37133083, 35580767, 35291813, 36807848, 36737225, 36793806, 36565479, 35251110, 36149105, 35079224, 34900814, 36310382, 37597147, 36148662, 35527786, 36284701, 37115554, 37015200, 36394248, 36624162, 36244077, 38311481, 39679130, 40605053, 39608544, 40254653, 40366577, 39561941, 40139118, 39929374, 39342704, 38889083, 39110877, 40601208, 40155449, 38910538, 38745027, 38753514, 39922110, 37814829, 38496242, 38997239, 40073219, 41965805, 41130068, 40496764, 41641699, 41789093, 41024450, 42484375, 41704274, 43110515, 42810658, 44469713, 44570200, 42357665, 42880838, 42980514, 42328309, 42724286, 43278728]
4698D3278728j985602P69132l10393K33227p75352k92822N60303K19345J049875
4689D2746441K62353o18426n12190Q00320Q68816L60801n99756k90788j108723
4680D1908848M13492K305930J583950j642255j386844J805895Q18955r32936k07884
4671D4667151o9566k194318J843486J66024L58865J131614J951369j68589l245626
4662D4440410j78057L710510J959402j968807j475319J079940J792140o5007k56228
4653D9038984j188136j856028K705230J621446J059873r73082O97312j786287
4645D9319312m42055Q23365m49919K01556Q64218J629331k44796M48764J226446
4636E3376222n94540N37774J574250j354717J522699j925066P0107K472505J668077
$$ y = [43278728, 41293126, 42062258, 41751865, 41985092, 41209740, 40916918, 41477221, 41696566, 42746441, 43008794, 42390368, 41878178, 42678498, 43547314, 43908115, 43308359, 43017571, 41908848, 42322340, 44628270, 46212220, 44569965, 43183121, 44989016, 45807971, 44875035, 44667151, 44597585, 42403267, 44246753, 44412777, 44771642, 45903256, 47854625, 47686036, 44440410, 44262353, 47972863, 49932265, 47963458, 46488139, 47568079, 49360219, 49295212, 49038984, 47850848, 45994820, 48700050, 50321496, 51381369, 50408287, 51105599, 49319312, 48877257, 49700622, 49250703, 49452259, 50316477, 51945808, 51701012, 52149776, 53376222, 52781682, 53319456, 54893706, 53538989, 55061688, 53136622, 53206729, 55679234, 57347311]
4627E7347311j683186O29833n52742O96107P20341q8677J776161J015037m98308
4618E9361877K40638J210660n35997J657121K045099O44569N7941J886653j72248
4609F6396313K190719J798638L256077N19204K682234j506022k497350K566925
4601G5406738J19077o63939K353046J821894n2904J657709K62627J558683m73445
4592H1989486j567095J562167L402114M52537m1416k189891K768061K398235K208493
4583I0982691J318950K179960L579754l86756j403501K709612Q37484K359870
4575A02178064J144157J197253L82233L008194q1869O34717K377905j117496j352802
4566A08370356J19506l60092j746615j335172m39012j913247o22606r07217k911659
$$ y = [57347311, 55664125, 56293958, 55741216, 56437323, 57157664, 57068987, 58845148, 59860185, 59361877, 59602515, 60813175, 60277178, 61934299, 63979398, 64623967, 64681908, 66568561, 66396313, 68587032, 70385670, 73641747, 74160951, 76843185, 75337163, 72839813, 75406738, 75525815, 74861876, 77214922, 79036816, 78983912, 80641621, 80904248, 82462931, 81989486, 80422391, 81984558, 85386672, 85839209, 85797793, 83607902, 86375963, 88774198, 90982691, 92301641, 94481601, 98061355, 97674599, 96271098, 98980710, 99818194, 102178064, 103322221, 104519474, 104901707, 107909901, 107828032, 108462749, 110840654, 109723158, 108370356, 108489862, 108129770, 106383155, 105047983, 104608971, 102695724, 102073118, 101165901, 98254242]
4557I8254242k030932l177870m93328j841151l492813j147649j701310m409838
4549G9959351k370384j929144m489069l665987j264592l406717j937084N34227
4541F1430601k077702l182376j561098l361399q09306j210584k92006j411093
4533D7525037j333832k110440k222841n23970j105150o57993L33850j6682j630995
4524C8256984q23019m55791k142359l21255m4913j031937j132386O93759j484248
4515C1514835n57809j620545j293985J85608q07j642913k869630j631714K301118
4506B4384158R80829r20814P05181R55191O65742j661499j713809Q2035J073373
4497B4550387m40615p13453n29174j166087n86550M01890P17508n08840L03330
$$ y = [98254242, 96223310, 93045440, 92552112, 90710961, 87218148, 86070499, 84369189, 79959351, 77588967, 75659823, 71170754, 67504767, 66240175, 62833458, 60896374, 61430601, 59352899, 56170523, 54609425, 51248026, 50438720, 49228136, 48936130, 47525037, 46191205, 44080765, 41857924, 41333954, 40228804, 39570811, 39904661, 39887979, 38256984, 37433965, 36978174, 34835815, 34514560, 34469647, 33437710, 32305324, 32999083, 31514835, 30957026, 29336481, 28042496, 28228104, 28227297, 26584384, 23714754, 22083040, 24384158, 25364987, 24444173, 25149354, 26104545, 26770287, 25108788, 23394979, 23477014, 24550387, 24109772, 23396319, 22867145, 21701058, 21114508, 21516398, 22233906, 21725066, 22028396]
4488B2028396Q31356k689675j705647j26583K849292J186200r35400p09108k49606
4479B0479225P26184r23216M23726k409950K140172J924590j587574j365711P4559
4470A9482005r75553K78065L24339j419795J582481K775576m74534r18601L10702
4461B0964685K06206J853942j3935j503154j450750j242845O07824N39348Q84896
4452B0846217J81174j674351J637440J671932k199359j429188K456501L14743
4444B1805109J146024j634444L11433J426259J201598L49920j740333k171564
4436B0694002J38030M38042J056012J288561O12630j313316l214053J625728J978272
4427B3303908j190972J95452R27993J527586K288267m91751o05240r99529J08888
$$ y = [22028396, 22859752, 20170077, 18464430, 18337847, 21187139, 22373339, 21437939, 20728831, 20479225, 21205409, 20282193, 20705919, 18295969, 20436141, 22360731, 20773157, 19407446, 19482005, 18506452, 18784517, 19108856, 17689061, 19271542, 22047118, 21572584, 20653983, 20964685, 21170891, 23024833, 23010898, 21507744, 20056994, 18814149, 19421973, 19961321, 20846217, 21027391, 19353040, 20990480, 22662412, 20463053, 19033865, 21490366, 21805109, 22951133, 21316689, 21628122, 23054381, 24255979, 24605899, 22865566, 20694002, 20832032, 21270074, 22326086, 23614647, 24227277, 22913961, 19699908, 21325636, 23303908, 22112936, 22308388, 23236381, 24763967, 27052234, 26560483, 25955243, 24955714, 25064602]
4418B5064602J34853j581277j86913K64557P86021n08132J602704M71271k39857
4409B5807829j123072J472804k7947p42708J10471K02446n10636j96298R58583
4400B5951472j162503n93802J653855N35175J026293k25942j543118k44365L28104
4391B5725169M98951p46825P96481k16206L20787J9560Q35112J505743K113485
4382C0852257k481172o72843l99020n62743K05834j496195J287996J15422n95865
4373B6253671k23316j638417J910876J646312K355736j001487m65531K206222
4365C1044066j260667l214905l43616K825811K171183R69534J25971q19117j426075
4356C0072185q86810L17612J515534j944254o38403J451924K409346p10071j77394
$$ y = [25064602, 25199455, 23618178, 23431265, 23695822, 24481843, 23973711, 25576415, 26047686, 25807829, 24684757, 26157561, 26129614, 25386906, 25497377, 25699823, 25189187, 24992889, 25951472, 24788969, 24195167, 25849022, 26384197, 27410490, 27184548, 25641430, 25397065, 25725169, 26224120, 25477295, 26273776, 26057570, 26378357, 26397917, 27233029, 28738772, 30852257, 28371085, 27698242, 27299222, 26736479, 26942313, 25446118, 26734114, 26849536, 26253671, 26030355, 24391938, 26302814, 27949126, 30304862, 29303375, 28837844, 31044066, 29783399, 26568494, 26224878, 29050689, 31221872, 32191406, 32317377, 31498260, 30072185, 29185375, 29502987, 31018521, 29074267, 28435864, 29887788, 32297134, 31587063, 31409669]
4347C1409669J033989J072934j204279k66426P4757j141257n78653N76949K577789
4338C3555472j906308r88003K222492j54342j127859l69657J492083J903507j017784
4329C3609601J76283J021336J61122j512413j499581K535628P81408j54444R91327
4320C6110267j338232J978015p9184o87524j223768J046928L71192l5872j632490
4311C4509332P34279L11274j737557J09901K758947O33389n25820r36966k63470
4302C5593309J530695k72618J987946p86222O95596J265376j37639j350713l31654
4293C8194076Q68795J067991L3851m74499K142860k92053p98682O66327j566024
4284C9842642P48729q94607P85935K001519k30224J785240J825468o30514J062432
$$ y = [31409669, 32443658, 33516592, 32312313, 32045887, 32120644, 30979387, 30400734, 30977683, 33555472, 31649164, 30661161, 32883653, 32729311, 31601452, 31231795, 32723878, 34627385, 33609601, 33785884, 34807220, 34968342, 33455929, 31956348, 34491976, 35273384, 35118940, 36110267, 34772035, 36750050, 36670866, 35983342, 34759574, 35806502, 36177694, 36141822, 34509332, 35243611, 35554885, 33817328, 33927229, 36686176, 37319565, 36793745, 35856779, 35593309, 37124004, 36851386, 38839332, 38053110, 38748706, 40014082, 39876443, 38525730, 38194076, 39062871, 40130862, 40164713, 39690214, 41833074, 41541021, 40742339, 41408666, 39842642, 40591371, 39696764, 40482699, 42484218, 42253994, 44039234, 45864702, 45234188, 46296620]
4275D6296620L43034k646898j651417J353296J297941J849698N90769N20853O95804
4266D8649700K4799p70479N1043j331332J412565N75291N66873K50395K61945
4257D9690800j118140P62287J709757j455635o42635K42739r15757J340825N40004
4248E0154245J569348k73172l61334Q96277K581628R69178M30923J01125n04731
4239E5563487P63670k547683J241497K121800J327710J410164J543302n42603
4231F0881344k152320l90268K711603N33571K02445N5834M89044K467610J373849
4222F6172712j48692K891499k134661J75851J745366K118341N84980n70978O10322
4213G1444740O6322p95558O24641N14825N56860K342755K012165o71163K311431
$$ y = [46296620, 46639654, 43992756, 42341339, 43694635, 44992576, 46842274, 47433043, 47953896, 48649700, 48674499, 47904020, 47955063, 46623731, 48036296, 48611587, 49178460, 49428855, 49690800, 48572660, 49334947, 51044704, 49589069, 48946434, 49189173, 48273416, 49614241, 50154245, 51723593, 51450421, 51089087, 51985364, 54566992, 55536170, 55967093, 56068218, 55563487, 56327157, 53779474, 55020971, 57142771, 58470481, 59880645, 61423947, 60881344, 58729024, 58338756, 61050359, 61583930, 61786375, 61842209, 62331253, 64798863, 66172712, 66024020, 68915519, 66780858, 66956709, 68702075, 70820416, 71405396, 70834418, 71444740, 71511062, 70715504, 71340145, 71854970, 72411830, 74754585, 76766750, 76095587, 78407018]
4204G8407018n64034l56843L97971l27710J958062K390454N23865N15173K23536
4195H3167492Q11278K255065J975065m0775J12124M97788J619512J764485K181923
4186I4343957N95658l09787q26788j175427j282406k776770p70375q68613j804053
4177H5125396k562670j439444J269866j248539j806053n58684j251370j784224
4169G5744278j65990k452689k438788j065835p67209p745k132282j915820p33999
4160F4063921j382019k298944J889875M14211j719711k837364L57441j47629J6076
4151E8355857k619725P86002l2260j431467o9691k634279P07208L35146Q24533
4142E4221324n37074j684603r36980j018146j296134j87844J989206J041639K68473
$$ y = [78407018, 77842984, 77486141, 77884112, 77556402, 79514464, 81904918, 82428783, 82943956, 83167492, 83978770, 86233835, 88208900, 88168125, 88280249, 88778037, 90397549, 92162034, 94343957, 94939615, 94629828, 93803040, 92627613, 91345207, 88568437, 87798062, 86929449, 85125396, 82562726, 81123282, 82393148, 81144609, 79338556, 78779872, 77528502, 75744278, 75578288, 73125599, 70686811, 69620976, 68853767, 68846022, 66713740, 64797920, 64063921, 62681902, 60382958, 62272833, 62687044, 60967333, 58129969, 58487410, 58339781, 58355857, 55736132, 56522134, 56489874, 55058407, 54988716, 52354437, 53061645, 53396791, 54221324, 53684250, 51999647, 51062667, 50044521, 48748387, 48560543, 50549749, 51591388, 51859861]
4133E1859861k772999j71513J742980p11383j699861J098756N58291P80170r85885
4124D9698417j269238k195245K21612J609822M18257k7815O15880l13551L37944
4115D9096083j495790r9938J120622K346463k16424j192955m3915j07239p77102
4106D8629805m45574J280578L26279n08911M037k96617L33396l90598J170183
4097E0102578N07993O6686j978543J798424L209575l037373j272680K367461R18630
4088E2682751r83208P13824j805130M29542J94801J90758J437421n9754p41192
4079E2059813R41831J655361O29832j291937M87287Q05461Q54482J071110j115991
4070E6097249j275715Q44110J788451K534643o1783r0961j063459P62037J919882
$$ y = [51859861, 49086862, 48915349, 50658329, 49946946, 48247085, 49345841, 49904132, 50684302, 49698417, 48429179, 46233934, 46455546, 48065368, 48483625, 48455810, 49071690, 48758139, 49096083, 47600293, 47500355, 48620977, 50967440, 50751016, 49558061, 49514146, 49406907, 48629805, 48184231, 49464809, 49791088, 49282177, 49286214, 48989597, 49322993, 48932395, 50102578, 50610571, 50677257, 48698714, 50497138, 53706713, 50669340, 49396660, 51764121, 52682751, 51699543, 52413367, 50608237, 51037779, 51232580, 51423338, 52860759, 52801005, 52059813, 53001644, 54657005, 55286837, 53994900, 54482187, 55287648, 56142130, 57213240, 56097249, 54821534, 55665644, 57454095, 59988738, 59926955, 59835994, 58772535, 59534572, 61454454]
4061F1454454R78752K256812J718849p50532j776130J404976Q71816r76115K504126
4052F7687008L623878j153633j29498K115726J615170J306482o3694J126239J875479
4043G8003157o64363K0135K980054R16072l27909j32353j03456l88587K443587
4034H2746337J035284m97264p60740J613488Q78712J06328j783679J835676p22181
4025H4451961J79467q57425j964845k312118j383948j286780k018038j254109
4017G3554165p92138r20925j086087j768703j906558j56428j147775j879806j912783
4008F1982962q27020R2972o94903j426059R1405j109373o84940j879147k908483
3999E2637414l98622p61406l235707j427406J187578n55986j082707Q77343P04042
$$ y = [61454454, 62433206, 64690018, 66408867, 65658335, 63882205, 65287181, 66158997, 65182882, 67687008, 71310886, 70157253, 70027755, 72143481, 73758651, 75065133, 75001439, 76127678, 78003157, 77338794, 77358929, 80338983, 81255055, 80927146, 80794793, 80691337, 80302750, 82746337, 83781621, 83284357, 82523617, 84137105, 85015817, 85122145, 83338466, 85174142, 84451961, 84631428, 83774003, 81809158, 79497040, 78113092, 76826312, 74808274, 73554165, 72762027, 71841102, 70755015, 68986312, 67079754, 66923326, 65775551, 63895745, 61982962, 61155942, 61248914, 60554011, 59127952, 59219357, 58109984, 57425044, 55545897, 52637414, 52238792, 51477386, 48241679, 46814273, 48001851, 47445865, 46363158, 47240501, 47944543]
3990D7944543k329552L0092m896j209940o93354r93721l8307P32685j450862j103860
3980D0882828N78372o62045j258402R59177K60929Q29913J500908k988969J621848
3971D1724559q47882j760398M59551K3025K138280k77054M97299j39043k340955
3962C9477382O54446n70941j859931j681328K076314J111884K204934q17767M70593
3953D1065586K71923J79255j819518j362711k13081K43799q63396K195403j593071
3944C8104189j421620J542046O44527j126944l17972K806421m47268J072471K65614
3935D1121464Q57169K03050o77295R94933m78461J064089r45769L63495L309872
3926D5812547M8763j371313J469815k97546r54869n1686p80994j66774m76769
$$ y = [47944543, 45614991, 45645083, 45640187, 44430247, 43736893, 42743172, 42704865, 43437550, 41986688, 40882828, 41461200, 40799155, 39540753, 40499930, 40760859, 41590772, 43091680, 40102711, 41724559, 40876677, 39116279, 39575830, 39598855, 41737135, 41460081, 41957380, 41818337, 39477382, 40131828, 39560887, 37700956, 36019628, 38095942, 39207826, 41412760, 40594993, 41065586, 41337509, 41516764, 39697246, 38334535, 38121454, 38365253, 37501857, 39697260, 38104189, 36682569, 38224615, 38869142, 37742198, 37424226, 40230647, 39783379, 40855850, 41121464, 41978633, 42181683, 41504388, 42499321, 42020860, 43084949, 42139180, 42502675, 45812547, 45861310, 44489997, 45959812, 45662266, 44707397, 44655711, 43874717, 43707943, 43231174]
3917D3231174R267o0065K350968k71775k500290j106108J277979j842405q2980
3908D1005765K747946j160888Q64876L1752K141836p798k990363J61636n9378
3899D2735384J711283l564548j433194N35312J402304Q52677r22218J98743j196794
3890D0318949p5711j05445l416883K824679K271437n26196o73574O44486Q40117
3881D2101859K7172j712269q15859l41653O28478O12603k654170J61425o2311
3872C7945275R47497j7237o82795k04381L27400j662785k589242o45469J048193
3863C4466456L188413J489472p69237j0284J72476k53975P18703Q25295q00136
3854C9027183o74290R09754o30359J329802P87791l024344J898812J289013N70906
$$ y = [43231174, 43240441, 43180376, 45531344, 45259569, 42759279, 41653171, 42931150, 41088745, 41005765, 43753711, 42592823, 43457699, 43489451, 45631287, 45623489, 42633126, 42794762, 42735384, 44446667, 40882119, 39448925, 39984237, 41386541, 42239218, 41317000, 41515743, 40318949, 40243238, 40137793, 36720910, 39545589, 41817026, 41290830, 40617256, 41261742, 42101859, 42129031, 40416762, 39600903, 39259250, 39887728, 40500331, 37846161, 38007586, 37945275, 38892772, 38875535, 38192740, 37988359, 38315759, 36652974, 34063732, 33418263, 34466456, 37654869, 39144341, 38375104, 38364820, 38537296, 38283321, 39002024, 39827319, 39027183, 38352893, 39262647, 38632288, 39962090, 40749881, 37725537, 39624349, 40913362, 41484268]
3845D1484268J59991q3213J7864n57143J678370j47040j662641j56495J352988
3836D2086949p52510j539345J760085Q57043J527894J056257j90688r99745K934689
3827D6740629j092686O38268o94640p51261k33621L97490K39915j229517J075403
3818D5089980l47773M23180J61095J397440j185766J22971P99362J706962j081993
3809D7085458L08818K422365q54925l179434L78732J136186J491071q22204o75020
3800D7291047N45413L189373k022848l744124K465484J499077J95165J642140
3792E1060727M56107R85197k16254o72156J937581J111390L1080J184856j561191
3783E4317337j91779j720462L04457L91325R34046J789039J458162J085050Q14592
$$ y = [41484268, 41644259, 41561046, 41578910, 41021767, 42700137, 42553097, 40890456, 40733961, 42086949, 41334439, 39795094, 41555179, 42412222, 43940116, 44996373, 44805685, 43805940, 46740629, 45647943, 46286211, 45591571, 44840310, 44606689, 45004179, 45244094, 44014577, 45089980, 44742207, 45165387, 45326482, 46723922, 45538156, 45661127, 46460489, 48167451, 47085458, 47394276, 49816641, 48961716, 45782282, 46161014, 47297200, 48788271, 47966067, 47291047, 47836460, 51025833, 49002985, 45258861, 47724345, 49223422, 49418587, 51060727, 51516834, 52502031, 52285777, 51613621, 53551202, 54662592, 54693672, 55878528, 54317337, 54125558, 52405096, 52709553, 53100878, 54034924, 55823963, 57282125, 58367175, 59181767]
3774E9181767M10053j17672K401937q13863j361721N76627K217585j249394j449299
3765E9796020Q02166j236437Q77038J02975m3381J084052j417117O10927n78349
3756E9997894q41275R523J576069K72933j160229K738614k150777j066277M34910
3747E9811385j281774J752744l79189r11086j856909j656125M429P33994j179566
3738E5037903m60419q7903l4230j063448l34473p37260k717036o63460J257138
3729E0196812l21915k613943M54085j708815r89827J944626r81514k639507q28977
3720D2511025O19929l80226J32880l915506J061113P18564j409445j527012m65312
3711C7346010k246399J10626o23150k345774P88382l6906l234806J76287J798956
$$ y = [59181767, 59591820, 59474148, 61876085, 61062222, 59700501, 60277128, 62494713, 61245319, 59796020, 60598186, 59361749, 60238787, 60341762, 60298381, 61382433, 59965316, 60576243, 59997894, 59156619, 59166142, 60742211, 61015144, 59854915, 62593529, 60442752, 59376475, 59811385, 58529611, 60282355, 59903166, 58992080, 57135171, 55479046, 55483475, 56217469, 55037903, 54577484, 54489581, 54455351, 53391903, 53057430, 52320170, 49603134, 48939674, 50196812, 49874897, 47260954, 47715039, 46006224, 45016397, 46961023, 45979509, 43340002, 42511025, 43130954, 42750728, 42883608, 38968102, 40029215, 40747779, 39338334, 37811322, 37346010, 35099611, 35210237, 34587087, 32241313, 33029695, 32992789, 29757983, 29934270, 31733226]
3702C1733226K36799o93183k62059q83362k295975j522547J518152M49727O15731
3693B8896509j76626k059748M55522o15201j581504M37355Q71323k431301L0996
3684B3827325J561673O3005J09533l47996l00020j84157j251185m13132K72262
3675B3337308j08832N93907m34478j452130j323349Q22692M95358M54023j054347
3666B1330152k394491J88122J229680J077634k20382J72480p98211j115866j90214
3657A9278904J169373n17601k010766j295241N18543O57192k42696j198311J650100
3648A8009497r87598N7259j32037L59495k008209L9428K764228j441010k652103
3639A4008950J959882L7835r06581j6428k94142K29403j085819N4475J740740
$$ y = [31733226, 31970025, 31276842, 31014783, 30131421, 27835446, 26312899, 27831051, 28280778, 28896509, 28719883, 26660135, 27115657, 26500456, 24918952, 25356307, 26227630, 23796329, 23827325, 25388998, 25452003, 25561536, 25213540, 24913520, 24729363, 23478178, 23065046, 23337308, 23228476, 23822383, 23387905, 21935775, 20612426, 21435118, 21930476, 22384499, 21330152, 18935661, 19123783, 20353463, 21431097, 21210715, 21383195, 20584984, 19469118, 19278904, 20448277, 19930676, 17919910, 16624669, 17143212, 17800404, 17557708, 16359397, 18009497, 17021899, 17079158, 16947121, 17306616, 15298407, 15337835, 18102063, 16661053, 14008950, 15968832, 16006667, 15100086, 15083658, 14789516, 15018919, 13933100, 13987575, 15728315]
3630A5728315n55630j753997N20430k25012o81874j237690J201194K74559m88652
3621A2781643j02756J472648J60400M20449O60418n75845j713292n42913q2089
3612A2478663k97824L75627Q18551j286007o69434q81700O16989J531380j274254
3603A1411991j380908J148339J571844Q0139j526328J435611O13743j060929J606441
3594A3899943J01276L87300j772583p50732K702271j315108K14831j145249q95531
3585A1426418J75058j505134J361360j375045P13917L31736J172760J047578k00190
3576A3148458j534318N57534J521129k159806J06053J663415j58393k267956J896107
3567A2772223J751275p50743J323846k351737j546262M42599L008131j437066
$$ y = [15728315, 15172685, 13418688, 13939118, 13714106, 13032232, 11794542, 12995736, 13270295, 12781643, 12678887, 14151535, 14311935, 14732384, 15392802, 14816957, 13103665, 12560752, 12478663, 12180839, 12556466, 13375017, 12089010, 11419576, 10537876, 11154865, 12686245, 11411991, 10031083, 11179422, 12751266, 12831405, 11305077, 12740688, 13354431, 12293502, 13899943, 14001219, 14388519, 12615936, 11865204, 14567475, 13252367, 13467198, 12321949, 11426418, 11601476, 10096342, 11457702, 10082657, 10796574, 11128310, 12301070, 13348648, 13148458, 11614140, 12171674, 13692803, 11532997, 11639050, 13302465, 13144072, 10876116, 12772223, 14523498, 13772755, 15096601, 12744864, 11198602, 11641201, 14649332, 13212266]
3559A3212266j808807O65390n83150O54950L81337K32708r98293j918034J014333
3550A0852700m51352J004498J354686o23891n40442m02783j880863l39856J484959
3541A0457656M21818k0670K629263k364861j269527q08626n56224J416217K24627
3532A0129673j373746J077714K036470j279054M9542M59490q56051J392505j213292
3523A0423251k07212J583134k45090j472093M87987R99860L72990q68246k124442
3514H950139j11866L18319J755618o5284Q06825j141720L40433j696626k51478
3505H904360l56663k70913r6670J051126j72550k04504K071653K883843j165779
3496A2643903j027601o49840K715892j649053o96390p58509K730445K17859k033072
$$ y = [13212266, 11403459, 12068849, 11485699, 12140649, 12521986, 12754694, 11756401, 9838367, 10852700, 10401348, 11405846, 12760532, 12136641, 11596199, 11193416, 9312553, 8972697, 10457656, 10879474, 10858804, 13488067, 11123206, 9853679, 9045053, 8488829, 9905046, 10129673, 8755927, 9833641, 11870111, 10591057, 10640599, 11100089, 10244038, 11636543, 10423251, 10216039, 11799173, 11554083, 10081990, 10569977, 11569837, 11942827, 11074581, 8950139, 8838273, 9156592, 10912210, 10846926, 11653751, 10512031, 10852464, 9155838, 8904360, 8547697, 8276784, 8180114, 9231240, 9058690, 8854186, 10925839, 13809682, 12643903, 11616302, 10966462, 13682354, 12033301, 11336911, 10578402, 13308847, 13526706, 11493634]
3487A1493634j908228p02799N44766N32955j062158J62862J488360Q3685k4240
3478A0608837P16343J34950k887039k6353J381516J653076J497243j400898j501986
3469A0175689l27920N77719o59848J541541p21750k696774K236642L74005j560260
3460H939044q75892K086437J909438k443413P57403L82364J637826L10924k787717
3451I916414O62764n20179J788961j250124M26425j415920J354458O27448P01653
3442A2291900j451433q83531k199181L72780J734444O70898P37954J30082L47136
3433A1751049j619049p19644j288256J48885K073296q11591j098305P86624J386272
3424A0609281O27643k467861L62657J248508K195214K42207L78698j288519O53393
$$ y = [11493634, 9585406, 8882607, 9427373, 9960328, 8898170, 9061032, 10549392, 10633077, 10608837, 11325180, 11460130, 8573091, 8546738, 9928254, 11581330, 13078573, 11677675, 10175689, 9847769, 10425488, 9765640, 11307181, 10585431, 7888657, 10125299, 10499304, 8939044, 8063152, 10149589, 12059027, 9615614, 10373017, 10755381, 12393207, 12704131, 9916414, 10579178, 10058999, 11847960, 10597836, 11024261, 9608341, 10962799, 11590247, 12291900, 10840467, 9956936, 7757755, 8130535, 9864979, 10535877, 11273831, 11403913, 11751049, 10132000, 9412356, 8124100, 8272985, 10346281, 9534690, 8436385, 9223009, 10609281, 11236924, 8769063, 9131720, 10380228, 12575442, 12817649, 13196347, 11907828, 12561221]
3415A2561221k139419j474452P37455J952028O78584O17832J08450j393802J998310
3406A3646207k865207K15177n37062j55855J689696J433607j677268j292916Q06686
3397A1263065Q81690k78072Q83356m35106m73956j540648J349972N46905N3635
3388A2250841m70017r87624j18218J286015p19847p78540K044962j813024N99059
3379A1293607R09922j327040m4873j38981j73377l73734o06330J223815J819591
3370A2582600P89820J303383j689264k205677m98229j473346J177890P1920p69157
3361I289940J107093K393312p91520j371312m8916j188921J549182j24619n86892
3352A0227347j241715M33179K135770J975913m08232j504811j76826M5003k85620
$$ y = [12561221, 10421802, 8947350, 9684805, 11636833, 12315417, 12933249, 13041699, 11647897, 13646207, 10781000, 10996177, 10459115, 10303260, 11992956, 13426563, 11749295, 10456379, 11263065, 12144755, 11866683, 12750039, 12314933, 11840977, 10300329, 11650301, 12197206, 12250841, 11780824, 10793200, 10674982, 11960997, 11241150, 10462610, 12507572, 10694548, 11293607, 12203529, 10876489, 10831616, 10692635, 10519258, 10145524, 9539194, 10763009, 12582600, 13372420, 14675803, 12986539, 10780862, 10282633, 8809287, 9987177, 10059097, 9289940, 10397033, 12790345, 11998825, 10627513, 10578597, 9389676, 10938858, 10814239, 10227347, 8985632, 9418811, 11554581, 13530494, 13122262, 11617451, 11440625, 11485628, 11200008]
3343A1200008k53870P75758j676496q54878n19097J220683j155212l49685J30824
3334H518035R90477J238499j099338p63374Q52675M04905p7230l06661j430183
3325H327805J639290O40404n87806O99807L68002j53193k2337k4414q55087q77563
3315I154908p82814N04138n99162m73254P39376Q50712L19865R53149O83207o93317
3305A0656808j274549J676855Q26696j207754Q78758j524259j160033M66648k849647
3296F489523J701519j18142J71103M26633j128217J078313Q46084l68025n72794
3287H525997K76865r18753K010097k1456j255408k58608N20098j59538j35062
3278H584232l34174K687473j730438p84827L164486R85237j077416k406226J951927
$$ y = [11200008, 10946138, 11721896, 10045400, 9190522, 8671425, 9892108, 8736896, 8387211, 8518035, 9508512, 10747011, 9647673, 8884299, 9736974, 10141879, 10064649, 9757988, 8327805, 9967095, 10607499, 10019693, 10719500, 11087502, 10934309, 10911972, 10887558, 10032471, 9154908, 8372094, 8876232, 8277070, 7803816, 8543192, 9393904, 9713769, 10666918, 11350125, 10656808, 9382259, 11059114, 11885810, 10678056, 11556814, 10032555, 8872522, 9339170, 6489523, 8191042, 8072900, 8244003, 8670636, 7542419, 8620732, 9466816, 9098791, 8525997, 8802862, 7884109, 9894206, 9872750, 8617342, 8358734, 8878832, 8719294, 8584232, 8250058, 10937531, 9207093, 8422266, 11586752, 12571989, 11494573, 9088347, 11040274]
3269A1040274K65869j986077q52286J856275q30795L16038k41166l10321N0389
3260I308200L53566j042549K63730l199913M99845K648200J829910j717535o40227
3251H303227J584326J22826J15789J8988K663649k538578k510138K152949J291201
3242A1204239k488881j658416J447465L20631j151579L95146J001288q9893P60310
3233I740310j31N86162j461651j78814K021864n18479R059j671250J248876j083648
3223H692298N72776M00224P23592k60803m21153j285205K211551K293144k400719
3214A0525705p84845p47002o19244J741969Q61091J190940l6279m60994j319564
3205A0351777m98529j17533J706879Q1178m69802O88077K29503j269191k042042
$$ y = [11040274, 11306143, 9320066, 8467780, 10324055, 9493260, 9809298, 9568132, 9257811, 9308200, 9661766, 8619217, 8882947, 5683034, 6182879, 8831079, 10660989, 8943454, 8303227, 9887553, 10010379, 10126168, 10145156, 12808805, 10270227, 7760089, 9913038, 11204239, 8715358, 7056942, 8504407, 8825038, 7673459, 8068605, 9069893, 8980000, 9740310, 9740179, 10326341, 8864690, 8685876, 10707740, 10189261, 10198320, 8527070, 9775946, 8692298, 9265074, 9665298, 10388890, 10128087, 9706934, 8421729, 10633280, 12926424, 10525705, 9740860, 8993858, 8374614, 10116583, 10977674, 12168614, 12132335, 11671341, 10351777, 9853248, 9735715, 11442594, 11523772, 11053970, 11742047, 11971550, 10702359, 8660317]
3196H660317J578376J892137r83572P17290N52770q99804J478206k53366j423026
3187A1319328p97359O12119Q1266j558690Q04967K843030O82438p37542m59032
3178A2790525j560380j31415K2554j13732J773581o4756j800708N97249m62l47087
3168A1165369p27679M63581O23499L45936J861292o32489j822189j752826L93181
3159I917675R67217M30959K871684r93571j806263J572421k113993O01759l92068
3150A1055820k538770j187290J278767R59493j523679j620421K309834N16898
3142I250652K286815O56256p96156r15651J876334L90422j056462j430843O95635
3133A0957002J620384q7680k339426j978385P58877j216842J463711l23260L62818
$$ y = [8660317, 10238693, 12130830, 11147258, 11864548, 12417318, 11517514, 12995720, 12742354, 11319328, 10521969, 11134088, 11215354, 9656664, 10461631, 13304661, 13987099, 13249557, 12790525, 11230145, 11098730, 11121284, 11007552, 12781133, 12716377, 10915669, 11512918, 11512456, 11165369, 10437690, 10901271, 11524770, 11870706, 13731998, 13099509, 11277320, 9524494, 9917675, 10884892, 11315851, 14187535, 13193964, 11387701, 12960122, 10846129, 11447888, 11055820, 8517050, 7329760, 8608527, 9568020, 8044341, 6423920, 8733754, 9250652, 11537467, 12193723, 11397567, 10481916, 12358250, 12748672, 11692210, 10261367, 10957002, 12577386, 12489706, 10150280, 8171895, 8930772, 7713930, 9177641, 8854381, 9217199]
3124I217199L25543J912707j624748k878287q99359l86416M96344J019192L90021
3115G572196o62248P7668K12129Q02960l20813n76641Q656n82052K102083P77940
3105I411878j031069j107118j39278o59641k85728q97844J059798J410159Q86301
3096H647458n13008k540265m49351K876843k20668j825888J384693K9603k99713
3087G089704j562413J8944n95046n20937J695606K137479N62998j034985m46470
3078G344880P56421Q74920k157528J003405M90118j87432j082363J2734Q37454
3069G892609j045905M61898L94679p1411m74746j832159j21K685180N5422L512
3059H068958j639384n20855J137898J150510j749623Q27804J17057J283294j461468
$$ y = [9217199, 9542742, 11455449, 9830701, 6952414, 6053055, 5666639, 6162983, 7182175, 7572196, 6909948, 6987616, 7199745, 8002705, 7681892, 7105251, 7113907, 6531855, 8633938, 9411878, 8380809, 7273691, 7134413, 6474772, 6189044, 5291200, 6350998, 7761157, 8647458, 8134450, 5594185, 5144834, 8021677, 7801009, 5975121, 7359814, 7389417, 7089704, 5527291, 5546235, 4951189, 4430252, 6125858, 8263337, 8826335, 7791350, 7344880, 8101301, 8976221, 6818693, 7822098, 8312216, 8124784, 7042421, 7055155, 7892609, 6846704, 7308602, 7703281, 7631870, 7157124, 5324965, 5324844, 8010024, 8065446, 8068958, 6429574, 5908719, 7046617, 8197127, 6447504, 7275308, 7392365, 8675659, 7214191]
3050G214191p30800Q46148K277791K11006j041528R2101n76000k23532k192195
3041E877182k82531J794876j150189q84445J901230P44750j831745j64802m48845
3032E555481N72296j089273P2722L603879k01222j061009l638846P69252J775715
3023F358995K96223j84278j988611J02706K382770J667081j62364k241214j195464
3014E035844M88824J731058j970532p31661Q16427J694486q99446L58237J178886
3005G702123j791634N45515p77375j064742N56833n95881L365721O13303k527446
2996F026417j900539n76913L184938j152943j028585P61575J69889r02660j202348
2987C378831K12479J155120M1584K01114R148Q20349Q90043j00291j140098j17554
$$ y = [7214191, 6483391, 7329539, 9607330, 9818336, 8776808, 8868909, 8292909, 8069377, 5877182, 5594651, 7389527, 6239338, 5354893, 7256123, 8000873, 6169128, 6004326, 5555481, 6127777, 5038504, 5111226, 8715105, 8513883, 7452874, 3814028, 4583280, 6358995, 6655218, 6470940, 4482329, 4585035, 6967805, 8634886, 8472522, 6231308, 5035844, 5524668, 7255726, 5285194, 4553533, 5369960, 7064446, 6165000, 6523237, 7702123, 5910489, 6456004, 5678629, 4613887, 5170720, 4574839, 7940560, 8553863, 6026417, 4125878, 3548965, 6733903, 5580960, 4552375, 5313950, 5483839, 4581179, 3378831, 3591310, 4746430, 4788014, 4989128, 4998276, 5818625, 6708668, 6608377, 5468279, 5350725]
2977E350725J98055L44520r40210k35013J784963j962884K1639Q62736l74885
2968E049646R52137J37442r04166j857192J328926J547688j299662P89864J70367
2959E915050o2727J311061P4995j406571j278076k057322M28398N68042n5311
2950C437539J8662k94600R2425K172748K00437r66719q69693J082042r99488j385775
2940B487578P62049j813969j293366L788003J274912j718964O12728J470429J75552
2931E744952O66319p77055j943765J617210n13824j369562P5077P23858l79568
2922C843642r00858J16661J82654J061384P23769j342647k07862L15103j61234
2913C630612N35285Q02715O48208k339061O07554R47829J238630k70270O08226
$$ y = [5350725, 5548780, 5893300, 4953090, 4718077, 6503040, 4540156, 4561795, 5424531, 5049646, 6001783, 6139225, 5235059, 3377867, 4706793, 6254481, 4954819, 5744683, 5915050, 5852323, 7163384, 7238379, 5831808, 4553732, 2496410, 2924808, 3492850, 3437539, 3456201, 3161601, 3254026, 5426774, 5627211, 4660492, 3790799, 4872841, 3873353, 2487578, 3249627, 1435658, 142292, 3930295, 5205207, 3486243, 4098971, 5569400, 5744952, 6411271, 5634216, 3690451, 5307661, 4793837, 3424275, 3499352, 4223210, 3843642, 2942784, 3059445, 3242099, 4303483, 5027252, 3684605, 3476743, 3791846, 3630612, 4165897, 4968612, 5616820, 3277759, 3885313, 4833142, 6071772, 5801502, 6409728]
$$ [...]
##END NTUPLES=NMR SPECTRUM
##END=
