##TITLE=1H_EC-3362(II-2)
 200.13MHz, CDCl3,
 8 sc
 
 3.10.2025
##JCAMPDX= 6.0         $$ Bruker NMR JCAMP-DX V2.0
##DATA TYPE= NMR SPECTRUM
##DATA CLASS= NTUPLES
##ORIGIN= UXNMR, Bruker Analytische Messtechnik GmbH
##OWNER= pz
$$ XWIN-NMR		Version 3.5
$$ Fri Oct  3 13:49:07 2025 Russian Standard Time (UT+4h)  she@DPX200
##.OBSERVE FREQUENCY= 200.1313
##.OBSERVE NUCLEUS= ^1H
##.ACQUISITION MODE= SIMULTANEOUS
##.ACQUISITION SCHEME= undefined
##.AVERAGES= 8
##.DIGITISER RES= 18
##SPECTROMETER/DATA SYSTEM= spect
##.PULSE SEQUENCE= zg30
##.SOLVENT NAME= CDCl3
##.SHIFT REFERENCE= (INTERNAL, CDCl3, 0, 15.5078)
##AUDIT TRAIL= $$ (NUMBER, WHEN, WHO, WHERE, WHAT)
$$ ##TITLE= Audit trail, XWIN-NMR		Version 3.5
$$ ##JCAMPDX= 5.01
$$ ##ORIGIN= Bruker BioSpin GmbH
$$ ##OWNER= she
$$ F:/spectra/data/she/nmr/H-C/1/pdata/1/auditp.txt
$$ ##AUDIT TRAIL=  $$ (NUMBER, WHEN, WHO, WHERE, WHAT)
(   1,<2025-10-03 13:47:57.17 +0400>,<she>,<DPX200>,
      <created by zg, POWCHK disabled, PULCHK disabled
       configuration hash MD5:
       00 E9 B6 7A A2 85 ED C7 34 08 36 98 17 FE 4E 26
       data hash MD5: 16K
       13 45 6F A5 7D 80 EA AD 15 6E 86 59 A2 88 E5 A4>)
(   2,<2025-10-03 13:47:59.71 +0400>,<she>,<DPX200>,
      <Start of raw data processing
       efp BC_mod = 2 LB = 0.25 FT_mod = 6 PKNL = 1 PHC0 = -2272.893 PHC1 = 10.39224 SI = 16K 
       data hash MD5: 16K
       64 78 AA 57 63 31 D4 92 15 CA 0E 9F 9D 51 62 A7>)
(   3,<2025-10-03 13:48:17.09 +0400>,<she>,<DPX200>,
      <pk PHC0 = -1.144681 PHC1 = 3.129244e-07 
       data hash MD5: 16K
       F0 ED C4 F7 80 6E 06 C4 88 CE 3E 9D 89 66 63 85>)
(   4,<2025-10-03 13:48:20.56 +0400>,<she>,<DPX200>,
      <abs ABSG = 5 
       data hash MD5: 16K
       2F 7E F2 1D 1F F1 93 2C 55 98 78 D8 36 4D 2A C2>)
$$ ##END=
$$ 
$$ hash MD5
$$ F2 AE 41 B4 4C C0 F8 AB 7B 27 94 C8 53 1D 0A FE
##$RELAX= 
##$RELAX= 
##$RELAX= 
##$RELAX= 
##$RELAX= 
##$RELAX= 
$$ Bruker specific parameters
$$ --------------------------
##$DU= <F:/spectra>
##$EXPNO= 1
##$NAME= <H-C>
##$PROCNO= 1
##$TYPE= <nmr>
##$USER= <she>
##$AMP= (0..31)
100 100 100 100 100 100 100 100 100 100 100 100 100 100 100 100 100 100 
100 100 100 100 100 100 100 100 100 100 100 100 100 100 
##$AQSEQ= 0
##$AQ_mod= 1
##$AUNM= <au_zg>
##$AUTOPOS= <>
##$BF1= 200.13
##$BF2= 200.13
##$BF3= 200.13
##$BF4= 200.13
##$BF5= 200.13
##$BF6= 200.13
##$BF7= 200.13
##$BF8= 200.13
##$BYTORDA= 1
##$CFDGTYP= 0
##$CFRGTYP= 5
##$CHEMSTR= <none>
##$CNST= (0..31)
1 1 145 1 1 1 1 1 1 1 1 1 1 1 1 1 1 1 1 1 1 1 1 1 1 1 1 1 1 1 1 1 
##$CPDPRG= <>
##$CPDPRG1= <>
##$CPDPRG2= <>
##$CPDPRG3= <>
##$CPDPRG4= <mlev>
##$CPDPRG5= <mlev>
##$CPDPRG6= <mlev>
##$CPDPRG7= <mlev>
##$CPDPRG8= <mlev>
##$CPDPRGB= <>
##$CPDPRGT= <>
##$D= (0..31)
0 0.7 0 0 0 0 0 0 0 0 0 0.03 0 0 0 0 0 0 0 0 0 0 0 0 0 0 0 0 0 0 0 0 
##$DATE= 1759484876
##$DBL= (0..7)
120 120 120 120 120 120 120 120 
##$DBP= (0..7)
150 150 150 150 150 150 150 150 
##$DBP07= 0
##$DBPNAM0= <>
##$DBPNAM1= <>
##$DBPNAM2= <>
##$DBPNAM3= <>
$$ [...]
##$SUBNAM3= <"">
##$SUBNAM4= <"">
##$SUBNAM5= <"">
##$SUBNAM6= <"">
##$SUBNAM7= <"">
##$SUBNAM8= <"">
##$SUBNAM9= <"">
##$SW= 18.0517328524113
##$SWIBOX= (0..15)
0 0 2 0 0 0 0 0 0 0 0 0 0 0 0 0 
##$SW_h= 3612.71676300578
##$TD= 16384
##$TD0= 1
##$TE= 0
##$TE2= 300
##$TE3= 300
##$TEG= 300
##$TL= (0..7)
0 120 120 120 120 120 120 120 
##$TP= (0..7)
150 150 150 150 150 150 150 150 
##$TP07= 0
##$TPNAME0= <>
##$TPNAME1= <>
##$TPNAME2= <>
##$TPNAME3= <>
##$TPNAME4= <>
##$TPNAME5= <>
##$TPNAME6= <>
##$TPNAME7= <>
##$TPOAL= (0..7)
0.5 0.5 0.5 0.5 0.5 0.5 0.5 0.5 
##$TPOFFS= (0..7)
0 0 0 0 0 0 0 0 
##$TUNHIN= 0
##$TUNHOUT= 0
##$TUNXOUT= 0
##$USERA1= <user>
##$USERA2= <user>
##$USERA3= <user>
##$USERA4= <user>
##$USERA5= <user>
##$V9= 5
##$VALIST= <valist>
##$VCLIST= <CCCCCCCCCCCCCCC>
##$VD= 0
##$VDLIST= <DDDDDDDDDDDDDDD>
##$VPLIST= <PPPPPPPPPPPPPPP>
##$VTLIST= <TTTTTTTTTTTTTTT>
##$WBST= 1024
##$WBSW= 4
##$XGAIN= (0..3)
0 0 0 0 
##$XL= 0
##$YL= 0
##$YMAX_a= 848214
##$YMIN_a= -978199
##$ZGOPTNS= <>
##$ZL1= 120
##$ZL2= 120
##$ZL3= 120
##$ZL4= 120
##$ABSF1= 15.48797
##$ABSF2= -2.563879
##$ABSG= 5
##$ABSL= 3
##$ALPHA= 0
##$AQORDER= 0
##$ASSFAC= 0
##$ASSFACI= 0
##$ASSFACX= 0
##$ASSWID= 0
##$AUNMP= <proc_1d>
##$AZFE= 0.1
##$AZFW= 0.1
##$BCFW= 0
##$BC_mod= 2
##$BYTORDP= 0
##$COROFFS= 0
##$CY= -3
##$DATMOD= 1
##$DC= 0
##$DFILT= <>
##$DTYPP= 0
##$F1P= 0
##$F2P= 0
##$FCOR= 1
##$FTSIZE= 16384
##$FT_mod= 6
##$GAMMA= 0
##$GB= 0
##$INTBC= 1
##$INTSCL= 3.241238e-09
##$ISEN= 128
##$LB= 0.25
##$LEV0= 0
##$LPBIN= 0
##$MAXI= 10000
##$MC2= 0
##$MEAN= 0
##$ME_mod= 0
##$MI= 1.114404
##$NCOEF= 0
##$NC_proc= -6
##$NLEV= 6
##$NOISF1= 3.799351
##$NOISF2= 2.8
##$NSP= 0
##$NTH_PI= 0
##$NZP= 0
##$OFFSET= 15.5078
##$PC= 1
##$PHC0= -2274.038
##$PHC1= 10.39224
##$PH_mod= 1
##$PKNL= yes
##$PPARMOD= 0
##$PSCAL= 0
##$PSIGN= 0
##$REVERSE= no
##$SF= 200.130002782656
##$SI= 16384
##$SIGF1= 3
##$SIGF2= 2
##$SINO= 0.751879
##$SIOLD= 32768
##$SREGLST= <19F.Aceton>
##$SSB= 0
##$STSI= 16384
##$STSR= 0
##$SW_p= 3612.71676300578
##$SYMM= 0
##$S_DEV= 0
##$TDeff= 16384
##$TDoff= 0
##$TI= <>
##$TILT= no
##$TM1= 0
##$TM2= 0
##$TOPLEV= 0
##$USERP1= <user>
##$USERP2= <user>
##$USERP3= <user>
##$USERP4= <user>
##$USERP5= <user>
##$WDW= 1
##$XDIM= 16384
##$YMAX_p= 471333463
##$YMIN_p= -405929
$$ End of Bruker specific parameters
$$ ---------------------------------
##NTUPLES= NMR SPECTRUM
##VAR_NAME=  FREQUENCY,     SPECTRUM/REAL,   SPECTRUM/IMAG
##SYMBOL=    X,             R,               I
##VAR_TYPE=  INDEPENDENT,   DEPENDENT,       DEPENDENT
##VAR_FORM=  AFFN,          ASDF,            ASDF
##VAR_DIM=   16384,         16384,           16384
##UNITS=     HZ,            ARBITRARY UNITS, ARBITRARY UNITS
##FACTOR=    0.220516191357247, 1,           1
##FIRST=     3103.57607761294, 0,            0
##LAST=      -509.14068539284, 0,            0
##MIN=       -509.14068539284, -405929,      0
##MAX=       3103.57607761294, 471333463,    0
$$ Real data points
##PAGE= N=1
##DATA TABLE= (X++(R..R)), XYDATA
$$ [...]
6514B305389j82484J55240P1976j52428m0247j1957o0930j32999j72028J20655
$$ 2305389 2122905 2278145 2350121 2197693 2157446 2145489 2084559 1951560 1779532 1900187
6504A900187P9689l8290k7944M2325L5650R8802k8304N3337p5370l6734r2334
$$ 1900187 1979876 1941586 1913642 1955967 1991617 2090419 2062115 2115452 2040082 2003348 1911014
6493A911014l0470j885J66047Q5260J51560K25513J19844J53987R6633J45970
$$ 1911014 1880544 1878659 2044706 2129966 2281526 2507039 2626883 2780870 2877503 3023473
6483C023473J05817l8365r4840n3050j17295j04179n9688p9450l5399K6438j14409
$$ 3023473 3129290 3090925 2996085 2943035 2825740 2721561 2661873 2582423 2547024 2573462 2459053
6472B459053n6902q3446j24986L6811k7801j13894J6836n7058j10126K2362r5746
$$ 2459053 2402151 2318705 2193719 2230530 2202729 2088835 2105671 2048613 1938487 1960849 1865103
6461A865103K9581l4470p8535q3243P7407P0121o0541P2933J2168l6465q6683
$$ 1865103 1894684 1860214 1781679 1698436 1775843 1845964 1785423 1858356 1870524 1834059 1747376
6450A747376J523O5525j24564j2959J45647J09672N1228L7633o6005p6098R9822
$$ 1747376 1748899 1814424 1689860 1676901 1822548 1932220 1983448 2021081 1955076 1878978 1978800
6439A978800j10002N833j39918j06573j0989j23482l1920j11546P8327j668j90941
$$ 1978800 1868798 1874631 1734713 1628140 1617151 1493669 1461749 1350203 1428530 1426862 1235921
6428A235921j09420K5730O7946m1663j09405M7287N1144M6945j24450j7908q3997
$$ 1235921 1126501 1152231 1220177 1178514 1069109 1116396 1167540 1214485 1090035 1072127 988130
6417I88130j14584k0687o4795P7859p9893K4265K7738l4689n3502j17945k5591
$$ 988130 873546 852859 788064 865923 786030 810295 838033 803344 749842 631897 606306
6406F06306J7555Q374J6571j53750P2610O0593N5545j4011M3758N0006M7769n0863
$$ 606306 623861 632235 648806 495056 567666 628259 683804 669793 713551 763557 811326 760463
6394G60463q9600j40090N9603M5898k8299q328j64426O4449l9202M5733J51185
$$ 760463 670863 530773 590376 636274 607975 599647 435221 499670 460468 506201 657386
6383F57386k0815K3096Q1m4163j19795R8294J2074p2467Q8320O3969j4522J4586
$$ 657386 636571 659667 659748 615585 495790 594084 606158 533691 622011 685980 671458 686044
6371F86044r9525r0622J30904J30756L4401O7162r8661J3588K3070l4857J00169
$$ 686044 586519 495897 626801 757557 791958 859120 760459 774047 797117 762260 862429
6360H62429q647o1678J729R3930j85211p3498J23944K4424O5511Q7133k6475r2337
$$ 862429 853782 792104 793833 887763 702552 629054 752998 777422 842933 930066 903591 811254
6348H11254n8290p7562K4459L8809K2091j777J3566j1219q0201J01917j17923
$$ 811254 752964 675402 699861 738670 760761 758984 772550 761331 681130 783047 665124
6337F65124M277J50446l0367J1360M6601j9107j5682J03537M6361k2913k9777
$$ 665124 669401 819847 789480 800840 847441 828334 812652 916189 962550 939637 909860
6326I09860j30540R8137j0465j50701n5530J63952J14271k5542k0544j22640p7039
$$ 909860 779320 877457 866992 716291 660761 824713 938984 913442 892898 770258 693219
6315F93219K9013l4253J05094K18212n5792n8493Q444N8732o0790j45215k3348
$$ 693219 722232 687979 793073 1011285 955493 897000 905444 964176 903386 758171 734823
6304G34823Q3725r1526q1642J21771P3795L2495K03215p263j05180p8426n4364
$$ 734823 818548 727022 645380 767151 840946 873441 1076656 1069393 964213 885787 831423
6293H31423J90397m2434o4594M1835M6459l7335q5075p6557k9079j19216J53352
$$ 831423 1021820 979386 914792 956627 1003086 965751 880676 804119 775040 655824 809176
6282H09176Q7583P170k5278m5016M9504M0378r1828J5763l4561K2984J45205N5563
$$ 809176 896759 903929 878651 833635 883139 923517 831689 847452 812891 835875 981080 1036643
6270A036643N2871j35458j20803L423N5452N7119L6529J1263n9099N4604J66068
$$ 1036643 1089514 954056 833253 836676 892128 949247 985776 997039 937940 992544 1158612
6259A158612Q802Q1073k7924K0357L7412P706J14791n4428j3481J42752M7860
$$ 1158612 1167414 1248487 1220563 1240920 1278332 1286038 1400829 1346401 1332920 1475672 1523532
6248A523532j29281m5321J37357L2932J2644Q7868K630J10119R469j00935N459
$$ 1523532 1394251 1348930 1486287 1519219 1531863 1619731 1622361 1732480 1741949 1641014 1646473
6237A646473N3445j9611m6160j8268m2607M4232J42689K9374Q3380R535k9295
$$ 1646473 1699918 1680307 1634147 1615879 1573272 1617504 1760193 1789567 1872947 1882482 1853187
6226A853187J94018k5168j63319j35252L793j917j34676O012N3345N264m6033
$$ 1853187 2047205 2022037 1858718 1723466 1727259 1725342 1590666 1596678 1650023 1655287 1609254
6215A609254n9355J0083N6563N6937m1369P6310P929k1845J16038L5338o3174
$$ 1609254 1549899 1559982 1616545 1673482 1632113 1708423 1716352 1694507 1810545 1845883 1782709
6204A782709j968J9681L2861j1456k0207k1955J85860J13210L9985l6152M843
$$ 1782709 1780741 1800422 1833283 1821827 1801620 1779665 1965525 2078735 2118720 2082568 2087411
6193B087411K4328J18877K1247J0376N5507n7692p323J56006P4667p801J10700
$$ 2087411 2111739 2230616 2251863 2262239 2317746 2260054 2252731 2408737 2483404 2475603 2586303
6182B586303J23510K5731J28590J9343L0252K66854j3287R3276M4124k4199J42020
$$ 2586303 2709813 2735544 2864134 2883477 2913729 3180583 3167296 3260572 3304696 3280497 3422517
6171C422517J07866k4675Q181K2312O7056L0585p5734J26710M0467p0922J99393
$$ 3422517 3530383 3505708 3513889 3536201 3603257 3633842 3558108 3684818 3725285 3654363 3853756
6160C853756R2959n471K04009j1159k38932m2899J02904L6366R348J56303k968
$$ 3853756 3946715 3941244 4145253 4134094 3895162 3852263 3955167 3991533 4000881 4157184 4154216
6149D154216l4212j2615L6400J15258k0185n5131N1777r240O4854R0342j0331
$$ 4154216 4120004 4107389 4143789 4259047 4238862 4183731 4235508 4226268 4291122 4381464 4371133
6138D371133j1132J0141J6853J6517L531M6209m5512N1226J1991r0306o1713K4508
$$ 4371133 4360001 4370142 4386995 4403512 4407043 4453252 4407740 4458966 4470957 4380651 4318938 4343446
6126D343446j17082n7092O1856n3815K9144o1720m2827K3863J727l3336j9169
$$ 4343446 4226364 4169272 4231128 4177313 4206457 4144737 4101910 4125773 4127500 4094164 4074995
6115D074995k2691k6677j53162J05513J75645L1949L7764N5683Q658J61155Q8577
$$ 4074995 4052304 4025627 3872465 3977978 4153623 4185572 4223336 4279019 4287677 4448832 4537409
6104D537409L5171J11911J47557K7237N9525N9176K15462n297N6518O6309N1015
$$ 4537409 4572580 4684491 4832048 4859285 4918810 4977986 5193448 5188151 5244669 5310978 5361993
6093E361993J92006k5402J07930J34569K47503J90575K34154K24186P1448K21693
$$ 5361993 5553999 5528597 5636527 5771096 6018599 6209174 6443328 6667514 6738962 6960655
6083F960655K57805K91319M17185L50721K98378M55034M68110N38764M84892N34025
$$ 6960655 7218460 7509779 7926964 8277685 8576063 9031097 9499207 10037971 10522863 11056888
6073A1056888N76082P18349Q02362N23989O81607P06790O87398R09718R40274
$$ 11056888 11632970 12351319 13153681 13677670 14359277 15066067 15753465 16663183 17603457
6064A7603457R48287J005287J002579J383231J470166J662987J951641J979263
$$ 17603457 18551744 19557031 20559610 21942841 23413007 25075994 27027635 29006898
6056B9006898J811691J596774J203376P28026K68104K2241k24796k77770n37930
$$ 29006898 30818589 32415363 33618739 34346765 34614869 34637110 34412314 34134544 33596614
6047C3596614n98814l38972k54526j26241j21805J29105L60685L62931M75053
$$ 33596614 32997800 32658828 32404302 32278061 32156256 32285361 32646046 33008977 33484030
6038C3484030O76459O08950P48892R00812J072525J037860J265734J539280J656645
$$ 33484030 34160489 34769439 35518331 36419143 37491668 38529528 39795262 41334542 42991187
6029D2991187K118623K412138K847044L009966L203550K963857K420636J524555
$$ 42991187 45109810 47521948 50368992 53378958 56582508 59546365 61967001 63491556
6021F3491556M06090n95943j475986k048760k420600k572324k336422k136195
$$ 63491556 63897646 63301703 61825717 59776957 57356357 54784033 52447611 50311416
6013E0311416j873359j813466j554055j302343j050397r29475q71390o39257m61635
$$ 50311416 48438057 46624591 45070536 43768193 42717796 41788321 40916931 40277674 39816039
6004C9816039m89369o63536n71316l15633l27213k24207J21270J76878M28619
$$ 39816039 39326670 38663134 38091818 37776185 37448972 37224765 37346035 37522913 37951532
5995C7951532P05693Q17229R54074Q68722N13806N943l49272r58211j331276j559874
$$ 37951532 38657225 39474454 40428528 41297250 41811056 41816999 41467727 40509516 39178240 37618366
5985C7618366j756997j708961j608853j542997j357649j388609j354926j204837
$$ 37618366 35861369 34152408 32543555 31000558 29642909 28254300 26899374 25694537
5977B5694537r76060q43595j117084j078071q14455p95426q00294p45636q99365
$$ 25694537 24718477 23874882 22757798 21679727 20865272 20069846 19269552 18523916 17624551
5968A7624551o68123n34704o08198o10044n47017n05055l64286k32897l06642
$$ 17624551 16956428 16421724 15813526 15203482 14656465 14151410 13787124 13554227 13247585
5959A3247585l66138k26494k39775k40151p1790k9164k17901r8907l95j68497
$$ 13247585 12881447 12654953 12415178 12175027 12103237 12074073 11856172 11757265 11756870 11588373
5949A1588373k9838Q0482j11801r6484k28784k69658l02705k53013l45950j87580
$$ 11588373 11558535 11639017 11527216 11430732 11201948 10932290 10629585 10376572 10030622 9843042
5939I843042k42755k62723j64772j02100k86674j95335p1604j34028j43218O3910
$$ 9843042 9600287 9337564 9172792 9070692 8784018 8588683 8517079 8383051 8239833 8303743
5929H303743l4463p5293k8462j39547k87592j04516p0484j43324k07533n1510
$$ 8303743 8269280 8193987 8165525 8025978 7738386 7633870 7563386 7420062 7212529 7161019
5919G161019j23180j51766j264Q9986n2035j42130j3328j22347m9279K7462M08
$$ 7161019 7037839 6886073 6884809 6974795 6922760 6780630 6767302 6644955 6595676 6623138 6623546
5908F623546j3385j29433O9543L1055j6226J41383q2233j1839M215R3636Q465
$$ 6623546 6610161 6480728 6550271 6581326 6565100 6706483 6624250 6612411 6616626 6710262 6718727
5897F718727p7741j9026k8122k6844J7123p4458l763j01367j76289j31559j58143
$$ 6718727 6640986 6621960 6593838 6566994 6584117 6509659 6505896 6404529 6228240 6096681 5938538
5886E938538R3271j61155p8129K8621j26732J6868p3858j20868k13067J42396
$$ 5938538 6031809 5870654 5792525 5821146 5694414 5711282 5637424 5516556 5303489 5445885
5876E445885J6659O8675J28102k36347r1177q5869q9182n6485J2219j30016R2391
$$ 5445885 5462544 5531219 5659321 5422974 5331797 5245928 5156746 5100261 5112480 4982464 5074855
5865E074855j4204l5044j5997K105J15351j25385q4289k0363P1951k5828p5256
$$ 5074855 5060651 5025607 5009610 5011715 5127066 5001681 4917392 4897029 4968980 4943152 4867896
5854D867896j28413K4193O9053l5354k9863J01378M8158j17564j65273P4052k41508
$$ 4867896 4739483 4763676 4832729 4797375 4767512 4868890 4917048 4799484 4634211 4708263 4466755
5843D466755r0048p493j12428j45949j7652J7492k39437n2987p658L9524J01866
$$ 4466755 4376707 4369214 4256786 4110837 4093185 4110677 3871240 3818253 3810595 3850119 3951985
5832C951985k14670K7583N1146o8338n437j46300j34429r2509k7473j23288J13167
$$ 3951985 3737315 3764898 3816044 3747706 3742269 3595969 3461540 3369031 3341558 3218270 3331437
5821C331437O1931j73072l7146r225O8477j21239q730R504J34300p1155m0084
$$ 3331437 3393368 3220296 3183150 3173925 3242402 3121163 3112433 3121937 3256237 3185082 3144998
5810C144998r0244q9864R6231L617j06456J6024p365o1763N7718L8773O5756M6649
$$ 3144998 3054754 2964890 3061121 3064738 2958282 2974306 2966941 2905178 2962896 3001669 3067425 3114074
5798C114074j20135j58644J02805J9760o8613k4229l7792J46785j6545q9898M3836
$$ 3114074 2993939 2835295 2938100 2957860 2889247 2865018 2827226 2974011 2957466 2867568 2911404
5787B911404k5186r214r1243o3948J71558L1452j3884K370k3693p7652M6112R4750
$$ 2911404 2886218 2877004 2785761 2721813 2893371 2924823 2910939 2913309 2889616 2811964 2858076 2952826
5775B952826o9598K3859P6685m0317l979J36278J4266Q3721O6362J4846m802O6624
$$ 2952826 2883228 2907087 2983772 2943455 2939476 3075754 3090020 3173741 3240103 3254949 3250147 3316771
5763C316771k6046j2438K119M4806J73550L0305k2386q7921M0790J5359Q8742
$$ 3316771 3290725 3278287 3280406 3325212 3498762 3529067 3506681 3418760 3459550 3474909 3563651
5752C563651J5536j06192P5678K4757O883J30856L5202N2131N2635k2587R3913
$$ 3563651 3579187 3472995 3548673 3573430 3580313 3711169 3746371 3798502 3851137 3828550 3922463
5741C922463q7835n5351m5440j8669J4015J20613r4395j12246J19446Q1855o1509
$$ 3922463 3834628 3779277 3733837 3715168 3729183 3849796 3755401 3643155 3762601 3844456 3782947
5730C782947L440M3257J06734M677K4826J31266J87270L6324L5287p449Q502K2368
$$ 3782947 3786387 3829644 3936378 3941055 3965881 4097147 4284417 4320741 4356028 4348579 4357081 4379449
5718D379449J33056K0360K25500K06056J57357J12616J46447K85697L36457K14083
$$ 4379449 4512505 4532865 4758365 4964421 5121778 5234394 5380841 5666538 6002995 6217078
5708F217078j2477J68041Q0838j94045k46502k11508p3275k6717p9810m9499k6016
$$ 6217078 6204601 6372642 6453480 6259435 6012933 5801425 5728150 5701433 5621623 5572124 5546108
5697E546108o77p5771j54809j1121r3715j22968j38135J39411J23446J4583K741
$$ 5546108 5545431 5469660 5314851 5303730 5210015 5087047 4948912 5088323 5211769 5226352 5229093
5686E229093r4718j824J12837J68882K63017m583Q4846K01114K60809K39501N5482
$$ 5229093 5134375 5132551 5245388 5414270 5677287 5672704 5757550 5958664 6219473 6458974 6514456
5675F514456J56697M7465n0374P206q9728R8748J5098p4154p6601m0562J85722
$$ 6514456 6671153 6718618 6668244 6675450 6585722 6684470 6699568 6625414 6548813 6508251 6693973
5664F693973J07669p1598l1201P1305J39102J10716N9765J06258K01025P0400
$$ 6693973 6801642 6730044 6698843 6770148 6909250 7019966 7079731 7185989 7387014 7457414
5654G457414J97699J31901J65538K81687L47795K74967L83777M26095M03439N41072
$$ 7457414 7655113 7787014 7952552 8234239 8582034 8857001 9240778 9666873 10070312 10611384
5644A0611384K06734J71401j31163M997M7707L3403J21156L66678J90084K11651
$$ 10611384 10818118 10989519 10858356 10863353 10911060 10944463 11065619 11432297 11622381 11834032
5634A1834032L59872K73612L70054M57175N40478O32588O88341Q19616P09709
$$ 11834032 12193904 12467516 12837570 13294745 13835223 14467811 15156152 15975768 16685477
5625A6685477O97637Q52031J095009J039804J269989J461923J477635J553690
$$ 16685477 17383114 18235145 19330154 20369958 21639947 23101870 24579505 26133195
5617B6133195J807638J916189K163585K473288K498095K330338K661749K805825
$$ 26133195 27940833 29857022 32020607 34493895 36991990 39322328 41984077 44789902
5609D4789902L105800L292379L799935M205729M542432M809677N030000N154680
$$ 44789902 47895702 51188081 54988016 59193745 63736177 68545854 73575854 78730534
5601G8730534N324544N327430M930765M534996L768341K740184J571786N10579
$$ 78730534 84055078 89382508 94313273 98848269 102616610 105356794 106928580 107439159
5593A07439159m67031j347184j946545k382895k712665l047642l325101l411051
$$ 107439159 106972128 105624944 103678399 101295504 98582839 95535197 92210096 88799045
5585H8799045l437903l330152l138981k752391k642697k753145k534970k625255
$$ 88799045 85361142 82030990 78892009 76139618 73496921 70743776 68208806 65583551
5577F5583551k447760k420067k405711k378691k376521k445357k283601k363224
$$ 65583551 63135791 60715724 58310013 55931322 53554801 51109444 48825843 46462619
5569D6462619k163053k064144k022674j759159j770942j745929j446907j534028
$$ 46462619 44299566 42235422 40212748 38453589 36682647 34936718 33489811 31955783
5561C1955783j340468j291778j230906j209739j156843j014049j060062j103766
$$ 31955783 30615315 29323537 28092631 26882892 25726049 24712000 23651938 22548172
5553B2548172r32090q13114q09030p28921o83563o49775n76662o90446o03378
$$ 22548172 21616082 20802968 19993938 19265017 18581454 17931679 17355017 16664571 16061193
5544A6061193l89403l70532l73883n38865n16883l90916m07084l82792m32781
$$ 16061193 15671790 15301258 14927375 14388510 13871627 13480711 13073627 12690835 12258054
5535A2258054j63944l09386l99906k27249l95523k67241j42624j51910k58749
$$ 12258054 12094110 11784724 11384818 11157569 10762046 10494805 10352181 10200271 9941522
5526I941522k76369k29468j50009k02685j28720k29787j78953k37984j71461k8591
$$ 9941522 9665153 9435685 9285676 9082991 8954271 8724484 8545531 8307547 8136086 8107495
5516H107495j24092k55359o5830j26609o8237j93851j15485k4076o4194j31352
$$ 8107495 7983403 7728044 7662214 7535605 7467368 7273517 7158032 7133956 7069762 6938410
5506F938410o6794r1320M7373q6204k5501j26393N8010j51081r8132n4210N5869
$$ 6938410 6871616 6780296 6827669 6741465 6715964 6589571 6647581 6496500 6398368 6344158 6400027
5495F400027r9266J13472j35874p2162q370j09575m9483O9995J8930m1968p1235
$$ 6400027 6300761 6414233 6278359 6206197 6197827 6088252 6038769 6108764 6127694 6085726 6014491
5484F014491L0705O2854Q7668J40628O6033q1349K1797M0750J51549O008K5580
$$ 6014491 6045196 6108050 6195718 6336346 6402379 6321030 6342827 6383577 6535126 6541134 6566714
5473F566714P0688J30231J04878R9040o6653J78568J89524J73094N9780J63418
$$ 6566714 6637402 6767633 6872511 6971551 6904898 7083466 7272990 7446084 7505864 7669282
5463G669282J51037J65294R3539J23622L7194J97763N6736J53058P7777J67184
$$ 7669282 7820319 7985613 8079152 8202774 8239968 8437731 8494467 8647525 8725302 8892486
5453H892486k9702J87959P2565J24433K49535L11821J22131J38540L92767M41726
$$ 8892486 8862784 9050743 9123308 9247741 9497276 9809097 9931228 10069768 10462535 10904261
5443A0904261K47689L50048L47892M42086L17565L54554L20619N13138M16554
$$ 10904261 11151950 11501998 11849890 12291976 12609541 12964095 13284714 13797852 14214406
5434A4214406O24840O12706N93052N51382R34384Q89110J071941J065952J267283
$$ 14214406 14839246 15451952 16045004 16596386 17530770 18419880 19491821 20557773 21825056
5425B1825056J408482J483401J371549J251348J567339J669528J950549K120996
$$ 21825056 23233538 24716939 26088488 27339836 28907175 30576703 32527252 34648248
5417C4648248K428181K758435L115316L152325L708928L997755M581284N206581
$$ 34648248 37076429 39834864 42950180 46102505 49811433 53809188 58390472 63597053
5409F3597053N736315O303273P253707P656861Q210389Q490851R322195R244408
$$ 63597053 69333368 75636641 82890348 90547209 98757598 107248449 116570644 125815052
5401A25815052J0728797J2353661J4950411J8078966K4421457L1979338M3386578
$$ 125815052 136543849 148897510 163847921 181926887 206348344 238327682 281714260
5394B81714260N1752468N4865261J6133003l650333m398886j7323806l9922868
$$ 281714260 333466728 388331989 404464992 400814659 396415773 379091967 339169099
5387C39169099m3137112k8117217k1318098j4783755j7882437j7927597j4837463
$$ 339169099 296031987 267914770 246596672 231812917 213930480 196002883 181165420
5380A81165420r850316o007348n898411r193540q565577p574492n480190n865625
$$ 181165420 171315104 165307756 159409345 150215805 141650228 134075736 128595546 122729921
5372A22729921p186014r424484q341524q690951p364951o755529n846166n119770
$$ 122729921 115543907 106119423 97777899 89086948 81721997 74966468 69120302 64000532
5364F4000532m204350l947910l217421l339115k684977k606252k145053k166879
$$ 64000532 59796182 55848272 52630851 49291736 46606759 44000507 41855454 39688575
5356C9688575j743541j741394j537011j503698j243009j295446j036635j319407
$$ 39688575 37945034 36203640 34666629 33162931 31919922 30624476 29587841 28268434
5348B8268434j188411j207810q61303r59175q34113r76599p46486o55162p17421
$$ 28268434 27080023 25872213 25010910 24051735 23217622 22241023 21494537 20839375 20121954
5339B0121954o83738o48845o68063o85922n90109m68639o15908l74367o41199
$$ 20121954 19438216 18789371 18121308 17435386 16845277 16376638 15760730 15386363 14745164
5330A4745164n01571m46746n70508m92659m23309l42781l51459k53514k69243
$$ 14745164 14243593 13796847 13226339 12733680 12310371 11967590 11616131 11362617 11093374
5321A1093374j80125l55824m64171j08398l10466r7855j07021j17959k35406l09417
$$ 11093374 10913249 10557425 10093254 9984856 9674390 9576535 9469514 9351555 9116149 8806732
5311H806732k84321k02572j49744j04466k52645k10121K0887p8589p8926j65132
$$ 8806732 8522411 8319839 8170095 8065629 7812984 7602863 7623750 7545161 7466235 7301103
5301G301103j69261j56289j11938p372J4901Q051O6845k33386k30697j79922m6163
$$ 7301103 7131842 6975553 6863615 6856243 6871144 6879195 6946040 6712654 6481957 6302035 6255872
5290F255872p9423P0746j42306j08667j02475j92095m5931j05926j08024K5316
$$ 6255872 6176449 6247195 6104889 5996222 5893747 5701652 5655721 5549795 5441771 5467087
5280E467087j38162k5985n0309q0929j10067L2047j10225l2935R1751q971k8438
$$ 5467087 5328925 5302940 5252631 5171702 5061635 5093682 4983457 4950522 5042273 5033302 5004864
5269E004864J12925j32386K4434r2230m0543j06973j5455j08712J06520j5154
$$ 5004864 5117789 4985403 5009837 4917607 4877064 4770091 4754636 4645924 4752444 4737290
5259D737290m4983q4579l7448o8590q8688j3671M7743m6471P6042M0995j2781
$$ 4737290 4692307 4607728 4570280 4501690 4413002 4399331 4447074 4400603 4476645 4517640 4504859
5248D504859j26813p4359M2939r6475j33138K5024n3211J39439j43502q4R3943
$$ 4504859 4378046 4303687 4346626 4250151 4117013 4142037 4088826 4228265 4084763 4084679 4178622
5237D178622J9103n2652j5480q7883J23902r6552k6752J54493J72940n0801r5122
$$ 4178622 4197725 4145073 4129593 4041710 4165612 4069060 4042308 4196801 4369741 4318940 4223818
5226D223818n5897j9703J3831j8712L0410Q5939J1474k6083J19755k7489L1881
$$ 4223818 4167921 4148218 4162049 4143337 4173747 4259686 4271160 4245077 4364832 4337343 4369224
5215D369224J45040K0474J00140N4542N7527M9060q0467m1239r4963m3461K7451
$$ 4369224 4514264 4534738 4634878 4689420 4746947 4796007 4715540 4674301 4579338 4535877 4563328
5204D563328K7791o4505j24810O8784M5722j11838j52446J7779R0646r2482l3844
$$ 4563328 4591119 4526614 4401804 4470588 4516310 4404472 4252026 4269805 4360451 4267969 4234125
5193D234125k06460j28789J27541j32541q0499J44546j02773M941R4236J871r4491
$$ 4234125 4027665 3898876 4026417 3893876 3813377 3957923 3855150 3860091 3954327 3956198 3861707
5182C861707j7716J8984R875M2317n122M2062J05970J0826K9868m3331r683Q8136
$$ 3861707 3843991 3862975 3872850 3915167 3910045 3952107 4058077 4068903 4098771 4055440 4045757 4133893
5170D133893O8429J18060M5689j16551o4234K04349N3611j86373n8222j17213
$$ 4133893 4202322 4320382 4366071 4249520 4185286 4389635 4443246 4256873 4198651 4081438
5160D081438m8140q1106n0378J25022o9126O5075K3353R934j5528M5231m9812
$$ 4081438 4033298 3952192 3901814 4026836 3957710 4022785 4046138 4056072 4040544 4085775 4035963
5149D035963K4145Q4750K4899J2664o9736k0635o9775J13608N5408N9245o5910
$$ 4035963 4060108 4144858 4169757 4182421 4112685 4092050 4022275 4135883 4191291 4250536 4184626
5138D184626J34318J3176j2220q8968Q7633q4425R4264J22262N6234K1492J58054
$$ 4184626 4318944 4332120 4319900 4230932 4318565 4234140 4328404 4450666 4506900 4528392 4686446
5127D686446p9003Q5267J84204n4191k0659m1724J07600Q8841Q3082J4713n818
$$ 4686446 4607443 4692710 4876914 4822723 4802064 4760340 4867940 4956781 5039863 5054576 5048758
5116E048758n9515l7704J46017K2621p1890j14310J59656m6931Q423m8247K55506
$$ 5048758 4989243 4951539 5097556 5120177 5048287 4933977 5093633 5046702 5055125 5006878 5262384
5105E262384J45381j47307p627J2219P7181J42883m3987q9210J56625M391Q2097
$$ 5262384 5407765 5260458 5252831 5265050 5342231 5485114 5441127 5351917 5508542 5512933 5595030
5094E595030J69447P2812O9494N1088O5911j0690J0367l8806j0420Q7165M1483
$$ 5595030 5764477 5837289 5906783 5957871 6023782 6013092 6023459 5984653 5974233 6061398 6102881
5083F102881J79080K8950R8904K03239J15171K9510P8723K56756K12386K49632
$$ 6102881 6281961 6310911 6409815 6613054 6728225 6757735 6836458 7093214 7305600 7555232
5073G555232K26002L34606K34489j09924j7310j04451l24119k92650q2259k2255
$$ 7555232 7781234 8115840 8350329 8240405 8223095 8118644 7794525 7501875 7419616 7397361
5063G397361J8225k3205j19339j60721n4669l2641N9899p0416J12672l9358r4675
$$ 7397361 7415586 7392381 7273042 7112321 7057652 7025011 7084910 7014494 7127166 7087808 6993133
5052F993133N3309j14729M5078O9475Q604j42121k4870j5655M4700m2022q4529
$$ 6993133 7046442 6931713 6976791 7046266 7054870 6912749 6887879 6872224 6916924 6874902 6790373
5041F790373L5850O2767k1943l2938r0733k2552J04603P272o2341j5626J47831
$$ 6790373 6826223 6888990 6867047 6834109 6743376 6720824 6825427 6832699 6770358 6754732 6902563
5030F902563j1187j6558k1007J08819M6170J47559J14712R0207Q8781l1849O7876
$$ 6902563 6891376 6874818 6853811 6962630 7008800 7156359 7271071 7361278 7450059 7418210 7486086
5019G486086J66047J00258J02039K60038R1905N0083K09367J25352K64279R3476
$$ 7486086 7652133 7752391 7854430 8114468 8206373 8256456 8465823 8591175 8855454 8948930
5009H948930J97595J84862K59643J56328K76364L26674K20509K81919L99142K51227
$$ 8948930 9146525 9331387 9591030 9747358 10023722 10350396 10570905 10852824 11251966 11503193
4999A1503193K55607L15953M16421M27001M85682N19539M48847L59028L62623
$$ 11503193 11758800 12074753 12491174 12918175 13403857 13923396 14372243 14731271 15093894
4990A5093894M26581O02945O33273O66961O92221P84265O44155Q35772Q78836
$$ 15093894 15520475 16123420 16756693 17423654 18115875 18900140 19544295 20380067 21258903
4981B1258903P79621Q90054J111603J191246J326781J417916J189595J504998
$$ 21258903 22038524 22928578 24040181 25231427 26558208 27976124 29165719 30670717
4973C0670717J588935J638278J976560K106868K322801K695361K658414K801350
$$ 30670717 32259652 33897930 35874490 37981358 40304159 42999520 45657934 48459284
4965D8459284K760793K218325J663861J263510P84639M10177M4499n1978n614
$$ 48459284 51220077 53438402 55102263 56365773 57150412 57560589 57605088 57553110 57547496
4956E7547496O9340K75569M14576N50655P90337R78479J206996J404075J665047
$$ 57547496 57616836 57892405 58306981 58857636 59647973 60626452 61833448 63237523 64902570
4947F4902570J814326K108711K327012K545227K788231K918706L314950L637687
$$ 64902570 66716896 68825607 71152619 73697846 76486077 79404783 82719733 86357420
4939H6357420M010830M593915M951822N547636N904501O033644N528429M697549
$$ 86357420 90368250 94962165 99913987 105461623 111366124 117399768 122928197 127625746
4931A27625746L620292K244877J116361K95717j88407o0074Q8877L49056O18715
$$ 127625746 131246038 133490915 134607276 134902993 134714586 134654512 134743389 135092445 135711160
4922A35711160P98541J247539J600805J740903J810848J890969J844788J582970
$$ 135711160 136509701 137757240 139358045 141098948 142909796 144800765 146645553 148228523
4914A48228523J429760J545098J431145J266305J422186J371755J266213J006827
$$ 148228523 149658283 151203381 152634526 153900831 155323017 156694772 157960985 158967812
4906A58967812P80144L41292k36694p89058j344696j989936k800842l228627l632247
$$ 158967812 159747956 160089248 159852554 159063496 157718800 155728864 152928022 149699395 146067148
4897A46067148l589448l537390l315684k854644k371161k077496j771815k055010
$$ 146067148 142477700 138940310 135624626 132769982 130398821 128321325 126549510 124494500
4889A24494500k475055l145221l732256m145762m471586m243225m208199m015793
$$ 124494500 122019445 118874224 115141968 110996206 106524620 102281395 98073196 94057403
4881I4057403l757780l268121l124507k930699k718063k431145k134246j831936
$$ 94057403 90299623 87031502 83906995 80976296 78258233 75827088 73692842 71860906
4873G1860906j809969j727808j448680j263523j054161j041693r99863j051284
$$ 71860906 70050937 68323129 66874449 65610926 64556765 63515072 62515209 61463925
4865F1463925j086610j007305r56594r19944j086068r09238q41402q86960q55506
$$ 61463925 60377315 59370010 58413416 57493472 56407404 55498166 54656764 53769804 52914298
4856E2914298p57267o38468o92178n67796o83272p85415p53738r12056q08187
$$ 52914298 52157031 51518563 50826385 50258589 49575317 48789902 48036164 47124108 46315921
4847D6315921o10533p01933n44133n00888k79152l1826O7155k05532o60593q65124
$$ 46315921 45705388 45003455 44459322 43958434 43679282 43647456 43714611 43509079 42848486 41983362
4837D1983362j050321j015567j202778j152459j042943j069362j075915q49083
$$ 41983362 40933041 39917474 38714696 37562237 36519294 35449932 34374017 33524934
4829C3524934r19509r39375r02621q14610p82501p24116o92825p36648o22382
$$ 33524934 32605425 31666050 30763429 29948819 29166318 28442202 27749377 27012729 26390347
4820B6390347n38796o99003o24743o06494o30903n17844n75379l80037m11847
$$ 26390347 25851551 25152548 24527805 23921311 23290408 22772564 22197185 21817148 21405301
4811B1405301m28135l55990m36567l94030l46556k25379k92198l65791l49623
$$ 21405301 20977166 20621176 20184609 19790579 19444023 19218644 18926446 18560655 18211032
4802A8211032k92428k73761k17511j48795r5263j91152k49069k93309k56764j98056
$$ 18211032 17918604 17644843 17427332 17278537 17183274 16992122 16743053 16449744 16192980 15994924
4792A5994924l3556m7048j45943j07291q8107k584j10674p3076j79732L3296k5268
$$ 15994924 15961368 15914320 15768377 15661086 15572979 15570395 15459721 15386645 15206913 15240209 15214941
4781A5214941j05086J3208L6290r7440O8193r7561J5827N9672J0779M7988j01896
$$ 15214941 15109855 15123063 15159353 15061913 15130106 15032545 15048372 15108044 15118823 15166811 15064915
4770A5064915Q856J3818O4256J9197j5164P1470K6177l5043n3615M1612n6669
$$ 15064915 15073771 15087589 15151845 15171042 15155878 15227348 15253525 15218482 15164867 15206479 15149810
4759A5149810P9368O1872K7854L8122L0884q4710l8224M8970J29386n1607N7461
$$ 15149810 15229178 15291050 15318904 15357026 15387910 15303200 15264976 15313946 15443332 15391725 15449186
4748A5449186K8393K6744J21655P8436J04293j074R5613N0922Q5815R9612p1385
$$ 15449186 15477579 15504323 15625978 15704414 15808707 15807633 15903246 15954168 16039983 16139595 16068210
4737A6068210J46681K3734K1204Q8052M2802J20656Q7658M0444J11583J22040
$$ 16068210 16214891 16238625 16259829 16347881 16390683 16511339 16598997 16639441 16751024 16873064
4727A6873064k28135O4166O142o1543R9750l7942J2548M0535r3556j4753J27443
$$ 16873064 16644929 16709095 16715237 16653694 16753444 16715502 16728050 16768585 16675029 16660276 16787719
4716A6787719R7694O7320J27417J39612R0033L7818J33018J61408K512R5292K64984
$$ 16787719 16885413 16952733 17080150 17219762 17309795 17347613 17480631 17642039 17644551 17739843 18004827
4705A8004827M9145k963J46311K84419K4439M6279K13803J93559N9918J77733
$$ 18004827 18053972 18051009 18197320 18481739 18506178 18552457 18766260 18959819 19019737 19197470
4695A9197470L19125J93728J32428O0017J36421p327P179J7287L9903P3811J53546
$$ 19197470 19516595 19710323 19842751 19902768 20039189 20031862 20039041 20056328 20096231 20170042 20323588
4684B0323588K0302J20829R3673J51158J23619K22204L44028L58297K47488K50310
$$ 20323588 20343890 20464719 20558392 20709550 20833169 21055373 21399401 21757698 22005186 22255496
4674B2255496J61414L43707L78726K60535L11298M08329M19209L19331N61222
$$ 22255496 22416910 22760617 23139343 23399878 23711176 24119505 24538714 24858045 25419267
4665B5419267L06182M88120M70177N55591P05806N70334O89322Q05243P28542
$$ 25419267 25725449 26213569 26683746 27239337 27945143 28515477 29204799 30010042 30738584
4656C0738584R36957J033676J028548J114428J155330J137339J211569J547866
$$ 30738584 31675541 32709217 33737765 34852193 36007523 37144862 38356431 39904297
4648C9904297J697189J836909K241147K032763K473828K762066K977770L396919
$$ 39904297 41601486 43438395 45679542 47712305 50186133 52948199 55925969 59322888
4640E9322888L732430L854142M331554M690110M818277N286419N567001O255705
$$ 59322888 63055318 66909460 71241014 75931124 80749401 86035820 91602821 97858526
4632I7858526P119697P941583R500288J1222358J3164789J5095852J5729149J4202129
$$ 97858526 104978223 112919806 122420094 133642452 146807241 161903093 177632242 191834371
4624A91834371R849385M740829L74110l726895p333204r272611r029395p976470
$$ 191834371 201683756 206424585 206798695 203071800 195738596 186465985 177436590 169460120
4616A69460120o666042o085615n727702m967117l857226l291948l208750l550572
$$ 169460120 162794078 156708463 150980761 146013644 142156418 138864470 135655720 132105148
4608A32105148m034901m221180m315941m503972m935369n071379m884303m597830
$$ 132105148 128070247 123849067 119533126 115029154 110093785 105022406 100138103 95540273
4600I5540273m436751l973207l669670l328663k761338k524893k521297k206919
$$ 95540273 91103522 87130315 83460645 80131982 77370644 74845751 72324454 70117535
4592G0117535j858066j686211j682294j430631j399216j294496j204098j016568
$$ 70117535 68259469 66573258 64890964 63460333 62061117 60766621 59562523 58545955
4584E8545955r20344q23071p00696q07733n20137l35956k04660j57328j98061
$$ 58545955 57625611 56802540 56101844 55294111 54773974 54438018 54233358 54076030 53877969
4575E3877969k30549j23953n1476l4951J0064K41322J00824K04114L12696K10377
$$ 53877969 53647420 53523467 53471991 53437040 53447104 53688426 53789250 53993364 54306060 54516437
4565E4516437M08702N07807M12025M99532M99399N18019O47512P64249R30307
$$ 54516437 54925139 55432946 55844971 56344503 56843902 57361921 58009433 58773682 59703989
4556E9703989R29027R74349J053461R82362J065608J213560J257830J332161J336645
$$ 59703989 60633016 61607365 62660826 63643188 64708796 65922356 67180186 68512347 69848992
4547F9848992J427060J756253J660832J571751J738142J742320J972029J777512
$$ 69848992 71276052 73032305 74693137 76264888 78003030 79745350 81717379 83494891
4539H3494891K002903K008539K018501K089458K262546K315459K399906K372072
$$ 83494891 85497794 87506333 89524834 91614292 93876838 96192297 98592203 100964275
4531A00964275K427266K513335K732218K786152K658086K816477K787239K648938
$$ 100964275 103391541 105904876 108637094 111423246 114081332 116897809 119685048 122333986
4523A22333986K555717K465200K311993K097251K062165J885548J952946J795907
$$ 122333986 124889703 127354903 129666896 131764147 133826312 135711860 137664806 139460713
4515A39460713J467997J417617J256405J006988J082261Q67451O46246M94430
$$ 139460713 140928710 142346327 143602732 144609720 145691981 146559432 147205678 147700108
4507A47700108L75220L40060K17842P7412Q213k54633m34091o22934q42926j212245
$$ 147700108 148075328 148415388 148633230 148710642 148718855 148464222 148030131 147407197 146564271 145352026
4497A45352026j404642j511046j733135j941037k096075k054081k216849k276511
$$ 145352026 143947384 142436338 140703203 138762166 136666091 134612010 132395161 130118650
4489A30118650k251020k540099k416236k303052k342686k285165k407794k138233
$$ 130118650 127867630 125327531 122911295 120608243 118265557 115980392 113572598 111434365
4481A11434365k144475k075439k049332j992300j857317j932271j886788k081488
$$ 111434365 109289890 107214451 105165119 103172819 101315502 99383231 97496443 95414955
4473I5414955k058942j953266k085256k135410k106268k158325k161593k055708
$$ 95414955 93356013 91402747 89317491 87182081 85075813 82917488 80755895 78700187
4465G8700187j974013j936216j758656j907278j685292j649420j724358j631112
$$ 78700187 76726174 74789958 73031302 71124024 69438732 67789312 66064954 64433842
4457F4433842j428762j426163j469745j478146j515170j411790j301431j075664
$$ 64433842 63005080 61578917 60109172 58631026 57115856 55704066 54402635 53326971
4449E3326971j272883j177410j076168j094359j169008q31724r26731r96852r53570
$$ 53326971 52054088 50876678 49800510 48706151 47537143 46705419 45778688 44781836 43828266
4440D3828266q71059r11976p82207p57350p69763o33288p30126p64967q27875
$$ 43828266 42957207 42045231 41263024 40505674 39735911 39102623 38372497 37607530 36779655
4431C6779655o51476n92172o62538n36931o58997n08112o74043n39764m08417
$$ 36779655 36128179 35536007 34873469 34336538 33677541 33169429 32495386 31955622 31547205
4422C1547205l44172m35362n25384m48828l88766m31189l78654l57043m56143
$$ 31547205 31203033 30767671 30242287 29793459 29404693 28973504 28594850 28237807 27781664
4413B7781664n42445l09112m19895l50396l94712k81183l76590m09979k74769
$$ 27781664 27239219 26930107 26510212 26159816 25765104 25483921 25107331 24697352 24422583
4404B4422583m50470j32807j24070m39050l26590k63563l04009k58324l37920
$$ 24422583 23972113 23839306 23715236 23276186 22949596 22686033 22382024 22123700 21785780
4395B1785780k83844j88326j77993l05270k89920k54856k83630l34636j66080
$$ 21785780 21501936 21313610 21135617 20830347 20540427 20285571 20001941 19667305 19501225
4386A9501225j69860k78281j14081k23264k45861k82176j08285j97122k94818
$$ 19501225 19331365 19053084 18939003 18715739 18469878 18187702 18079417 17882295 17587477
4377A7587477k79995k95373k02382n5301k73996k66508j97893r5500j84261k59341
$$ 17587477 17307482 17012109 16809727 16754426 16480430 16213922 16016029 15920529 15736268 15476927
4367A5476927O4345k25177k38284o7838l7255j11483k21857j53802j56254k52409
$$ 15476927 15541272 15316095 15077811 15009973 14972718 14861235 14639378 14485576 14329322 14076913
4357A4076913K1188m3073j28065o6026j47629j12571r4699q2364J13539m4455
$$ 14076913 14098101 14055028 13926963 13860937 13713308 13600737 13506038 13423674 13537213 13492758
4347A3492758k050r0226M6226O8127r088J56654J06370J65662J54497J43925J99578
$$ 13492758 13490708 13400482 13446708 13514835 13505747 13662401 13768771 13934433 14088930 14232855 14432433
4336A4432433J75046O0970J17990K22872Q5583K7383L8730P0434j54229k0602
$$ 14432433 14607479 14668449 14786439 15009311 15094894 15122277 15161007 15231441 15077212 15056610
4326A5056610j20681m5972j0571l601L7985j7368n0940m2219j94639q511l05469
$$ 15056610 14935929 14889957 14879386 14875785 14913770 14896402 14845462 14803243 14608604 14600093 14294624
4315A4294624j83718k50806l39192j86496l7534j69008k56174j93125k23481j40708
$$ 14294624 14110906 13860100 13520908 13334412 13296878 13127870 12871696 12678571 12455090 12314382
4305A2314382j26437p7085j34954j21572o9298q1630Q6841n1084j08590N3670
$$ 12314382 12187945 12110860 11975906 11854334 11785036 11703406 11790247 11739163 11630573 11684243
4295A1684243j15045j9092L8978P9857m3425Q850R9306J86338K41233K64817J85210
$$ 11684243 11569198 11550106 11589084 11668941 11625516 11634366 11733672 11920010 12161243 12426060 12611270
4284A2611270M62671M84697L34096J28127j00443j78186J1117l55323m04610k31631
$$ 12611270 13073941 13558638 13892734 14020861 13920418 13742232 13753349 13398026 12993416 12761785
4274A2761785l04658k22835j1668o5439k51663l0424r4506O4260K3398O1585K2290
$$ 12761785 12457127 12234292 12222624 12157185 11905522 11875098 11780592 11844852 11868250 11929835 11952125
4263A1952125K2861p1147q0794m5626l864j1242q4031k9199Q4681l0570J3120
$$ 11952125 11974986 11903839 11823045 11777419 11773555 11762313 11678282 11649083 11733764 11703194 11716314
4252A1716314K40510N7805m9662J23376P7972k9345J46653J28864J08730K21794
$$ 11716314 11956824 12014629 11964967 12088343 12166315 12136970 12283623 12412487 12521217 12743011
4242A2743011O5781j4125L06541Q4419P1501K15989K24465J26517J79549K87504
$$ 12743011 12808792 12794667 13101208 13185627 13257128 13473117 13697582 13824099 14003648 14291152
4232A4291152L48814J52997J63954K97309L79144L93819J62318M99957M66686
$$ 14291152 14639966 14792963 14956917 15254226 15633370 16027189 16189507 16689464 17156150
4223A7156150M14827N39733N22078M72059N82491M89011O89413Q99516O98819
$$ 17156150 17570977 18110710 18632788 19104847 19687338 20176349 20865762 21765278 22464097
4214B2464097R93315Q10273J136572J186403J057875J084112J328325J465093
$$ 22464097 23457412 24267685 25404257 26590660 27648535 28732647 30060972 31526065
4206C1526065J558172J704953J697701J747692J912827K091301K215545K310651
$$ 31526065 33084237 34789190 36486891 38234583 40147410 42238711 44454256 46764907
4198D6764907K322766K450323K557049K803509K913782K896957K978592L227590
$$ 46764907 49087673 51537996 54095045 56898554 59812336 62709293 65687885 68915475
4190F8915475L325106L367374L607848L519365L739646L765929L600727L675370
$$ 68915475 72240581 75607955 79215803 82735168 86474814 90240743 93841470 97516840
4182I7516840L915355L719093L627801L800368L711401L542722L628052L719230
$$ 97516840 101432195 105151288 108779089 112579457 116290858 119833580 123461632 127180862
4174A27180862L695194L555311L588894L437698L335722L020024K757905K605508
$$ 127180862 130876056 134431367 138020261 141457959 144793681 147813705 150571610 153177118
4166A53177118K356744K048946J807162J807315J529647J351803J065276J025838
$$ 153177118 155533862 157582808 159389970 161197285 162726932 164078735 165144011 166169849
4158A66169849Q49254N20339J95903n4499l15809n56816q88360j235915j583227
$$ 166169849 167019103 167539442 167735345 167680846 167365037 166808221 165919861 164683946 163100719
4149A63100719j816175j911005k122516k071284k369106k403857k743052k951818
$$ 163100719 161284544 159373539 157251023 155179739 152810633 150406776 147663724 144711906
4141A44711906k866383k978528l076818l300809l309131l519705l571712l667323
$$ 144711906 141845523 138866995 135790177 132489368 129180237 125660532 122088820 118421497
4133A18421497l596573l756942l686598l715830l595514l640814l416015l341399
$$ 118421497 114824924 111067982 107381384 103665554 100070040 96429226 93013211 89671812
4125H9671812l328009l336705l345527l092379l172373l147389l009167k908460
$$ 89671812 86343803 83007098 79661571 76569192 73396819 70249430 67240263 64331803
4117F4331803k740888k652247k534591k436315k321025k267445k256526k052437
$$ 64331803 61590915 58938668 56404077 53967762 51646737 49379292 47122766 45070329
4109D5070329j939791j790487j689514j702338j490422j441558j395314j305211
$$ 45070329 43130538 41340051 39650537 37948199 36457777 35016219 33620905 32315694
4101C2315694j264489j220503j168897j045061r44735j019297r15327q59058p22957
$$ 32315694 31051205 29830702 28661805 27616744 26672009 25652712 24737385 23878327 23155370
4092B3155370p09653n96666p29068o51506m82391m30248n54230o22053l53468
$$ 23155370 22445717 21849051 21119983 20468477 19986086 19555838 19001608 18379555 18026087
4083A8026087l06232m64724m76010k90557k65764k40198l32048l38034k48596
$$ 18026087 17719855 17255131 16779121 16488564 16222800 15982602 15650554 15312520 15063924
4074A5063924j549k59423l20568j93010j80542k28848j40006j22599j53064k50451
$$ 15063924 15062375 14802952 14482384 14289374 14108832 13879984 13739978 13617379 13464315 13213864
4064A3213864j81097q9186j36274o0703k92354j11778j71377p1896q2247j23694
$$ 13213864 13032767 12943581 12807307 12746604 12454250 12342472 12171095 12099199 12016952 11893258
4054A1893258j54495j63618K0498m9300n7887j22565j79091p1052k9835k09456
$$ 11893258 11738763 11575145 11595643 11546343 11488456 11365891 11186800 11115748 11085913 10876457
4044A0876457N6359J55038o5544J4217J0362j08520K4453n0421q9877L5178m2631
$$ 10876457 10932816 11087854 11022310 11036527 11046889 10938369 10962822 10912401 10822524 10857702 10815071
4033A0815071k06964r1942k2811P8521J5513n5006j07227j458j11307o963m6503
$$ 10815071 10608107 10516165 10493354 10571875 10587388 10532382 10425155 10423697 10312390 10305427 10258924
4022A0258924n4551m9074M2067K1552j74518j25586l4307l0065m9794L3498N905
$$ 10258924 10204373 10155299 10197366 10218918 10044400 9918814 9884507 9854442 9804648 9838146 9844051
4011I844051O519L1213k1644L5323m2858j830N972J25663k8173J6611O5748K9079
$$ 9844051 9850570 9881783 9860139 9895462 9852604 9850774 9856746 9982409 9954236 9970847 10036595 10065674
3999A0065674O1584m2499J0098O3796M678P8221K92920J9266L5973L6614M3572
$$ 10065674 10127258 10084759 10094857 10158653 10163331 10241552 10534472 10553738 10589711 10626325 10669897
3988A0669897R3515Q6108J8282k3659K9790P1306j43119J60926n8443o1212N7929
$$ 10669897 10763412 10849520 10867802 10844143 10873933 10945239 10802120 10963046 10904603 10843391 10901320
3977A0901320M8594p1396L7854l0842J40940K6579O3686k3245m7205N7249K6468
$$ 10901320 10949914 10878518 10916372 10885530 11026470 11053049 11116735 11093490 11046285 11103534 11130002
3966A1130002N5434p5264K8551M1966j7193r4705M2301j09678j26366Q052J6771
$$ 11130002 11185436 11110172 11138723 11180689 11163496 11068791 11111092 11001414 10875048 10883100 10899871
3955A0899871K4565n3105J179J20991L3623N897O6984o8923l9829M3915J05520
$$ 10899871 10924436 10871331 10872510 10993501 11027124 11033021 11100005 11031082 10991253 11035168 11140688
3944A1140688Q0171q4007K0521Q6740J53379J51509J81386m929K41743J30727
$$ 11140688 11220859 11136852 11157373 11244113 11397492 11549001 11730387 11725458 11967201 12097928
3934A2097928K19990J60061K05718L6672J91828J12710J54049K27240K14785K97081
$$ 12097928 12317918 12477979 12683697 12720369 12912197 13024907 13178956 13406196 13620981 13918062
3924A3918062J89544J94393K97957L36600J43318J80014K06256n5561J2072L5984
$$ 13918062 14107606 14301999 14599956 14936556 15079874 15259888 15466144 15410583 15422655 15458639
3914A5458639Q5177M1588J10197J45031L8080N4557J5691J23076Q4750j7703J7822
$$ 15458639 15543816 15585404 15695601 15840632 15878712 15933269 15948960 16072036 16156786 16139083 16156905
3903A6156905j16920j38449q7593j40570M3094J61027J3631M4124r9976n9593
$$ 16156905 16039985 15901536 15813943 15673373 15716467 15877494 15891125 15935249 15835273 15775680
3893A5775680p793J15947J00158l5029K16793L2901n6549J2395K32474K12102
$$ 15775680 15767887 15883834 15983992 15948963 16165756 16198657 16142108 16154503 16386977 16599079
3883A6599079K10506J19456J14158K96602M28175K87692J13711L80320M42762
$$ 16599079 16809585 16929041 17043199 17339801 17767976 18055668 18169379 18549699 18992461
3874A8992461L02793N50788M60197M06128O97991P09892O75498P26472O62410
$$ 18992461 19295254 19846042 20306239 20712367 21410358 22120250 22795748 23522220 24184630
3865B4184630Q23230Q67301J053255R27863J311367J347849J162293J205329J338044
$$ 24184630 25007860 25875161 26928416 27856279 29167646 30515495 31677788 32883117 34221161
3856C4221161J539547J474100J392442J539017J379104J405067J611109J682581
$$ 34221161 35760708 37234808 38627250 40166267 41545371 42950438 44561547 46244128
3848D6244128J657230J595104J558788J808091J721796J581907J640039J280588
$$ 46244128 47901358 49496462 51055250 52863341 54585137 56167044 57807083 59087671
3840E9087671J098084J120547J238223J084101P95869Q37127R01127Q10926O96763
$$ 59087671 60185755 61306302 62544525 63628626 64424495 65261622 66162749 66973675 67670438
3831F7670438O78727P15542N31708M79667N09220K44234K62855L64952J52086
$$ 67670438 68349165 69064707 69596415 70076082 70585302 70829536 71092391 71457343 71609429
3822G1609429K13098M12001M39030L98266N50205P33744Q39034J014114J274798
$$ 71609429 71822527 72234528 72673558 73071824 73622029 74355773 75194807 76208921 77483719
3813G7483719J375960J571566J912213K119520K327337K703868L051797L231223
$$ 77483719 78859679 80431245 82343458 84462978 86790315 89494183 92545980 95777203
3805I5777203L714860M036647M371271M652184M864732N209234N523296N734148
$$ 95777203 99492063 103528710 107899981 112552165 117416897 122626131 128149427 133883575
3797A33883575N842778O351706O453348O499779O944729P081969P360167P544780
$$ 133883575 139726353 146078059 152531407 159031186 165975915 173057884 180418051 187962831
3789A87962831P530281P627033P467662P335567P297619P102589O979049O863469
$$ 187962831 195493112 203120145 210587807 217923374 225220993 232323582 239302631 246166100
3781B46166100O606989O718371O377649O273835O228377N769249N615913N374468
$$ 246166100 252773089 259491460 265869109 272142944 278371321 284140570 289756483 295130951
3773B95130951N018728M918966M769915M671548M629507M828266M998915N156597
$$ 295130951 300149679 305068645 309838560 314510108 319139615 323967881 328966796 334123393
3765C34123393N453740N680289O112154O666381P252924P909738Q878426R876287
$$ 334123393 339577133 345257422 351369576 358035957 365288881 373198619 382077045 391953332
3757C91953332J0429912J0930257J1176744J0688842R758610Q413143O616990
$$ 391953332 402383244 413313501 424490245 435179087 444937697 453350840 459967830
3750D59967830N007472L250810J797140P17282J87517j06064k08797J81212K60861
$$ 459967830 464975302 468226112 470023252 470740534 470928051 470821987 470613190 470794402 471055263
3741D71055263K65429J2771j068287k345487l811287n490384p402921q846198
$$ 471055263 471320692 471333463 470265176 467919689 464108402 458618018 451215097 442368899
3733D42368899r808068j0461973j0449541r968948r257442q256051o789145n177743
$$ 442368899 432560831 422098858 411649317 401680369 392422927 384166876 377377731 372199988
3725C72199988l798198k211239o75370N29104J600588K248797K356153K213749
$$ 372199988 368401790 366190551 365515181 366044285 367644873 369893670 372249823 374463572
3717C74463572J625644P08851k54907j241088j910194k948215l311387l436566
$$ 374463572 376089216 376798067 376543160 375302072 373391878 370443663 367132276 363695710
3709C63695710l392547l122458k897625k940792k993096l361467m228669n244179
$$ 363695710 360303163 357180705 354283080 351342288 348349192 344987725 340759056 335514877
3701C35514877o366928p599021q898513j0070274j0837837j1305964j1623606
$$ 335514877 329147949 321548928 312650415 302580141 291742304 280436340 268812734
3694B68812734j1577263j1141472j0697979j0236994r636411r051978q589336
$$ 268812734 257235471 246093999 235396020 225159026 215522615 206470637 197881301
3687A97881301q130017p729437p417308o875335o561285o452258o197872n953365
$$ 197881301 189751284 182021847 174604539 167729204 161167919 154715661 148517789 142564424
3679A42564424n857385n624117n346996n175736m801682m616510m377998m185636
$$ 142564424 136707039 131082922 125735926 120560190 115758508 111141998 106764000 102578364
3671A02578364m075383l772795l514271l376669l185841k933011k947976k882387
$$ 102578364 98502981 94730186 91215915 87839246 84653405 81720394 78772418 75890031
3663G5890031k766877k473803k571330k301474k399877k427224k205403k000547
$$ 75890031 73123154 70649351 68078021 65776547 63376670 60949446 58744043 56743496
3655E6743496k114202j996560j780652j721058j835218j680482j509649j442828
$$ 56743496 54629294 52632734 50852082 49131024 47295806 45615324 44105675 42662847
3647D2662847j405204j466963j250757j337477j185126j079505j175112j060479
$$ 42662847 41257643 39790680 38539923 37202446 36017320 34937815 33762703 32702224
3639C2702224q28094r44854r29924q55667o79444p58934o69687p47309n67361
$$ 32702224 31874130 30929276 29999352 29143685 28464241 27705307 27035620 26288311 25720950
3630B5720950o70961q18664n59344n14198n67333l78890m31059o55088n39714
$$ 25720950 25049989 24231325 23671981 23157783 22590450 22211560 21780501 21125413 20585699
3621B0585699l88456l96898m52571l97384l45944l21085l33689l43324k87778
$$ 20585699 20197243 19800345 19347774 18950390 18604446 18283361 17949672 17606348 17318570
3612A7318570l52643l67030l44719l89678j94875l11776l66569k61492k01794
$$ 17318570 16965927 16598897 16254178 15864500 15669625 15357849 14991280 14729788 14527994
3603A4527994k42239k12543k72620j95039k28255j52127k68087k50504o6706j33380
$$ 14527994 14285755 14073212 13800592 13605553 13377298 13225171 12957084 12706580 12639874 12506494
3593A2506494j42800j77968k73005k65912j92207k37922m3602k21229k17256j24407
$$ 12506494 12363694 12185726 11912721 11646809 11454602 11216680 11173078 10951849 10734593 10610186
3583A0610186p6996p8411k86807j60271j73566j27688j03653j82754O3867j74750
$$ 10610186 10533190 10454779 10167972 10007701 9834135 9706447 9602794 9420040 9483907 9309157
3573I309157j74416k6947n5289j68055n2872m8517j74062m6701n6678j45987m5249
$$ 9309157 9134741 9107794 9052505 8884450 8831578 8783061 8608999 8562298 8505620 8359633 8314384
3562H314384o1879j02922j31196j27750j24744p6969J2912j62000j20390R3616
$$ 8314384 8252505 8149583 8018387 7890637 7765893 7688924 7701836 7539836 7419446 7513062
3552G513062k05633p5510n4937j30381n728j70494l3665K9540p9268j3396l9716
$$ 7513062 7307429 7231919 7176982 7046601 7040873 6870379 6836714 6866254 6786986 6773590 6733874
3541F733874j44537j19753K0208L1215k494o1397l2555j3755j9505j68761p9944
$$ 6733874 6589337 6469584 6489792 6521007 6518513 6457116 6424561 6410806 6391301 6222540 6142596
3530F142596k8826j4639j3754J31895K2570r8574q5192j8659P1578L1428p117
$$ 6142596 6113770 6099131 6085377 6217272 6239842 6141268 6056076 6037417 6108995 6140423 6133306
3519F133306l7841Q1409J294r1482q1130J5425J24718r790o2315M3242J8017M5308
$$ 6133306 6095465 6176874 6178168 6086686 6005556 6020981 6145699 6135909 6073594 6116836 6134853 6180161
3507F180161M423L5499l0207R0397k5074J30213M2078J2495N4663J25266J57559
$$ 6180161 6184584 6220083 6189876 6280273 6255199 6385412 6427490 6439985 6494648 6619914 6777473
3496F777473Q9905J52111j72635J22166K75936N8260K70324R9663O8272l2626
$$ 6777473 6867378 7019489 6846854 6969020 7244956 7303216 7573540 7673203 7741475 7708849
3486G708849P7210J9008L6051J63482P2177K4649K28443J63900J22173M7480K44391
$$ 7708849 7786059 7805067 7841118 8004600 8076777 8101426 8329869 8493769 8615942 8663422 8907813
3475H907813L8223J33046K71566J59324K18535K56281L01378K41380K23192J45606
$$ 8907813 8946036 9079082 9350648 9509972 9728507 9984788 10286166 10527546 10750738 10896344
3465A0896344L31005M25453K87993J68267L76160M13125K52497K40219K17593
$$ 10896344 11227349 11652802 11940795 12109062 12485222 12898347 13150844 13391063 13608656
3456A3608656K97077L26511M46457L90745L89081M37105L16017L46713O66564
$$ 13608656 13905733 14232244 14678701 15069446 15458527 15895632 16211649 16558362 17224926
3447A7224926M64595J68124j5366O768k3976j39952r1621J20606K96110Q6233
$$ 17224926 17689521 17857645 17842279 17849047 17825071 17685119 17593498 17714104 18010214 18096447
3437A8096447K66019k8882K43772M6496k14784n3701j91177j39760k60545l19631
$$ 18096447 18362466 18333584 18577356 18623852 18409068 18355367 18164190 18024430 17763885 17444254
3427A7444254j50079k34201l89326j95954l08353j59416l63386k44432L050o6339
$$ 17444254 17294175 17059974 16670648 16474694 16166341 16006925 15643539 15399107 15402157 15335818
3417A5335818j03231J17030N8874J36172K81828K74603M24436J70571K74372J15677
$$ 15335818 15232587 15349617 15408491 15544663 15826491 16101094 16525530 16696101 16970473 17086150
3407A7086150L02447J01696L59124N13723O55055P50200K80582L74678K31676
$$ 17086150 17388597 17490293 17849417 18363140 19018195 19768395 20048977 20423655 20655331
3398B0655331L4734p7913k03839n85676o28265o76434r87308j020141r34966n35325
$$ 20655331 20690065 20612152 20408313 19822637 19194372 18517938 17530630 16510489 15575523 15040198
3388A5040198l34754n21540o11605l15155n41921k18368j46628j84125j95223
$$ 15040198 14705444 14183904 13572299 13257144 12715223 12496855 12350227 12166102 11970879
3379A1970879j16684k39416j55225j39123J8472R7453K12385K28001N34673O63696
$$ 11970879 11854195 11614779 11459554 11320431 11338903 11436356 11648741 11876742 12411415 13075111
3369A3075111O61911K11206k30100l75607o92303o38732q65211o40862o44280
$$ 13075111 13737022 13948228 13718128 13342521 12650218 12011486 11146275 10505413 9861133
3360I861133o25220l97814l94425l01223l35756j63148l29255m34570j69508k08068
$$ 9861133 9235913 8838099 8443674 8142451 7806695 7643547 7314292 6879722 6710214 6502146
3350F502146j68935k09060k87763j76686j59360k55483k48284j69149l9767j81129
$$ 6502146 6333211 6124151 5836388 5659702 5500342 5244859 4996575 4827426 4787659 4606530
3340D606530j94302q4088p8857j99316j68025j22957P7536j67816j46695j06714
$$ 4606530 4412228 4328140 4249283 4049967 3881942 3758985 3836521 3668705 3522010 3415296
3330C415296k3033K4325j27656j32460Q4386k9395j31647l6741k3435O4864j24469
$$ 3415296 3392263 3416588 3288932 3156472 3240858 3211463 3079816 3043075 3019640 3084504 2960035
3319B960035o9295J06083j144q861K6427k25909O7806M9159r0107J54305L379
$$ 2960035 2890740 2996823 2995679 2986818 3013245 2787336 2855142 2904301 2814194 2968499 2971878
3308B971878j44291j50396m0882J29070J64806m9606M3992j9212J8483M6702J42022
$$ 2971878 2827587 2677191 2636309 2765379 2930185 2880579 2924571 2905359 2923842 2970544 3112566
3297C112566m7376M3358k1112R3941K32538J47091J43318L3457P7419J30697Q2446
$$ 3112566 3065190 3108548 3087436 3181377 3413915 3561006 3704324 3737781 3815200 3945897 4028343
3286D028343J08840K23280K75846L81678M54176O27842N75707L23223Q2083J687
$$ 4028343 4137183 4360463 4636309 5017987 5472163 6100005 6675712 6998935 7081018 7082705
3276G082705M3672m29350m97931k68278l81915j45231j8410j48731r6326j6334
$$ 7082705 7126377 6697027 6199096 5930818 5548903 5403672 5385262 5236531 5140205 5123871
3266E123871j41107k2070J6712p6692p1143P5102J09532N6047J03479J39916J47878
$$ 5123871 4982764 4960694 4977406 4900714 4829571 4904673 5014205 5070252 5173731 5313647 5461525
3255E461525K89503M31054M83142M86128K30122r5383j93924j07946l36337m89452
$$ 5461525 5751028 6182082 6665224 7151352 7381474 7286091 7092167 6984221 6647884 6158432
3245F158432m50353k60109j87733j82700j87246j37741j61399k84542j73330l8461
$$ 6158432 5708079 5447970 5260237 5077537 4890291 4752550 4591151 4306609 4133279 4094818
3235D094818n0735j65249l34894j29683J06233j77878k21000j03504j32474k2471
$$ 4094818 4044083 3878834 3543940 3414257 3520490 3342612 3121612 3018108 2885634 2863163
3225B863163k1309j04098o6454j11573m1682k6338n9742l6654j775p2924l7163
$$ 2863163 2841854 2737756 2671302 2559729 2518047 2491709 2431967 2395313 2393538 2320614 2283451
3214B283451r9287q2304j5053k3093o6089j23804N3210K3r1628n7558j8745K3355
$$ 2283451 2184164 2101860 2086807 2063714 1997625 1873821 1927031 1927054 1835426 1777868 1759123 1782478
3202A782478L6609l4912O6820L0708o7548j2111L8343R015n9672q4714O425j8694
$$ 1782478 1819087 1784175 1850995 1881703 1814155 1802044 1840387 1849402 1789730 1705016 1711441 1692747
3190A692747k7424l8829j96892O5307M4887l1625L1557Q5934N327r8113n4126
$$ 1692747 1665323 1626494 1429602 1494909 1539796 1508171 1539728 1625662 1630989 1532876 1478750
3179A478750j10245P9300Q6006r1890p6600p3594J15322J10165j8476j50799J24032
$$ 1478750 1368505 1447805 1533811 1441921 1365321 1291727 1407049 1517214 1498738 1347939 1471971
3168A471971R1203j10767n7115M8793k8735j276J20791j61558l9168O4722K1891
$$ 1471971 1563174 1452407 1395292 1444085 1415350 1414074 1534865 1373307 1334139 1398861 1420752
3157A420752O7771P1231n9561o3631J43631j03412K0631J00398J19058J71538
$$ 1420752 1488523 1559754 1500193 1436562 1580193 1476781 1497412 1597810 1716868 1888406
3147A888406O1158k4776l2313R4762J10847K8281J4315j4002P0418J04513k5055
$$ 1888406 1949564 1924788 1892475 1987237 2098084 2126365 2140680 2126678 2197096 2301609 2276554
3136B276554K581P1289J87348J34657k3851O2857n557R0236k3616L3478k5850
$$ 2276554 2279135 2350424 2537772 2672429 2648578 2711435 2705878 2796114 2772498 2805976 2780126
3125B780126j74147J180J67957N9555Q267Q6758j53K2677J12283J0917r7606J44854
$$ 2780126 2605979 2607159 2775116 2834671 2842938 2929696 2929543 2952220 3064503 3075420 2977814 3122668
3113C122668K3946J42004J43019p1014j21506R1394l4888r2735K7901k8199P4316
$$ 3122668 3146614 3288618 3431637 3360623 3239117 3330511 3295623 3202888 3230789 3202590 3276906
3102C276906M1493j84262j26908L4489o315n1401j99856O50j42986N4463k1616
$$ 3276906 3318399 3134137 3007229 3041718 3035403 2984002 2784146 2784796 2641810 2696273 2674657
3091B674657p299m494l1933j39758r5594J90149k2156J09056k1775m6399l6209
$$ 2674657 2667358 2662864 2630931 2491173 2395579 2585728 2563572 2672628 2650853 2604454 2568245
3080B568245q994k6787J7516q7248r9334k1886o186o195j93510r271N7181m2098
$$ 2568245 2559251 2532464 2549980 2462732 2363398 2341512 2335326 2329131 2135621 2126350 2183531 2141433
3068B141433Q6054p0441P4533p0028m139j3593n0670p0211k2710r1540j15086
$$ 2141433 2227487 2157046 2231579 2161551 2157412 2143819 2093149 2022938 2000228 1908688 1793602
3057A793602j36454o7416O1906o9024K2779r3559j1143o60k05509k9272p7732
$$ 1793602 1657148 1589732 1651638 1582614 1605393 1511834 1500691 1500031 1294522 1265250 1187518
3046A187518q7156J9036j802l3489j27562M6570j1768P464L1796j08022q1140
$$ 1187518 1100362 1119398 1117596 1084107 956545 1003115 991347 998811 1030607 922585 841445
3035H41445r2049K2838n2983l2451o1501P1739l6557j05312K9975M7855O2264
$$ 841445 749396 772234 719251 686800 625299 697038 660481 555169 585144 632999 695263
3024F95263p091r657m5473j09106n1820O6200N3140m6390j09724Q3122J9306o4245
$$ 695263 688172 678515 633042 523936 472116 538316 591456 545066 435342 518464 537770 473525
3012D73525j8732q4729j6354k7766R2833M1936r8187L8464N2862o5938j13148
$$ 473525 454793 370064 353710 325944 418777 460713 362526 400990 453852 387914 274766
3001B74766J34149J27598N1260O008k12085m2049l6198J34222K0153j15149m6094
$$ 274766 408915 536513 587773 593781 381696 339647 303449 437671 457824 342675 296581
2990B96581O455Q1424Q1834o8915j6429m2396p0394N3912m4558m0299k7070P9389
$$ 296581 303036 384460 466294 397379 380950 338554 268160 322072 277514 237215 210145 289534
2978B89534l1396n603O6460M4673L0857K2189N3753P4204j55129l7060j29437
$$ 289534 258138 252535 318995 363668 394525 416714 470467 544671 389542 352482 223045
2967B23045q893L0978n8274K8929Q5370Q1031r4862j21079K41O1924P1835J9255
$$ 223045 214152 245130 186856 215785 301155 382186 287324 166245 166486 228410 300245 319500
2955C19500o2530q8256P1003j06877m1412N8521j2825j8941n8712P5721P2076
$$ 319500 256970 168714 239717 132840 91428 149949 137124 118183 59471 135192 207268
2944B07268l4953P4267r2131M5671k3217j7745l8602J01502l6151K6509R4535
$$ 207268 172315 246582 154451 200122 176905 159160 120558 222060 185909 212418 306953
2933C06953q24j8700r8093p1954J1869j3418k5499P7529R9524k7096j25775j07390
$$ 306953 306129 287429 189336 117382 129251 115833 90334 167863 267387 240291 114516 7126
2921G126P2270k117m4729J51601j26280q045L3661J0524K623O2645R2150m2211
$$ 7126 79396 77279 32550 184151 57871 49826 83487 94011 96634 159279 251429 209218
2909B09218p1832K4466j62464Q2195N1932L7917L728Q549P6752o9359r0306P558
$$ 209218 137386 161852 -612 81583 133515 171432 175160 183709 260461 191102 100796 108354
2897A08354L3574q108p7932j9030J1700m5388n9953J19726j339j39731J35145
$$ 108354 141928 133820 55888 36858 48558 3170 -56783 62943 61604 -78127 57018
2886E7018O8787p3890Q1259J35407m8302o2847j58612L8842J59055l6434l5063
$$ 57018 125805 51915 133174 268581 220279 157432 -1180 37662 196717 160283 125220
2875A25220o3130J31976m7516j0311M8157j8968j3773K1816q3829m8804L4062
$$ 125220 62090 194066 146550 136239 184396 165428 151655 173471 89642 40838 74900
2864G4900R7396o4650j81374K8921L4545J00569L3297J15717n0408j320L2216
$$ 74900 172296 107646 -73728 -44807 -10262 90307 123604 239321 188913 187593 219809
2853B19809J6122m9282j24204J60720J1455m0187j23114K9847L5155p7934L9067
$$ 219809 235931 186649 62445 223165 234620 194433 71319 101166 136321 58387 97454
2842I7454m1376q2429L5882M5742R8315L9572j42060J9028J48250K3655k03740
$$ 97454 56078 -26351 9531 55273 153588 193160 51100 70128 218378 242033 38293
2831C8293q3471j26181r383J13684O3782K4077k3414N8195R1538M1404J4356p1966
$$ 38293 -45178 -171359 -180742 -67058 -3276 20801 -2613 55582 147120 188524 202880 130914
2819A30914j22731M631J9952l7277J15682P8466j46860Q717K503l72q4268j4595
$$ 130914 8183 12814 32766 -4511 111171 189637 42777 51494 53997 53625 -30643 -45238
2807d5238J02656j6168o3433J5983Q6656o3704J22794q9212j09376K5274O5519
$$ -45238 57418 41250 -22183 -6200 80456 16752 139546 50334 -59042 -33768 31751
2796C1751K7249K6216j0565L3452j6611p890M0832m6095k29L6816l4765r2603
$$ 31751 59000 85216 74651 108103 91492 83602 124434 78339 78110 114926 80161 -12442
2784a2442J12842k354o7702J6513n563K1137p9264k0724J92690m6035j75128j35328
$$ -12442 100400 98046 30344 46857 41294 62431 -16833 -37557 155133 109098 -66030 -201358
2772b01358O875J70740L2573l0823l4170N5185L316M1577k2961j4561J26618j26967
$$ -201358 -194483 -23743 8830 -21993 -56163 -978 2338 43915 20954 6393 133011 6044
2760F044r880p0746M1078n6422R3405J06282q869o3105Q5764n2130M7154K4362
$$ 6044 -3836 -74582 -33504 -89926 3479 109761 100892 37787 123551 71421 118575 142937
2748A42937l1374P5234j74342L0705j9662J0203r6287K4673N7854L782N5383M7458
$$ 142937 111563 186797 12455 43160 23498 33701 -62586 -37913 19941 23723 79106 126564
2736A26564m7974K0630k0820o2712O6720Q937m1864J8558l8752N7422J29281q4118
$$ 126564 78590 99220 78400 15688 82408 91345 49481 68039 29287 86709 215990 131872
2724A31872O582m9511j07185K2559n1880Q3050K3343j6234j4175L367K2537j09292
$$ 131872 138454 88943 -18242 4317 -47563 35487 58830 42596 28421 31788 54325 -54967
2712e4967P446l68L1914J44708K02l6943l8685Q6085L060j14749m0697K5768o8465
$$ -54967 -47521 -47889 -15975 128733 128935 91992 53307 139392 142452 27703 -12994 12774 -55691
2699e5691M582Q9580R8024N396K1107l1599j4081j9832l7018q6304p6573P9138
$$ -55691 -51109 38471 136495 141891 162998 131399 117318 97486 60468 -25836 -102409 -23271
2687b3271o5570L7501j7059L0554J45018L1011j5659k3743l6162q8704J29177
$$ -23271 -88841 -51340 -68399 -37845 107173 138184 122525 98782 62620 -26084 103093
2676A03093k3867n0448N9552m2949L5367k57629M642J45777k8011K0485R5188
$$ 103093 79226 28778 88330 45381 80748 -176881 -172239 -26462 -54473 -33988 61200
2665F1200j17601J18540L4481j8857O2314j60133q0069N5241n6328M0111L7480
$$ 61200 -56401 62139 96620 77763 140077 -20056 -100125 -44884 -101212 -61101 -23621
2654b3621m9347o3278N3055m0262j7267Q3921P984k0265k2558O1289P7001L1157
$$ -23621 -72968 -136246 -83191 -123453 -140720 -56799 -48815 -69080 -91638 -30349 46652 77809
2642G7809l363j8742p9573j5172j16203J12478J56940L1277L9911p9202j66773
$$ 77809 74446 55704 -23869 -39041 -155244 -42766 114174 145451 185362 106160 -60613
2631f0613l4702l4086J20857j3474K6008Q2283J117j63775J5559N5748q8508N2647
$$ -60613 -95315 -129401 -8544 -22018 3990 86273 87390 -76385 -60826 -5078 -93586 -40939
2619d0939J25955l8806P63j29171m2564P3111J59367p5407Q290J33283r4958j2764
$$ -40939 85016 46210 46973 -82198 -124762 -51651 107716 32309 40599 173882 78924 66160
2607F6160P837j07625J32447M5459Q1579l7383k0990j01895l0770R0839m3990
$$ 66160 73997 -33628 98819 144278 225857 188474 167484 65589 34819 125658 81668
2596H1668p6168R7791J16774m5917k8169j91431J0636l2700P7939R1782o7197
$$ 81668 5500 103291 220065 174148 145979 -45452 -34816 -67516 10423 102205 35008
2585C5008j7339O5669K8063O712r652O1710K917P5080m1860q7633K0227M9070
$$ 35008 17669 83338 111401 118113 108461 170171 173088 248168 206308 118675 138902 187972
2573A87972j32871R2938M9325N8552r5007q9004j22850J91497J58592J07793j13913
$$ 187972 55101 148039 197364 255916 160909 71905 -50945 140552 299144 406937 293024
2562B93024k77002j6024J27171j5196j2552k7638m7689m2586m6391o084J226O6923
$$ 293024 16022 -2 127169 111973 99421 71783 24094 -18492 -64883 -70967 -69741 -2818
2550b818m0736J227K01035j65527m0668L5714R1211o8400J14272J29416j47848
$$ -2818 -43554 -42327 158708 -6819 -47487 -11773 79438 11038 125310 254726 106878
2539A06878j07117Q2499q7162j70288K25369M4167p3429k9774o6556m6966J81363
$$ 106878 -239 82260 -4902 -175190 50179 94346 20917 -8857 -75413 -122379 58984
2528E8984N849n1958j55707q4419R2836M7216J0359J24075J21439j42083p2191
$$ 58984 64833 12875 -142832 -227251 -134415 -87199 -76840 47235 168674 26591 -45600
2517d5600m5379J2977K20324n250k8744q1016O6388q9026p3163k4598L5350n3828
$$ -45600 -90979 -78002 142322 137072 108328 27312 93700 4674 -68489 -93087 -57737 -111565
2505a11565L3469O7789P6933k3467P9018M4377n3663l9919R563j45506j641m5217
$$ -111565 -78096 -10307 66626 43159 122177 166554 112891 72972 82535 -62971 -64612 -109829
2493a09829K4066N7082k7690R816L1592N6984J08511J4353j16292J507M3702Q204
$$ -109829 -85763 -28681 -56371 -46555 -14963 42021 150532 164885 48593 50100 93802 102006
2481A02006j16799O5991K220r3333n9505J36753N3657j40360p87M9026K5199m987
$$ 102006 -14793 51198 53418 -39915 -99420 37333 90990 -49370 -50157 -1131 24068 19081
2469A9081n649M354m24L1682k8872j1464Q1541o0809j22783Q2668M7696l0089
$$ 19081 13432 17786 17362 49044 20172 8708 90249 29440 -93343 -10675 37021 6932
2457F932L5634N0910O3231j19312L8921K02603j20989l7967j29477J9478M1735
$$ 6932 42566 93476 156707 37395 76316 278919 157930 119963 -9514 9964 51699
2446E1699o2929R5271n217m9029J364m0702M7143j98j46611J19750K56949j26199
$$ 51699 -11230 84041 78824 29795 31159 -9543 37600 37402 -109209 10541 267490 141291
2434A41291q812M4488j13600J11822n3523Q4523L7962j432p8686L3460r4069m6755
$$ 141291 132479 176967 63367 175189 121666 206189 244151 242719 164033 197493 103424 56669
2422E6669P162Q0262J21952o3303l2770j4369o2897L1451M3869R0665j04545j92738
$$ 56669 63831 144093 266045 202742 169972 155603 92706 124157 168026 258691 154146 -38592
2410c8592R8787K7838J4559J24094N5487j18110j9080k9424K6751J21408L1524
$$ -38592 60195 88033 102592 226686 282173 164063 144983 115559 142310 263718 295242
2399B95242N671L3379p5268O8919k8244r4389J27368q9073l6479Q1614O820K2981
$$ 295242 300913 334292 259024 327943 299699 205310 332678 243605 207126 288740 295560 318541
2387C18541K7114j2331l0999o7600K4476J47341r1582m2052N9701J03304m3884
$$ 318541 345655 333324 302325 234725 259201 406542 314960 272908 332609 435913 392029
2376C92029O4031q130J5339J66675J59976o6697J8651o2679l6153r2921N8030
$$ 392029 456060 447930 463269 629944 789920 723223 741874 679195 643042 550121 608151
2365F08151N4858r6732P4974J00269J29701Q1764j928O7392n9505O9609J68728
$$ 608151 663009 566277 641251 741520 871221 952985 951057 1018449 958944 1028553 1197281
2354A197281l6031J8620k9259J88495J15511o921J14613J09561J09179J10492
$$ 1197281 1161250 1179870 1150611 1339106 1454617 1447696 1562309 1671870 1781049 1891541
2344A891541R3336J40197L34836K00752O6840K50509K68443J45617L45315K86372
$$ 1891541 1984877 2125074 2459910 2660662 2727502 2978011 3246454 3392071 3737386 4023758
2334D023758K77398L47967M15905M28655M57042N41383P29526P66648Q35343O16791
$$ 4023758 4301156 4649123 5065028 5493683 5950725 6492108 7221634 7988282 8823625 9440416
2324I440416R73279R08061Q57877P07669J060920J131013J485850J699337K222687
$$ 9440416 10413695 11321756 12179633 12887302 13948222 15079235 16565085 18264422 20487109
2315B0487109K627158L748815M773901N933473M605719J77278k21633p62301k604168
$$ 20487109 23114267 26863082 31636983 37570456 42176175 42353453 42131820 41369519 38765351
2306C8765351m734857l678256k588379j981022j596703j909503j908579j260204
$$ 38765351 34030494 30352238 27763859 25782837 24186134 22276631 20368052 19107848
2298A9107848q44288l53750p14708q39993q52874o84477o99491p21973r37510
$$ 19107848 18263560 17909810 17195102 16355109 15502235 14817758 14118267 13396294 12458784
2289A2458784j008974r37843j063231p95369p70131m92309m39822m89161m58306
$$ 12458784 11449810 10511967 9448736 8653367 7883236 7390927 6951105 6461944 6003638
2280F003638l27854l72333j73320l67901l42706k75336j46407k22225k69744j29612
$$ 6003638 5675784 5303451 5130131 4762230 4419524 4144188 3997781 3775556 3505812 3376200
2270C376200k91934l4847l3636k09486j41947l0798j32478m2769n3605o5335l6380
$$ 3376200 3084266 3049419 3015783 2806297 2664350 2633552 2501074 2458305 2404700 2339365 2302985
2259B302985j00603j40714p0972m2216j60279j28245j42351n2570l0614j8163
$$ 2302985 2202382 2061668 1990696 1948480 1788201 1659956 1517605 1465035 1434421 1416258
2249A416258n2729j77082j1094o9040j34783J60033j59258m2527J8104J53866
$$ 1416258 1363529 1186447 1175353 1106313 971530 1131563 972305 929778 947882 1101748
2239A101748o8657j7793P6652o7477j98967m8244K8106J799j06813M6325k3516
$$ 1101748 1033091 1015298 1091950 1024473 825506 777262 805368 807167 700354 746679 723163
2228G23163j9088K384j40120k97466K0754K15942N0837l2898J5334K6306K0388
$$ 723163 704075 706459 566339 268873 289627 505569 556406 523508 538842 565148 585536
2217E85536j5637k6319m7406L3856N818j80140P7399m0823R3679K1458j4076j53115
$$ 585536 569899 543580 496174 530030 535848 355708 433107 392284 485963 507421 493345 340230
2205C40230K8268K6408r9300P2962K3644k8242m6529l4299N4234J300M2343L8575
$$ 340230 368498 394906 295606 368568 392212 363970 317441 283142 337376 338676 381019 419594
2193D19594k8553j16124N6081K0229j31004K9130m2216r719K9529o5297L4274
$$ 419594 391041 274917 330998 351227 220223 249353 207137 197418 226947 161650 195924
2182A95924N7173O0788j5809J3077J5080j30412q7566j121k3051n4832p7904M0385
$$ 195924 253097 313885 298076 311153 326233 195821 108255 107134 84083 29251 -48653 -8268
2170h268J68242M7742L4750l6036p137j02196j0140j7530Q4931R0161K2117n8062
$$ -8268 159974 207716 242466 206430 199293 97097 86957 69427 154358 244519 266636 208574
2158B08574j68518l2966Q6554o7238K4831Q8720j25870J03601P2709j7410l2568
$$ 208574 40056 7090 93644 26406 51237 139957 14087 117688 190397 172987 140419
2147A40419M1754n090j09515J16999K6452r0521j02537j7723M5842l148m6497
$$ 140419 182173 177083 67568 184567 211019 120498 17961 238 46080 42932 -3565
2136c565O369M7901l7274J41008O1821j06386L6401r113r7727o0770Q903m3318
$$ -3565 2804 50705 13431 154439 216260 109874 146275 137162 39435 -21335 -12432 -55750
2124e5750R1247L8090M15J12666j39153O7196K4892r4119j45395J11427k1125
$$ -55750 35497 73587 74002 186668 47515 114711 139603 45484 -99911 11516 -9609
2113i609l7189M5436k2276J36059j21981m2726P2425J066m0467m1908m4585k5587
$$ -9609 -46798 -1362 -23638 112421 -9560 -52286 20139 21205 -19262 -61170 -105755 -131342
2101a31342J35339P4525p6898j01816P6928P2307n0360k8720l0610M3758O3731
$$ -131342 3997 78522 1624 -100192 -23264 49043 -1317 -30037 -60647 -16889 46842
2090D6842n1540r7383P3605N4094j51407L6328o010Q680K7180M8362N1143j30133
$$ 46842 -4698 -102081 -28476 25618 -125789 -89461 -95471 -86791 -59611 -11249 39894 -90239
2078i0239n4803L6499K8342P6085P2256M399q8209K4654k266K3522K4069Q6837
$$ -90239 -145042 -108543 -80201 -4116 68140 72539 -15670 8984 6718 30240 54309 141146
2066A41146o5890m2747K0716j30027J58824J2023r5122M3971J45544J8160m062
$$ 141146 75256 32509 53225 -76802 82022 94045 -1077 42894 188438 206598 202536
2055B02536l7382p0153j0458j18571o4222J95775r7629n4453K4683R5291j6391
$$ 202536 165154 95001 84543 -34028 -98250 97525 -104 -54557 -29874 65417 49026
2044D9026M5149P1425j0422N0719K8605l5205O1360M1670l2603j47658J10686
$$ 49026 94175 165600 155178 205897 234502 199297 260657 302327 269724 122066 232752
2033B32752l9248q6782j28164j14104Q957J16550J96541j03632j31133J40131
$$ 232752 193504 106722 -21442 -135546 -126589 -10039 186502 82870 -48263 91868
2023I1868N0418M0525l837r7854L6496p6677Q8845o0462j09185J36421L7630j23095
$$ 91868 142286 182811 178974 81120 117616 40939 129784 69322 -39863 96558 134188 11093
2011A1093k9598k6150J51046j17640k0943J8927n4029k219n439J3401j01897K8065
$$ 11093 -18505 -44655 106391 -11249 -32192 -13265 -67294 -69513 -74952 -61551 -163448 -135383
1999a35383p8235L9005J16923l7789M213k973O3001l4362N5645L5836M5067n1203
$$ -135383 -213618 -174613 -57690 -95479 -91266 -94239 -31238 -65600 -9955 25881 70948 19745
1987A9745j5615O3045l4046P858l2049q8433m1939J6853Q7622N7725p6853J4788
$$ 19745 4130 67175 33129 40987 8938 -79495 -121434 -104581 -16959 40766 -36087 -21299
1975b1299m3153j4859R581q3729k7967K9393Q9565L2672O4910l0300Q0292J1195
$$ -21299 -64452 -79311 -69730 -153459 -181426 -152033 -62468 -29796 35114 4814 85106 96301
1963I6301k6663M0187M4365j16128l7536J37542P535o6783l0729o1679k9913r7161
$$ 96301 69638 109825 154190 38062 526 138068 145603 78820 48091 -13588 -43501 -140662
1951a40662P0871K5245J5980k4105q9804J8485J37017m7579n7393R0473O6379
$$ -140662 -69791 -44546 -28566 -52671 -142475 -123990 13027 -34552 -91945 -1472 64907
1940F4907J5456O1779n4204j56747p3404L1903j8615j7762J10673o8291m8610
$$ 64907 80363 142142 87938 -68809 -142213 -110310 -128925 -146687 -36014 -104305 -152915
1929a52915R4312l2114o8397J63597n8148Q9823o3769l4089L2321o9396Q8648
$$ -152915 -58603 -90717 -159114 4483 -53665 36158 -27611 -61700 -29379 -98775 -10127
1918a0127N550k0778K7802r0825K9964J4168O3753M264J4940J1471l5656K1082
$$ -10127 -4577 -25355 2447 -88378 -58414 -44246 19507 23771 38711 50182 14526 35608
1906C5608K7285k1709K9054q5268O9443M7925j55427Q4919J3240m9924q018Q4817
$$ 35608 62893 41184 70238 -15030 54413 102338 -53089 31830 45070 -4854 -12872 71945
1894G1945M8800q5380k19051L551P8165M4057k9557l3226K9536O9415N859q6309
$$ 71945 120745 35365 -183686 -180135 -101970 -57913 -87470 -120696 -91160 -21745 -15886 -102195
1882a02195k0643O498J44180R3640K0347j39340l6076j34370J628O1452l5610
$$ -102195 -122838 -116340 27840 121480 141827 2487 -33589 -167959 -166331 -104879 -140489
1871a40489J15498N3533j51489n3913k5651Q1644r729R4248l1858n4901N8551
$$ -140489 -24991 28542 -122947 -176860 -202511 -120867 -130596 -36348 -68206 -123107 -64556
1860f4556r8783Q9518q7044l1904K6407O8238N0960j2708j7529j6514N8505m5978
$$ -64556 -163339 -73821 -160865 -192769 -166362 -98124 -47164 -59872 -77401 -93915 -35410 -81388
1848h1388j1882l6647N0982R4772L7200j20536j5678j7545k4541O3019k47l4526
$$ -81388 -93270 -129917 -78935 15837 53037 -67499 -83177 -100722 -125263 -62244 -62491 -97017
1836i7017J0456j3964k0063J04762M94j2791R7048O9510n613q7509o4061m5868
$$ -97017 -86561 -100525 -120588 -15826 -15332 -28123 68925 138435 132822 45313 -18748 -64616
1824f4616q5956R1955k1606L7790Q838K0168J0099m7851m5138o4060Q7375P2342
$$ -64616 -150572 -58617 -80223 -42433 -33595 -13427 -3328 -51179 -96317 -160377 -73002 -660
1812f60p0011o3903P5898l6408J5412O4884m0059m026K6361j04848J1383Q3909
$$ -660 -70671 -134574 -58676 -95084 -79672 -14788 -54847 -58873 -32512 -137360 -125977 -42068
1800d2068m4891j4501P2072l7334n9588P0379K0971R4596r9172q2724K6102J5661
$$ -42068 -86959 -101460 -29388 -66722 -126310 -55931 -34960 59636 -39536 -122260 -96158 -80497
1788h0497L6674K3234p8430p186J12835L8223j21628O5997J8014q2267o8511L3180
$$ -80497 -43823 -20589 -99019 -106205 6630 44853 -76775 -10778 7236 -75031 -143542 -110362
1776a10362L4767l9814r44P2371l4763l0292j9309Q6296O0234N0195o3419R206
$$ -110362 -75595 -115409 -116353 -43982 -78745 -109037 -128346 -42050 18184 68379 4960 14166
1764A4166j51349N1868M8811n5645j283o1141J8323P4375l2952L4619p3515m3126
$$ 14166 -137183 -85315 -36504 -92149 -93432 -154573 -136250 -61875 -94827 -60208 -133723 -176849
1752a76849J40504P3317j14648j05475j6779o7843M9402P1922l5469q0275J48696
$$ -176849 -36345 36972 -77676 -183151 -199930 -267773 -218371 -146449 -181918 -262193 -113497
1741a13497N3604O689K020L7864M8261J8891j6110O0857q5865M2185j1474M5645
$$ -113497 -59893 -53204 -51184 -13320 34941 53832 37722 98579 12714 54899 43425 89070
1729H9070n7425N4292L361j44035K1333N9547p1638n868M8752N2174L1010o2422
$$ 89070 31645 85937 89298 -54737 -33404 26143 -45495 -51363 -2611 49563 80573 18151
1717A8151Q6655p9502o0907j8816n8198L8266K5354M8424K4882R4260o1711j24742
$$ 18151 104806 25304 -35603 -54419 -112617 -74351 -48997 -573 24309 118569 56858 -67884
1705f7884J5754o684r4666n6238J04727j2285M3846O5435n1587R7735j66264q980
$$ -67884 -52130 -58814 -153480 -209718 -104991 -117276 -73430 -7995 -59582 38153 -128111 -137091
1693a37091Q5508J7437r8102q3865k0290Q7972L1769P7318k6500M231M7867j5825
$$ -137091 -51583 -34146 -132248 -216113 -236403 -148431 -116662 -39344 -65844 -61613 -13746 -29571
1681b9571K2354l6424L5619O6520j36903n2001N6803J07695j5292n4027l0334
$$ -29571 -7217 -43641 -8022 58498 -78405 -130406 -73603 34092 18800 -35227 -65561
1670f5561n5936J6665l1972M3155J7878N4204r2017r166N3240K9109M9380Q735
$$ -65561 -121497 -104832 -136804 -93649 -75771 -21567 -113584 -122750 -69510 -40401 8979 17714
1658A7714n2980K1997j00494N7181L1723j2863q4534P8177N8965K1984l2766j3930
$$ 17714 -35266 -13269 -113763 -56582 -24859 -37722 -122256 -44079 14886 36870 4104 -9826
1646i826l973N8134o3501k5433J8745o8323P2769M3453K7511j64522o0446N0938
$$ -9826 -13799 44335 -19166 -44599 -25854 -94177 -21408 22045 49556 -114966 -175412 -124474
1634a24474J1232L523O9052r1460J1598P7975l2992Q146R9558j77448K8689l0459
$$ -124474 -113242 -109719 -40667 -132127 -120529 -42554 -75546 -67400 32158 -145290 -116601 -147060
1622a47060m6280N9202J04919j5483j01985O4606N219R6023K8408K9102p6636
$$ -147060 -193340 -134138 -29219 -44702 -146687 -82081 -76862 19161 47569 76671 35
1611C5j2684j0074K255m0334J08169J5539n7020l8578l6209l934r0018P3667J02829
$$ 35 -12649 -22723 -20468 -60802 47367 62906 5886 -32692 -68901 -72835 -162853 -89186 13643
1598A3643R0847j22682o2860O6561l6292k0792l1598K2195Q3654N6443o5562R1148
$$ 13643 104490 -18192 -81052 -14491 -50783 -71575 -103173 -80978 2676 59119 -6443 84705
1586H4705m1653k2118p4519j57095J15689Q9393q9803k5187m6289N5265K0802
$$ 84705 43052 20934 -53585 -210680 -94991 -5598 -95401 -120588 -166877 -111612 -90810
1575i0810J1445Q3480M5220p9911j2091K5226K4905P9306O0497o056n8585j19200
$$ -90810 -79365 4115 49335 -30576 -42667 -17441 7464 86770 147267 141211 82626 -36574
1563c6574J1567l0582j59282k3388J63362J7056q2799J48734j0181p2819Q674
$$ -36574 -25007 -55589 -214871 -238259 -74897 -57841 -140640 8094 -2087 -74906 -66232
1552f6232K7369k3438p1101J13690l8244O2475R210j27372J20612P0171q6796
$$ -66232 -38863 -62301 -133402 -19712 -57956 4519 13729 -113643 6969 77140 -9656
1541i656o6309K8809m2205N4980r1618Q2683n0266M379j5873N2203P8156r0472
$$ -9656 -75965 -47156 -89361 -34381 -125999 -43316 -93582 -89203 -105076 -52873 25283 -65189
1529f5189J20924P4561r1586r0855N4311O8540q5234P5382K7221M8249N2886k06614
$$ -65189 55735 130296 38710 -52145 2166 70706 -14528 60854 88075 136324 189210 -17404
1517a7404Q500l3291k277Q3331o5131M7994M8350K2489q6271m3600m6606o2639
$$ -17404 -8904 -42195 -44472 38859 -26272 21722 70072 92561 6290 -37310 -83916 -146555
1505a46555L2999K1806J0622Q3209l3306J8540n8415l7754P7171L5366j3435L942
$$ -146555 -113556 -91750 -81128 2081 -31225 -12685 -71100 -108854 -31683 3683 -9752 -5810
1493e810J0913q0022N4627j12687L2401R3581k749r2548N1095j42124j2342J27364
$$ -5810 5103 -74919 -20292 -132979 -100578 -6997 -9746 -102294 -51199 -193323 -205665 -78301
1481g8301M404k2726n582M2357O8335j7358p3923K4431k338P3623O1136k5086
$$ -78301 -73897 -96623 -102205 -59848 8487 -8871 -82794 -58363 -60701 12922 74058 48972
1469D8972j23824P9079l4972L9039m3582L4439P6204Q6726l7233J104j8074k1910
$$ 48972 -74852 4227 -30745 8294 -35288 -849 75355 162081 124848 125952 107878 85968
1457H5968r5380o1002j23555Q0440m801j7331L5764N2303L7452r5953m4680M4926
$$ 85968 -9412 -70414 -193969 -113529 -118330 -135661 -99897 -47594 -10142 -106095 -150775 -105849
1445a05849J74969M1646n9087j2921P5857J6117l8297k04682J4237J7218L2344
$$ -105849 69120 110766 51679 38758 114615 130732 92435 -112247 -98010 -80792 -48448
1434d8448K8131N7573m4945J4151J7033J29694r2472N4296P9501o075l9038J0283
$$ -48448 -20317 37256 -7689 6462 23495 153189 60717 115013 194514 188439 149401 159684
1422A59684j42463k9098m5420o2905k8360k0928p3993Q7910Q9865K0102J1569
$$ 159684 17221 -11877 -57297 -120202 -148562 -169490 -243483 -155573 -65708 -45606 -34037
1411c4037j5480O269r0578m7912M1784J14362r490N5404N6236K4189j41047l2969
$$ -34037 -49517 -43248 -133826 -181738 -139954 -25592 -35082 20322 76558 100747 -40300 -73269
1399g3269r1691L708L5690l4835J69262m8077m8087l5953N8169L0235m250o4134
$$ -73269 -164960 -161252 -125562 -160397 8865 -39212 -87299 -123252 -65083 -34848 -39098 -103232
1387a03232P3870J0522j3404k5457j27903r58J5793J32111J0042N4943l8264M7993
$$ -103232 -29362 -18840 -32244 -57701 -185604 -186562 -170769 -38658 -28616 26327 -11937 36056
1375C6056J11882j79956o5974N8356Q586j8720O8717M6295m5313P1900r3737l4580
$$ 36056 147938 -32018 -97992 -39636 -31050 -49770 18947 65242 19929 91829 -1908 -36488
1363c6488o3623N1776J39392p4026j48942N2409k9356j1739Q337J54645n4328
$$ -36488 -100111 -48335 91057 17031 -131911 -79502 -108858 -120597 -112260 42385 -11943
1352a1943p429L8204J11988q614m3312l4727k2443l0516k6353J7100P34N1121
$$ -11943 -19372 18832 130820 122206 78894 44167 21724 -8792 -35145 -18045 -17311 33810
1340C3810r008r2232P1236q115q389k4239N43N8945M3942Q8772j17831J0313j29968
$$ 33810 24802 -67430 3806 -4309 -12698 -36937 -36394 22551 66493 155265 37434 47747 -82221
1327h2221o2590O8170M3824P8153M73m764j00427k940m2339k2897M3048M4564
$$ -82221 -144811 -76641 -32817 45336 45809 41045 -59382 -62322 -104661 -127558 -84510 -39946
1315c9946N7961k0167p9580j03799Q9831J36951R670p6340J7685j06730L9802
$$ -39946 18015 -2152 -81732 -185531 -95700 41251 50921 -25419 -7734 -114464 -74662
1304g4662L9025m0675r2588N4284Q9788k8292J49920o4104l9500l8303l4280N4695
$$ -74662 -35637 -76312 -168900 -114616 -24828 -53120 96800 32696 -6804 -45107 -79387 -24692
1292b4692j21019l5042p1615J62312P8977j40418J4666p334O8640k5092M927Q1665
$$ -24692 -145711 -180753 -252368 -90056 -11079 -151497 -136831 -144165 -75525 -100617 -95690 -14025
1280a4025k8715k9123P9155R2706o2650L9878p6901K7577L36r392j8908P9619
$$ -14025 -42740 -71863 7292 99998 37348 77226 325 27902 28238 18846 -62 79557
1268G9557l3957L7269r8826j4698J57344j37807K4278N4167l0910P6558M410m1881
$$ 79557 45600 82869 -15957 -30655 126689 -11118 13160 67327 36417 112975 117385 75504
1256G5504Q6778j54327n6173N6316q3421q352J1650L2445L2217R8913j21897k3179
$$ 75504 162282 7955 -48218 8098 -75323 -83675 -72025 -39580 -7363 91550 -30347 -53526
1244e3526l1625K8579J34900j45569K6926J92955l4443m916q5277M1402M0415
$$ -53526 -85151 -56572 78328 -67241 -40315 152640 118197 113281 28004 69406 109821
1233A09821j05729K9559j00625k1942L8612J7904Q8657j4847N0808q3158q551
$$ 109821 4092 33651 -66974 -88916 -50304 -32400 56257 41410 92218 9060 509
1222E09M6569j36728j0627P9264m5857K2712K7737m3292n9856j01654J15854J247
$$ 509 47078 -89650 -100277 -21013 -66870 -44158 -16421 -59713 -119569 -221223 -105369 -104122
1210a04122J47470J7433k5098p0946N044R1475N68m2526j03404R737J64182J04466
$$ -104122 43348 60781 35683 -35263 -30219 61256 61824 19298 -84106 -74369 89813 194279
1198A94279j9379q6299j34814m9002l6976Q6477R1626j10117p402O9692N5020
$$ 194279 174900 88601 -46213 -95215 -132191 -45714 45912 -64205 -71607 -1915 53105
1187E3105L6665O4002r0250J10541l5946L8320r3109n6406K0218j3542p0759l1451
$$ 53105 89770 153772 63522 174063 138117 176437 83328 26922 47140 33598 -37161 -68612
1175f8612R5555l7661r0716P0080l3591m9166K0139j33558P8131O1546m5911N8934
$$ -68612 26943 -10718 -101434 -31354 -64945 -114111 -93972 -227530 -149399 -87853 -133764 -74830
1163g4830K07578O2429j78095l4218k0028j16527N7485p145j1139L2604Q4367
$$ -74830 132748 195177 17082 -17136 -37164 -153691 -96206 -103351 -114490 -81886 2481
1152B481M4702K3222k21275J2215K06542M1166j3551P5946j60632r0438M5883
$$ 2481 47183 70405 -150870 -138655 67887 109053 95502 171448 10816 -79622 -33739
1141c3739m9514m9886N1917J64823r0784n8615r1461N3564K7754P720O7350K5051
$$ -33739 -83253 -133139 -81222 83601 -7183 -65798 -157259 -103695 -75941 -68221 -871 24180
1129B4180l9883m6918K6511N0849J1263q1040J16356J48512N008m5411l4241j05322
$$ 24180 -15703 -62621 -36110 14739 26002 -55038 61318 209830 214838 169427 135186 29864
1117B9864J081M467j01689n866L6111O5311K6881j09532O0169N5313k702O717
$$ 29864 30945 35412 -66277 -72143 -36032 29279 56160 -53372 6797 62110 59408 66125
1105F6125k2778L4951Q138K6055j56390M4602P9712k07270M6939P6351R5684j07441
$$ 66125 43347 78298 86436 112491 -43899 703 80415 -126855 -79916 -3565 92119 -15322
1093a5322l7055Q1016j23402o0064N3105J12923l2432M5842O9346J0615N9034
$$ -15322 -52377 28639 -94763 -154827 -101722 11201 -21231 24611 93957 104572 163606
1082A63606p3753j32027p660K1541k6382K1315k7976J5759o1074K9225j1350M5434
$$ 163606 89853 -42174 -49834 -28293 -54675 -33360 -61336 -45577 -106651 -77426 -88776 -43342
1070d3342m9657o3275J13133J73221r7347q5226N2002r2661J13259J6625j1241
$$ -43342 -92999 -156274 -43141 130080 32733 -52493 -491 -93152 20107 36732 25491
1059B5491l3377P9297q3507p4364L3720o9812P6221Q5723N8518K2314o5701j1313
$$ 25491 -7886 71411 -12096 -86460 -52740 -122552 -46331 39392 97910 120224 54523 43210
1047D3210j25658n065l453k4072J58544O7628k0551l6783p52q8297O8276q069
$$ 43210 -82448 -87513 -90966 -115038 43506 111134 90583 53800 53048 -35249 33027 24958
1035B4958j1753N1297j8753k234m1228M5823l3893m9435j18477o0581J49680R1613
$$ 24958 13205 64502 45749 43515 2287 48110 14217 -35218 -153695 -214276 -64596 27017
1023B7017Q6679j1861l6251j9138n9383R6653r6436l5255J7495p6190J58336l2378
$$ 27017 113696 101835 65584 46446 -12937 83716 -12720 -47975 -30480 -106670 51666 19288
1011A9288N2027j9245m5166k4768r8709R4664L5234n3323n4201q9299j3865l8091
$$ 19288 71315 52070 6904 -17864 -116573 -21909 13325 -39998 -94199 -183498 -197363 -235454
999b35454J76584K7545N1073q7203M8813K2906M8873j799n3862N9495j34062J07702
$$ -235454 -58870 -31325 19748 -67455 -18642 4264 53137 51338 -2524 56971 -77091 30611
987C0611O4554R2790r6142J1352j5218n4306j07961K0399J7709J58739q6919m8731
$$ 30611 95165 187955 91813 103165 87947 33641 -74320 -53921 -36212 122527 35608 -13123
975a3123O5267J0243K3215q8200j04027J02456q949j26057j09275O5613R3272
$$ -13123 52144 62387 85602 -2598 -106625 -4169 -13118 -139175 -248450 -182837 -89565
964h9565P8230J01938k4657k02853J46983n3526j05518K4019R8772R1017k944
$$ -89565 -11335 90603 65946 -136907 10076 -43450 -148968 -124949 -26177 64840 61896
953F1896r7978J3292K0565P69M8450m71J08394j05764J5363j23236Q2555n108
$$ 61896 -36082 -22790 -2225 -1456 46994 46523 154917 49153 64516 -58720 23835 18727
941A8727Q1079J4151j93032j02802J49026Q9524q748r9484J3396K1407J14370
$$ 18727 99806 113957 -79075 -181877 -32851 56673 47925 -51559 -38163 -16756 97614
930I7614q122q96j67012o3616J45208O0498r4451m880J03235p8675N5400j4626
$$ 97614 89492 88596 -78416 -142032 3176 63674 -30777 -35657 67578 -11097 44303 29677
918B9677k0029L1881j797k2711O9191j04847O361J83847k652l0773l55o4562j58805
$$ 29677 9648 41529 39732 17021 86212 -18635 -12274 171573 168921 138148 137793 73231 -85574
905h5574o3903J02670L6716k159j6160q1920R3289N4631p0998k8613M6522J2809
$$ -85574 -149477 -46807 -10091 -12250 -28410 -110330 -17041 37590 -33408 -62021 -15499 -2690
893b690P3374J7789r2542m500q0155R7427L4585M1935p9953k824M3882q645m08
$$ -2690 70684 88473 -4069 -8569 -88724 8703 43288 85223 5270 2446 46328 37683 37275
880C7275p4180p217N5438O7817j47268O8682l8259K9833Q3327r9185j1936K8659
$$ 37275 -36905 -44122 11316 79133 -68135 547 -37712 -7879 75448 -23737 -35673 -7014
868g014J2842J3155j72735J24340J49095k6312J7665k00269J64028Q6943j58491
$$ -7014 5828 18983 -153752 -29412 119683 93371 111036 -89233 74795 161738 3247
857C247k8878k6208J83129M8675Q5811o6884j13094L6144j9559k623o8206O3153
$$ 3247 -25631 -51839 131290 179965 265776 198892 85798 121942 102383 99760 31554 94707
845I4707j082o5238O120m8712J7501J47862r8856j08292j3286L8032J929K3027
$$ 94707 93625 28387 34507 -14205 3296 151158 52302 -55990 -69276 -31244 -29315 -6288
833f288k7619L5132l9531P4068p4779o1296M6854N5621K0055O4919P9805O1179
$$ -6288 -33907 1225 -38306 35762 -39017 -100313 -53459 2162 22217 87136 166941 228120
821B28120j04745j46946N2815k5036J3194R962M6115O8849n3500j26316M0938
$$ 228120 123375 -23571 29244 4208 17402 27364 73479 142328 88828 -37488 3450
810C450O954j6076j7660n0267j4960J15588J2844J0311L3930J9727m0498P4250
$$ 3450 10404 -5672 -23332 -73599 -88559 27029 39873 50184 84114 103841 63343 137593
798A37593l5592k25370r5900J8083J54727J2780L2357Q0929M4517k2226j37786
$$ 137593 102001 -123369 -219269 -201186 -46459 -33679 -1322 79607 124124 101898 -35888
787c5888M1613l0025k4116J4925N8890j7419J4391n8443K316L8379l9449R4966
$$ -35888 5725 -24300 -48416 -33491 25399 7980 22371 -36072 -33756 4623 -34826 60140
775F0140l3552J292l6899J5763k4987k9426o9340J32459M8882m5089q2546j06176
$$ 60140 26588 27880 -9019 6744 -18243 -47669 -117009 15450 64332 19243 -63303 -169479
763a69479L2167R0942K9356N0288q3942R2005P349l5620L2001k1883L5897J8076
$$ -169479 -137312 -46370 -17014 33274 -50668 41337 48686 13066 45067 23184 59081 77157
751G7157J1086L4120Q3866o1088J1924l4709q9149p5666N916R908J81493L6937
$$ 77157 88243 122363 206229 145141 157065 122356 33207 -42459 -36543 -26635 154858 191795
739A91795l9426n231j5382l3358p3242j75079J13748Q5188k3507o1398l822m144
$$ 191795 152369 147138 131756 98398 25156 -149923 -36175 49013 25506 -35892 -39714 -43858
727d3858j3339P0838J38129p3885j15329O2457M1744k5995J33998r4238q9181
$$ -43858 -57197 13641 151770 77885 -37444 25013 66757 40762 174760 80522 -8659
716h659J76359j51491j61329M573Q2856R9402Q921J3157P8681K7227O3689o3693
$$ -8659 167700 16209 -145120 -140547 -57691 41711 50632 63789 142470 169697 233386 169693
704A69693m9341m4244j01801l4305Q4644q5494j19087J44006k6140K6902p734
$$ 169693 120352 76108 -25693 -59998 24646 -60848 -179935 -35929 -62069 -35167 -42901
693d2901m4190M6123j09934P4377J18345K5386J8515j65566n0705K44502n4838
$$ -42901 -87091 -40968 -150902 -76525 41820 67206 85721 -79845 -130550 113952 59114
682E9114m0784j3267m2675L7170o3073M0092L8111j477K6970Q654M3603j09395
$$ 59114 18330 5063 -37612 -442 -63515 -23423 14688 13211 40181 48835 92438 -16957
670a6957M7727J3655N6592R338j8715J6656j14215n5760K3243L7887L4968n7768
$$ -16957 30770 44425 101017 110355 91640 108296 -5919 -61679 -38436 -549 34419 -23349
658b3349m0467Q2299J58556j61912K0870P6477P471J1270q3536j03716n3552M2118
$$ -23349 -63816 18483 177039 15127 35997 112474 119945 131215 47679 -56037 -109589 -67471
646f7471K4170O4852m2809M0236q1505J10147K2542l7681j13803o3088l2289J19653
$$ -67471 -43301 21551 -21258 18978 -62527 47620 70162 32481 -81322 -144410 -176699 -57046
634e7046L9580k8753O2173l7496N9828O9071L8353j02760j08948j8619M4757R4408
$$ -57046 -17466 -46219 15954 -21542 38286 107357 145710 42950 -65998 -84617 -39860 54548
622E4548K11m4323M3335N4459P739p5672O1895l7699j6695p3080m3847R9939N7528
$$ 54548 54759 10436 53771 108230 115969 40297 102192 64493 47798 -25282 -69129 30810 88338
609H8338j54887R7495J02607l0701l5881n6028q4934M4872K00134n7944n2007
$$ 88338 -66549 30946 133553 102852 66971 10943 -73991 -29119 171015 113071 61064
598F1064j04838j10567P0093O7676P2577o7222k3318j34853P3207J43221K213
$$ 61064 -43774 -154341 -84248 -16572 56005 -11217 -34535 -169388 -96181 47040 49253
587D9253L6317M510J2634q3312n0953q590J1245m3881J10588p4183j0831p0741
$$ 49253 85570 90080 102714 19402 -31551 -40141 -28896 -72777 37811 -36372 -47203 -117944
575a17944k902N6640R9649n4365J27015r6727o3045N8295p8859P9986N3333k9837
$$ -117944 -120846 -64206 35443 -18922 108093 11366 -51679 6616 -72243 7743 61076 31239
563C1239q030j8343r40J4925N8014j8865m082n603k7827M3643P625J8923R4124
$$ 31239 23209 4866 3926 18851 76865 58000 53918 48315 20488 64131 71756 90679 184803
550A84803P4817j39973j06587J6764L4010r9930l3008k4436Q314O9775O0234L9321
$$ 184803 259620 119647 13060 29824 63834 -36096 -69104 -93540 -85226 -15451 44783 84104
538H4104p0124P800j3243N9243m9090j44993O0285k6785O6370n4221j0663K4957
$$ 84104 13980 21780 8537 67780 18690 -126303 -66018 -92803 -26433 -80654 -91317 -66360
$$ [...]
##END NTUPLES=NMR SPECTRUM
##END=
