##TITLE=1H_EC-3361(X-21)
 200.13MHz, CDCl3,
 8 sc
 
 27.10.2025
##JCAMPDX= 6.0         $$ Bruker NMR JCAMP-DX V2.0
##DATA TYPE= NMR SPECTRUM
##DATA CLASS= NTUPLES
##ORIGIN= UXNMR, Bruker Analytische Messtechnik GmbH
##OWNER= pz
$$ XWIN-NMR		Version 3.5
$$ Mon Oct 27 14:13:06 2025 Russian Standard Time (UT+4h)  she@DPX200
##.OBSERVE FREQUENCY= 200.1313
##.OBSERVE NUCLEUS= ^1H
##.ACQUISITION MODE= SIMULTANEOUS
##.ACQUISITION SCHEME= undefined
##.AVERAGES= 8
##.DIGITISER RES= 18
##SPECTROMETER/DATA SYSTEM= spect
##.PULSE SEQUENCE= zg30
##.SOLVENT NAME= CDCl3
##.SHIFT REFERENCE= (INTERNAL, CDCl3, 0, 15.4968)
##AUDIT TRAIL= $$ (NUMBER, WHEN, WHO, WHERE, WHAT)
$$ ##TITLE= Audit trail, XWIN-NMR		Version 3.5
$$ ##JCAMPDX= 5.01
$$ ##ORIGIN= Bruker BioSpin GmbH
$$ ##OWNER= she
$$ F:/spectra/data/she/nmr/H-C/1/pdata/1/auditp.txt
$$ ##AUDIT TRAIL=  $$ (NUMBER, WHEN, WHO, WHERE, WHAT)
(   1,<2025-10-27 14:11:18.32 +0400>,<she>,<DPX200>,
      <created by zg, POWCHK disabled, PULCHK disabled
       configuration hash MD5:
       00 E9 B6 7A A2 85 ED C7 34 08 36 98 17 FE 4E 26
       data hash MD5: 16K
       18 62 C2 BE B1 5D A7 BA B9 A5 9D 54 58 1C 17 30>)
(   2,<2025-10-27 14:11:20.48 +0400>,<she>,<DPX200>,
      <Start of raw data processing
       efp BC_mod = 2 LB = 0.25 FT_mod = 6 PKNL = 1 PHC0 = -2629.152 PHC1 = 14.19233 SI = 16K 
       data hash MD5: 16K
       D5 6E 41 81 56 08 42 8E DD 9F E1 2A B0 20 EB 35>)
(   3,<2025-10-27 14:12:23.92 +0400>,<she>,<DPX200>,
      <pk PHC0 = 50.27319 PHC1 = -61.99998 
       data hash MD5: 16K
       0C 4B DD 43 A7 68 45 D8 0F 88 7A 9E 75 0D 03 A9>)
(   4,<2025-10-27 14:12:28.21 +0400>,<she>,<DPX200>,
      <abs ABSG = 5 
       data hash MD5: 16K
       D3 69 DD AC EB C3 D9 42 78 93 0E BF CC E3 78 CD>)
$$ ##END=
$$ 
$$ hash MD5
$$ 11 94 53 97 79 A5 11 8A 29 BF AD 68 1A 31 13 DF
##$RELAX= 
##$RELAX= 
##$RELAX= 
##$RELAX= 
##$RELAX= 
##$RELAX= 
$$ Bruker specific parameters
$$ --------------------------
##$DU= <F:/spectra>
##$EXPNO= 1
##$NAME= <H-C>
##$PROCNO= 1
##$TYPE= <nmr>
##$USER= <she>
##$AMP= (0..31)
100 100 100 100 100 100 100 100 100 100 100 100 100 100 100 100 100 100 
100 100 100 100 100 100 100 100 100 100 100 100 100 100 
##$AQSEQ= 0
##$AQ_mod= 1
##$AUNM= <au_zg>
##$AUTOPOS= <>
##$BF1= 200.13
##$BF2= 200.13
##$BF3= 200.13
##$BF4= 200.13
##$BF5= 200.13
##$BF6= 200.13
##$BF7= 200.13
##$BF8= 200.13
##$BYTORDA= 1
##$CFDGTYP= 0
##$CFRGTYP= 5
##$CHEMSTR= <none>
##$CNST= (0..31)
1 1 145 1 1 1 1 1 1 1 1 1 1 1 1 1 1 1 1 1 1 1 1 1 1 1 1 1 1 1 1 1 
##$CPDPRG= <>
##$CPDPRG1= <>
##$CPDPRG2= <>
##$CPDPRG3= <>
##$CPDPRG4= <mlev>
##$CPDPRG5= <mlev>
##$CPDPRG6= <mlev>
##$CPDPRG7= <mlev>
##$CPDPRG8= <mlev>
##$CPDPRGB= <>
##$CPDPRGT= <>
##$D= (0..31)
0 0.7 0 0 0 0 0 0 0 0 0 0.03 0 0 0 0 0 0 0 0 0 0 0 0 0 0 0 0 0 0 0 0 
##$DATE= 1761559877
##$DBL= (0..7)
120 120 120 120 120 120 120 120 
##$DBP= (0..7)
150 150 150 150 150 150 150 150 
##$DBP07= 0
##$DBPNAM0= <>
##$DBPNAM1= <>
##$DBPNAM2= <>
##$DBPNAM3= <>
##$DBPNAM4= <>
$$ [...]
##$SUBNAM3= <"">
##$SUBNAM4= <"">
##$SUBNAM5= <"">
##$SUBNAM6= <"">
##$SUBNAM7= <"">
##$SUBNAM8= <"">
##$SUBNAM9= <"">
##$SW= 18.0517328524113
##$SWIBOX= (0..15)
0 0 2 0 0 0 0 0 0 0 0 0 0 0 0 0 
##$SW_h= 3612.71676300578
##$TD= 16384
##$TD0= 1
##$TE= 0
##$TE2= 300
##$TE3= 300
##$TEG= 300
##$TL= (0..7)
0 120 120 120 120 120 120 120 
##$TP= (0..7)
150 150 150 150 150 150 150 150 
##$TP07= 0
##$TPNAME0= <>
##$TPNAME1= <>
##$TPNAME2= <>
##$TPNAME3= <>
##$TPNAME4= <>
##$TPNAME5= <>
##$TPNAME6= <>
##$TPNAME7= <>
##$TPOAL= (0..7)
0.5 0.5 0.5 0.5 0.5 0.5 0.5 0.5 
##$TPOFFS= (0..7)
0 0 0 0 0 0 0 0 
##$TUNHIN= 0
##$TUNHOUT= 0
##$TUNXOUT= 0
##$USERA1= <user>
##$USERA2= <user>
##$USERA3= <user>
##$USERA4= <user>
##$USERA5= <user>
##$V9= 5
##$VALIST= <valist>
##$VCLIST= <CCCCCCCCCCCCCCC>
##$VD= 0
##$VDLIST= <DDDDDDDDDDDDDDD>
##$VPLIST= <PPPPPPPPPPPPPPP>
##$VTLIST= <TTTTTTTTTTTTTTT>
##$WBST= 1024
##$WBSW= 4
##$XGAIN= (0..3)
0 0 0 0 
##$XL= 0
##$YL= 0
##$YMAX_a= 216640
##$YMIN_a= -304007
##$ZGOPTNS= <>
##$ZL1= 120
##$ZL2= 120
##$ZL3= 120
##$ZL4= 120
##$ABSF1= 15.49678
##$ABSF2= -2.555069
##$ABSG= 5
##$ABSL= 3
##$ALPHA= 0
##$AQORDER= 0
##$ASSFAC= 0
##$ASSFACI= 0
##$ASSFACX= 0
##$ASSWID= 0
##$AUNMP= <proc_1d>
##$AZFE= 0.1
##$AZFW= 0.1
##$BCFW= 0
##$BC_mod= 2
##$BYTORDP= 0
##$COROFFS= 0
##$CY= -3
##$DATMOD= 1
##$DC= 0
##$DFILT= <>
##$DTYPP= 0
##$F1P= 0
##$F2P= 0
##$FCOR= 1
##$FTSIZE= 16384
##$FT_mod= 6
##$GAMMA= 0
##$GB= 0
##$INTBC= 1
##$INTSCL= 3.241238e-09
##$ISEN= 128
##$LB= 0.25
##$LEV0= 0
##$LPBIN= 0
##$MAXI= 10000
##$MC2= 0
##$MEAN= 0
##$ME_mod= 0
##$MI= 1.114404
##$NCOEF= 0
##$NC_proc= -9
##$NLEV= 6
##$NOISF1= 3.799351
##$NOISF2= 2.8
##$NSP= 0
##$NTH_PI= 0
##$NZP= 0
##$OFFSET= 15.49678
##$PC= 1
##$PHC0= -2578.879
##$PHC1= -47.80765
##$PH_mod= 1
##$PKNL= yes
##$PPARMOD= 0
##$PSCAL= 0
##$PSIGN= 0
##$REVERSE= no
##$SF= 200.130004988444
##$SI= 16384
##$SIGF1= 3
##$SIGF2= 2
##$SINO= 0.751879
##$SIOLD= 32768
##$SREGLST= <19F.Aceton>
##$SSB= 0
##$STSI= 16384
##$STSR= 0
##$SW_p= 3612.71676300578
##$SYMM= 0
##$S_DEV= 0
##$TDeff= 16384
##$TDoff= 0
##$TI= <>
##$TILT= no
##$TM1= 0
##$TM2= 0
##$TOPLEV= 0
##$USERP1= <user>
##$USERP2= <user>
##$USERP3= <user>
##$USERP4= <user>
##$USERP5= <user>
##$WDW= 1
##$XDIM= 16384
##$YMAX_p= 422704980
##$YMIN_p= -4395626
$$ End of Bruker specific parameters
$$ ---------------------------------
##NTUPLES= NMR SPECTRUM
##VAR_NAME=  FREQUENCY,     SPECTRUM/REAL,   SPECTRUM/IMAG
##SYMBOL=    X,             R,               I
##VAR_TYPE=  INDEPENDENT,   DEPENDENT,       DEPENDENT
##VAR_FORM=  AFFN,          ASDF,            ASDF
##VAR_DIM=   16384,         16384,           16384
##UNITS=     HZ,            ARBITRARY UNITS, ARBITRARY UNITS
##FACTOR=    0.220516191357247, 1,           1
##FIRST=     3101.3707378578, 0,             0
##LAST=      -511.346025147981, 0,           0
##MIN=       -511.346025147981, -4395626,    0
##MAX=       3101.3707378578, 422704980,     0
$$ Real data points
##PAGE= N=1
##DATA TABLE= (X++(R..R)), XYDATA
$$ [...]
8147 -1632159 -1209006 -682164 -555036 -1420656 -698773 -54242 384538 -276090 -394964 -202632
8137 -202632 61760 -50923 -526955 -281835 -135946 -740805 -2303237 -1860354 -960171 -271851
8127 -271851 -810394 -995951 -921338 -507443 -634832 -1106817 -2916507 -1074172 -1214175 -1033632
8117 -1033632 -830095 -693937 121378 -40238 -795917 -475593 843818 765209 24549 -1065134
8107 -1065134 -1530784 -761155 -42222 -134299 155725 -134621 -257420 -1320447 -884448 -560205
8097 -560205 9182 -720245 -973167 674268 -72199 -917859 -1480225 -1123572 -1059802 -1020344
8087 -1020344 -527219 -1458999 -1679829 -1144561 -1730399 -1875143 -845882 233132 84962
8078 84962 657912 352423 -139575 -988619 -1338092 -954364 -1188936 -1755302 -2281083 -1455708
8068 -1455708 -520741 -59761 -1345431 -1550122 -180959 -400057 -965891 -1133909 -357196
8059 -357196 -704544 -947382 -158333 -77278 73774 268672 -1436 -567453 -479470 -408326
8049 -408326 38418 -317155 -600105 -1386925 -1818795 -1040054 311354 577641 -684440
8040 -684440 -462587 -524203 -1217963 -532496 -281529 -899907 -599382 450211 68773 -50990
8030 -50990 -1137581 -2486153 -1351295 120547 107130 -451860 -1308641 -598812 -850977
8021 -850977 -423280 -914797 -1217538 -1401882 -1038254 -878953 -1236055 -1484943 -994271 -877260
8011 -877260 -1534668 -1320477 -622112 -1177100 -714140 -1288173 -1067121 -359479 -378426 -252544
8001 -252544 -539681 -988016 -1099395 -1188408 -1028224 -679347 -1468064 -1353733 -1629047 -1028295
7991 -1028295 -393692 -901995 -985674 -573246 -288483 -628121 -1192873 -918648 -760137 106930
7981 106930 -299097 -884052 -1346265 -1585665 -731295 -903162 -494364 -624387 -1171449 -286709
7971 -286709 265114 376060 168122 -235360 -971433 -541611 -363240 -760273 -832258 -262712
7961 -262712 160944 -253448 542707 901095 81360 214346 67760 -417576 942555 1563457
7951 1563457 775099 -163029 -1220256 144809 -801735 -770151 -882546 -590427 256722
7942 256722 -117864 -625465 -525023 -590867 -916827 -661292 -320136 158296 -386794 -1176923
7932 -1176923 -1370933 -1664119 -173916 527346 -1047488 -854708 -302745 -682450 -594269
7923 -594269 -538947 -719463 -580702 -1068708 -973497 -574256 -1331170 -1263917 -685401 -296315
7913 -296315 -556740 -648141 -917164 -878311 -728308 48450 -1174546 -1795728 -1219695 -229906
7903 -229906 -7640 -179618 -282072 190039 -40387 -323647 185706 -158196 -766921 -1110792
7893 -1110792 -1172138 -1210141 -1225903 -739119 -98218 -315570 -651420 -900995 -1006705 -112631
7883 -112631 451923 430170 -490661 -1323523 -890630 -1591197 -994153 -1274820 -776137 -1640254
7873 -1640254 -1380098 389155 657294 -51622 -233691 473617 -316424 -268512 -475430 -681658
7863 -681658 302987 251794 293046 -327629 -1182452 -572724 -918167 -659581 -700727 -828859
7853 -828859 -214878 -136928 -407731 -637320 -868419 -1674821 -949091 -458770 -196515 477402
7843 477402 771876 338203 -547048 -1533108 -1492050 -829203 -590258 -371781 -968327 -519329
7833 -519329 -349611 -1136443 -635998 -693010 259521 -840315 -384781 -42107 377871 138839
7823 138839 -58208 453442 772055 9424 -850599 -165753 -134180 560007 517355 155513
7813 155513 251372 -795371 -957097 -1276993 -15439 374701 182174 467025 1712435
7804 1712435 377518 -1207887 -446173 606448 -34877 -555313 -221396 -117764 -73496
7795 -73496 292300 -884387 -1055118 -3747 -779451 -819293 -604257 -869226 -2020601 -2702176
7785 -2702176 -2086433 -995382 -784687 -635113 -1185024 -765945 5075 567700 -530790
7776 -530790 -1681907 -1357333 -810579 -893670 -669258 -1225426 -1186394 -1452369 -484977 -1134491
7766 -1134491 -732855 -818533 -780660 -394242 4241 173221 -909540 -1140139 -607608 -133235
7756 -133235 -654653 -1180117 -1618628 -1569082 -1227473 -292100 -507986 -379491 -646645 -1302017
7746 -1302017 -1485942 -1825419 -644033 -438773 -490484 -288147 -30309 -570006 -891482 -917149
7736 -917149 -1015391 -1311291 -1037994 -239874 159573 33446 -372164 -1009058 287756 371164
7726 371164 -150927 -903335 -239886 -805697 -1033531 -270730 -377489 -370179 -461993 -543469
7716 -543469 -440557 -740218 -1100251 -1016806 -497959 -466159 -105566 -207838 -509590 -597569
7706 -597569 38883 691476 468707 225308 -1216264 -809443 -1067944 -1542445 -1886656 -1378410
7696 -1378410 -1026550 -673353 -931589 -591281 -543226 36885 -432413 -844001 -1240194 -1107842
7686 -1107842 -1701382 -903223 -681317 -271675 -969413 -1337402 -200301 -71796 -864510
7677 -864510 -1722495 -1429166 -1276814 -834204 -542254 -744771 -881919 -285857 -596547 -373297
7667 -373297 -437379 299167 268787 -219181 -919118 -885260 -1390771 -880093 -1651234 -1781680
7657 -1781680 -1986499 -2058035 -1626183 -2997141 -3410414 -1989023 -2043451 -1795013 -599476
7648 -599476 -1018528 -328597 -926930 -187571 -535326 -854356 -652481 -888914 -434977 366366
7638 366366 639474 824482 -276764 -2395263 -1891373 -2002148 -1428123 -1457398 -973251 -1347981
7628 -1347981 -1588842 -150446 -449379 -183128 -301203 -1348199 -761642 -676963 -1027140
7619 -1027140 59681 -1402160 -2872929 -2467493 -2130300 -2506501 -2731797 -1686598 -501704
7610 -501704 3164 268137 -312198 -73908 -699305 -1461563 -840586 -950892 -1338993 -1486064
7600 -1486064 -2383462 -1997038 -1181740 -571532 -1469351 -1329624 -1203887 -1507433 -2396467 -1119523
7590 -1119523 -686696 -1039078 156673 -273698 -138412 40660 -1464357 -2236105 -2206757
7581 -2206757 -1526928 -795731 -1075913 -578184 -1531654 -1530324 -1375808 -1689492 -1787797 -2032618
7571 -2032618 -485602 -588193 -1262128 -1449721 -1659985 -1801012 -1548579 -1051141 -1582514
7562 -1582514 -569175 207673 -400468 -1657082 -1356701 -841990 -1184215 -1180534 -1962240 -1915912
7552 -1915912 -1647158 -1835701 -1645553 -1594552 -1401466 -520332 232235 -192921 206450 -190078
7542 -190078 -894470 -957875 -840132 -1077618 -621154 -1137650 -1306873 -1076643 -947577 -832836
7532 -832836 -553307 40460 -309715 -829242 -1454767 -1806574 -1072615 -956861 -1058158 -1031737
7522 -1031737 -711766 -659091 -711139 -833122 -98837 -273166 -786808 -517013 -1716870 -1775382
7512 -1775382 -759091 44589 -1137210 -2032392 -1715434 -1058724 -1853566 -2390339 -1655222
7503 -1655222 -2036939 -2144558 -1533526 -1780934 -1665087 -1173901 -1546225 -1104787 -1152447 -1518589
7493 -1518589 -884233 -1265211 -925908 -940658 -1082194 -646015 -527043 53584 -428575 -1042211
7483 -1042211 -809574 -301282 214865 68573 49692 145280 -832241 -245011 -1260288 -1100758
7473 -1100758 -757741 -1211718 -503493 -623233 -1427400 -1799800 -1391091 -1102379 -555184 -614990
7463 -614990 -952734 -1121038 -1388740 -250872 -657145 -532783 -930177 -1435683 -2947016
7454 -2947016 -2639229 -839309 -1104167 -1115344 -45243 91695 -1004918 -819138 -1240928
7445 -1240928 -1872675 -941131 -680173 -683454 -215382 -197431 -288736 -1558864 -1687988 -1065836
7435 -1065836 -1118236 -1163552 -410153 -723280 -1304010 -1384869 -772887 -59817 201867 517611
7425 517611 -552170 -1202683 86210 -95989 885030 156196 -654207 -702866 -653456 -71224
7415 -71224 -829807 -1023031 -443949 -773620 -870956 -982888 -863335 -195081 -675585 -418784
7405 -418784 -170684 -963762 -1147554 -1029727 -1092020 -1066548 -906906 -966938 -741888 -1167570
7395 -1167570 -569366 -681455 -1311343 -1058742 -558818 -690033 -663261 -1326716 -1625132 -1065724
7385 -1065724 -343116 -967589 -648531 -475296 -626839 -158536 -5372 -227811 -1246191
7376 -1246191 68156 712295 449746 -109535 26081 -914461 -2069267 -731034 -795660
7367 -795660 -2012170 -2187179 -1520115 -802301 -1401488 -364890 -654462 -1434478 -819655
7358 -819655 -1334126 -1929388 -2211236 -1326364 212994 129246 -1170492 -1361315 -1050282 -993932
7348 -993932 -736329 -870714 -1150453 -925705 -573987 -2499 -1077374 -66775 852351
7339 852351 793229 203730 -4997 285873 -773102 -1734968 -1368183 -450029 -822604 -1444609
7329 -1444609 -969095 -115626 -743730 -1417632 -1621415 -1706168 -1736271 -537677 -229048 508706
7319 508706 -258470 -1402838 -765968 -1267092 -956320 -770556 -1380714 -432130 -585036 -1067877
7309 -1067877 -106060 -406263 -961763 -781570 -414834 -644368 -778141 -584928 131626 389275
7299 389275 -694298 68435 -20794 -542465 -691880 -328196 -590230 -874103 -700842 -601304
7289 -601304 -596252 -569147 -251009 265431 45445 266739 -479749 -905811 -16268 -579943
7279 -579943 -932127 -598615 -1135288 -1740098 -1461678 -931511 -289926 -922634 -659914 -602708
7269 -602708 -1248205 -377124 -108035 -607821 -1335810 -837238 382375 -386066 -429751 -563699
7259 -563699 -1379227 -401460 -1010406 -1447406 -830225 716867 923736 797781 -684144
7250 -684144 -1032178 -1009513 -544755 551248 140166 768770 249461 -244290 -221842 -950358
7240 -950358 -1249398 -610269 -186756 238391 349492 117117 69653 282280 -118870 -55576
7230 -55576 47765 486222 -44089 870438 932595 -20567 -532202 -331617 -323983 308974
7220 308974 168856 71776 -92680 235207 579261 168517 149002 -624031 -374201 -161967
7210 -161967 383005 687674 391899 138422 -628434 -927016 60851 -211986 -83882 6814
7200 6814 -400035 -566110 -409204 812637 792379 1121310 28692 -371581 205048 -127877
7190 -127877 -495968 -516287 473245 1028007 793762 650773 1090932 1206338 526722 624517
7180 624517 422377 987662 1578065 491466 685371 715966 847785 1399302 2062805 1867624
7170 1867624 1414311 1046702 1334293 1650852 1000163 439162 1160076 1716947 2016106 1523150
7160 1523150 1060564 1408128 970288 283264 6815 275220 114967 135948 741712 1810880
7150 1810880 2245369 2247954 2557648 1523261 920185 1128100 1088666 2286820 2898341 1958192
7140 1958192 1844655 1776789 2015696 1780364 2281032 2181489 2050596 1087966 834567 1565153
7130 1565153 1913867 2097968 1526793 619538 496316 1446024 1090418 1801251 2675064 2739810
7120 2739810 2958163 3232169 2774558 2337690 1906914 1934541 1534582 1632540 1721354 2517940
7110 2517940 2558454 2090946 1780327 2809703 2511449 1879345 3109808 2829805 3254813
7101 3254813 4334860 3435959 3556551 3735938 3704113 3879620 3659578 2923555 2845287 3613336
7091 3613336 3512351 3839201 2908755 2599069 2845527 2290860 2984117 2652462 3306373 2827268
7081 2827268 2787572 3007918 2985202 2278766 3033751 3346772 3585355 3359957 3829203 3519720
7071 3519720 2043795 2456385 2832888 3664769 2968613 2581602 2866927 3589056 5153037
7062 5153037 4577418 3596922 4435274 4512151 3323741 3060884 3564858 3070632 2979503 3617195
7052 3617195 4637185 3067949 3853962 5167748 5391844 4856004 4390157 4454207 5358894
7043 5358894 4822043 5197947 6106448 5383447 4483640 5350924 4833041 4896294 4547463 4436120
7033 4436120 4695349 5668195 5791725 5458679 5610610 5440268 5437521 6067034 6428591 6158885
7023 6158885 5818159 5707314 5793533 6867712 8425441 7183758 6887401 7958491 7627062
7014 7627062 7485417 7793372 8445858 8616505 8126761 7387096 7783824 7748576 7430099 8754556
7004 8754556 9169576 8664856 9707879 9696813 9904211 9608852 9792023 9944164 9769800 10228000
6994 10228000 10051528 10428366 10919003 11121078 13549141 16008626 15841239 15507255 15204394
6985 15204394 15814508 16138555 16484224 16165862 15923260 15767745 16367107 17520082 18649967
6976 18649967 18776593 18908225 18661526 18906876 19018098 18315181 18009649 18712481 18287465
6967 18287465 16786315 16962254 16190710 16758296 17568012 17016298 16491627 15338129 14531561
6958 14531561 14075553 14638233 13462943 13286579 13096060 13384706 13444390 12676463 11778513
6949 11778513 11472703 11157421 11813349 11587858 11976697 11803386 11801448 11194840 11256962 11068288
6939 11068288 10734121 11294083 11979143 11153162 9759907 10102585 10940171 10570797 10590241
6930 10590241 11793512 12425835 13189233 14220268 14396992 13252074 13441389 14202581 14436782
6921 14436782 15249450 15844898 16030274 16363368 17933399 16888666 17581576 18906638 18669970
6912 18669970 18548414 17932811 17948663 17552842 17208913 17598941 16313443 15811303 15952425
6903 15952425 15258013 14737929 15061290 14824141 14009402 14221117 13424865 11860330 10959184
6894 10959184 11776395 10720153 9646905 9890329 10415916 9769594 9669068 9056741 9121824
6885 9121824 9067481 8850703 8004440 7944134 8120121 8256470 8044590 7675542 7560006 7318674
6875 7318674 7074371 7996564 7190543 6967896 7234512 6782391 6362592 6141420 6506982 7330274
6865 7330274 7671476 7448601 7069227 7424898 7134540 7426356 7652829 8505035 8233968 7517517
6855 7517517 6910348 6629689 6217730 6547721 7188034 7517468 8635754 7647923 7053180
6846 7053180 7040680 7468294 7169695 7534537 7929205 6515399 7384336 8168106 9147849 9055576
6836 9055576 8896634 8420761 7874335 7568037 7370624 7297747 8698119 8662331 7944350 8110491
6826 8110491 8469853 8400903 8490768 9307465 8666848 8386501 9871270 11135760 9733571
6817 9733571 10046464 10629342 9921449 9146875 10555218 10234570 10434538 10465589 10927917 10285938
6807 10285938 10727459 10776412 10553889 10834837 12037559 11431274 10796495 10358945 9747431
6798 9747431 9902639 10239965 10742865 11228045 11310714 10952054 10424168 10123430 11221234 12383835
6788 12383835 13149750 13092756 11972053 11877416 12940526 12478968 11590872 11515827 12494881 12011838
6778 12011838 12611529 12259013 12086369 12486622 13468619 13840592 13671655 13638814 14055911 14976552
6768 14976552 14103631 14512472 13965734 14438303 14472831 13951067 14718048 14752301 15726290 16125251
6758 16125251 16491267 17298744 16532759 15263236 16459565 16299340 15794205 16176285 17251897
6749 17251897 18862759 17929606 18397161 18574485 19684526 19919965 19713847 20476858 21294114
6740 21294114 23293813 24038242 24821871 24106728 24254204 24605854 25863503 26572163 28077883
6731 28077883 28420348 27640257 28398312 29170603 30249879 30431341 31103699 31852313 31331999
6722 31331999 31065580 31412093 31100356 31777582 32546684 31406612 30679057 30605459 30661113 31079291
6712 31079291 31563564 31921484 32782825 33042455 32479618 31996806 31887152 32306659 31795738
6703 31795738 31327523 31972143 31791834 30856493 31401931 31471092 31804467 30934904 31002185 30663300
6693 30663300 29602365 29973642 29871247 29042280 27927352 26179116 26111058 25608055 24645987
6684 24645987 24259482 24158638 24482236 24597638 23438706 23705809 23415565 22172294 21287407
6675 21287407 20461577 20440527 20719674 20215385 19469230 18626590 18681168 18812628 18418771 18748421
6665 18748421 17772074 19395908 19632006 18226112 18076745 19414291 19403570 19166599 18874028
6656 18874028 18135823 17702840 19179671 19808850 19403448 19208436 18895032 18785643 19563191
6647 19563191 19254348 17870229 18779088 19258870 19921280 19162314 18929389 18659392 19209257
6638 19209257 20327209 19682187 19226957 19313523 19095913 19596826 19409403 19786483 18706841
6629 18706841 18553423 19307402 19617837 19268811 19916586 21234868 21321725 21034607 20377359
6620 20377359 20501896 20299022 20509841 20657514 21761386 21540276 21054511 21275039 21438926
6611 21438926 20676692 20019645 19911000 20618429 19177893 19800300 19983777 21377467 22527276
6602 22527276 22096152 22049538 22328843 21259306 21205473 22121666 23771755 23356490 24331073
6593 24331073 25359641 23584130 23238529 24330274 25257968 24970146 24869749 25744110 26638019
6584 26638019 26215508 25021857 24778437 24829181 24511565 25525010 25219200 25946024 25765146
6575 25765146 25525408 26334983 26131158 25998143 26685667 26943087 27827184 28238698 28345442
6566 28345442 28119483 28486338 29494335 31054294 31537692 31116049 30903579 31510012 31637773
6557 31637773 32370200 33267744 34866365 35296220 36121648 36696508 37089695 37050279 37259990
6548 37259990 36994657 37408057 38646456 38900980 38341089 39039512 39126973 38821173 38781412 37619485
6538 37619485 37158941 36656764 36739983 35878390 35200777 35016663 34618575 34145886 33079213
6529 33079213 33054958 32678071 32233776 32125850 31657349 29955453 30066203 30255131 30617101
6520 30617101 30346071 29129137 27318197 28124452 29312945 28314334 28503753 28495591 27515048
6511 27515048 27867448 27873239 27518997 28429772 27838034 27270785 26952188 28199857 27370160 27679674
6501 27679674 27762137 27151455 27239153 27630796 27669274 27605106 28081680 28287413 27444348 27834880
6491 27834880 26915997 28110403 28443000 28850142 28919480 28134790 28131377 28216150 28426242 29159622
6481 29159622 29995319 30042942 29508792 30016859 30442815 30421004 30721113 30817099 30100294 30834430
6471 30834430 31307460 31971216 31953709 32818411 32951705 32701395 32542203 32671871 33312886 32812170
6461 32812170 33390592 33172306 32606549 32688481 34068162 33482132 33333201 34130523 34805220
6452 34805220 34384495 34570592 35841297 36479826 36154523 36131853 35531792 35995931 35820157
6443 35820157 35919758 36370308 37265606 37138290 37527776 38187582 38034409 38538943 39122576 40275285
6433 40275285 40620678 40985430 42419920 42118411 41918433 41252672 42120469 42814382 43976273
6424 43976273 44253241 44254408 45326206 46358274 47042294 48872730 49187828 49812107 50983003
6415 50983003 50594220 51289120 51766754 51573904 52822454 55017358 56895473 58000504 58581070
6406 58581070 59136808 61032076 62260916 62316399 64142911 66601141 68476666 69544378 72034400
6397 72034400 73607198 74138190 77049586 81101586 84481860 87592550 90295618 95382620
6389 95382620 101575704 109851407 117504355 124058791 128507143 129751247 132740303 133937001
6381 133937001 132614185 133525790 133054151 132947990 132590751 132197387 131565392 130594448 128269819
6372 128269819 125809436 123866209 121117099 117474303 112365329 107644871 102019972 96269081
6364 96269081 91052788 85754048 81633032 77731810 74912383 72242430 69282779 66259653
6356 66259653 64880433 62737194 59968728 58124402 56153536 54110951 52627908 50768490
6348 50768490 48107031 46399083 44997536 43526165 40751576 38620882 36731630 35528560
6340 35528560 34507688 34343907 33477092 32686614 32334353 31916970 30830848 30447628 30996016
6331 30996016 30259733 29806456 30252321 28202038 27859184 28552873 27352448 27643828 27971689
6322 27971689 26971304 26116993 25928959 26260799 25737088 25680815 27120523 25641719 24966023
6313 24966023 25650437 26089370 25332674 25316599 24136480 23536610 24027732 23403979 23503156 23680292
6303 23680292 23815853 23225113 23482836 23910479 22978689 22492018 23142796 22734607 21468958
6294 21468958 20459929 21614662 22429824 22300051 23418154 22063214 21742235 22227469 22004891
6285 22004891 21118120 20588357 20734078 20828776 21240272 21311704 21061118 21031407 20763188 20428146
6275 20428146 19779162 20178711 21399436 21423588 21501387 21680153 21591839 21222709 21482158 21910911
6265 21910911 21280267 20636042 22110054 22502536 22917762 21765135 21088747 21982624 21995296
6256 21995296 21598847 21261578 20611079 20477718 21385170 21330188 21156425 20989316 21124899 21065853
6246 21065853 20791259 21070473 21332047 20912546 20983209 21693403 22110433 21890710 22214666 23177181
6236 23177181 21559735 20608796 20632022 21202447 22771245 22435842 22587085 21840136 20883059
6227 20883059 21691872 22275752 21931492 22528642 23042758 23115838 23067851 23019221 23202964 22550862
6217 22550862 23461128 23032483 22384036 22704715 23490012 23925404 23605161 24044552 24608272
6208 24608272 24946800 24897800 23679413 23420540 23910392 24360612 25148640 25969120 25414205
6199 25414205 25120967 25096387 25214790 26258920 25513537 26669012 27997325 27777325 27442975
6190 27442975 27377248 27262594 27010676 27395418 26763301 26564189 26885781 28733087 28506164
6181 28506164 27723695 27910665 27935902 27479882 28082961 27412166 27676987 28918964 28736080
6172 28736080 29332813 29377735 29462209 29702746 29859380 29673818 29469513 29400034 30179185 29765361
6162 29765361 29256973 29729573 29355345 29448610 29164706 29058583 29176320 29083267 29414366 27875798
6152 27875798 28341792 28174749 28569999 27921238 27318278 27669144 27366757 27146656 26295012
6143 26295012 26412679 25833160 26396907 26149873 25898814 26212623 25641227 24889170 24099374
6134 24099374 24284637 23193444 23320925 24113297 23136826 23370931 24515168 23850746 23699320
6125 23699320 23409010 22795388 22069493 22467807 21238554 20783496 21449059 21880725 21212565
6116 21212565 21514107 21578604 20981611 20708694 19906587 20511218 21156168 22038611 21237259 20224095
6106 20224095 20345798 19847208 20999873 20547597 20636012 21358291 21059009 20570088 20543780 21797996
6096 21797996 21388911 21189602 20573852 21432008 21680279 21149955 20919257 21200829 20565408
6087 20565408 20737338 21091171 21290863 21318321 20910154 21181368 21794138 22403045 22159567 21805218
6077 21805218 21471942 21840404 21797306 21479489 22870017 23143953 22533792 22609782 21713913 21326329
6067 21326329 22095031 21944828 22255913 22904225 22707674 22705021 23175476 22953602 22170995 22345956
6057 22345956 23003984 22689008 22913066 23526050 23253762 22418823 21417877 21918134 22835753
6048 22835753 22751994 22450369 23106462 23355947 22729958 23138003 22549094 22847314 22484998 22871344
6038 22871344 23027774 23955062 23604531 22764762 23172018 23432414 24019950 23616051 23144033
6029 23144033 23176306 23499714 23153312 23152262 23862812 25197538 24863979 25135368 24736014 25065289
6019 25065289 24649273 24228363 24614229 24523676 24725389 24734261 24384754 25342883 26042204 24876885
6009 24876885 25074442 25389521 25821565 25324998 25073532 25659363 25469168 24645874 24897994
6000 24897994 26423146 26366994 27012225 26771778 26653864 26222867 26545041 26421132 26709505
5991 26709505 27304065 27072468 26852572 27077477 27177768 26952736 27963598 28221466 28990542
5982 28990542 29172328 28977221 29008045 28710841 28546160 28906895 29487287 30000213 30614053 31167619
5972 31167619 31443238 31272272 31281129 32912306 33478695 34715397 34870692 35779669 36010161
5963 36010161 35572816 35728143 36073776 36996411 35534037 36199278 36890962 35197580 35631589
5954 35631589 36570327 36032322 34793483 34843926 34792453 34409307 33809843 32525620 32441414 32392620
5944 32392620 31580064 31178689 30974590 30288400 30014502 28959485 28763622 28214427 28296875
5935 28296875 28018510 27979103 26895924 25766749 26095231 25566477 26705998 26214839 25805214
5926 25805214 25748521 24490867 23453688 23666808 23914354 24211032 23831385 23419848 22844705
5917 22844705 22165407 22453480 22299895 22369371 22266401 23161222 22871150 22327525 22133274 22482164
5907 22482164 21726451 21755619 22863698 22711818 22697199 22151056 22630588 22364052 22543571 21846169
5897 21846169 21839250 21955076 22523677 22353313 21812126 21807424 21990288 22117819 21324945 21378693
5887 21378693 20895521 21136197 21846978 22006917 21520466 20760361 20072411 21122143 21420428
5878 21420428 21231967 21264619 20715132 20412310 19479858 19326189 20116548 21408027 22443973
5869 22443973 21933400 21779624 21810308 21297265 20856162 21135110 21717421 20794161 19604059
5860 19604059 18921201 19947850 19647869 20058881 20546298 20466186 20454103 19977531 21175278
5851 21175278 21170775 21789130 21718155 22332017 22022558 20811062 20188566 20606656 20078166 19888564
5841 19888564 19609914 19886531 20164285 20026120 21101101 21359021 20506963 19909076 19210255
5832 19210255 19506767 19453085 20403168 21273909 20935959 21042937 20874293 20650598 20772834 20908883
5822 20908883 20611741 20529175 21316063 20175755 19876783 20497700 20226988 19589000 19347200
5813 19347200 19994666 20625034 21539529 21668748 21685292 20897818 21332585 21878718 21661005 21399308
5803 21399308 21009784 20690803 20765130 22079479 22233558 21662702 22113322 22210150 21514947 21733062
5793 21733062 22444854 21530359 21162498 20640405 21362642 20956876 20006744 20594897 20542199 21659569
5783 21659569 22191144 21304614 20707353 20626604 20590289 21140844 21693296 21635701 22357738 22465095
5773 22465095 22320853 21442384 21470354 21275564 21154757 21841281 22838159 22267679 22072183 22040350
5763 22040350 23360004 23929690 23526207 22402242 21417001 21079098 21482942 23200640 23692575
5754 23692575 21601915 21362824 21402481 22529775 23350191 22851974 23604551 23964157 24407718
5745 24407718 23840299 23004652 22223032 22630598 22679731 23047777 23617907 23195903 23339972 23654255
5735 23654255 23953286 23289297 23591862 23364907 23409903 23901513 23432134 24639854 24311514
5726 24311514 24308827 23830806 23269177 24070761 24362492 23178058 23062052 23476371 23704244 24422104
5716 24422104 25108745 24736594 24997063 26589528 26384674 26203870 25150926 24273719 23900794
5707 23900794 24747240 24685808 24186217 25153417 25470540 25081778 25934160 26860682 26843966 25856039
5697 25856039 25337787 26216993 26610744 27201022 26564836 26485621 25982865 26636062 26755003 26798693
5687 26798693 26782342 26407800 25944405 25564269 26344632 25756087 26307368 27586277 27000640
5678 27000640 26169769 25869151 26555867 26939835 26406755 26571108 26881525 26560304 27093443
5669 27093443 27252791 27552712 27040341 26984101 27947935 28400276 27421493 28067764 28983459 28885503
5659 28885503 29298227 28645083 29237901 30139868 28918638 28696484 28518919 28502986 29031727
5650 29031727 28754675 29200789 29163612 28235388 29253727 28983260 28434267 28206795 29148276
5641 29148276 29679043 29454798 29224008 28982235 31314155 29972009 29773079 30963505 30683557
5632 30683557 31407060 30717128 29503021 29250172 30808776 31331008 31196262 31269526 31104788
5623 31104788 31767834 31416358 31434546 31820977 32087346 31919918 31213368 31701913 31202430 31521461
5613 31521461 31490216 31862571 32572474 32329681 32477999 33096827 32347673 32009277 32724832 33743123
5603 33743123 34456532 35213323 34703778 34946460 35146895 35284750 35303069 35365513 35895469 36696121
5593 36696121 36757412 36228035 35989891 36035112 37371128 36722211 36658774 36715946 37871287 37316064
5583 37316064 37017761 38223232 37716881 35868073 35919327 37027401 36741703 36563242 36677190
5574 36677190 36157264 36729015 36158955 35559768 35702933 35816164 35976173 36662379 35809660
5565 35809660 35647737 35380004 36235024 35943628 35944607 36001507 35744000 35589183 35303455 34656669
5555 34656669 35473493 36003611 35591477 35409847 35825562 34412309 34623797 35285318 34562379
5546 34562379 34544383 35602055 34725421 34621918 35061032 35524261 34961018 34039046 34890464
5537 34890464 34794320 34079012 33923422 35417027 35955540 36216971 35500353 34828623 35504401
5528 35504401 35423578 34982018 34834927 35209672 35480573 34613093 34536890 34490885 33624505 33019249
5518 33019249 32987995 32920907 33580917 33302270 33729338 33900296 33848522 33374226 32403534 32173255
5508 32173255 33266196 33194960 32608497 31047250 31117982 30493457 30107188 30318321 31695172
5499 31695172 32583803 31651436 30419609 30342459 30514178 30598767 30346179 30345569 30664879 30897623
5489 30897623 31030124 32070911 31151354 32044775 30970621 31951289 31957497 30805240 30843910
5480 30843910 30599105 30581396 29833926 29869512 31034689 32520801 32943487 32233017 31442406
5471 31442406 32112382 31526578 31593347 32153922 31733204 31338527 31647613 31984588 32266368 33278956
5461 33278956 32279098 31810317 32584414 32075608 33066956 34068243 34366521 33751198 33301690
5452 33301690 32845071 33742337 34285587 34457138 33254599 33848887 34479715 34828216 35128647
5443 35128647 35339697 34968325 34845514 34630123 34604204 34363786 35093495 35635077 35266976 36059730
5433 36059730 36300114 36378199 37123103 37589948 37600867 37378741 36793285 37068182 37403441 37228796
5423 37228796 37612928 37156534 37865828 38311220 38160663 38060776 38860905 39080979 39146011 39457724
5413 39457724 39212805 40542140 40748093 39360393 39445613 39196396 39469704 40290376 40503345
5404 40503345 40800364 41556201 41472521 40538839 40054782 40205405 40940415 40867566 40345746 39990011
5394 39990011 39966990 39982599 40735302 40519357 40470039 39049002 39371333 39536658 40092170 40008156
5384 40008156 39335501 38879077 39587948 40586656 40198384 39961961 40045925 40050419 39898045 41403975
5374 41403975 41691837 40592803 40017816 40976820 40552367 40771036 41490538 42371981 41634941
5365 41634941 40677190 40634945 40904075 40748580 41010966 41561367 41669133 41585097 41153701 41088991
5355 41088991 40780175 40573738 40332783 41870861 41417323 41346787 40924017 40831812 40996025 40996344
5345 40996344 41757394 41830328 40811551 40527498 41297888 42143550 42576758 43641960 44356126
5336 44356126 44736137 44198133 44498478 44706902 43997293 44127784 44383443 44101141 45088264
5327 45088264 46347518 45064406 44996995 45230017 46059548 45621415 45937114 45534014 45709039
5318 45709039 46502848 47335983 47689512 47524658 47060373 47648398 47333821 47668373 48265374
5309 48265374 46875036 48379018 49119296 48923270 48850346 48829912 50016662 50478989 50806251
5300 50806251 50693882 50615219 50846817 50389109 50525815 51251301 51958340 51851685 52201846 52042937
5290 52042937 52720581 52788249 52841655 52790407 53530345 55397661 55095723 55475056 55090400 55362009
5280 55362009 55868180 56126771 55728230 55834406 57025573 57177331 57203267 56803049 56883218 56722847
5270 56722847 56244129 57792998 57928963 58529675 59056095 60382433 60778192 60350258 61170338
5261 61170338 61942480 62041116 61721341 62667837 62360838 62530053 62669404 64284491 64420555
5252 64420555 64519993 64708865 65322092 65262686 65237666 65587382 66183871 65987534 66514487 67811656
5242 67811656 67787499 68609938 68332986 68748336 69805480 69391978 69304559 69367246 70337151 70466471
5232 70466471 69979558 71725455 72740109 72613739 72178824 72166214 72773205 73818221 74042864
5223 74042864 74510458 74839499 74047320 75983381 77034465 77421987 78301659 78063925 78395080
5214 78395080 79296627 79979326 79845193 80584450 81017772 81518958 81588458 81237255 82638828
5205 82638828 83760579 83280124 84736996 85723238 86974295 87534823 88472308 88799937 88982122
5196 88982122 89264438 88910845 89489342 90090385 91044028 90981348 91672272 92667731 93896662
5187 93896662 94982043 94791045 96231359 97468325 98307778 99224324 100465479 101604975 101973789
5178 101973789 103166725 103682686 104371274 106045596 107179136 108367718 109300316 110226968 111985984
5169 111985984 112611792 114784039 116008012 117122889 118931981 121160340 122842299 124190007
5161 124190007 125016738 127487479 129768276 131030462 133903774 135300029 136739725 139121721
5153 139121721 142531459 145275350 147375257 150343885 153139598 155880434 159056214 162403891
5145 162403891 166098621 169722177 174003438 179185846 183574265 189869100 196155199 201745903
5137 201745903 209016499 217337311 226804242 238919991 254450838 267404221 274614701 279442013
5129 279442013 282539576 284761734 287390925 291107990 294129269 298004309 302481368 308223060
5121 308223060 314265712 316006062 316223905 313960296 310282793 306089592 299493419 291382794
5113 291382794 281211978 273224866 265941544 256744093 247256658 238137527 230767953 224267614
5105 224267614 218677195 211339495 203603207 195022208 187526713 180506536 172746148 165086712
5097 165086712 157971276 151233478 146159840 140864018 135134036 130435997 125469146 121531437
5089 121531437 116241008 111731893 107964711 104839385 102378173 100683062 98319886 96092042
5081 96092042 93933216 91468129 88451136 87069517 84636730 82548787 81034267 79457162
5073 79457162 79726829 79059803 79035971 78840145 78686356 77919293 77370288 76764792 76555691 74813011
5063 74813011 74921495 75525687 75627803 74541001 74815693 74628847 74122940 72164300 70853372
5054 70853372 71636744 71471250 70210013 70277685 70270667 70153571 70537347 69398959 69220145 69446497
5044 69446497 68063220 67442700 68145539 68227454 67647310 67050861 67509555 67844091 67042966
5035 67042966 67136782 67007129 66693507 66895387 67018827 68056664 68968743 68796834 68307769
5026 68307769 68125504 67518460 68976925 68531505 68655620 69303039 69147891 69128333 69265985
5017 69265985 69658737 69948246 70673120 70957020 71215822 71663414 71983149 71667929 71811462
5008 71811462 72788026 73348177 73752672 74139931 73710313 73056789 72157550 73062991 74408372
4999 74408372 73672196 74662257 74700298 73813236 73500870 73291116 72823541 73394613 73679226 74518907
4989 74518907 74957549 74641423 74135313 74233133 74096819 74950659 75287032 74087369 73133386
4980 73133386 73544867 73263065 73514290 74487756 74060891 74289605 73896369 74231075 74579002
4971 74579002 74675666 75469083 75252838 75584593 76118838 77344765 77484079 77741272 78681270
4962 78681270 78198016 77366056 77485807 77782932 78022306 78680357 78550828 79490461 80425368
4953 80425368 80810683 80357460 80179510 80683123 81150553 81194604 82499479 83249488 82181183
4944 82181183 82012309 82380733 82654601 82875993 82856907 83463481 83183772 83122220 83550095 84081784
4934 84081784 84511257 84896976 86043658 85636793 85382005 85070004 85937302 86189369 87394578
4925 87394578 87549897 87749884 87759004 87173717 87751036 88027887 88704109 88786596 89491903 89386857
4915 89386857 90313020 89770681 89760236 89893590 90665437 90235981 90068158 89988838 88770574 89199500
4905 89199500 88964271 88289570 87422905 86102722 86424863 87110660 86223756 86035791 86288605
4896 86288605 85935435 85388231 84057844 83385248 83312365 83152616 82498712 81045368 80137640
4887 80137640 80306395 79131527 79477358 79193402 78553834 78200916 77511201 77529679 77874488
4878 77874488 76883818 75811548 76181693 75086078 74352958 72565137 72244638 72318924 72291313
4869 72291313 72080450 72198820 72215362 71403827 71831459 71394114 71860641 71963847 72798981 72340016
4859 72340016 71946630 71125464 71324109 71390095 70126015 70490173 69154087 67987778 69210294
4850 69210294 69506946 69223494 69897481 69857878 68804760 68394679 68831363 69377737 70175262
4841 70175262 69471592 69991047 70296364 70021397 70035579 69557872 69276203 69492116 69256993 69703617
4831 69703617 68895059 68191012 68185141 68096333 67663567 68369596 68958639 68047124 68157448 67904049
4821 67904049 69080026 68626689 69068837 69873294 70050879 70509511 69622432 68946158 69384374
4812 69384374 70096933 69887032 69827285 69770843 71417432 71486240 71476484 71334779 71304818 71260584
4802 71260584 70607440 70523884 71174219 71752510 73073841 72680867 71385215 71023699 71905116
4793 71905116 71795302 72981961 73860867 74023808 75168809 74319537 73866450 74208985 74837668
4784 74837668 74446955 74857893 74229289 74642346 74995292 74989069 75389265 74881384 74359873 74468666
4774 74468666 74902854 75455224 75483726 75432816 75999503 75877122 75467966 75524627 75241318 75847778
4764 75847778 75840100 75706625 76023721 75846239 76582873 76008719 75618611 75716720 76325516 76233502
4754 76233502 75993658 75436347 75328198 75206798 75512802 75422370 75165903 76011785 77014948
4745 77014948 77193798 76846841 75959276 75824241 76827308 76136291 75255499 75601392 75419873
4736 75419873 76659719 76543970 75706947 75817392 75411830 76038364 75289635 75371946 75441641 74598691
4726 74598691 75359425 75683656 75673899 76043919 75462476 75483262 75725827 76803264 76570390 76859128
4716 76859128 76783694 76376627 76047180 76760361 77523336 77327162 77467754 76993512 77224982 77742113
4706 77742113 78537664 79732316 80010839 80311030 81342724 81076471 80995582 82026390 82567023
4697 82567023 82934749 82867113 83772620 83393624 83716034 84629150 84556480 86259050 86405986 86741937
4687 86741937 87329357 87726233 88543552 87875024 88375898 89188354 89231423 89890392 90565022 89216784
4677 89216784 90303497 91706568 91569081 91759823 91661542 91488924 90379269 90714973 91861126
4668 91861126 92715805 93142944 92958725 93357217 93690699 94189029 94099973 94685834 94646750 94578142
4658 94578142 95184723 96337317 97142754 96958736 97724568 98300012 99298176 99929962 100537638
4649 100537638 100379117 101161011 101616721 102834746 104247201 106016225 106547827 108263581 110244911
4640 110244911 110037938 111029104 111843149 113377251 115140631 115711493 113976836 114644872 116186754
4631 116186754 117501153 117417115 117205936 118478628 118263699 117988881 116632760 116101233 115607830
4622 115607830 114257774 113409503 111686800 111012851 109908738 107371770 106638280 105830146 104548942
4613 104548942 102644809 101640284 100887714 99373315 96693275 95821136 93807222 91977398
4605 91977398 91319742 89892525 88222609 85984957 84978383 84772131 83668069 82464615
4597 82464615 82174916 82452178 81516236 80017047 79664741 79862235 79027106 78365004 78074373
4588 78074373 77093371 77101047 76247793 76374898 74765386 73518116 73376588 73102210 72508685
4579 72508685 72052601 73289967 73373145 73698540 73657767 73075353 73254835 73082126 72599691 72465685
4569 72465685 73398047 73222652 74024189 73752981 72824294 74766660 74035387 72928573 72578180
4560 72578180 73359348 73526533 74233852 74759985 75153605 74798226 73803789 75355501 74567079
4551 74567079 74597121 75201821 75259708 75136390 75139896 75290943 75315768 74838053 75395568 76144766
4541 76144766 76138056 75538181 76317129 76808558 76743175 77596169 78429903 78087801 78602280 78709206
4531 78709206 78737269 79509626 80072614 79546547 80337745 81443427 81869567 83149533 83598772
4522 83598772 84566112 85800049 85325391 85567237 86200356 86074943 86444719 87333794 87020445
4513 87020445 86066112 85675679 85224865 85561004 84882961 84022822 83706594 83865282 82212490
4504 82212490 82220062 81714176 81522357 79695957 77814730 77369805 76125983 74736536 74285356
4495 74285356 73298310 71814387 71171056 70988697 70154677 70465114 70187610 69808310 68676524
4486 68676524 67853165 68035589 68063980 66860213 66444947 66377912 65386747 66003143 65675765 64856103
4476 64856103 64435121 63760340 63235907 63454164 61966236 61131779 60717238 61510628 61433469
4467 61433469 61362873 62239463 61485773 61841026 61681456 60985470 62049013 62167018 60933977
4458 60933977 61132545 60865442 60406880 62200079 62625395 62482424 61677277 60890797 60878695
4449 60878695 60980746 61391222 61062208 60940661 60796338 60684248 61700000 60414804 60672629
4440 60672629 61540527 61798662 61498614 61924315 62863713 63221612 62873273 62626715 62152714
4431 62152714 61695489 61402171 61796426 62166949 61437268 61603126 61641260 61759157 61502491 61383888
4421 61383888 61355198 62170062 62556044 61473900 61852047 60920582 61763805 63017039 61426093
4412 61426093 60896468 61237907 61564951 60620983 60250919 60452113 61764071 60866273 60819480
4403 60819480 60585501 60955640 61114787 60290284 60691754 60339956 61644851 62152360 61072454
4394 61072454 60578064 60645348 60983308 60972065 60234129 60931931 61386602 61005252 60701540 60378455
4384 60378455 60728366 60183739 61139009 61136298 59952127 60888598 61503753 61737284 61370064 61398273
4374 61398273 61887397 61475748 60419427 59784955 60264446 61207753 61560835 62554720 62564850
4365 62564850 61428175 61386129 61714987 61759739 60391714 59661419 59921900 61252547 60521272
4356 60521272 60557091 60304245 60572532 60876315 61066059 61104693 61131541 61374884 60785697 60251869
4346 60251869 60450706 60108130 59861239 60077886 59019801 58943647 59636315 59933148 58347750
4337 58347750 58835631 59332022 60123602 60831931 60775459 60516924 59828745 60081285 60283963 60208220
4327 60208220 58531683 58197821 58921522 59100491 58758458 58233989 57823830 58425402 57577019
4318 57577019 57538990 57960883 57738712 58130559 57510421 58233598 57763381 57082153 57211556 58054384
4308 58054384 59063231 58697512 57940598 57718847 55898178 56734790 57108349 56020602 56541435
4299 56541435 58283104 58343763 58712336 58014803 57810165 58001472 57936075 57291455 56906369 57839000
4289 57839000 57919780 58327361 57812668 57452152 57553073 57577080 58071029 57550315 58088178 57940798
4279 57940798 58791600 58507197 57637079 57571241 57845692 58023435 56927790 56874692 56968923 58161474
4269 58161474 58056608 58660894 58237648 57969943 57659302 58195023 58967827 59004083 58745596 58805196
4259 58805196 57863928 57521822 57614672 57104243 58502777 57504316 58210177 58354217 58057851
4250 58057851 57976093 58127138 58547075 58907975 59654365 59285394 59513153 59516712 59610102 59407685
4240 59407685 59508425 59676244 59274381 58871239 60647348 60631611 60663829 59873644 60262616 60100286
4230 60100286 59051893 59283694 59966973 60014783 60346261 61180785 59563827 58515042 58925994
4221 58925994 59461918 59348780 59068841 60470719 60109711 60927387 60505254 59868534 60047367
4212 60047367 59874726 59556333 58937700 59877929 60106000 60798645 60067152 59451081 60505460
4203 60505460 60690052 60622485 60857984 61508981 60446110 59041730 60008830 60772807 61160796
4194 61160796 61924929 60518148 59992435 61208027 62135693 62851252 62383044 62713228 62104592
4185 62104592 61600901 60599255 61097816 61625413 60727845 60560206 61641772 61522650 61881513
4176 61881513 61774798 61208317 61895909 61863078 62208072 61525983 60292344 60353315 61766309
4167 61766309 61928691 62034029 61974097 61298301 60875580 61041150 61192864 61758728 62244167 61862538
4157 61862538 60976866 61316770 62355278 62163431 62298907 62485065 63223096 64214390 63481680
4148 63481680 62627351 62255910 63776180 64379526 63165616 63631822 62880418 63109715 63435398
4139 63435398 63007296 63644879 64296345 64402208 63870390 63440096 63956847 63740244 63964289
4130 63964289 63475518 63577215 63973636 64193878 64524618 64574470 65275600 65010308 64636415 64825201
4120 64825201 65418102 65646469 64703992 64685327 64847465 64990617 64428780 64502088 64039076 64777049
4110 64777049 65148493 65004306 64379954 64985397 65350432 66089592 66500355 64992816 64677083
4101 64677083 65244749 65364734 66273526 67198986 66402640 65602817 65010079 66359745 66888779
4092 66888779 65950865 65231104 65721840 65795738 65486259 65933068 66737740 67041505 68118188
4083 68118188 67314567 66421764 65712514 67147338 66617984 66052490 66739231 66489632 66743086
4074 66743086 67289188 67672481 68241851 68004038 69126412 69423775 68840486 68380512 68423671
4065 68423671 67813086 67410657 68653813 68313167 68393139 67905026 68910839 68864287 69430790
4056 69430790 69935562 69313092 69360997 70600141 69424833 69047609 69658229 69992306 70269317
4047 70269317 70404494 69961616 71046625 71449367 71031562 71021551 69961962 70083732 71911058
4038 71911058 71758366 71194314 71875113 71277551 71306294 70918501 71048605 71696463 72923607
4029 72923607 72250207 71727721 71805167 71951203 72495802 72718791 72436119 72547769 72248757 72097138
4019 72097138 71615310 72288183 72543215 73568356 74055200 72604152 72198767 74125494 74103452
4010 74103452 74391514 74362188 73747399 74100311 73839496 74737748 73932345 73777854 74546513 74990655
4000 74990655 74994012 74364281 73854784 75470410 75421612 75880357 76509398 75514956 76195817 75876903
3990 75876903 75629293 76076247 76446392 76955478 77129963 76978391 77551352 77060151 75972136
3981 75972136 76603956 77233470 76442783 77661108 78683563 77948691 77242254 77437793 78559274
3972 78559274 78408910 78474962 78835935 78710999 78746689 79401161 80069364 79362640 80551717 80690754
3962 80690754 81033742 81275452 81153994 80903651 80778269 81512297 81001747 82493926 83019915
3953 83019915 82950002 81612910 80615313 81938882 83123562 83017912 82587632 83238191 84466915
3944 84466915 85022967 84390282 83832851 84116153 83586033 83050008 83755296 84666836 84996864
3935 84996864 85427027 85803186 86462684 86388248 86391947 87266152 87650022 87113988 86289707 87376854
3925 87376854 88085559 88284299 89271020 88967140 89453622 88260539 88397234 89141038 89386283
3916 89386283 90445375 90993601 91200169 91144117 91044598 92156003 92261257 92701097 91950817
3907 91950817 91436834 92561688 92384608 92465632 92933603 92659446 93467383 93289929 93203435 93488546
3897 93488546 93092305 94152387 93825989 93849649 95623946 97002016 96216488 96668565 97000993
3888 97000993 97972136 98583820 97597753 97593584 96635096 95924807 96651878 96975112 97213646 97786983
3878 97786983 98471541 97821204 98715253 98127020 97842788 98060363 98123038 98449104 98331516 97927150
3868 97927150 96976012 98202263 97827088 97953877 97701071 98918580 99442638 98262951 98592865
3859 98592865 99576718 99094128 99175471 98725293 99174522 99261342 99142572 99605845 100540637 101484000
3849 101484000 100995951 101668285 101472018 101688468 101731358 102749279 103420208 102671339 102237344
3840 102237344 102861087 101813495 102328760 103369720 102877967 103422029 103629789 103405894 102580873
3831 102580873 102412217 102675516 102461636 101893299 102371635 103344048 102846461 102125497 102522318
3822 102522318 104110013 103335223 103972195 103432559 103229567 103289885 103912235 103819237 103226894
3813 103226894 103656414 104829509 105137808 105675932 105690824 104785180 104616629 104403719 105800393
3804 105800393 105717990 105814754 104976345 104987769 105229565 105160001 105183751 104966396 104696090 104862578
3794 104862578 105573417 105722305 105136235 105378484 104905667 106325822 106649250 106726168 106824910
3785 106824910 107055912 107564544 107495307 106707583 106334911 107512042 107614593 107902797 107401785
3776 107401785 107903127 108538282 108556198 108905028 108000241 108102051 109855205 110368040 110787178
3767 110787178 110335361 110023683 108770986 108841974 109816263 110471471 110217490 111022309 112247082
3758 112247082 111603949 111520294 112007447 111999180 111922988 112974721 112244144 112212959 113808307 114448425
3748 114448425 114421396 113935408 114590016 114428209 114849912 115697735 115148500 114855953 114956543
3739 114956543 115868384 116150285 115648416 115502567 116534728 117207334 116749801 117937879 117786288
3730 117786288 118153750 117993892 118189860 118583334 118894316 118921665 119806123 120094428 120687443
3721 120687443 121627515 120356965 120640808 120216940 120314036 121005128 121865414 122029667 121390880
3712 121390880 121832043 121380988 122460826 124191732 124485027 124413209 124000371 124007395 124302171
3703 124302171 124007261 123988430 124336451 124888931 125287025 125631239 126354795 125870244 126422156
3694 126422156 126742863 127227837 127687461 126656786 127630704 128234298 127905318 128527199 129419911
3685 129419911 129857153 128641007 128646741 129208817 130026034 130281788 130741774 130343430 130784901
3676 130784901 131149185 131308647 131237446 131543039 131625271 132677923 131468293 133045226 132735707
3667 132735707 133227978 134167274 134706439 134680193 135395831 135821417 135758121 136734678 136694229 136229555
3657 136229555 136687391 137055581 136233801 137516563 138059872 137563915 138069383 138768184 138398972
3648 138398972 139406453 139430121 139386376 139657250 141008215 142059336 142606511 143032764 143602648
3639 143602648 144736263 144480416 144068968 143532051 143358700 143956542 145734166 145897617 146475325
3630 146475325 148049146 147203568 147892350 148646482 149346590 150852785 151211546 151134490 151589117
3621 151589117 150517256 151094065 151752123 152017119 152903353 154228538 154413748 154883740 155662212
3612 155662212 156739567 156405674 156618925 155871700 157412228 159453209 159882630 160721276 161326394
3603 161326394 162161890 162237944 162894807 163352401 163660074 163707715 163402547 164363867 165769149
3594 165769149 167178850 167834407 169199310 169805149 169710845 170561767 171981176 171939643 173183978
3585 173183978 172715303 173188668 174183408 175366390 175152949 176568940 177563821 177304850 178804349
3576 178804349 179775922 181066167 182051357 182519038 183754044 183959540 183679328 184906893 185644572
3567 185644572 187154477 187936222 189231336 190092374 190707538 190953105 191919963 193176186 193700906
3558 193700906 194562071 195806655 196390820 197606967 198770593 200037192 201504026 202199084
3550 202199084 203677473 204700776 205839549 206690099 207591164 208625647 210174298 211108643
3542 211108643 211679473 213896021 214372316 215552154 216409006 217195012 217633006 220434427 222662122
3533 222662122 223654086 224380644 224957289 226258304 228109005 229294893 231271817 232824206
3525 232824206 234264454 236511163 237647896 238855933 240276978 241040390 242640578 244408060
3517 244408060 246733704 248943272 250842495 252554796 253795823 254958207 257179438 259092421
3509 259092421 261010335 262582664 265805903 267421721 269857162 272601455 274272205 276639393
3501 276639393 279074900 281275893 283021999 285703772 287626201 290076398 292412393 294952473
3493 294952473 296866488 299134860 302936293 306443006 309388668 312810032 315882437 317660129
3485 317660129 320493033 324663042 328176140 332171426 335997780 340351339 342883312 347602960
3477 347602960 353041280 358681691 363041700 368257484 373552839 379894955 385292567 390555910
3469 390555910 395158394 399544150 404938675 409759024 414418446 418640005 421333429 422160639
3461 422160639 421955367 421759254 422704980 421917641 420682897 418678986 416222046 413426552 409827316
3452 409827316 405730512 401641860 396541769 390284024 384158192 378044618 371515038 365703745
3444 365703745 357633532 350549021 344369581 339251048 332542123 326276474 319781398 314164979
3436 314164979 309043460 302981471 297233673 292913731 288740388 283110084 278394463 273729319
3428 273729319 268391493 263503144 258957632 253872224 248511560 244377219 240071395 236717273
3420 236717273 232851149 229881862 225067184 221496898 218866078 216227900 213391090 210434580
3412 210434580 207530348 205260177 201897827 197449116 196155312 193811669 191627145 189621827
3404 189621827 187835054 185199570 182710607 180853397 179356223 176550699 174298171 173492485
3396 173492485 172850334 171159830 167684735 166137062 164522599 161888438 161039399 159682205
3388 159682205 158733532 157221613 156363704 154981115 154694849 152322127 151515447 150088237 148443642
3379 148443642 146579468 146176575 145525600 145157834 144287684 142550846 141119119 141006920 141464313
3370 141464313 140644367 138190696 138288616 137345546 136805645 136068453 135567507 135820262 134290868
3361 134290868 134679242 133815805 132741953 130505893 130219561 130211847 130137336 130287978 129495687
3352 129495687 128452645 126905124 126828657 126456713 125283867 124697588 124687293 123338946 122603981
3343 122603981 122806823 121965987 122458979 120475191 120618399 120874726 120904861 120551988 119383393
3334 119383393 118833513 119063386 119245066 118923362 118121924 116141899 116559096 116404668 115797364
3325 115797364 115944521 115485875 114822036 114761207 115073486 114679299 114919694 115036625 114178142
3316 114178142 114314914 115036861 114038023 114051757 113321494 112973398 112407826 111292149 110522234
3307 110522234 111068445 111990045 111903977 111644016 111078440 110480296 111335734 111134639 110070624
3298 110070624 109907820 110285689 110287231 110799954 110316517 110097826 110134686 109637174 109924355 110127699
3288 110127699 109795081 109662175 108401415 108450866 108654931 108080039 108387810 108792735 109061690
3279 109061690 108610077 107384264 107241312 108637496 108385212 106878945 106923783 107987004 108283783
3270 108283783 107561553 107659080 108054920 107661473 107349063 106388284 106748356 105780997 106199094
3261 106199094 106998508 106652229 107528539 108092046 107421628 107616670 107684797 106885850 106611297
3252 106611297 106525444 105800386 105747262 106705936 106974269 106470363 106404167 106150119 106582469 105667893
3242 105667893 105300245 106289559 106823107 106701541 106820891 107377877 106886291 107046692 107721196
3233 107721196 108109153 108185822 108718110 107486904 107140789 108230298 109267073 109457593 109072724
3224 109072724 108862223 109642577 109643866 110590362 111797599 112615889 112789077 112031769 112508253
3215 112508253 112804820 112281137 112994669 113153062 112934066 114036785 114642840 115564852 115868541
3206 115868541 117060694 116748139 116810148 116584908 116638582 118307433 119365668 119843995 121267534
3197 121267534 121358960 122308740 122348077 122565066 123479455 124073036 124083167 124993908 126154420 126478933
3187 126478933 127220422 126981490 127189171 128539274 129824348 129938646 130724609 130342961 131710428
3178 131710428 133649464 133844598 134571425 135233082 136002187 135971446 136174950 138295182 140371591
3169 140371591 141271626 142399346 143097564 144282338 145261799 146185164 146402701 147347790 149571999
3160 149571999 150562653 152171971 154116170 154444616 155018988 157214849 159107393 160804734
3152 160804734 162178380 163146414 164969789 166816159 167867090 168967598 169872888 170958725
3144 170958725 172673952 173873537 174760692 178286461 178535388 178086261 180404326 182505493
3136 182505493 183292299 184714371 186215600 189127033 190610381 191908979 194206199 196048061
3128 196048061 197949690 200290644 201501371 203591619 204709941 207517410 208490832 208971402
3120 208971402 209508783 209668155 210292172 210848598 210224346 210666835 212002250 211860544 211717606
3111 211717606 211240818 211330766 211302424 210786909 208879816 208505238 209059113 209375827 207802338
3102 207802338 207496924 206580126 206193002 206369425 205282758 205095354 205684143 204124471 204166122
3093 204166122 202873641 201155319 199964128 199361763 197397749 195818430 193565456 190711440
3085 190711440 186861767 184626839 182355252 178992740 176859648 174542946 171697835 168963757
3077 168963757 166922300 164541544 161685156 158833749 154964445 152517994 149305726 147207146
3069 147207146 145466324 141530925 139533408 138214771 134772212 131815038 129329609 126844784
3061 126844784 123797354 119573377 117491456 114113161 111533477 109191747 105418614 102542079
3053 102542079 99788516 97550472 93657738 91145247 88476604 86655901 83785772 80443185
3045 80443185 78767431 76586205 74520141 72650397 71955858 70940148 68507286 65730352
3037 65730352 63878018 62336573 61247777 60301676 58749367 57176132 55811277 53762199
3029 53762199 53589710 52739819 52015467 49797212 49140158 47890876 46385059 45479821 44872502
3020 44872502 43694700 42948079 42122024 42191632 41515595 40162548 39511431 38835332 38098515
3011 38098515 37845454 36443175 35007154 34782122 34955650 34834816 34264892 33497749 33046026
3002 33046026 32168903 32810491 32666849 32417799 32665657 32180251 31197701 30471473 29222902
2993 29222902 29591198 29762551 29255623 29167469 28962885 29070694 28161032 27819440 27484457 27437513
2983 27437513 26747032 26214452 25767635 25057395 24449048 23510522 23716597 23640560 24079434 24129890
2973 24129890 23230009 23437300 22796823 23054656 22665902 22829283 22064979 21484438 21099271
2964 21099271 21241070 21128178 20429752 21687876 21542363 20828152 20149277 19339969 20052745
2955 20052745 19150410 19369922 19593061 19173169 19046562 19440944 19449720 19015802 19186005 19498779
2945 19498779 19784681 18424773 17889906 17551190 17835963 17808282 17378920 17749636 17991068
2936 17991068 19348001 18879375 17707282 17264756 16580707 15252462 16085429 16272783 16325611
2927 16325611 17012406 16688939 15420382 15627730 16192741 16887311 17473542 16009876 16056712
2918 16056712 16763629 16276021 16231225 15085615 15060125 15645160 16100256 16471216 15102594
2909 15102594 14546618 14744867 15231543 14154740 14453726 15447251 15891436 15602045 15459809
2900 15459809 15047774 14991404 15896194 15440231 14054520 14721433 14853769 14054129 14923665
2891 14923665 14812377 14745896 14631342 14413315 14939652 14911690 13855950 14073568 13356191 13766726
2881 13766726 13780742 13996566 13883332 14044419 14347868 14338640 13118345 12924857 14394444 14119889
2871 14119889 12938286 12625189 12818110 13322082 13879697 13667472 13771265 13658383 13975528
2862 13975528 13464148 13463309 12524226 12617872 12783529 12229901 11781010 12563708 11958111 12273940
2852 12273940 13087483 12508874 12677898 12447677 11548789 11511097 11703757 12093207 12443437 12469690
2842 12469690 12357154 12407217 12978762 13423655 13152761 12521860 12254906 12298464 12245681 12283084
2832 12283084 12063415 11923636 12040968 11852544 11843174 11681093 13158723 12165509 12623814 12331132
2822 12331132 10934778 11684767 11825968 11716941 11174652 11933576 12587247 12599734 12209546
2813 12209546 11653263 10624135 10923062 10578931 11013657 11243799 11460843 10928916 10530638
2804 10530638 12065678 11408405 11378857 11262932 10917390 10560798 10294460 10604944 10357565
2795 10357565 9772545 10416649 11161165 10126337 10176005 10101171 9423429 10027400 9342784 9312642
2785 9312642 9242454 9764741 10284818 9475340 10042775 9535146 8554217 8284883 8788038 8758580
2775 8758580 8840373 9372631 9769300 9214984 10475034 10700168 10293783 9193278 7875134
2766 7875134 8430803 10048288 10965797 9558450 7736757 8124874 8339024 8224980 9454496
2757 9454496 10060114 8326806 7463434 8695214 8298409 8046939 8286204 8079515 8056762
2748 8056762 8944777 8468076 9004687 10184459 8912860 8356680 8272281 8101307 8512235
2739 8512235 8287771 7301530 8059264 9372176 8492349 8060112 8696864 7422030 8210120
2730 8210120 8973006 8767543 8650230 9718033 9638148 8188337 7895754 7282093 7374555 6845723
2720 6845723 7924669 7824747 7155807 7224084 8063676 8019884 7435647 7273898 7700284 7642065
2710 7642065 8019665 8003145 7286557 6880525 7320034 6590342 6402968 6280950 6865933 7397636
2700 7397636 6929922 7843305 7433489 7162400 7349632 7073650 5970003 5583089 6410095
2691 6410095 7738250 7917460 8125694 7235808 7492884 7179491 6457464 6882141 6605452
2682 6605452 7408588 6429953 5834654 6004350 6220932 7539966 8130942 7233663 6847451
2673 6847451 6201458 6462353 6083426 7002375 5908664 6378193 6527902 6531724 7515239 7702186
2663 7702186 7133950 6266241 6380939 6128267 8027267 7044975 5966783 6351516 6333249
2654 6333249 6614218 6690848 6529109 5855205 5710074 7014556 7799621 7102087 5958264
2645 5958264 5831884 5853211 5394935 5045592 5132077 5022516 5217594 5552096 5853639 6345905
2635 6345905 6537381 6448750 5448497 4801849 4906540 5779988 6398599 5497316 5064226 4677785
2625 4677785 4927948 4303713 4385302 5410314 5098441 5766468 5860599 6408527 6843363 6703846
2615 6703846 6648290 6369065 6037479 5532974 5253887 5509323 5645382 6165747 5421927 5572392
2605 5572392 6084227 5545745 5452999 4608339 5041567 4878101 4877257 4866428 6101486 6314597
2595 6314597 5479470 5300631 5675434 5928333 6546041 6638536 6133340 5858352 4774095 5305627
2585 5305627 5844968 5714044 5374465 5442983 5202624 4704800 5279224 5291297 5153093 5089316
2575 5089316 5502238 5971566 6352700 5705337 5858429 5232617 5189958 5607622 5455058 5645185
2565 5645185 5269162 4885341 5777895 6883857 6756261 5869207 5719978 5508548 5581401 5026128
2555 5026128 5277698 5606341 6952395 6144327 4618026 4936348 6116026 6834446 5761623
2546 5761623 5920352 6230346 6118381 6115109 5751655 5243343 5421340 4840390 4392320 4811235
2536 4811235 4584410 5187200 6867934 5996515 5754040 6144927 6551947 5845458 5466608
2527 5466608 6032517 6138968 6093147 6059157 5445291 5652376 5397222 5181305 6186937 6443563
2517 6443563 6652722 5969289 6500531 6683883 7255397 6962135 6082746 5636668 5886169 5891013
2507 5891013 5910217 6155126 5608728 5539612 5765873 6245618 5807516 6835111 6964101 6386245
2497 6386245 5479468 5434762 5702747 5253395 5592523 6137768 6039136 5549142 5813154 7025066
2487 7025066 6745889 6015573 6306042 6378418 5864480 6208501 6849574 6509738 5532863 5453280
2477 5453280 5389308 5634246 7385871 8191794 7107647 6064998 6046169 6325606 6133305
2468 6133305 6053205 5188682 5100175 4939424 5821645 6269490 7083689 7222334 6279623 6240499
2458 6240499 6370828 6046406 6237657 6113809 5598855 6099977 7103847 7107556 6897025 7283889
2448 7283889 7148254 7078011 6830474 6364925 6183228 6673850 6797527 7897720 8226680 7335979
2438 7335979 6383367 5990491 7615546 7587806 8063392 7782904 8005960 7815593 7829796 7937602
2428 7937602 7291402 7495071 7514833 7718914 9120625 9384975 7882781 7892080 8332048 9151324
2418 9151324 8483114 9322389 8621306 8310612 8876852 8672065 9169818 8933486 8890071 8320259
2408 8320259 8743954 8225225 8405858 9483299 9724789 8861577 8696424 9194273 8237294
2399 8237294 8408150 8786385 8178476 9250007 9892691 10477753 11146246 10302599 9860327
2390 9860327 10402589 10678415 12118434 11542836 10698517 11623978 10601039 11517130 10366791
2381 10366791 10198827 10053447 10273703 10360392 10830477 10640267 11120666 10729027 11481400 11509075
2371 11509075 11305067 11531473 11314817 11088111 11583261 11309667 11075200 10624175 11803017
2362 11803017 12998127 13947314 13810432 13797755 14646740 15602465 15587344 16199254 15757614 14446594
2352 14446594 15210127 16037781 16344096 15313110 15691287 16613489 17762467 17613723 17976022
2343 17976022 17545631 18824253 20439133 20941851 20448729 21101047 21398296 22102654 23210885
2334 23210885 24567902 25848098 26602703 28255515 28203922 29054142 30663960 33757058 36814364
2325 36814364 37831276 38433081 38331150 39009853 38482220 37118945 36516543 36364429 36691304
2316 36691304 36958925 35975260 34844193 33631356 33827699 33056709 31470884 29778689 28297024
2307 28297024 25945842 24481155 22885731 20396138 18632286 18618665 17496860 14702582
2299 14702582 12788234 11562726 11173598 10827755 10814620 9774083 8691784 7876733 7223847
2290 7223847 7093564 6438887 6057491 5767646 5669926 5469350 4750649 3986588 3638669 2469021
2280 2469021 2698737 2950402 2512555 2179228 2996062 3039692 1782504 1940221 1908373 811503
2270 811503 -152627 96877 -720618 -1261377 -1151773 546356 2002682 2153435 1760547
2261 1760547 1825341 1546352 213074 422655 903178 -147295 -952657 -71907 -107860 -621298
2251 -621298 -192895 125037 -71496 694687 248601 -727695 -379704 351838 1059981 1261993
2241 1261993 520460 22142 85924 1746632 1680220 644091 287419 320218 385613 386006
2231 386006 344107 619447 671268 1177836 692052 -116133 -182476 -764498 -735616 -215045
2221 -215045 658458 112220 940105 1247828 -262860 301154 1967263 646545 469606
2212 469606 332354 -303548 -284758 -225863 -550688 -725042 109195 607822 281739 909788
2202 909788 602177 -999532 2928 -579914 -834134 -591886 -630661 -79914 -698113 -21182
2192 -21182 88353 1248556 1191514 183735 324760 625907 411015 -192332 177906 -191647
2182 -191647 -907751 -560483 -271396 377475 19454 -294443 -333093 -95602 85701 -116344
2172 -116344 89645 65140 -1239620 -1414877 -570536 -776275 -77631 197276 -192823 -874386
2162 -874386 -103995 -256373 -551619 -407679 -325139 -155635 522874 558015 -369834 -698066
2152 -698066 -889001 -306711 -177802 -62384 -689958 267233 -69458 -179546 -22902 121352
2142 121352 -21335 -1389943 -1322241 -359681 874438 828832 13000 -419340 -574228 -893809
2132 -893809 -1251474 -1338222 -447910 621980 168576 -254000 -905099 -260435 -571403 -233763
2122 -233763 -50064 -253901 707976 817204 670049 796517 287608 442580 461443 482455
2112 482455 155920 -37837 307509 -79350 792416 174245 -342083 -326944 47294 483918
2102 483918 -468871 -433041 36167 224702 351297 461328 1314205 545197 750889 -67045
2092 -67045 105977 1502214 860197 897936 715382 150774 1279147 1014997 -214208 -460657
2082 -460657 -94894 -210647 5916 -792285 -200182 304099 455846 -221334 -953882 -471926
2072 -471926 221791 -97962 -475556 81867 -150613 215244 -437061 -273813 -399932 -527589
2062 -527589 -503555 119067 567378 527914 -40600 -293351 158146 -470203 -516363 17596
2052 17596 -522938 -470173 -1536952 -1551588 317159 313172 -715231 -517066 -396269 -1275704
2042 -1275704 -538900 -50533 -399909 -795844 -1051709 -481716 504392 1155471 772063 -683415
2032 -683415 -235987 -267875 808205 637909 -114024 -1399807 212199 -42442 -337709
2023 -337709 -262546 -571538 163330 -825785 -1070409 -932945 -1035044 -269843 -737564 -27152
2013 -27152 -84834 116961 582697 422464 885634 -172523 -273916 121803 135332 -997924
2003 -997924 -770889 388499 878868 708521 -395727 -224089 45060 227774 621352
1994 621352 -318803 -366175 -1186182 -690154 -63118 90075 -5964 744745 -372052 -73904
1984 -73904 -164704 177979 60200 844259 163365 -378120 -500135 -857429 -511031 -804295
1974 -804295 -490248 28602 438461 -313458 -482955 -1408264 -2249950 -1518572 -1590000 -980639
1964 -980639 43131 417868 -561679 -347111 -508145 -462160 6969 -88436 -250133 -388935
1954 -388935 -336537 -980243 -1471256 -515309 -284274 -178566 173939 329058 563104 -682456
1944 -682456 -726921 -1763624 -329219 -329827 -1096605 -270671 -440712 -533507 -1235489 -672405
1934 -672405 230685 1512979 1021521 532324 522330 -602071 -948538 220564 -242889 -679709
1924 -679709 -346627 -1162729 -1018953 -594228 396321 95954 -589292 -440937 -131621 -1367207
1914 -1367207 -1874155 -868397 -243129 54488 -42166 -109820 657129 966958 1028206 1439947
1904 1439947 1178202 -304938 -302889 504885 72281 432211 -480297 -1325016 -1347341 -1709789
1894 -1709789 -1910962 -1557280 -1213171 -767154 -1348068 -1334911 -257263 93987 437337 350412
1884 350412 -133981 -212804 -38748 -447628 -1155034 -113339 638238 540231 -125803 -162314
1874 -162314 -700207 -440032 654834 -217514 -10570 374175 486582 571431 -70618 -225890
1864 -225890 -310940 -980531 -1107523 -972636 -506999 -1469735 -1174103 -584022 -804996 -1434703
1854 -1434703 -298401 -418515 204734 -940142 -1536336 -1586735 -862195 -1315975 -671275
1845 -671275 -135686 268884 373980 524303 43218 -287622 -491977 -1328740 -1304416 -309790
1835 -309790 1032063 916009 575788 469835 464393 -179174 -153812 110264 591544 1025204
1825 1025204 141824 -1148802 -688873 -1101367 -127316 -439878 -168430 -165139 1064216 229235
1815 229235 -845633 -132806 -482689 -32902 -369395 -207082 -1541227 -2051082 -2520971
1806 -2520971 -2317193 -396813 -372782 -1109120 -363774 229507 -40688 150398 -71135 82667
1796 82667 -596364 -1124837 -1526998 -357781 30923 -115297 -865345 -792072 -1320258 -1032656
1786 -1032656 -822370 -1110157 -453085 -209277 -1792333 -1869551 -832629 -970855 -758491
1777 -758491 -870535 -69622 -117250 -603934 -491683 -93606 142685 89901 -707032 -1509775
1767 -1509775 -1417384 -606861 -760693 -887530 -966055 -945148 -1078948 -1252618 -206340 55930
1757 55930 210928 -640307 -517730 -1111679 -1516090 -623629 -1740817 -1516217 -577451 -1171360
1747 -1171360 -1769428 -1722735 -949399 -768837 -43791 -659345 -1070744 -1335079 -640560 -809833
1737 -809833 -1171922 -1346701 -1560159 -1936871 -1416398 -1808529 -2209604 -1610129 -2074313 -1303178
1727 -1303178 -1418415 -604570 -14323 -589491 -332337 -35758 -760366 -541970 -707296 95197
1717 95197 50801 -503076 -965384 -1007304 -392859 534263 -241143 -747790 -720796 -1796896
1707 -1796896 -1333018 -2318423 -1788403 -132526 43401 -475155 -600882 -846198 -428384
1698 -428384 1098599 1472664 490994 -1491864 -982683 -340635 -401180 87814 -141423 156577
1688 156577 -460029 -1049043 -394099 -283478 -1044746 -1022605 -124371 -693201 224048 121676
1678 121676 -742199 -1361165 -747469 -507114 -435274 -463517 -172061 -228374 -688731 -550531
1668 -550531 -907209 212315 358133 -708439 -270042 -741262 -735002 351265 226854 -594358
1658 -594358 457672 -446060 -1142346 -589647 -744946 -717217 -172553 596837 -60221 -282084
1648 -282084 -706187 -1290091 -1431903 -524247 272066 601221 185108 -721212 -575032 -158978
1638 -158978 84959 123795 -671881 -1803351 -1680775 -1400783 -290232 480102 733451 149500
1628 149500 874667 822081 -1358782 -1426896 -774038 -471157 -1749072 -1458531 -459332 -754484
1618 -754484 -900326 -360833 -498495 -559848 -431405 -154127 -715620 -826894 -338738 -397918
1608 -397918 -560950 -496519 -662046 -997233 -217907 -370741 -1060638 -905836 -1186965 -1383827
1598 -1383827 -839727 -841493 -249906 -301477 301358 135339 -435237 -192026 -214768 312142
1588 312142 67631 -566707 104355 13414 -530950 268217 -446710 -547250 57740 -918971
1578 -918971 -2104206 -2262043 -2223062 -914818 -899548 -601550 -818741 -873778 -877447 -341497
1568 -341497 -455302 -168374 -287057 455176 237912 -419230 131933 -187753 -350017 -720491
1558 -720491 -754255 -1845480 -1629018 -839294 -1020294 -788062 -261174 -396820 -708254 -491562
1548 -491562 -149445 3811 734941 326813 -1024239 -1376467 -399831 -1118571 -156516 43710
1538 43710 -346533 -74585 -1275283 -106952 438400 -155456 -556121 -1068069 -940666 -257538
1528 -257538 344950 189226 -343808 240542 964800 826379 436702 -179990 -972817 -203902
1518 -203902 -591180 -1148915 -1607944 -837919 -1136654 -2084861 -2306083 -1582020 -1126447 -1645500
1508 -1645500 -1347948 -1336873 -424551 -819208 -1383444 -1102610 -1386888 -874143 -1129708 -926020
1498 -926020 -707105 -1375639 -1136642 -646599 -1124654 -1400860 -767738 -529568 169521 467992
1488 467992 35285 -794517 -848606 -784295 -153004 1229784 640402 3448 36693 -394639
1478 -394639 -626131 -135644 274821 -785578 -116141 897349 381377 -572819 -256947
1469 -256947 -255531 -416046 -492553 -368142 -186395 431398 -1088169 -1057541 -493394 -360139
1459 -360139 -510000 -741531 -891781 -673536 -31504 -331303 -469878 103734 -467985 -603532
1449 -603532 -707229 -951206 -460240 117962 -441617 1165339 1097917 -263455 -775043 -731178
1439 -731178 -476235 -134673 -358712 -255957 799321 105221 -1056030 -1915023 -1359468
1430 -1359468 -1303874 -1604608 -1295630 -137151 -491045 -589097 -784735 -1159 30794 50559
1420 50559 -508551 -201723 -392651 -1055945 -1947841 -1461239 -519259 -1722341 -1898295 -917210
1410 -917210 -461041 -974782 -1052150 -1108110 -752242 -1132960 -1455189 -833660 -838678 -1343233
1400 -1343233 -451295 -342262 -1064018 -1203780 -1779246 -1086287 -940064 -1153013 -492863 6911
1390 6911 -30890 -148975 -111768 -185462 -553339 -1102490 -1017407 -370978 -1013910 247836 -261739
1379 -261739 -646260 -595636 -1616459 -1579300 -760915 -1218765 -1866982 -2132003 -1717646 -284869
1369 -284869 -780029 -1466430 -1082582 -551168 150546 -871418 -786451 -1601021 -1290305 -87962
1359 -87962 -892714 -1057324 -1710684 -840193 -2143915 -1718602 -682413 649724 1028391
1350 1028391 -150976 -914647 -128428 -349549 -368642 -340127 367740 33208 45676 658002
1340 658002 -299025 -1964945 -1819026 -835391 -1362478 -775060 -604657 -445700 -1142340 -50338
1330 -50338 313316 -484624 -987946 -1459208 -1346526 -1125584 -2035965 -1886966 -1439305 -1400281
1320 -1400281 -1464911 -1304360 -1163245 -1061009 -725711 -1330325 -1158947 -1206780 -95286 261889
1310 261889 -596986 -837717 -699928 -414809 -55097 211583 36657 -319582 -613355 123479
1300 123479 524189 104729 110904 238962 -862539 -1393743 -1102607 -281333 -325682 -1202135
1290 -1202135 -1084599 -488606 -455492 16271 -1052398 -1341830 -583997 77815 -887811 -1103626
1280 -1103626 -1009009 -283168 484217 -610682 -879341 -437249 -1293335 -1200668 -935026 -1878069
1270 -1878069 -765683 -303194 -1075153 -1332709 -1907620 -1347297 -730820 -829346 -148104 -1075177
1260 -1075177 -1550018 -925781 -1052288 -864232 -976597 -562919 -482321 -610738 -692914 -509103
1250 -509103 -737982 -1062988 -1271590 -1336922 -430223 -1098902 -815054 -546816 -838860 -1622455
1240 -1622455 -559280 -622623 -1135227 -782403 -287252 -820142 -641426 36721 216277 399553
1230 399553 36806 -97916 -608349 304455 -250638 -48228 -256420 -916783 461299 664655
1220 664655 -108151 -871657 -348738 -1018065 -110163 -197129 -922562 -699663 -640186 -638398
1210 -638398 -76762 -489876 -790481 472035 -243020 -1207223 -1379555 -1214221 -580884 -1298855
1200 -1298855 -151507 501540 -246709 -923326 -204463 487525 -267771 -434584 -833338
1191 -833338 -1000391 -1001804 -461057 -82164 -767566 -854801 -1440803 -942394 -935599 -746993 -85784
1180 -85784 90228 372551 9972 -655676 -1091725 -1195646 -219218 111781 779717 1056164
1170 1056164 -706712 -525223 -31246 1082260 801454 421150 -133808 -639198 -448674
1161 -448674 293438 269055 -486847 -852528 -803574 -1525978 -1794119 -297247 891820 -462904
1151 -462904 -386376 228202 5081 -285597 -151460 -650302 -1348198 -1206897 -1627975 -66607
1141 -66607 -74886 1022 -570800 -925918 57175 -5161 -496440 -739791 -51894 -201105 -1377484
1130 -1377484 -1439985 -650976 29819 852542 -575170 -964492 -16103 -33042 -330035 -599886
1120 -599886 -1871529 -1327871 -604729 -451461 -1381059 -632685 -303421 121456 -537979 -808360
1110 -808360 -1221733 -776158 -1515191 -1639867 -263985 -396131 -722035 197641 -522254 -122791
1100 -122791 -496131 -1106856 -871386 -522940 261973 -165311 334485 263273 36878 -790942
1090 -790942 -1219034 -1110329 220666 114605 465764 558118 218977 -283977 -79657 71544
1080 71544 -591665 -983459 -1452633 -1380241 -437918 -257071 -2328 65672 128102 897562
1070 897562 510718 -434393 -230378 -53452 529940 1101705 1559384 127336 -385076 -983025
1060 -983025 -881046 -1189045 -1159645 329237 -86471 -637112 171212 199242 -44660 193743
1050 193743 -679441 -279576 -1204359 -1177329 84028 -12587 991156 1460320 865881 -184726
1040 -184726 258236 50888 -427028 -913020 -1162954 -1142125 -987274 -939619 -360837 -878067
1030 -878067 -2029000 -1385588 -827110 -1020089 -227484 62065 -367063 -839955 -671165 -90514
1020 -90514 -475582 -2186661 -2090976 -2002964 -1455852 -999746 -728297 -1127055 -1275142 -1233434
1010 -1233434 -556926 -355243 -291823 266484 -290590 -835528 -564836 -644980 -1261982 -1180202
1000 -1180202 487927 584811 43376 -833985 -1791656 -1411802 -1348128 -399748 712943 1521679
990 1521679 -228661 -1400119 -1592471 -1246383 -2200517 -1640926 -616792 -52266 209781
981 209781 -46040 378487 -44266 -94260 887160 850154 550223 95448 -148052 -206240
971 -206240 478798 725869 103504 -469584 -1213809 -399352 80568 -1006729 -200381 571440
961 571440 1150207 1258746 387974 -368066 -111999 -950403 -1181950 -1367435 -74492 143446
951 143446 -15864 -284169 136083 432522 -276375 419063 27374 -595324 120233 -855371
941 -855371 -1581828 -926091 17702 -711428 -561218 -16645 277791 764854 -184957 -1180245
931 -1180245 -1245791 -758418 -211871 592186 -441414 309800 -58680 -278940 -428405 799086
921 799086 -457522 -189113 534555 -258849 -158967 -848915 -644231 -1253361 -963289 -1387699
911 -1387699 -246552 -773044 -805980 -444828 -1152571 267687 639054 658652 -159713 741844
901 741844 1214480 -428521 17777 331313 700296 1194019 -112289 216345 -575881 -840298
891 -840298 371139 -330922 -254115 -560473 -863566 66564 -198919 -22835 447340 -191357
881 -191357 -933230 -1028527 -1319962 -432196 -719431 -997530 -1108067 -535289 86868 -35220
871 -35220 111385 -647455 -155476 -735026 -1130763 -1452051 -650591 -765025 -757383 40946
861 40946 -1726 79110 563159 543985 -936093 -1347408 -420318 -524428 -905352 -836469 -129712
850 -129712 -339374 177145 96817 -1566158 -585190 -468848 -972352 -1394744 -875768 248664
840 248664 -103703 270471 446193 207815 -348752 -15085 165482 144906 113017 -968501
830 -968501 -165360 736819 1050400 1181228 1100737 1013379 656713 -264269 499872 210720
820 210720 -37668 127865 -376991 -1654090 -633015 255283 43241 185351 225125 -122757
810 -122757 191739 235571 33251 -780313 -1160617 -387527 -446354 -538237 -1309885 -1568308
800 -1568308 -1798735 -853487 -1529077 -1240953 -922773 -955318 -75912 -158820 808958 920521
790 920521 -72695 -149019 -472363 -60241 260575 -423069 -808823 -473979 -145925 -444356
780 -444356 -391561 -260766 -1978332 -1839400 -995731 -109424 140367 582565 899432 573796
770 573796 432169 381710 884923 -448779 -1102613 -1032025 -630527 175244 -971244 -1583270
760 -1583270 -455902 380943 -2491 -237338 228152 615923 -45144 -269576 -744939 -258033
750 -258033 1016835 829951 698220 1099721 1575470 926605 583498 480244 659539 1308039
740 1308039 1045982 707883 741401 623503 727950 60275 123002 291285 824859 928461
730 928461 674035 124975 637071 1530658 1289253 -365316 -667060 -802197 -611226 604142
720 604142 462966 -147858 87050 -177309 -291700 -58897 -539839 -912024 -659721 610533
710 610533 -179584 188249 344844 -403979 -318957 -779898 -1366494 -1520436 -1203187 -1193721
700 -1193721 -1343331 -188562 -121872 -862806 -1496536 -762749 139777 -53003 -782429 -498881
690 -498881 1382328 587063 -696447 -304193 -28068 425746 618860 -308891 -288864 546371
680 546371 1107904 479235 52137 15921 -254906 -900036 -46595 233555 -127633 -399228
670 -399228 216397 606509 275819 819928 40485 -344594 952506 1377139 1822889 1904033
660 1904033 1696924 457587 100179 -25216 -526898 -126973 511965 95156 -1350121
651 -1350121 -1418677 -878672 -955942 137233 563865 -749993 -944672 -845257 -193589 -103782
641 -103782 -90834 -959803 -449130 -504804 -935035 -1560568 -555627 7246 395980 311386
631 311386 174574 -2114 -738897 -663837 -826307 -269586 -670828 -562468 75587 -259830
621 -259830 377854 357427 -433769 -616081 672164 424585 1079896 1241991 -256469 -665189
611 -665189 -303128 37941 804169 1184581 1423062 78378 267820 196012 -4157 -383556
601 -383556 -1295695 -577919 -89307 296124 1131238 49467 -658102 -884942 -765719 -242931
591 -242931 313010 1003858 966158 1220685 841044 1038573 145410 -274385 -869142 -711367
581 -711367 -779278 -467762 -392874 -280307 -250954 153997 1135991 1796047 603572 -437061
571 -437061 89026 341218 -118598 58721 -12071 1371518 1235691 1241284 1320528 1289680 748230
560 748230 91918 -271173 730509 424262 -264593 -121097 1138021 2277670 2084987
551 2084987 853231 1193567 498553 -219500 57520 175880 847773 -623168 -863521
542 -863521 599985 887602 858442 559138 112800 -60356 -485619 197565 -46556 -364624
532 -364624 -565983 169100 351887 -879441 -849594 -130625 165520 692255 1836681 1819683
522 1819683 725022 76299 -308775 -384976 -704004 -348457 631405 626487 388440 -733331
512 -733331 -1107745 165107 -211526 -485469 41679 -290058 99287 123148 103447 364217
502 364217 -34510 -444380 -274244 358435 -60188 208351 685384 780788 348639 -64228
492 -64228 -258635 1294825 2662016 1607753 847409 -494407 -1198184 -435603 -323161
483 -323161 282272 689068 1469534 448123 163614 -117075 625607 1550711 1117223 1586106
473 1586106 303531 775101 324495 -276447 634989 18726 695868 1375200 400742 -662251
463 -662251 -634947 181184 128078 -534208 -394919 472471 367268 -591202 -374614 -91044
453 -91044 642046 214467 1170424 717426 -536377 -387345 -39545 123240 81039 184298
443 184298 184242 -402626 -1141832 -471476 -271205 209432 617018 108432 -213894 -533224 513973
432 513973 736470 865152 363980 641523 636696 321418 604547 89805 510188 -30589
422 -30589 -701576 -599403 -1403238 -425956 -311537 247276 147994 -403851 -652627 209901
412 209901 808438 806762 1052601 -185505 778531 968787 727504 320040 475015 -1112687
402 -1112687 -1174169 -377789 479683 712160 380740 254289 224369 61227 -1521641 -852378
392 -852378 11604 -296509 162027 236006 122508 -103570 -49180 695729 389315 23074
382 23074 -569759 -361889 72448 679482 1619529 -228265 -12657 1200299 863859 -201729
372 -201729 16880 248864 1534036 1950330 896334 -17787 -785128 -718270 413781 -250027
362 -250027 -173836 -126019 -220727 55327 -244203 198711 -532662 181266 -543463 85604
352 85604 602019 -397711 -336233 -679002 663165 694579 218078 -121290 148427 -625408
342 -625408 -1603371 -1048663 -501652 176008 1167322 694719 73615 957552 1466307 1040176
332 1040176 594471 661637 -295500 -1014969 -125741 -123388 -332846 -121482 -792562 -219504
322 -219504 -380733 -740018 -479514 -174838 811955 796946 -61926 925835 809764 652852
312 652852 -170160 -553056 1215693 258689 -403135 -514387 122982 734369 974004 1285353
302 1285353 821900 1657329 951398 166030 429158 1024894 757147 144037 943048 235534
292 235534 -361908 -438351 -309988 163605 511848 833684 901861 70584 -72782 691407
282 691407 1113091 960918 312501 312581 -141954 -360486 214635 845613 578065 156027 485353
271 485353 355094 1164527 1282230 111652 -420211 -167420 136192 25091 747321 1294891
261 1294891 1015687 816124 905846 827498 385274 -288605 808470 474659 -323860 -225582
251 -225582 -403771 -867358 -24763 438671 -382434 -454432 -542424 -529975 -25672 -87958 268980
240 268980 742852 355617 279152 72251 -501044 -894954 -676660 -803275 -546839 520074
230 520074 563792 913929 496922 -80825 1228624 1527556 1605116 1827012 1855681 946462
220 946462 818041 1036169 570961 641794 20127 1468842 418949 -285656 -201213 -795361
210 -795361 -119398 207716 -155383 -342005 -168590 201792 1074345 1320680 450335 -587927
200 -587927 -978374 -350793 549107 1878542 3544439 2594125 547729 437052 1083605
191 1083605 1114134 1267013 1149769 1699692 602860 -380303 204750 96619 474061 1002926
181 1002926 887029 1215556 700055 1408346 677671 613677 1808676 713917 439669 582046
171 582046 1029629 2400052 1789951 1049486 816889 -80901 160965 404951 936918 1198243
161 1198243 1117067 1440528 1297525 770390 268377 1115495 1674915 815826 568078 451830
151 451830 1281977 355110 189731 1052850 1359339 1165340 1388103 1717375 361670 96096
141 96096 748025 801556 1191792 655181 1176045 960406 1208267 1673717 753885 406971
131 406971 512626 516512 -185990 147530 701482 1547886 1527747 901551 1441640 2546918
121 2546918 2283796 1377006 1173676 1719187 1282929 756332 1023784 857182 181419 1383755
111 1383755 1461314 1219503 1006224 1404396 1652457 415964 665354 1588268 2142697 938069
101 938069 767191 1479742 1412806 1338459 468089 516221 785078 -89451 -293496 1127194
91 1127194 1333463 1936210 1615375 955270 1207903 1095747 687749 1205317 2137015 1795216
81 1795216 1265963 741615 924030 1670267 1158162 1584211 1408555 2121821 1088546 1245972
71 1245972 1851347 1155440 930474 1373756 1054442 389612 188626 351675 683294 1232935
61 1232935 1364335 500273 22662 -112819 -172952 -197499 765441 1222970 819805 427036
51 427036 957124 969034 1401783 1065539 1116834 431146 452956 701409 640363 1415473 1331932
40 1331932 1708468 2094735 1400745 1325169 1227926 1425093 1269586 985002 974422 1435925
30 1435925 1869977 1538443 1557133 1101585 1023100 1298557 1483835 1650989 998215 817557
20 817557 783272 911605 1525567 868084 1044425 2123773 2173668 1532420 1425068 1752800
10 1752800 1318612 1209589 1092423 1288178 594716 844417 1153986 1555416 1331332 1230322
0 1230322
$$ Imaginary data points
##PAGE= N=2
##DATA TABLE= (X++(I..I)), XYDATA
16383 -7758078 -7943485 -7748670 -7512904 -7302460 -7210617 -7223103 -7089384 -7097661 -6683375 -6686739
16373 -6686739 -6487371 -6754160 -6885797 -6930833 -6406630 -6893613 -6166441 -6796533 -6455102 -6263398
16363 -6263398 -5440780 -6170390 -6070284 -6091167 -5950039 -4881486 -3993412 -4199640 -4685524
16354 -4685524 -4719512 -4817334 -4730160 -5215039 -4938659 -5552773 -5305465 -3845027 -3724304 -4126133
16344 -4126133 -3533517 -3057697 -3377258 -4030595 -4261274 -3930180 -3551413 -3316883 -3217046 -2900577
16334 -2900577 -2677992 -3035299 -2388611 -2242047 -1464914 -1435980 -2444325 -2571917 -2913260
16325 -2913260 -2483514 -1977835 -2342686 -2356306 -1845461 -1892552 -1302649 -2341262 -2488549 -2452954
16315 -2452954 -2851706 -2140407 -1510527 -1055007 -877125 -1158822 -1127810 -736369 -770019 -601792
16305 -601792 -529771 -595027 -475407 -1391312 -1336517 -240417 -246154 -304581 30073 605185
16295 605185 130263 -651745 126436 937115 1392845 1254280 412595 769655 776655 477231
16285 477231 290525 -159449 -557514 811177 959589 1453425 1286719 1324498 1192138 1098013
16275 1098013 230160 871540 1847479 1796765 1501697 1940382 1897726 1874356 2003668 1963342
16265 1963342 2287582 2657447 2509375 2965322 3135481 2823207 2480140 3434136 3405212 2643089
16255 2643089 2050326 2438842 2556814 2262700 2244452 3386889 3787552 3754406 2737387
16246 2737387 3178718 3466525 3764346 3559768 4216875 3743677 3725721 3976541 3858800 3375406
16236 3375406 3210237 3314139 3251265 4245100 3926244 3736803 4797057 4621858 3400974
16227 3400974 4166537 4040362 4594555 4542172 5663054 4757992 3855967 5018424 5003801
16218 5003801 4515108 4510517 4238858 4948301 4216248 5047911 4546725 4627951 4305342 4618103
16208 4618103 4967370 5631930 5004534 4881738 5098586 4836936 5474909 5883709 6051599
16199 6051599 6174486 5930026 5931996 4934253 4724503 5189629 4636999 4576439 5523372 6138392
16189 6138392 5889281 6422811 7472164 6538994 5752382 5997406 5476514 5124151 5020097
16180 5020097 4837368 5665789 6401609 5281248 5534849 4878276 4532991 4835302 4293768
16171 4293768 3641496 4985108 5380916 6698618 6615126 6327669 6787700 6075323 6143955
16162 6143955 6104265 5803017 6392393 6706940 6318126 5995744 6189425 5902035 5876372 6701575
16152 6701575 6086362 6248715 6473845 6066759 6390247 6307391 6639088 6801539 7479699 7566195
16142 7566195 6817440 7512040 7311916 6229253 6525360 6395533 6186028 8764301 9107232
16133 9107232 9200800 8368956 7312169 7648313 6895282 6319088 6364999 6974660 6744590 7237496
16123 7237496 7325118 7160261 7608629 6697460 6186295 7205331 7799614 6579221 6499194
16114 6499194 6370262 7161417 6237115 6765154 6441773 7018524 6869354 6704419 6789180 6675974
16104 6675974 6756811 6520412 6890611 7059048 6892623 6934973 6551771 6766121 6509049 7150981
16094 7150981 8536527 7840316 8228310 8787195 8284376 7536975 7834059 8437618 8470029
16085 8470029 7359735 7269797 7641478 7580571 8217496 7959392 6919714 7776152 7064269
16076 7064269 7740999 7543535 7484019 8003505 8867006 7391795 6560757 6469469 6896298 7133530
16066 7133530 6933822 6789007 7404719 7739263 8618348 8795054 8767570 7973983 8016956 7190346
16056 7190346 6374619 6768871 6886429 5593023 6395911 6948792 7687058 7883415 6306466
16047 6306466 7612139 6557539 5434719 5871452 6573168 5634661 5559876 6172323 6215771
16038 6215771 6067288 6451545 6856910 7172623 7415159 7663450 7316121 6326861 6399082 7628140
16028 7628140 6942694 7428569 6619744 6153474 6711181 7241911 8434944 7905079 6988778
16019 6988778 6906425 8032036 8069722 8559975 7899907 7966235 8455012 8510045 7956957 7628903
16009 7628903 7111637 6700377 7658688 6960636 7090193 7625317 8371055 8441537 7183286
16000 7183286 6649656 6817392 8685114 7785946 8040625 7767217 7710758 8529805 8157187
15991 8157187 7864749 6872934 7086462 6568599 7445424 7420693 8979008 8792300 7548692
15982 7548692 7616476 7163752 7758702 8228799 7613584 7718877 8508071 8545269 7627810 7830571
15972 7830571 8275328 7341727 7399993 8218078 7877905 7306974 7355196 7947791 7413702 7784568
15962 7784568 8670165 8524488 8863188 9202607 8508625 8277924 7668468 7385336 8103080
15953 8103080 7185308 7327888 7003625 7134089 7127997 7106460 6965174 7714387 8538256 6919292
15943 6919292 6738200 7310543 7450777 8234749 8667896 8713817 8112168 7746773 7601002 8121078
15933 8121078 8395676 7432321 8354560 8187491 7579429 7202522 8639297 8335749 7565589
15924 7565589 7653473 7272230 6903247 6849879 6219370 6380774 7011823 6811729 6508999 6403037
15914 6403037 6459733 7119995 8420491 8046884 8038425 7776571 7361062 7543495 7783930 6941342
15904 6941342 7085373 8621226 8439533 8213727 7919933 7792143 7767235 8168010 8056293
15895 8056293 7640713 6959427 6827585 7850918 7855995 8324466 8017710 7026708 7980771 8531528
15885 8531528 9033660 8327933 8002571 7267811 6579483 6439573 6914121 7570199 6277453
15876 6277453 6483021 6627375 6924651 7188202 7849343 8169982 8052820 7779428 7784953 7858302
15866 7858302 7832384 7892153 7454517 6551041 6752098 7658606 7593126 7124553 7500172 7530273
15856 7530273 7063213 6830721 6708595 7267627 6580654 6278465 7116741 7359013 7623929
15847 7623929 7583968 7667227 7298275 7388590 7427929 7657153 7579194 7930347 6499127 6908668
15837 6908668 8178089 8216991 8923460 8561417 7916209 6562621 6712133 7745856 7505150
15828 7505150 7235340 7234445 6538197 6983507 7445982 6953091 7998937 8020429 7349791 8560545
15818 8560545 8787159 8893258 9175078 8854315 9468204 9222286 7820121 6590310 7177932
15809 7177932 7940444 8463189 8005171 7843758 7825275 7891204 7359699 7905866 10067937 9154786
15799 9154786 7184420 7696026 8024788 9136018 9075752 8392491 8756698 7233400 7286560
15790 7286560 7389391 7977393 8719790 8124847 8139442 7080203 7802508 8304357 9025298
15781 9025298 9362210 8668663 8483443 9213235 8950152 8049484 7097232 7424085 7695462
15772 7695462 8437981 9732200 9686426 9220250 7601919 7800879 8309924 7987185 8413281
15763 8413281 8232818 8193535 8859704 9003028 8722045 8363703 8789953 8755614 8234632 8863998
15753 8863998 8605740 7576242 8096464 7889663 8205011 8136715 8517054 8068334 8603683
15744 8603683 8385191 8471385 9097311 8618055 8187794 8409329 7928587 8069409 8381617 8652292
15734 8652292 8473774 7725666 7508421 7135560 7179679 7626708 7514676 7683470 8240727 7632121
15724 7632121 7269468 8862812 9041560 9109567 8791721 8334050 8467625 7774422 7258518
15715 7258518 7878976 7490109 7952817 8446078 8370183 8383473 8353140 7473023 8406833 8899408
15705 8899408 9303463 8297550 7283275 8463868 8731018 8189603 7962969 7685212 7623140
15696 7623140 6957678 6848161 7690170 6852915 7207078 7598793 7167715 6964292 7819846
15687 7819846 7336316 7366995 7870497 7833882 7512883 7276302 6963345 7480731 7856296 7839312
15677 7839312 7716991 7434916 7317812 7632632 7616036 8569993 8552131 8227976 8154487 8629270
15667 8629270 8933737 8912462 7850200 7824860 7940042 7420491 7253174 7667329 8974594
15658 8974594 8925627 9223851 8414922 7506898 7166213 7813407 8353968 8171960 7797945 7861420
15648 7861420 7589662 7631790 7831659 7589661 6667564 7510131 8627061 8897215 9103492
15639 9103492 8012678 8838208 8779254 7780366 7626747 8498886 8007720 8217531 7838223
15630 7838223 8425732 7994314 8091077 8617590 7682086 7566735 8897673 8258619 8399786
15621 8399786 8089432 7560167 7592457 7899257 7700874 7448676 8047922 7320684 7534715 8137332
15611 8137332 8479887 9300589 8423615 7264635 7649409 8383839 9374584 8688317 7799104
15602 7799104 7342041 7459242 8170692 9225772 9539893 8159898 7975054 7269049 7673038
15593 7673038 8566946 9379346 8667326 7384838 7913268 7687837 8124145 7578425 7366444
15584 7366444 7735007 7973453 7623580 8584949 8624639 7871230 7747380 8348496 7695053 7237058
15574 7237058 7317253 8314187 8266225 8410860 8372239 8649060 8102327 7305422 7079337 7904641
15564 7904641 8809129 8590222 8808332 9393622 8128238 7360867 7689223 7713797 7815465
15555 7815465 8813375 8093912 7947600 8795755 8323584 8348035 8107934 7967156 9158391
15546 9158391 8741259 8563881 8348987 7585746 7621024 7836775 8049811 7055691 7845807 8004316
15536 8004316 8370895 7517940 7295620 6658149 8334383 8428675 8072196 7981262 7354172 7371164
15526 7371164 7617496 7912181 6846069 7794317 8025960 7821534 7530023 6909127 7492130
15517 7492130 7618203 7304727 7837356 7780551 8456877 9479439 9247091 7591592 8245158
15508 8245158 8743807 8206945 8916639 8488171 7892202 7311528 8120337 7605456 7414941
15499 7414941 7779373 8113968 8798563 7934250 7546281 8001725 8192054 7296098 7881122
15490 7881122 8554255 8506520 7964687 8783310 8580496 8141445 8084312 8924693 8173533 7238250
15480 7238250 8538357 9051903 8631752 8578534 8586675 8799758 8724883 9200622 9406616 8225927
15470 8225927 8207750 8986911 8768879 8246322 8321196 7583857 8167933 8701207 8330094 8134082
15460 8134082 8506899 8230214 7771343 7317237 7741776 6941327 6830836 6379114 8380155
15451 8380155 9822398 8905850 7962344 7773795 8548037 7528042 7883400 8561214 7187515
15442 7187515 7093645 7757290 7729359 7396033 8485412 9200371 7388420 7819273 9138608
15433 9138608 9046006 8228943 8846569 8566983 8033136 9061265 8448851 8062380 8462937
15424 8462937 8212606 7784394 8175128 8262197 8408859 8887230 8694102 9035936 9897427 9845254
15414 9845254 8822300 8368092 8575881 8528816 8878074 9362199 9330563 8345707 7956467 8061214
15404 8061214 7858505 8180678 8463531 9289258 8938234 9203983 9227554 8932431 8923321 8804687
15394 8804687 9096886 8190589 7892398 7421317 7998229 8458828 8443566 8590192 8744376 8814256
15384 8814256 8665620 8289946 8260609 8470788 8883369 8919511 9577266 9124107 7395427 7422679
15374 7422679 7223016 8782022 9623757 9211638 8709360 8835239 9662913 9456090 9012540
15365 9012540 8462973 8723138 8702218 7854830 7828541 8616370 8169700 7743022 8385727 8108804
15355 8108804 7785616 8088722 8164284 8082344 8515537 7606452 8636694 8438374 8729845 8339577
15345 8339577 7986661 8525046 10319482 9777401 8972863 9332958 9463906 9348691 7766598
15336 7766598 8108713 7900593 7994348 9312548 8880528 9108006 9966478 8954735 9074686
15327 9074686 8044657 7283032 8168411 8893167 8901617 9060593 8552217 8298017 8702837 8570010
15317 8570010 8484623 8872149 7858310 7982953 8308082 7893139 8281284 8684123 7891958
15308 7891958 7357048 8500711 8694791 8858522 9214838 8711991 7855949 7507532 8999500
15299 8999500 9755732 8592866 8355532 8683264 8448053 7655283 7094786 7897357 8045758
15290 8045758 7403041 8021903 7811586 8270582 8531744 8120221 8119129 8618667 7379710 7261793
15280 7261793 7990628 8211117 8807968 8097415 8322291 7199746 7849473 6850519 7528095
15271 7528095 8654828 8497224 8743730 8655279 8718202 8759286 8102497 8596405 7775544 8598220
15261 8598220 9172533 7821701 7703187 8376648 8621445 8535374 9453819 9057420 8653407
15252 8653407 7963335 8015810 8389347 7724598 8292757 9171632 9488780 8554661 8139352 8889625
15242 8889625 8391506 8901466 8704486 8540474 9014686 8627627 7922367 8441689 8664107
15233 8664107 8668214 9207311 9775198 9676591 8237498 7025004 7315290 7189959 7510210 8376097
15223 8376097 8205783 8257864 7864580 7651004 8004979 9187501 9686866 8444605 8478426
15214 8478426 8221344 8570540 9156584 9416016 8319821 7736993 8277772 8527355 8453061
15205 8453061 9129763 9488523 8415122 7632389 8085076 8259849 8929301 8291926 8562407
15196 8562407 9423501 9494142 10081601 9634290 9844165 10078614 8845531 7693390 7507153
15187 7507153 7512726 8311938 8624095 9782397 9755438 9877483 9351630 8117276 8615994 7977988
15177 7977988 8804515 8958538 8958755 8912206 8584824 8161331 8770605 9000007 8752254 9000738
15167 9000738 9097115 9497175 10198946 10221225 10018218 9322225 9067803 9158917 9629060 9314573
15157 9314573 8835956 9133291 8167054 7215236 7992631 8246212 8659557 8835278 8725274
15148 8725274 8375050 7779443 8352239 8081756 8975799 9618517 9468453 9336116 9322085 8067140
15138 8067140 7476850 7726355 8808789 8746140 8879010 8233565 7669159 7373365 7694331
15129 7694331 7484950 8375796 8443408 8504590 7665954 7817703 8406697 8663147 10142342 9598186
15119 9598186 8780665 9018414 8648278 8495027 8688518 7870955 7715603 7643348 7972783 7963130
15109 7963130 8378422 8853458 9266269 8937633 8743175 8748610 8652237 8559282 8069368 8481671
15099 8481671 8069156 8083509 8770731 9588248 9347186 9007742 9237923 9606120 9667492 8893024
15089 8893024 9003410 8016936 8512625 8628798 9168138 8235350 8155147 9539173 9531366 8170227
15079 8170227 7598930 8780230 9462272 8635820 8387673 9250015 8360093 8062674 9157942
15070 9157942 9796538 10595402 9500834 8736105 9054940 8900244 8102656 8187121 9569033
$$ [...]
##END NTUPLES=NMR SPECTRUM
##END=
