##TITLE=1H_EC-3361(VI-23)
 200.13MHz, CDCl3,
 8 sc
 
 2.10.2025
##JCAMPDX= 6.0         $$ Bruker NMR JCAMP-DX V2.0
##DATA TYPE= NMR SPECTRUM
##DATA CLASS= NTUPLES
##ORIGIN= UXNMR, Bruker Analytische Messtechnik GmbH
##OWNER= pz
$$ XWIN-NMR		Version 3.5
$$ Thu Oct  2 13:49:15 2025 Russian Standard Time (UT+4h)  she@DPX200
##.OBSERVE FREQUENCY= 200.1313
##.OBSERVE NUCLEUS= ^1H
##.ACQUISITION MODE= SIMULTANEOUS
##.ACQUISITION SCHEME= undefined
##.AVERAGES= 8
##.DIGITISER RES= 18
##SPECTROMETER/DATA SYSTEM= spect
##.PULSE SEQUENCE= zg30
##.SOLVENT NAME= CDCl3
##.SHIFT REFERENCE= (INTERNAL, CDCl3, 0, 15.4913)
##AUDIT TRAIL= $$ (NUMBER, WHEN, WHO, WHERE, WHAT)
$$ ##TITLE= Audit trail, XWIN-NMR		Version 3.5
$$ ##JCAMPDX= 5.01
$$ ##ORIGIN= Bruker BioSpin GmbH
$$ ##OWNER= she
$$ F:/spectra/data/she/nmr/H-C/1/pdata/1/auditp.txt
$$ ##AUDIT TRAIL=  $$ (NUMBER, WHEN, WHO, WHERE, WHAT)
(   1,<2025-10-02 13:47:34.23 +0400>,<she>,<DPX200>,
      <created by zg, POWCHK disabled, PULCHK disabled
       configuration hash MD5:
       00 E9 B6 7A A2 85 ED C7 34 08 36 98 17 FE 4E 26
       data hash MD5: 16K
       B0 0F 0F A4 06 54 33 8E A5 EC 36 D2 12 04 46 BB>)
(   2,<2025-10-02 13:47:36.92 +0400>,<she>,<DPX200>,
      <Start of raw data processing
       efp BC_mod = 2 LB = 0.25 FT_mod = 6 PKNL = 1 PHC0 = -1914.801 PHC1 = 11.99226 SI = 16K 
       data hash MD5: 16K
       A1 4A EC 6E 30 36 97 AC 15 50 D6 9F D8 36 F4 5D>)
(   3,<2025-10-02 13:48:12.54 +0400>,<she>,<DPX200>,
      <pk PHC0 = 13.40001 PHC1 = -12.40001 
       data hash MD5: 16K
       BE 7E BC 8E 0E 13 11 E4 25 0C 40 C4 BD B5 49 CF>)
(   4,<2025-10-02 13:48:16.57 +0400>,<she>,<DPX200>,
      <abs ABSG = 5 
       data hash MD5: 16K
       FE 33 9B 78 80 F3 F6 35 B2 77 71 C4 EC DE 65 E1>)
$$ ##END=
$$ 
$$ hash MD5
$$ 49 87 DD 99 CC 4F 4E 4D FC A1 23 2C 42 83 D6 5B
##$RELAX= 
##$RELAX= 
##$RELAX= 
##$RELAX= 
##$RELAX= 
##$RELAX= 
$$ Bruker specific parameters
$$ --------------------------
##$DU= <F:/spectra>
##$EXPNO= 1
##$NAME= <H-C>
##$PROCNO= 1
##$TYPE= <nmr>
##$USER= <she>
##$AMP= (0..31)
100 100 100 100 100 100 100 100 100 100 100 100 100 100 100 100 100 100 
100 100 100 100 100 100 100 100 100 100 100 100 100 100 
##$AQSEQ= 0
##$AQ_mod= 1
##$AUNM= <au_zg>
##$AUTOPOS= <>
##$BF1= 200.13
##$BF2= 200.13
##$BF3= 200.13
##$BF4= 200.13
##$BF5= 200.13
##$BF6= 200.13
##$BF7= 200.13
##$BF8= 200.13
##$BYTORDA= 1
##$CFDGTYP= 0
##$CFRGTYP= 5
##$CHEMSTR= <none>
##$CNST= (0..31)
1 1 145 1 1 1 1 1 1 1 1 1 1 1 1 1 1 1 1 1 1 1 1 1 1 1 1 1 1 1 1 1 
##$CPDPRG= <>
##$CPDPRG1= <>
##$CPDPRG2= <>
##$CPDPRG3= <>
##$CPDPRG4= <mlev>
##$CPDPRG5= <mlev>
##$CPDPRG6= <mlev>
##$CPDPRG7= <mlev>
##$CPDPRG8= <mlev>
##$CPDPRGB= <>
##$CPDPRGT= <>
##$D= (0..31)
0 0.7 0 0 0 0 0 0 0 0 0 0.03 0 0 0 0 0 0 0 0 0 0 0 0 0 0 0 0 0 0 0 0 
##$DATE= 1759398453
##$DBL= (0..7)
120 120 120 120 120 120 120 120 
##$DBP= (0..7)
150 150 150 150 150 150 150 150 
##$DBP07= 0
##$DBPNAM0= <>
##$DBPNAM1= <>
##$DBPNAM2= <>
##$DBPNAM3= <>
##$DBPNAM4= <>
$$ [...]
##$SUBNAM3= <"">
##$SUBNAM4= <"">
##$SUBNAM5= <"">
##$SUBNAM6= <"">
##$SUBNAM7= <"">
##$SUBNAM8= <"">
##$SUBNAM9= <"">
##$SW= 18.0517328524113
##$SWIBOX= (0..15)
0 0 2 0 0 0 0 0 0 0 0 0 0 0 0 0 
##$SW_h= 3612.71676300578
##$TD= 16384
##$TD0= 1
##$TE= 0
##$TE2= 300
##$TE3= 300
##$TEG= 300
##$TL= (0..7)
0 120 120 120 120 120 120 120 
##$TP= (0..7)
150 150 150 150 150 150 150 150 
##$TP07= 0
##$TPNAME0= <>
##$TPNAME1= <>
##$TPNAME2= <>
##$TPNAME3= <>
##$TPNAME4= <>
##$TPNAME5= <>
##$TPNAME6= <>
##$TPNAME7= <>
##$TPOAL= (0..7)
0.5 0.5 0.5 0.5 0.5 0.5 0.5 0.5 
##$TPOFFS= (0..7)
0 0 0 0 0 0 0 0 
##$TUNHIN= 0
##$TUNHOUT= 0
##$TUNXOUT= 0
##$USERA1= <user>
##$USERA2= <user>
##$USERA3= <user>
##$USERA4= <user>
##$USERA5= <user>
##$V9= 5
##$VALIST= <valist>
##$VCLIST= <CCCCCCCCCCCCCCC>
##$VD= 0
##$VDLIST= <DDDDDDDDDDDDDDD>
##$VPLIST= <PPPPPPPPPPPPPPP>
##$VTLIST= <TTTTTTTTTTTTTTT>
##$WBST= 1024
##$WBSW= 4
##$XGAIN= (0..3)
0 0 0 0 
##$XL= 0
##$YL= 0
##$YMAX_a= 316648
##$YMIN_a= -455657
##$ZGOPTNS= <>
##$ZL1= 120
##$ZL2= 120
##$ZL3= 120
##$ZL4= 120
##$ABSF1= 15.52542
##$ABSF2= -2.526429
##$ABSG= 5
##$ABSL= 3
##$ALPHA= 0
##$AQORDER= 0
##$ASSFAC= 0
##$ASSFACI= 0
##$ASSFACX= 0
##$ASSWID= 0
##$AUNMP= <proc_1d>
##$AZFE= 0.1
##$AZFW= 0.1
##$BCFW= 0
##$BC_mod= 2
##$BYTORDP= 0
##$COROFFS= 0
##$CY= -3
##$DATMOD= 1
##$DC= 0
##$DFILT= <>
##$DTYPP= 0
##$F1P= 0
##$F2P= 0
##$FCOR= 1
##$FTSIZE= 16384
##$FT_mod= 6
##$GAMMA= 0
##$GB= 0
##$INTBC= 1
##$INTSCL= 3.241238e-09
##$ISEN= 128
##$LB= 0.25
##$LEV0= 0
##$LPBIN= 0
##$MAXI= 10000
##$MC2= 0
##$MEAN= 0
##$ME_mod= 0
##$MI= 1.114404
##$NCOEF= 0
##$NC_proc= -7
##$NLEV= 6
##$NOISF1= 3.799351
##$NOISF2= 2.8
##$NSP= 0
##$NTH_PI= 0
##$NZP= 0
##$OFFSET= 15.49127
##$PC= 1
##$PHC0= -1901.401
##$PHC1= -0.4077501
##$PH_mod= 1
##$PKNL= yes
##$PPARMOD= 0
##$PSCAL= 0
##$PSIGN= 0
##$REVERSE= no
##$SF= 200.13000608926
##$SI= 16384
##$SIGF1= 3
##$SIGF2= 2
##$SINO= 0.751879
##$SIOLD= 32768
##$SREGLST= <19F.Aceton>
##$SSB= 0
##$STSI= 16384
##$STSR= 0
##$SW_p= 3612.71676300578
##$SYMM= 0
##$S_DEV= 0
##$TDeff= 16384
##$TDoff= 0
##$TI= <>
##$TILT= no
##$TM1= 0
##$TM2= 0
##$TOPLEV= 0
##$USERP1= <user>
##$USERP2= <user>
##$USERP3= <user>
##$USERP4= <user>
##$USERP5= <user>
##$WDW= 1
##$XDIM= 16384
##$YMAX_p= 516356136
##$YMIN_p= -951704
$$ End of Bruker specific parameters
$$ ---------------------------------
##NTUPLES= NMR SPECTRUM
##VAR_NAME=  FREQUENCY,     SPECTRUM/REAL,   SPECTRUM/IMAG
##SYMBOL=    X,             R,               I
##VAR_TYPE=  INDEPENDENT,   DEPENDENT,       DEPENDENT
##VAR_FORM=  AFFN,          ASDF,            ASDF
##VAR_DIM=   16384,         16384,           16384
##UNITS=     HZ,            ARBITRARY UNITS, ARBITRARY UNITS
##FACTOR=    0.220516191357247, 1,           1
##FIRST=     3100.26797250038, 0,            0
##LAST=      -512.448790505396, 0,           0
##MIN=       -512.448790505396, -951704,     0
##MAX=       3100.26797250038, 516356136,    0
$$ Real data points
##PAGE= N=1
##DATA TABLE= (X++(R..R)), XYDATA
$$ [...]
7393G02886K17019R132j34660R9047J20007M5170O1014M22163J72270J07243L20955
7382B142246J10200Q9548J46106L6838p1272n4474m32653l63121j68758q9712
7372A344948Q1317j27924N2336j2992p1529k23447l1630n4439M15090k09353n9841
7361A102536K2403j47005P5364q2064l12833o4124K82139J9306k51507q9013R7313
7350F52515r1715J28555K11188k42663j35239k6735J68904K42581l7436k29877
7340F40078J4089J57570J90596M8283k20290J75770M376j72784l7292K19522R7227
7329A117145p4397q3104p4862o3058m2112k5067L62436J11955k29916k4520R9834
7318A074334o9736J63329N2999K60567N9262N0567q0031j55202N9916j06015j41703
$$ plain form
7393 702886 919905 929037 794377 893424 1013431 1058601 1119615 1541778 1714048 1821291 2142246
7382 2142246 2252446 2341994 2488100 2524938 2453666 2399192 1966539 1603418 1434660 1344948
7372 1344948 1426265 1298341 1350677 1337685 1266156 1042709 1011079 956640 1371730 1162377 1102536
7361 1102536 1124939 977934 1053298 971234 658401 594277 876416 895722 644215 555202 652515
7350 652515 560800 689355 900543 657880 522641 495906 664810 907391 869955 640078
7340 640078 654167 811737 1002333 1050616 830326 1006096 1010472 837688 800396 1019918 1117145
7329 1117145 1042748 959644 884782 821724 779612 754545 1116981 1228936 999020 974500 1074334
7318 1074334 1004598 1167927 1220926 1481493 1540755 1591322 1511291 1356089 1416005 1309990 1168287
7307A168287M1448K69476L8620j18629L2580J3001j33375L2094J71251k09708
7297A305045J17375J1736J14703J70588j52818m607K40619J08994O7028J43163
7287B121826j27100Q6432K2428P112j43462M29170J31410M5192J6874J04686L6552
7276B731120r9023J36398j54975O3134J27122Q8388L88475K2422M6472J12702
7266C462235K02671J50526K4865K26552J54618J99870L3361K88173K19824L39643
7256E302338K80520N1028N61802J68827L31428L14096J24194M40315N47701M49070
7246H571319L56546L63597L67098M32599O13987M81776K58653N86086Q39920O98728
7236A3570309J14458N02139R12394L57753N11657P49888M29032L86474N58929
$$ plain form
7307 1168287 1209735 1479211 1517831 1399202 1431782 1444783 1311408 1343502 1514753 1305045
7297 1305045 1422420 1434156 1548859 1719447 1566629 1562022 1802641 1911635 1978663 2121826
7287 2121826 1994726 2081158 2103586 2110698 1967236 2396406 2527816 2573008 2589882 2694568 2731120
7276 2731120 2632097 2768495 2613520 2676654 2803776 2892164 3280639 3303061 3349533 3462235
7266 3462235 3664906 3815432 3840297 4066849 4221467 4421337 4454698 4742871 4962695 5302338
7256 5302338 5582858 5633886 6195688 6364515 6695943 7010039 7134233 7574548 8122249 8571319
7246 8571319 8927865 9291462 9658560 10091159 10705146 11186922 11445575 12031661 12871581 13570309
7236 13570309 13684767 14186906 15099300 15457053 15968710 16718598 17147630 17534104 18093033
7227A8093033L55520M26339M51066P8660K12298K03596j84929k70932l51850k64794
7217A8748007m48408n93424n60858o28003p69696o19557m69446o62234q55629
7208A3140752p88112m88135p96009l48592o43440o06724n37134k36351o63658
7199H032597m00656j54314l15979l89318m95407m56385k24558k01335l58790O639
7189E042494o7472l09326k18048p746n70981j8714k1879k87859J31039j77619
7179C493889l08084m6911k01036J20524m6144n50637j16165k5605k2581r0401
7169B206849K11358Q8665J48017l09439j94661Q8649j23314j23854l44752j42152
7159A505366K16793m4720l63381K3837M7150R0281J21089K9464j74588K84211
$$ plain form
7227 18093033 18448553 18874892 19325958 19404618 19616916 19820512 19635583 19364651 19012801 18748007
7217 18748007 18299599 17706175 17145317 16517314 15747618 15128061 14658615 13996381 13140752
7208 13140752 12352640 11864505 11068496 10719904 10076464 9469740 8932606 8696255 8032597
7199 8032597 7631941 7477627 7161648 6772330 6276923 5820538 5595980 5394645 5035855 5042494
7189 5042494 4975022 4665696 4447648 4439902 3868921 3850207 3828328 3540469 3671508 3493889
7179 3493889 3185805 3138894 2937858 3058382 3012238 2461601 2345436 2319831 2297250 2206849
7169 2206849 2418207 2506872 2654889 2345450 2150789 2239438 2116124 1992270 1647518 1505366
7159 1505366 1722159 1677439 1314058 1337895 1385045 1475326 1596415 1625879 1451291 1735502
7149A735502j31936M1744Q7394k5736k29111j40532K59926P1971N7917m4590n7866
7138A624683j60438j89248R0077O1324L6108J06555q5238k00493Q5598J30232
7128A499160N8925k15255j49210M789O1867j10277J20599K17354k28717J61864
7118A421099l601r2120k08306J46030K20910M0409N0780J15050J25380l47362
7108A468269J37888j83794k84437L05954M38540J62284J34766J3341K15108J91063
7098B598982O8167K92850K1121O8116J15924K48606N7471j93696J54695K70367
7088C702603L31016J12345k83495q1031N7076j01649l46997o7730q6179l81639
7078B854320l5499P524O9060n7825j71202l07658j31315J08757k6179k74849o2521
$$ plain form
7149 1735502 1603566 1645310 1732704 1706968 1477857 1337325 1597251 1669222 1727139 1682549 1624683
7138 1624683 1464245 1274997 1365074 1426398 1462506 1569061 1483823 1283330 1368928 1499160
7128 1499160 1558085 1342830 1193620 1198409 1260276 1149999 1270598 1487952 1259235 1421099
7118 1421099 1417498 1325378 1117072 1263102 1484012 1524421 1575201 1690251 1815631 1468269
7108 1468269 1606157 1422363 1137926 1443880 1882420 2044704 2179470 2192811 2407919 2598982
7098 2598982 2667149 2959999 2981120 3049236 3165160 3413766 3471237 3277541 3432236 3702603
7088 3702603 4033619 4145964 3862469 3781438 3838514 3736865 3389868 3322138 3235959 2854320
7078 2854320 2818821 2826345 2895405 2837580 2666378 2358720 2227405 2336162 2309983 2035134 1972613
7067A972613J14665N2195Q0547k24966j05418O6699R092n6044j61761J01836m5403
7056A804055q1974J77741J79070l09684J48543j31891j47334L60616K6337k3164
7046B002315k34179j35022K46767j98587k55973l5759o4660J03834j48455p0173
7036A210108k09622j02529k9425J71461o2667m40498q0501L58007k38109Q6784
7026F63009J00537J37143J58050O2175l34689n7942r5339j9764M5735J18056J20457
7015H97428j17230j40781o4574j40425O1457k1501K86261L5250L5106k7489o6307
7004G37195m5819l31798j5650K50055j85497K7565L01601R0759j07366k94359
6994D26686J73338K0874J59248k09514p7687k6979J04118Q7069J1470K538J10139
$$ plain form
7067 1972613 2087278 2139473 2220020 1995054 1889636 1956335 1965427 1909383 1747622 1849458 1804055
7056 1804055 1722081 1899822 2078892 1769208 1917751 1785860 1638526 1999142 2025479 2002315
7046 2002315 1768136 1633114 1879881 1681294 1425321 1389562 1324902 1428736 1280281 1210108
7036 1210108 1000486 897957 868532 1039993 977326 536828 456327 814334 576225 663009
7026 663009 763546 900689 1058739 1120914 786225 728283 632944 613180 658915 776971 897428
7015 897428 780198 639417 574843 434418 495875 474374 760635 795885 830991 803502 737195
7004 737195 691376 359578 343928 593983 408486 436051 737652 828411 721045 426686
6994 426686 600024 620898 780146 570632 492945 465966 570084 657153 668623 671161 781300
6983G81300K6975J06511K50186j74902l84297r3908M4596K0391m56j0354N0915
6972F16957m0995j61164J80831k08971l6955K47405J98087O9760l10428j24755
6962D29772N1644R5077R3555M6634o9550p5353j23810k3110O5876O2682K27190
6951G80607Q504o1966k14258k28567K87547J94611Q6311m7835N857o8060j90504
6940E52247j6457O8435J27373J50169P9952p8968K499j97805l8201J48506m1142
6929G56608q8691K13285m148j06368J35869J02948l383J16819j21650R6508r5719
6918A002078k27125P1131Q5200J88069J69626j54560p4574r421J12798J31398
6908A294620M5161K989J01608k00615L6932J07125Q8816p1626k982Q2385j0197
$$ plain form
6983 781300 808275 914786 1164972 990070 605773 511865 556461 576852 576396 566042 616957
6972 616957 575962 414798 595629 386658 349703 597108 795195 864955 554527 429772
6962 429772 481416 576493 670048 716682 647132 571779 447969 424859 490735 553417 780607
6951 780607 789111 727145 512887 284320 571867 766478 852789 804954 810811 742751 552247
6940 552247 535790 604225 731598 881767 961719 882751 885250 687445 649244 797750 756608
6929 756608 667917 881202 877054 770686 906555 1009503 1006120 1122939 1001289 1097797 1002078
6918 1002078 774953 846084 931284 1119353 1288979 1134419 1059845 1050424 1163222 1294620
6908 1294620 1339781 1342770 1444378 1243763 1280695 1387820 1476636 1405010 1402028 1484413 1474216
6897A474216N8668L323j93614l3337J22709k1034J32268k88318j07719K37238
6887A384400L40536j60097j18726L228k71771N9748P1767K21603J4998k08606
6877A337080l21458J80242j81610J23677R6111j69464K96258m4907k39813N6482
6867A132598K05093k13460j08682J9627P5997J68670q0089l02227L80742j03481
6857A174788O6627p9481J11519K5873L04228n3678j361j53885r6427k04395J03138
6846A196946J83083o0790r5112J55898p0419m7337M6706m5415K28491o9638n0640
6835A371773q3420j45857k50059K8094L15092J26765n9847L12644L4000k13217
6825A435968j06102n6075J76684J10438k90506Q2401n225K51869J39240k10241
$$ plain form
6897 1474216 1532884 1536207 1342593 1309256 1431965 1410931 1543199 1254881 1147162 1384400
6887 1384400 1724936 1564839 1446113 1449341 1177570 1237318 1309085 1530688 1545686 1337080
6877 1337080 1015622 1195864 1014254 1137931 1234042 1064578 1360836 1315929 1076116 1132598
6867 1132598 1337691 1124231 1015549 1035176 1111173 1279843 1199754 897527 1278269 1174788
6857 1174788 1241415 1161934 1273453 1299326 1603554 1549876 1548515 1394630 1298203 1093808 1196946
6846 1196946 1380029 1319239 1224127 1380025 1309606 1262269 1308975 1263560 1492051 1422413 1371773
6835 1371773 1288353 1142496 892437 920531 1235623 1362388 1302541 1615185 1649185 1435968
6825 1435968 1329866 1273791 1450475 1560913 1270407 1352808 1347583 1599452 1738692 1528451
6815A528451k05172k16414j66557q783l805J09216L89161k92343k26028Q9287
6805I97013N178J93837J47832j26636k3215k8618o2451K03553J38497m3509k02380
6794A199101L04766l18530p9612K32782j81162O2504J51186j18626K4156p6354
6784A200211o854M23744j18570k37565K57638j85025j66780J25324o9923o1033
6774A161167J0258K10844p0348L1926K85504q909k385N6768j35307j661K2209
6763A560066l04208N4940J01324O2472P0453p0978q4513o4108K57464J64560n8375
6752A689097p0373P3922l29387J24979j32779k11569J72623J0314k4202J91231
6742A493856Q3761k92496J38970O754j23261J33161J14027K9861J05135o5680
$$ plain form
6815 1528451 1323279 1106865 940308 931525 927720 1036936 1426097 1133754 907726 997013
6805 997013 1002191 1196028 1343860 1217224 1194009 1165391 1102940 1306493 1444990 1401481 1199101
6794 1199101 1503867 1185337 1105725 1338507 1157345 1219849 1371035 1252409 1276565 1200211
6784 1200211 1193357 1617101 1498531 1260966 1518604 1333579 1166799 1292123 1222200 1161167
6774 1161167 1171425 1382269 1311921 1343847 1629351 1620442 1618057 1674825 1539518 1537857 1560066
6763 1560066 1255858 1310798 1412122 1474594 1545047 1474069 1389556 1325448 1582912 1747472 1689097
6752 1689097 1618724 1692646 1363259 1488238 1355459 1143890 1316513 1326827 1302625 1493856
6742 1493856 1577617 1285121 1424091 1430845 1307584 1440745 1554772 1584633 1689768 1624088
6732A624088n8594j44936R3800k26762l6211L47830K98440o9148j421J36947K2551
6721A986584o9315K7613k1943M2053n9620Q0095Q3163o2373J35114q121K69250
6710B402500J64768o2402j30656K94708J08812o728o3547o1016K16603j04610
6700B758432j16028l2639k03166j89776R6468O9220k10409K59120J11317R699
6690B552238j4577n9328j42572P7650M31657n7022k15419j43009J62667Q7911
6680B680196k42854K18294Q3613R27J70239J53529m16974j50194J07046J15797
6670B719619P3300J44506J34055j93402R1095Q8394n9449J3264K69571K54306
6660C535259K25839k84541k55402J14687j42166P5238J01241j34363k29099K25
$$ plain form
6732 1624088 1565494 1420558 1514358 1287596 1251385 1599215 1897655 1828507 1827086 1964033 1986584
6721 1986584 1917269 1944882 1922939 1964992 1905372 1985467 2068630 2006257 2141371 2133250 2402500
6710 2402500 2567268 2504866 2374210 2668918 2777730 2771002 2707455 2646439 2863042 2758432
6700 2758432 2642404 2609765 2406599 2216823 2313291 2382511 2172102 2431222 2542539 2552238
6690 2552238 2537661 2478333 2335761 2413411 2845068 2788046 2572627 2429618 2592285 2680196
6680 2680196 2437342 2655636 2739249 2740176 2910415 3063944 2646970 2496776 2603822 2719619
6670 2719619 2792919 2937425 3071480 2878078 2969173 3057567 2998118 3011382 3280953 3535259
6660 3535259 3761098 3476557 3221155 3335842 3193676 3268914 3370155 3235792 3006693 3006918
6650C006918k1207J43208J03825k71346J33960J41857p2369N8305J05690q7820
6640C241021J13642O0998j901j35448Q834J18322J89529Q7451m6994k38238J99625
6629C596841M5161K0319K52058l46226j8769j29266K72411J18931l34468j3117
6619C463875J26582J91553j27893J68765L3899k60403K98745Q5493l36542O1118
6609C705192N472q3105Q3634M823K12036P1318k05614J18972K68225J82616l30488
6598D033081K9435J34215k28868m8077J94922K13127j4016j45173K15586l4p5610
6587D308588j10830q6795J27813K12488J49430k7179L3977J40028N3689j0678
6577D790531j94970j33692R5341L94509j52883K87651K66920J2535J27321k34781
$$ plain form
6650 3006918 2985711 3128919 3232744 2961398 3095358 3237215 3164846 3223151 3328841 3241021
6640 3241021 3354663 3415661 3413760 3278312 3287146 3405468 3594997 3682448 3635454 3397216 3596841
6629 3596841 3642002 3662321 3914379 3568153 3549384 3420118 3692529 3811460 3476992 3463875
6619 3463875 3590457 3782010 3654117 3822882 3856781 3596378 3895123 3980616 3644074 3705192
6609 3705192 3710664 3627559 3711193 3716016 3928052 3999370 3793756 3912728 4180953 4363569 4033081
6598 4033081 4062516 4196731 3967863 3919786 4114708 4327835 4313819 4168646 4384232 4384198 4308588
6587 4308588 4197758 4110963 4238776 4451264 4600694 4573515 4607492 4747520 4801209 4790531
6577 4790531 4595561 4461869 4557210 4951719 4798836 5086487 5353407 5365942 5493263 5258482
6567E258482K35227K64413J71320j36128K3560k5902j5809K7156o8415R9569L51130
6556F184603J41453K27232J55540M91085r610K86458J45523J72107O18570L97444
6546H810405K13393M48690K96237L52419j5856p6198N780N0580n63672k07084
6536I314694P9660j41112j4708m16042K6729J33222n3872J92089M7219J48511
6526I316390J49544k09435l28692j26160k85967q1587l19302j55286J143o1510
6516G899138j55917M0159J57958p2320J01513m7632R8473k93959L5068k86268
6506G476213J14066n0627k78751k54801k65345m2489K54228j30180k3238j75578
6496F623498R1934n5516n3103J91352l7896N6866l614r4851J00303P2648J29700
$$ plain form
6567 5258482 5493709 5758122 5929442 5793314 5816874 5790972 5775163 5802319 5733904 5833473 6184603
6556 6184603 6326056 6553288 6708828 7199913 7190303 7476761 7622284 7794391 8412961 8810405
6546 8810405 9023798 9472488 9768725 10121144 10105288 10029090 10034870 10085450 9521778 9314694
6536 9314694 9394354 9253242 9238534 8822492 8849221 8982443 8928571 9120660 9167879 9316390
6526 9316390 9465934 9256499 8927807 8801647 8515680 8434093 8114791 7959505 7960648 7899138
6516 7899138 7743221 7783380 7941338 7869018 7970531 7922899 8021372 7727413 7762481 7476213
6506 7476213 7590279 7539652 7260901 7006100 6740755 6698266 6952494 6822314 6799076 6623498
6496 6623498 6715432 6659916 6606813 6798165 6760269 6817135 6813521 6718670 6818973 6891621 7021321
6485G021321M3815J8498l8451M127L258o9162L4061K61012J46771O7873j26849
6474G366274J8738P210K5256J37470J5960o4866j04787K08855K71233N6625k98583
6463G639385L12410J5289j48610J1031J84177L29050n4926j9480j03207j19883
6453H045236K05636J47771K19233J14415M3891L6299m2115M9694L31247Q621J46721
6442I306649j7203l11299K25458L30453N4247R6785K01877k4554j0609m2434K00391
6431A0009761o7701J33873M5071K64711K57943l4432j1959K11346J28706j7760
6421A0919559J20611O0601L2511K96404L02367J5661L3530J13410k521j84734
6411A1707399J09987L93940O4319Q8669K01282K73560J67873p1467N26455K08516
$$ plain form
6485 7021321 7065136 7083634 7045183 7049310 7052568 6983406 7017467 7278479 7425250 7493123 7366274
6474 7366274 7385012 7392222 7417478 7554948 7570908 7506042 7401255 7610110 7881343 7937968 7639385
6463 7639385 7951795 7967084 7818474 7829505 8013682 8342732 8287806 8268326 8165119 8045236
6453 8045236 8250872 8398643 8617876 8732291 8776182 8812481 8770366 8820060 9151307 9159928 9306649
6442 9306649 9289446 8978147 9203605 9534058 9588305 9685090 9886967 9862413 9851804 9809370 10009761
6431 10009761 9942060 10075933 10121004 10385715 10643658 10609226 10597267 10808613 10937319 10919559
6421 10919559 11040170 11100771 11133282 11429686 11732053 11747714 11781244 11894654 11892133 11707399
6411 11707399 11817386 12211326 12275645 12364314 12565596 12839156 13007029 12935562 13462017 13670533
6401A3670533r2511J94244K88923n8819N2721K72564J65099j50498J29354L54795
6391A4826405L0188J68640K17436j88594K61322J88557K24902J97756J87499M26463
6381A6540574O22141J83847K62592J66627K98826K09343L64723L67315K34364
6372A9250352O8994L65608P14869L37177P17420O51355O24770N71101R46470J011741
6362B5259857P63432R26833J140814J420585J708291J730704J774695K286455
6354C7011666K565097J420667R10067Q73351R72802J111395J044530J551861K206562
6345D9667998K257704K217607J725560R34021Q46024Q25589R77733R52107J390129
6336F1794472K069402J965768J623729J374398Q51159O68824J272051K160719
$$ plain form
6401 13670533 13578022 13772266 14061189 14002370 14055091 14327655 14492754 14342256 14471610 14826405
6391 14826405 14856593 15025233 15242669 15054075 15315397 15503954 15728856 15926612 16114111 16540574
6381 16540574 17162715 17346562 17609154 17775781 18074607 18283950 18648673 19015988 19250352
6372 19250352 19319346 19684954 20399823 20737000 21454420 22105775 22730545 23301646 24248116 25259857
6362 25259857 26023289 26950122 28090936 29511521 31219812 32950516 34725211 37011666
6354 37011666 39576763 40997430 41907497 42780848 43753650 44865045 45909575 47461436 49667998
6345 49667998 51925702 54143309 55868869 56802890 57648914 58474503 59452236 60404343 61794472
6336 61794472 63863874 65829642 67453371 68827769 69678928 70347752 71619803 73780522
6328G3780522K996499M008766N056453O490803Q432990R269964R533240P767877
6320A27337114L535855l80865l830141n698640o103951o019173m607841l532837
6312A00699521k460321q14355J27951J626594L312775M279764O158695P509454
6304A20440078Q082841P303661N906001M250966K386426k18745l069910o243517
6296A38837801p371167q239876p874174o800240o378763n171881m303876l236742
6288H9461082k614015j764048p17129l89562L33884Q24261K000155L272646M249273
6279I4656547N738039O623668Q024732Q622436Q206293O537605M156042J941849
6271A44507211Q214k652924m761542o197046o751201o586114o007200n152217
$$ plain form
6328 73780522 76777021 80785787 85842240 92333043 100766033 110035997 119569237 127337114
6320 127337114 130872969 130492104 126661963 120963323 114859372 108840199 104232358 100699521
6312 100699521 98239200 97424845 97552796 99179390 102492165 106771929 112930624 120440078
6304 120440078 128522919 135826580 141732581 145983547 148369973 148151228 145081318 138837801
6296 138837801 131466634 123226758 115352584 108552344 102173581 97001700 92697824 89461082
6288 89461082 86847067 85083019 84365890 83976328 84310212 85134473 87134628 90407274 94656547
6279 94656547 100394586 107018254 115042986 123665422 131871715 138409320 142565362 144507211
6271 144507211 144515425 141862501 137100959 130903913 124152712 117566598 111559398 106407181
6263A06407181l942450k807110j552014o21153Q85798K104413L789291N560382
6255A09824338O571940O068622M233747J254272j844103m757248o360872o742947
6247A08247749o495318o677260n521616m088341l756387l101776k334272j174350
6239G5098429j588652k026925j959390k110347k083750j790729j493523j175038
6231F0870075r40289j014649j542090j743372j829394j824430j851024j757868
6223D8366959j582885q10981p39307j161673j330675j587754j709602k247760
6215C7196322k306339j871925j718660j519280j348108j373291j208925j141881
6207B4707913p70359j013036j071301p39747p23308q00920p02741k56185p26273
$$ plain form
6263 106407181 102464731 99657621 98105607 97484454 98370252 100474665 104263956 109824338
6255 109824338 116396278 122464900 126698647 127952919 126108816 121351568 114990696 108247749
6247 108247749 101752431 95075171 89553555 85465214 81708827 78607051 76272779 75098429
6239 75098429 73509777 71482852 69523462 67413115 65329365 63538636 62045113 60870075
6231 60870075 59929786 58915137 57373047 55629675 53800281 51975851 50124827 48366959
6223 48366959 46784074 45973093 45233786 44072113 42741438 41153684 39444082 37196322
6215 37196322 34889983 33018058 31299398 29780118 28432010 27058719 25849794 24707913
6207 24707913 23937554 22924518 21853217 21113470 20390162 19589242 18886501 18630316 17904043
6198A7904043n70235m18397j23112l58709l62712m75862j85600k48286l73540
6189A4787590m58553m9584k12078j54661k38715l26425n72709l12049J97232j27850
6179A2532198j77915P7518j35072q5459k48267L9967L3975j16040m6337k05450
6169A1669118j57791J61669j98170l51602j19853l7407Q4024Q5482K71520k40165
6159A1166825k00009k75813j71233N8714k03820j94529N4274q0119j09678o6634
6149I977978m855k98466j18161l0068R0063l82122j68517k0279L58188o0792k16070
6138I126899k41231j38599J1384j68375J86530L22340j55756j42313j98082R2203
6128H695000j9273J79538p1457j58238k35534j82784K11718j04066l03672j04104
$$ plain form
6198 17904043 17333808 16915411 16792299 16433590 16070878 15595016 15409416 15161130 14787590
6189 14787590 14329037 14279453 14067375 13912714 13673999 13347574 12774865 12462816 12660048 12532198
6179 12532198 12354283 12431801 12296729 12211270 11963003 12002970 12036945 11920905 11874568 11669118
6169 11669118 11511327 11672996 11474826 11123224 11003371 10965964 11049988 11135470 11406990 11166825
6159 11166825 10966816 10691003 10519770 10578484 10374664 10180135 10234409 10154290 10044612 9977978
6149 9977978 9973123 9674657 9556496 9526428 9616491 9234369 9065852 9045573 9403761 9342969 9126899
6138 9126899 8885668 8747069 8758453 8590078 8776608 9098948 8943192 8800879 8602797 8695000
6128 8695000 8675727 8855265 8783808 8625570 8390036 8207252 8418970 8314904 8011232 7907128
6118G907128N9136j82961L3102k21629L2870j74884r9714k17786k39542M0650
6108F936370O7910j20704k22183p6560j14285K13324J2655K47891K18803j11276
6098G051945k54305k8948j49248J57628j18996l3843j36921M08259j25030l18784
6088F451757K65394j49974M01101j82102n9788J47585j9145K0396r4615J18661
6078F899270R9154o7775K16812j66775Q1319K37271J20337K81257J30373m19514
6068G411729j27386J07048k7065l02664N8041J60925j86365n2739Q5083J29088
6058G255695l0035P8058m6629q0721O1525J70449O5964J94928K90109O6004Q5574
6047H110921K16595K65976J42711k11077p6975p0511p5986O7738o693p9967j32714
$$ plain form
6118 7907128 7966264 7783303 7816405 7594776 7627646 7452762 7353048 7135262 6895720 6936370
6108 6936370 7004280 6883576 6661393 6584833 6470548 6683872 6696527 6944418 7163221 7051945
6098 7051945 6797640 6768692 6619444 6777072 6658076 6624233 6487312 6895571 6770541 6451757
6088 6451757 6717151 6567177 6968278 6786176 6726388 6873973 6854828 6875224 6780609 6899270
6078 6899270 6998424 6930649 7147461 6980686 7062005 7299276 7419613 7700870 7831243 7411729
6068 7411729 7284343 7391391 7364326 7061662 7119703 7280628 7094263 7041524 7126607 7255695
6058 7255695 7225660 7303718 7257089 7176368 7237893 7408342 7474306 7669234 7959343 8025347 8110921
6047 8110921 8327516 8593492 8736203 8525126 8448151 8377640 8301654 8369392 8362699 8282732 8150018
6036H150018j45054o3049J32231K06819j53366r4144L71248j15152l3607l89539
6026G866405J17231J75957m778K08769J24547j32236K12987N703L2119L1058J96270
6015H834032J73171o604R021k72917K1235K46565L6397l24310p600n5970K32785
6004H885805J86665k6142j59646R8201J42307j73686j36468j31772r4644o8530
5994H522090j13459l6190K9072j0417m882J20608p074O4206K20054J44698J72578
5983I101284j65101J05786J03657J94543L47941l26426K4279l6132O0971J94624
5973I605426J12124K88834R137K11858K44689J58434k928j34523M23220N10020
5963A1426291L28479L53614J82072j96214j02548k4743j63572j78641p757K1637
$$ plain form
6036 8150018 8004964 7941915 8074146 8280965 8127599 8033455 8404703 8289551 8255944 7866405
6026 7866405 7983636 8159593 8154815 8363584 8488131 8355895 8568882 8574585 8606704 8637762 8834032
6015 8834032 9007203 9000599 9009620 8736703 8757938 9004503 9040900 8716590 8708990 8653020 8885805
6004 8885805 9072470 9046328 8886682 8984883 9127190 8953504 8817036 8685264 8590620 8522090
5994 8522090 8408631 8372441 8401513 8391096 8386214 8506822 8499748 8563954 8784008 8928706 9101284
5983 9101284 8936183 9041969 9145626 9340169 9688110 9361684 9385963 9349831 9410802 9605426
5973 9605426 9717550 10006384 10015521 10227379 10472068 10630502 10627574 10493051 10916271 11426291
5963 11426291 11754770 12108384 12290456 12094242 11991694 11966951 11803379 11624738 11616981 11638618
5953A1638618l7656j37523L00850Q523k71217K49802J60546J16674m2591R0692
5943A2076718m77946j24651O1943p7244k39817j21354k43447l35620m7708K57064
5933A0727938J04764p4216j43842j66748l8459r3926l39671q2278J70101J61141
5923A0224804j62448J18819R2610j32230P585L26048Q4878j18316L49110o7644
5913A0723216J01263P1186L50166j05350r298K93134K0925R6J24876J03383j7445
5902A1656152p7179M10866O4557K6418Q4881r5389J71684M09488J83025M41554
5892A3276057M89425N07331N7281L38372L53173M95188J53554j2790J55491K34921
5882A6048003J57562J46606o3151o1019l60288k55871o0833j99868l38595j37553
$$ plain form
5953 11638618 11600962 11463439 11764289 11772812 11501595 11751397 11911943 12028617 11986026 12076718
5943 12076718 11598772 11474121 11536064 11458820 11219003 11097649 10854202 10518582 10470874 10727938
5933 10727938 10832702 10758486 10614644 10447896 10409437 10315511 9975840 9893562 10063663 10224804
5923 10224804 10062356 10181175 10273785 10141555 10149140 10475188 10560066 10441750 10790860 10723216
5913 10723216 10824479 10895665 11245831 11140481 11131183 11424317 11445242 11445338 11570214 11673597 11656152
5902 11656152 11578973 11989839 12054396 12080814 12165695 12070306 12241990 12651478 12834503 13276057
5892 13276057 13765482 14272813 14330094 14668466 15021639 15516827 15670381 15657591 15813082 16048003
5882 16048003 16205565 16352171 16289020 16228001 15867713 15611842 15551009 15351141 15012546 14874993
5872A4874993k08249k58623l04154m38955J3089k47027l35183k19633k40481K24605
5862A2860382L1604j92459Q2288J49307j02480j03434J47784j76236p4027j68866
5852A2453863k43404R0990K97351j35615n6660P9385k24680K0386k8068q9013
5842A2164535K23056j5700K87884k73845P236K95725N7953K5817j21341L7254
5832A2688574K49185r0726N2782m0059K7828j58299L86282J40380l2363J27095
5822A3350679J50679J31597K45942K85111K79131J33841j78326N2096K73651l8580
5812A4685821J83185R7318p0395J66981K9752R3253j70908N3388p3091L49469
5802A5344773J15609k2468J09425j29537J06643l96075J40310k97582l06679p6910
$$ plain form
5872 14874993 14666744 14408121 14103967 13665012 13678101 13431074 13095891 12876258 12635777 12860382
5862 12860382 12891986 12699527 12781815 12931122 12828642 12725208 12872992 12696756 12622729 12453863
5852 12453863 12210459 12301449 12598800 12463185 12406525 12485910 12261230 12281616 12253548 12164535
5842 12164535 12387591 12371891 12659775 12385930 12393166 12688891 12746844 12772661 12651320 12688574
5832 12688574 12937759 12847033 12899815 12859756 12887584 12729285 13115567 13255947 13223584 13350679
5822 13350679 13501358 13632955 13878897 14164008 14443139 14576980 14398654 14450750 14724401 14685821
5812 14685821 14869006 14966324 14895929 15062910 15092662 15185915 15015007 15068395 14995304 15344773
5802 15344773 15460382 15437914 15547339 15417802 15524445 15128370 15268680 14971098 14664419 14587509
5792A4587509j46926j00302r1338l22694j44448Q947O3711j19447j72351J54068
5782A3716729O0290o8497k45102l8061j85744J90624J75331l23687K72557L5915
5772A3590355k1198Q8346K72737K71979J94027j2757J7465M42106R5295j19640
5762A4818715j01426R219J35560K9096M6623j09343m4673O7383q9126K2664J69889
5751A4954581J94919j80633M81308N00737K03497M1615K62803R5060l37909o29073
5741A5586905r1320J1809l28725l87821k3244p228p1675J7188J49038J08419j7135
5730A4946211j594J01829k15558K78596q1865J77982J95480J64441k8872j82730
5720A5353920J34691J81580k2178J75978K76675j4332P2810J2705K48793K76225
$$ plain form
5792 14587509 14440583 14340281 14248943 13926249 13781801 13790748 13854459 13735012 13562661 13716729
5782 13716729 13777019 13708522 13463420 13425359 13239615 13430239 13605570 13281883 13554440 13590355
5772 13590355 13569157 13657503 13930240 14202219 14396246 14383489 14400954 14843060 14938355 14818715
5762 14818715 14717289 14726508 14862068 14891164 14937787 14828444 14783771 14851154 14762028 14784692 14954581
5751 14954581 15149500 14968867 15450175 15950912 16154409 16196024 16458827 16553887 16215978 15586905
5741 15586905 15495585 15507394 15178669 14790848 14767604 14760376 14688701 14705889 14854927 14963346 14946211
5730 14946211 14944617 15046446 14830888 15109484 15027619 15205601 15401081 15565522 15536650 15353920
5720 15353920 15488611 15670191 15648013 15823991 16100666 16086334 16159144 16171849 16420642 16696867
5710A6696867l575m9304K75981M40653M81289J3280J67124K06723L64317M28197
5700A9021552K25512N13769P23463O00169Q3577K38429K66703J00494l9033j71109
5690B1563526m0699m8365r7699J2635m8672m6786j8359N03497L22523J8508J68344
5679B2288453Q2877K96060L73619K24792N6735K45982L22105M72175L45766J33979
5669B4842543J81402M79130P02286P98824R11716O93638O21505J16287j83751
5660B9163580o95368p06856l18027l61264j33819l90013j05L5370K50857J77096
5650B7021451K32284Q4027K73340K56349N42345M84713M15938M91202N75380M89774
5640C0866803L81752R23215P90792P47513Q77088J138860J438411J722407J291138
$$ plain form
5710 16696867 16693292 16643988 16919969 17360622 17841911 17855191 18022315 18229038 18593355 19021552
5700 19021552 19247064 19760833 20484296 21084465 21168042 21406471 21673174 21773668 21734635 21563526
5690 21563526 21522827 21474462 21376763 21389398 21340726 21293940 21275581 21779078 22101601 22120109 22288453
5679 22288453 22371330 22667390 23041009 23265801 23322536 23568518 23890623 24362798 24708564 24842543
5669 24842543 25023945 25503075 26205361 27004185 27915901 28609539 29231044 29347331 29163580
5660 29163580 28468212 27761356 27443329 27082065 26948246 26558233 26558128 26593498 26844355 27021451
5650 27021451 27253735 27337762 27611102 27867451 28409796 28894509 29310447 29801649 30377029 30866803
5640 30866803 31248555 32171770 32962562 33710075 34587163 35726023 37164434 38886841 40177979
5631D0177979Q91403O14644j14502Q0448o0254j86234K23836r6994K79884N30997
5621D2341207L71853Q50331P47850J011795J141579J079386J036298J519122J500124
5612E1599545J698530J797784J727050J729783J772796J761884K179924K662780
5604F6930076K478800K513857L095014L764586M226127M609638N200313N995037
5596I8813448O866528Q155140R042240R970840J1308101J2341217J3008174J3251160
5588A82756848J3546984J2965192J1523315R679100O130679K332557j142353l780807
5580B34011515n520613o615392q227828r421978j0601330j1314336j1516759j1330740
5572A59462539j0763221j0237999r546704q613502q072894p590076p003402o366314
$$ plain form
5631 40177979 41069382 41684026 41569524 41649972 41589718 41403484 41627320 41530326 41810210 42341207
5621 42341207 42713060 43563391 44311241 45323036 46464615 47544001 48580299 50099421 51599545
5612 51599545 53298075 55095859 56822909 58552692 60325488 62087372 64267296 66930076
5604 66930076 69408876 71922733 75017747 78782333 83008460 87618098 92818411 98813448
5596 98813448 105679976 113835116 122877356 132848196 144156297 156497514 169505688 182756848
5588 182756848 196303832 209269024 220792339 230471439 236602118 238934675 237792322 234011515
5580 234011515 228490902 221875510 213647682 204225704 193624374 182310038 170793279 159462539
5572 159462539 148699318 138461319 128914615 120301113 112228219 104638143 97634741 91268427
5564I1268427n600387n113179m745739m173809m038574l555251l089002l042343
5556E7910143k950501k242324k113129k155075j664109j730818j543772j655971
5548D1854444j602049j186764j040907j201825j245973j038037j010689q92274
5540C2635926p90237p73847o02598p56103o88265o75946m17685p04153r09851
5531B6317241n81098p53716m46559m56919m26552n38018m66769l20178k70549
5522B2056883j09701l25239m09389j53427j52400l16734k25349j9883k64238l67694
5512A9712829L5369o8162l88612k01135O5535p9515r9333j01470J14966L7669
5502A9028141O8753L0415j74652j36011k0004j05711K21999N1105j47468j33684
$$ plain form
5564 91268427 85668040 80554861 75809122 71635313 67596739 64041488 60952486 57910143
5556 57910143 54959642 52717318 50604189 48449114 46785005 45054187 43510415 41854444
5548 41854444 40252395 39065631 38024724 36822899 35576926 34538889 33528200 32635926
5540 32635926 31845689 31071842 30469244 29713141 29024876 28348930 27931245 27227092 26317241
5531 26317241 25736143 24982427 24535868 24078949 23652397 23114379 22647610 22327432 22056883
5522 22056883 21947182 21621943 21212554 21059127 20906727 20589993 20364644 20344761 20080523 19712829
5512 19712829 19748198 19680036 19291424 19090289 19155824 19076309 18976976 18875506 18990472 19028141
5502 19028141 19096894 19127309 18952657 18816646 18796642 18690931 18912930 18964035 18816567 18682883
5492A8682883j01624K23230J7271j04312m69534l12473r7471k99575n4086k1853
5482A7462456k85479J29255j6743l91405k33245m21891j36393j45061j04121m03177
5472A5454196l16914o3676k20533J39092m1619j52849j95575j59617j6957j56377
5462A4269171Q0921k8179j16335l21861l26798k7542J97971n729j21306j12230
5452A3488083L7480M8103j31897k02561j44224K0536M67158j75842r4658J73803
5442A3485981k45986O5812J80008J07837J33889K35186J89664J73904J52514n6038
5432A4422771j45818K96751R486Q3857L4304k6139j71647N41606k70364J6506
5422A4791313j5069J53545M89150K59115K07393M69962N83575O12111L28968K03263
$$ plain form
5492 18682883 18581259 18804489 18821760 18717448 18247914 17935441 17837970 17538395 17484309 17462456
5482 17462456 17176977 17306232 17289489 16898084 16664839 16242948 16106555 15961494 15857373 15454196
5472 15454196 15137282 15073606 14853073 14992165 14950546 14797697 14602122 14442505 14425548 14269171
5462 14269171 14350092 14321913 14205578 13883717 13556919 13529377 13727348 13721619 13600313 13488083
5452 13488083 13525563 13573666 13441769 13239208 13094984 13115520 13582678 13406836 13312178 13485981
5442 13485981 13239995 13305807 13485815 13593652 13727541 13962727 14152391 14326295 14478809 14422771
5432 14422771 14276953 14573704 14583190 14667047 14701351 14675212 14503565 15045171 14774807 14791313
5422 14791313 14776244 14929789 15418939 15678054 15885447 16355409 16938984 17551095 17880063 18083326
5412A8083326K3824l95850j74076k11525m15167m32246j51057l67532l49596q6077
5402A5524024j38945j37815O5836J921P5891j09295O5735n4996j29386k16942
5392A4946028p0513J81638j68729j49613J56055k83149l20257N2717j07466l72516
5382A3864195K50118k04284l30917Q6624N6823J25894L9376k69319L3580k24228
5372A3427862J26187J48228k02603l7711k60186j52289J6221j4265O1085k16817
5362A2895712K8934J87795k75463k86632J62643N6753p2183j52621j53730p4727
5352A2316481J17285L0626k03336k00236J16410K12143k2972l86556k40915K72748
5342A2011678J26334j83550l3845R0432K31005J75292k28272R0465m3254M4967
$$ plain form
5412 18083326 18107150 17711300 17537224 17325699 16910532 16478286 16327229 15959697 15610101 15524024
5402 15524024 15385079 15247264 15313100 15315021 15390912 15281617 15347352 15292356 15162970 14946028
5392 14946028 14875515 15057153 14888424 14738811 14894866 14611717 14291460 14344177 14236711 13864195
5382 13864195 14114313 13910029 13579112 13665736 13722559 13848453 13887829 13618510 13652090 13427862
5372 13427862 13554049 13702277 13499674 13461963 13201777 13049488 13065709 13051444 13112529 12895712
5362 12895712 12924646 13112441 12836978 12550346 12712989 12769742 12697559 12544938 12391208 12316481
5352 12316481 12433766 12464392 12261056 12060820 12177230 12389373 12366401 11979845 11738930 12011678
5342 12011678 12138012 11954462 11920617 12011049 12242054 12417346 12189074 12279539 12236285 12281252
5332A2281252k50565j32396M4962O2010N9547o2410j66331Q869j02188M301J30962
5321A1878013Q932j686P2170R5978J96257R5497m3164K16415j16222J00700J03399
5310A2606289j04017j900J10767n3524q1035J34683K09979j7373J56473l6235
5300A2924107l07367J20916Q8785o2217j16000J00632K21751j16232J73978K06095
5290A3234448K19251J77934l01043L9239P7750Q2711J00382K25608K68594K05752
5280A4330626L634L7930K228R4352J24553j29193J45061J28655j8957k50005J17217
5269A4586101L14979p8676j26820Q9457O3427l22634j8185M26974J6914j16084
5259A4835453J913O8669L29700L03770K02765J33483L56505J55660L28137L66991
$$ plain form
5332 12281252 12030687 11898291 11943253 12005263 12064810 12002400 11836069 11844938 11742750 11747051 11878013
5321 11878013 11886945 11885259 11957429 12053407 12249664 12345161 12301997 12518412 12402190 12502890 12606289
5310 12606289 12502272 12500372 12611139 12557615 12476580 12611263 12821242 12803869 12960342 12924107
5300 12924107 12616740 12737656 12826441 12764224 12648224 12748856 12970607 12854375 13028353 13234448
5290 13234448 13453699 13631633 13330590 13369829 13447579 13530290 13630672 13856280 14124874 14330626
5280 14330626 14334260 14372190 14374418 14468770 14593323 14464130 14609191 14737846 14718889 14468884 14586101
5269 14586101 14901080 14822404 14695584 14785041 14848468 14525834 14507649 14934623 14951537 14835453
5259 14835453 14837366 14906035 15235735 15539505 15742270 15875753 16232258 16387918 16716055 17083046
5249A7083046M96270M00937P92589O77839P80470N07556L63490N88515m0285m69893
5239B1180534l83602n45658o75391k16461k49451l82712l60816j06911j98038
5230A8061494k9567J82524j27253j65073J74390P6683J49279J37918p299K6233
5220A8479329K29221P1451j72094J32261J34062K56260K49088J76209L02703K30755
5210B0089245M45384N18183O22092K07513K84783M68794N35961L77105O93935
5201B4242995M86420K83715L32789J07481M3634Q5850k99581j624K6817n6199
5191B5252297N31854M91810M09035M96561L39246K83842L79023q3392j24797j92388
5181B7783091k71563n39923m82425j58438j82543m8415j31459j57925l95818k18082
$$ plain form
5249 17083046 17579316 17980253 18772842 19450681 20231151 20738707 21102197 21690712 21650427 21180534
5239 21180534 20796932 20251274 19575883 19359422 19109971 18727259 18366443 18259532 18061494
5230 18061494 18031927 18214451 18087198 17922125 18096515 18173198 18322477 18460395 18453096 18479329
5220 18479329 18708550 18780001 18607907 18740168 18874230 19130490 19379578 19555787 19858490 20089245
5210 20089245 20534629 21052812 21674904 21882417 22167200 22635994 23171955 23549060 24242995
5201 24242995 24729415 25013130 25345919 25453400 25497034 25582884 25283303 25281679 25308496 25252297
5191 25252297 25784151 26275961 26684996 27181557 27520803 27804645 28183668 28100276 27975479 27783091
5181 27783091 27511528 26971605 26489180 26330742 26148199 26099784 25968325 25810400 25414582 25196500
5171B5196500K55067P1557J32201l6634K93449M70495N40961N44461M16947N17591
5161B8402595Q68675P40556P24369O70498L11433N05072O70300O23964O68458
5152C4185920P02478R84303O23102R34913L73337j13803L5818m70367k65617n64332
5142C6425752j069469r42883q95833j003099n54435k72786m82711m40322m41305
5133C0322909K39833J9329J04979N91758L97263Q86025R80129J286426J026359
5124C5855010R44348R17499L17436P6624l80711q53920p06496r15793n87815q46212
5114C3819970p17171q59522q18267n09857q60090o93745l90292l54156k48686
5105B8368184k13404o2620k40311o4728J8751k07006k75413j54521J51426M3916
$$ plain form
5171 25196500 25451567 25523124 25655325 25618691 25912140 26382635 26923596 27468057 27885004 28402595
5161 28402595 29271270 30011826 30736195 31406693 31718126 32223198 32893498 33517462 34185920
5152 34185920 34888398 35872701 36495803 37430716 37804053 37690250 37726068 37255701 36990084 36425752
5142 36425752 35356283 34413400 33517567 32514468 31960033 31687247 31204536 30764214 30322909
5133 30322909 30562742 30582071 30687050 31278808 31676071 32562096 33542225 34828651 35855010
5124 35855010 36799358 37716857 38034293 38110917 37730206 36876286 36169790 35253997 34666182 33819970
5114 33819970 33102799 32243277 31425010 30915153 30055063 29361318 28971026 28616870 28368184
5105 28368184 28154780 28092160 27851849 27787121 27805872 27598866 27323453 27168932 27320358 27364274
5095B7364274n17297k51896M43102P2081J5257K95348j57347j17444K19963M97804
5085B7863845L62812J09259p2545r0420R8928j5493k2545j42105n2732j2996r4406
5074B7931602p5025j8222P2511n7727j33991k00496J14050J96593k22383L6364
5064B7643276l9570j6731M4069K46195O0408r3082R8662J05115J04170M14440
5054B8566952K18877R1234K44806K1545J49169L44814L28428O10930M92735n6089
5044C1013401K47800o4234K27564N3655k47048J47962J56572R9026L39067N02174
5034C2475939K79191J23748K7696M85212L99025K44638J97942K69726L79254J71769
5024C5054140K07894O79650L12169L27745J75653N08944Q15203M84957N7306k17741
$$ plain form
5095 27364274 26846977 26595081 27038183 27110264 27125521 27420869 27263522 27146078 27366041 27863845
5085 27863845 28226657 28335916 28263371 28172951 28271879 28256386 28233841 28091736 28039004 28026008 27931602
5074 27931602 27856577 27838355 27910866 27853139 27719148 27518652 27632702 27829295 27606912 27643276
5064 27643276 27603706 27586975 27631044 27877239 27937647 27844565 27943227 28048342 28152512 28566952
5054 28566952 28785829 28877063 29121869 29143414 29292583 29637397 29965825 30576755 31069490 31013401
5044 31013401 31261201 31196967 31424531 31478186 31231138 31379100 31535672 31634698 31973765 32475939
5034 32475939 32755130 32878878 32906574 33391786 33790811 34035449 34233391 34503117 34882371 35054140
5024 35054140 35262034 35941684 36253853 36581598 36757251 37266195 38081398 38566355 38623661 38405920
5014C8405920n68889k8212P2279l3244o5373K8092k0961R6579O19299M49131K92161
5003C9246782N43868N73526M30590O28845O12332O99096P66035O34507O02522
4994D4738103Q38860P01302M11880L94454O15630M52245P13050O98370Q63125
4985E0427019O83735L84121K80048N7415K52992K22518K97726K98212O66884P10942
4975E4281612Q92177J133151J105758J198632P05777Q93935N03089M53709O30129
4966F1797969L92043L62276M36594O61566L79578M77319J008154O22593N47700
4957F6685792O01430N91558O97645Q26497R45603R56403J209731J188128J154975
4948G4857762J641093J493768J568688J720108J901344K017028K318986K224724
$$ plain form
5014 38405920 37837031 37808819 37881098 37847854 37782481 37810573 37789612 37886191 38505490 38954621 39246782
5003 39246782 39790650 40364176 40794766 41423611 42035943 42735039 43501074 44135581 44738103
4994 44738103 45576963 46278265 46690145 47084599 47700229 48152474 48865524 49563894 50427019
4985 50427019 51110754 51494875 51774923 51832338 52085330 52307848 52605574 52903786 53570670 54281612
4975 54281612 55173789 56306940 57412698 58611330 59317107 60211042 60714131 61167840 61797969
4966 61797969 62190012 62552288 62988882 63650448 64030026 64507345 65515499 66138092 66685792
4957 66685792 67287222 67878780 68576425 69402922 70348525 71304928 72514659 73702787 74857762
4948 74857762 76498855 77992623 79561311 81281419 83182763 85199791 87518777 89743501
4940H9743501K302010K678429K654412K867341K847360L530896L923285M404367
4932A14951601M792678N487855N955515O362102O847491P315271P679189Q073558
4924A67465260R054265J0250983J1480781J3296307J4876781J6297451J7026601
4917B59748429J7967336J8562150J9117217J9548408J9526546J8397649J4905515
4910C87773250R644143L553164k049993o052547r089106j1714651j3447883j4519032
4902C44097345j6003025j7707741j8858061j9078880j8053329j6389655j4521538
4895B23485116j2823235j1300602j0096553q897671p838349o936427o293986o068949
4887A53229344o185239n795936n644611m903828n160703m767188m403598m088860
$$ plain form
4940 89743501 92045511 94723940 97378352 100245693 103093053 106623949 110547234 114951601
4932 114951601 119744279 125232134 131187649 137549751 144397242 151712513 159391702 167465260
4924 167465260 176519525 186770508 198251289 211547596 226424377 242721828 259748429
4917 259748429 277715765 296277915 315395132 334943540 354470086 372867735 387773250
4910 387773250 397417393 400970557 398920564 392868017 383778911 372064260 358616377 344097345
4902 344097345 328094320 310386579 291528518 272449638 254396309 238006654 223485116
4895 223485116 210661881 199361279 189264726 180367055 172528706 165592279 159298293 153229344
4887 153229344 147044105 141248169 135603558 130699730 125539027 120771839 116368241 112279381
4879A12279381l677140l643575k949698k729836k650471k027772k080873j336108
4871I1183908j097759p54159o95032l31026J78902L94580P35684P36774N47489
4862I0899361Q61287J375840J362420J974697K393121K775432K848294L230995
4854A07721447L613367L140283K820766K359490J215702O13389L46491j012290
4846A20818645j950491k811624l219638m024092m625513m092554m294056l952282
4838I1848395l768598l155232l050598k662558k344510k243482k035393j666926
4830G0921098j873921j527334j415583j564190j388665j212143j010779j157353
4822E9771130r67348r81825p01690q76866j005614o77733q04251r34236o47203
$$ plain form
4879 112279381 108602241 104958666 102008968 99279132 96628661 94600889 92520016 91183908
4871 91183908 90086149 89331990 88636958 88305932 88484834 88879414 89615098 90351872 90899361
4862 90899361 91760648 93136488 94498908 96473605 98866726 101642158 104490452 107721447
4854 107721447 111334814 114475097 117295863 119655353 120871055 121484444 121830935 120818645
4846 120818645 118868154 116056530 112836892 108812800 104187287 100094733 95800677 91848395
4838 91848395 88079797 84924565 81873967 79211409 76866899 74623417 72588024 70921098
4830 70921098 69047177 67519843 66104260 64540070 63151405 61939262 60928483 59771130
4822 59771130 58803782 57821957 57120267 56243401 55237787 54560054 53755803 52821567 52174364
4813E2174364n48240m89659j66135k00277l90623m69072j28761j09558j98974
4804D9473065n2800m50997o7945L8521j23493j05197q9765L51172J57265Q6962
4794D9216788j26966J81143J39473K63871K74916k13685k61302l9074K48880P5823
4784D9759867J39194K05884M32505P44985M00961J46698L33400L37054M0981M18831
4774E2960360N26495M34478N80727L59064L74319J81507k77696K13927k49k39449
4764E5113483k89476K9079k9288j33624m5002M30927j1330J61124J38448k33235
4754E5131106L87767M77713L09314N29332O84751O36689L96265N08858O33425
4745E9695220J019115Q79934P11343M29008M24088O18263N55748L50197P01657
$$ plain form
4813 52174364 51626124 51136465 50970330 50770053 50379430 49910358 49781597 49672039 49473065
4804 49473065 49420265 48969268 48901323 48939844 48816351 48711154 48621389 48972561 49129826 49216788
4794 49216788 49089822 49270965 49410438 49674309 49949225 49735540 49474238 49435164 49684044 49759867
4784 49759867 49899061 50104945 50537450 51282435 51683396 51830094 52163494 52500548 52541529 52960360
4774 52960360 53486855 53921333 54502060 54861124 55235443 55416950 55139254 55353181 55352932 55113483
4764 55113483 54824007 54853086 54823798 54690174 54645172 55076099 55064769 55225893 55364341 55131106
4754 55131106 55518873 55996586 56305900 56835232 57519983 58156672 58552937 59061795 59695220
4745 59695220 60714335 61594269 62305612 62734620 63158708 63776971 64332719 64682916 65384573
4736F5384573P31410J031633J004535J098320J524564J738708J252927J330009
4728G5096679J726174J564835K010853K263735K515633K774870K976840L026204
4720I3955823L290094L241342M196460M932394O030784O770212Q115307R674271
4712A40206687J1494222J2894050J5946039J9258610K5538392L1940841M1014507
4705B98293348N6061360P4869740O2878216K4253472k1732262m4333708m3678171
4698D06611995m4696310l7991429l1706241k6743584k3397877j9197247j4958983
4691B07920324j2185639j0995420r560082q670311p599671p165932o091989n575375
4683A40075905m804138l615847k546197j781257p03652k99676l12193k27169J11225
$$ plain form
4736 65384573 66115983 67147616 68152151 69250471 70775035 72513743 73766670 75096679
4728 75096679 76822853 78387688 80398541 82662276 85177909 87952779 90929619 93955823
4720 93955823 97245917 100487259 104683719 109616113 115646897 122417109 130532416 140206687
4712 140206687 151700909 164594959 180540998 199799608 225338000 257278841 298293348
4705 298293348 354354708 429224448 492102664 516356136 494623874 450290166 406611995
4698 406611995 361915685 323924256 292218015 265474431 242076554 222879307 207920324
4691 207920324 195734685 184739265 175179183 166508872 158909201 151743269 145651280 140075905
4683 140075905 135271767 131655920 129109723 127328466 126624814 126325138 126012945 125785776 125897001
4674A25897001J84742K60674J103408J016156j63464j647574j722367j324654
4666A23603922r67477k25803N92712J522207K081532L267611M321399M869034
4658A39065137M735261L676702K428055K038801J823618K404796L097821M692174
4650A63962365N899529P478442R246211J0739075J2620044J5071633J8391233
4643B43408532K2763525K7786199L4211816M1793941M6321547L8605867J6539393
4636D71430820r022367k4974147l0324822l0538225k7720383k4120082j9890938
4629C04839856j5529330j1614928q958937q908267j0444851j1891585j2393820
4622B25098138j2086570j1248782j0029935q889731p348428o101856m806458m385967
$$ plain form
4674 125897001 126081743 126342417 127445825 128461981 128298517 126650943 124928576 123603922
4666 123603922 122636445 122410642 123003354 124525561 126607093 129874704 134196103 139065137
4658 139065137 143800398 147477100 149905155 151943956 153767574 156172370 159270191 163962365
4650 163962365 169861894 177340336 186586547 197325622 209945666 225017299 243408532
4643 243408532 266172057 293958256 328170072 369964013 416285560 454891427 471430820
4636 471430820 462408453 437434306 407109484 376571259 348850876 324730794 304839856
4629 304839856 289310526 277695598 268736661 259828394 249383543 237491958 225098138
4622 225098138 213011568 201762786 191732851 182843120 175494692 169392836 164586378 160200411
4614A60200411m633324n623093n865039n527757n584904n034374m220387l570791
4606A20140742k811296k058836j591073j657740k323403k591300l055649l207697
4598A00843748l600118l291950k952654l073961k748276k595674k301675k152756
4590G8126684j808319k157303j973031j692444j409282j264677j214881o97773
4582F5908974m45065l46207l9659K69289L52074P40949K56845M39620L16526j44461
4572F7308885L1098l43817o70335o52745q29688p25651j66484l51930k70534K0772
4562F3349571M81962N16644O74707K74883K22J10025J36704N36132J470593J643511
4552F9194954N98092j292728k503632k736299k694534k380291j981088j476644
$$ plain form
4614 160200411 155567087 149943994 144078955 138551198 132966294 127931920 123711533 120140742
4606 120140742 117329446 115270610 113679537 112021797 109698394 107107094 104051445 100843748
4598 100843748 97243630 93951680 90999026 87925065 85176789 82581115 80279440 78126684
4590 78126684 76318365 74161062 72188031 70495587 69086305 67821628 66606747 65908974
4582 65908974 65463909 65117702 65078043 65347332 65699406 66440355 66697200 67136820 67453346 67308885
4572 67308885 67339983 66996166 66325831 65673086 64843398 64117747 63951263 63599333 63328799 63349571
4562 63349571 63831533 64348177 65022884 65297767 65297989 65408014 65544718 66080850 67551443 69194954
4552 69194954 69793046 68500318 65996686 63260387 60565853 58185562 56204474 54727830
4544E4727830j601530j247101q84607n35553l53656k39671j35185J11302J86169
4535E0027998P01919Q65803P26188J164211J112511J506320J445317J373700J372274
4526F0296241J379402J312637R66840J054819J127071J288471J202878J203134
4518F9831493J165700O23456q1652l23814m54881m22612J68290K94272M51839
4509G1252091Q41350J679479K371931K927351L655029M774703O149202P132238
4501A00783374R073881J0722803J2439686J5010297J7820535J8035178J1490510
4494A95376264k37725j0813052j4666512j5333443j5019800j2947233j1669519
4487A14688980j0320069q812166p405408o068740n300130m813649m627061m068042
$$ plain form
4544 54727830 53126300 51879199 50994592 50459039 50105383 49865712 49730527 49841829 50027998
4535 50027998 50729917 51595720 52321908 53486119 54598630 56104950 57550267 58923967 60296241
4526 60296241 61675643 62988280 63955120 65009939 66137010 67425481 68628359 69831493
4518 69831493 70997193 71620649 71538997 71215183 70760302 70337690 70505980 70800252 71252091
4509 71252091 72093441 73772920 76144851 79072202 82727231 87501934 93651136 100783374
4501 100783374 109857255 120580058 133019744 148030041 165850576 183885754 195376264
4494 195376264 195138539 184325487 169658975 154325532 139305732 126358499 114688980
4487 114688980 104368911 95556745 88151337 82082597 76782467 71968818 67341757 63273715
4479F3273715l719385l478493l154030k643781k370257j960598k014592j688243
4471D2244336j319218j626512j317451j312267r89949q24358q50551n06924m16921
4462C3080185j40868j38601r7493J43701N61298P29750N63223R18440L84559j37898
4452C5866296p41312o15073j002870r51213p99951p37553n26856k68713M1026
4443C0263781O06437N69304N38961M42186M44108j14613q89136j302558j491636
4434B9066834j036254r21341q87527j074141p57322p43607r45812l85137j75119
4425B2140574l77346l21803m81978k13142l8325K58792L464J06011J26332P48027
4415B1950606P52408K00974J65419K39345m48512o34882m56329m04127l8944q6975
$$ plain form
4479 63273715 59554330 56075837 52921807 50278026 47907769 45947171 43932579 42244336
4471 42244336 40925118 39298606 37981155 36668888 35678939 34854581 34004030 33497106 33080185
4462 33080185 32939317 32800716 32703223 32846924 33408222 34137972 34701195 35619635 36004194 35866296
4452 35866296 35124984 34509911 33507041 32555828 31755877 31018324 30491468 30222755 30263781
4443 30263781 30870218 31439522 31978483 32420669 32864777 32750164 31861028 30558470 29066834
4434 29066834 28030580 27109239 26221712 25147571 24390249 23646642 22700830 22315693 22140574
4425 22140574 21763228 21441425 20959447 20746305 20707980 20966772 20970236 21076247 21202579 21950606
4415 21950606 22703014 22903988 23069407 23308752 22860240 22225358 21769029 21364902 21325958 21238983
4405B1238983m70394Q457L76124O3053J64614J67277P760j59965m83568m84044
4395B0428297o01061n15650m52329o22643n93681k47048o12436k44768K86940
4386A6825621M5374j75448j44389l20883k63760k56054m27784m27546N678n6391
4376A4804418j68578j36374J02526k84535l46702o9490l47918l55584j40581j29718
4366A2927464n20136j03772k21921l5728Q9833L7390k76882j53671K49740J75540
4356A2167857L128K6667R5140M0569J73641L84797k2369q7264m02210k41909P4346
4345A2212393k45616m07742k56525j49831j09560n19653J26139L7163R3676K40788
4335A1021232J67276N8846p0708j99215j52674m36496j26570k63958J4335j11481
$$ plain form
4405 21238983 20768589 20777046 21153170 21216223 21380837 21548114 21555874 21395909 20912341 20428297
4395 20428297 19827236 19311586 18859257 18236614 17642933 17395885 16783449 16538681 16825621
4386 16825621 16870995 16695547 16551158 16230275 15966515 15710461 15282677 14855131 14860809 14804418
4376 14804418 14635840 14499466 14601992 14317457 13970755 13901265 13553347 13197763 13057182 12927464
4366 12927464 12407328 12303556 12081635 12045907 12135740 12173130 11896248 11742577 11992317 12167857
4356 12167857 12170985 12197652 12292792 12333361 12507002 12891799 12869430 12782166 12379956 12138047 12212393
4345 12212393 11966777 11559035 11302510 11152679 11043119 10523466 10649605 10686768 10780444 11021232
4335 11021232 11188508 11247354 11176646 10977431 10824757 10388261 10261691 9997733 10012068 9900587
4325I900587j43633l45819k7475j02409j58408L5032n6200l87133q4648J39014
4315H768908j07278O9201k29927o8430N1852o2297o8857R5926J4755k20946k83332
4304G959575J39524q3428K09229m2107K80061k10740m09417l2978K8989j70647
4294G668061n2284L49946K19931q167p0483J27133k67989k13657j93278J46953
4284G706166K76719j53514O6035j83676R3654k83247J47451j77491k03369j68595
4274G120133M8034O1205r9926q2833j5896J42561Q4203j97131k1168k5500J26505
4263G140187j61017r9416j9884J00772J62835Q5577j41719q0877K8010J39868
4253G154336N3568l29282J87292M9581K936Q4285k99614j27874J27946J7614Q1533
$$ plain form
4325 9900587 9756954 9411135 9383660 9281251 9122843 9157875 9101675 8714542 8629894 8768908
4315 8768908 8661630 8730831 8500904 8432474 8484326 8422029 8353172 8449098 8463853 8242907 7959575
4304 7959575 8099099 8015671 8224900 8182793 8462854 8252114 7842697 7809719 7838708 7668061
4294 7668061 7615777 7965723 8185654 8177487 8107004 8234137 7966148 7752491 7559213 7706166
4284 7706166 7982885 7829371 7895406 7711730 7805384 7522137 7669588 7492097 7288728 7120133
4274 7120133 7168167 7229372 7129446 7046613 7030717 7173278 7257481 7060350 7039182 7013682 7140187
4263 7140187 6979170 6879754 6859870 6960642 7123477 7209054 7067335 6986458 7014468 7154336
4253 7154336 7207904 6878622 7065914 7115495 7118431 7202716 6903102 6775228 6903174 6920788 7002321
4242G002321l0495j1260j23543L4072l7462J54869K19276k22763j0355K06240
4232G180900k17032J64453J38624J25005L3177K02407o1454J18518J44435l154
4222G825879J53571M08677L09745K34350K19413K7503J55765M1083Q6583J04871
4212I567440m19902j95024k79869k11323k77747O4250R641j60617L955l4199n1219
4201H015386k8433n9941Q5200j3779j87560K44714M8352L40712K23029J75353
4191H843033q5381L38774L12893K52677J31151L11769K93696J07131M88965L50446
4181A1345154L56539J74015K80464J23790R6638p7383k91954j98215k86160m14141
4171A1108747k46204l1004j4005K49872K18904K36237j56991L18459K02417L84658
$$ plain form
4242 7002321 6971826 6960566 6837023 6871095 6833633 6988502 7207778 6985015 6974660 7180900
4232 7180900 6963868 7128321 7266945 7391950 7425127 7627534 7566080 7684598 7829033 7825879
4222 7825879 7979450 8388127 8697872 8932222 9151635 9179138 9334903 9375986 9462569 9567440
4212 9567440 9147538 8952514 8672645 8461322 8183575 8247825 8257466 8096849 8100804 8066605 8015386
4201 8015386 7986953 7927012 8012212 7998433 7810873 8055587 8103939 8444651 8667680 8843033
4191 8843033 8757652 9096426 9409319 9661996 9793147 10104916 10398612 10505743 10994708 11345154
4181 11345154 11701693 11875708 12156172 12279962 12376600 12299217 12007263 11809048 11522888 11108747
4171 11108747 10862543 10831539 10817534 11067406 11286310 11522547 11365556 11684015 11886432 12271090
4161A2271090Q84059R14420R08423R42340P83740O25613O46411L65594K29617
4152A8571307m25480j74615n97999n98620l74010j111423q17603o61258p20063
4143A3090236o57397l33418j736k46339P9921j41845L30337K76822J43617K79593
4133A2819791J55755K56527R8169J67093l0098j50092m13352o577L65369k1325
4123A3241260m4869K69673L93897p5450K41311L09910J51915k66790k05132m87834
4113A3527891k53090l89161l09098K06838k09817l23522n15073O616M5886k88033
4103A1499437l33338j45867J6673J10897K74866R4800L84191J31166k51184J20733
4093A1902374j79226l81617j91650l99941n18343m27199o18501k49215l56841
$$ plain form
4161 12271090 13155149 14069569 14977992 15920332 16704072 17329685 17976096 18341690 18571307
4152 18571307 18145827 17971212 17373213 16774593 16400583 15289160 14471557 13810299 13090236
4143 13090236 12432839 12099421 12097685 11851346 11931267 11789422 12119759 12396581 12540198 12819791
4133 12819791 12975546 13232073 13330242 13497335 13467237 13317145 12903793 12897216 13262585 13241260
4123 13241260 13196391 13466064 13859961 13784511 14025822 14335732 14487647 14220857 14015725 13527891
4113 13527891 13274801 12885640 12576542 12783380 12573563 12250041 11734968 11741584 11787470 11499437
4103 11499437 11166099 11020232 11036905 11147802 11422668 11517468 11901659 12032825 11781641 11902374
4093 11902374 11723148 11341531 11149881 10749940 10231597 9804398 9185897 8936682 8579841
4084H579841j75754k20802k06945l03805j51822j04314l18194J90557O3897m6126
4074G306533K40853j26544m1575L63158J02461O5932N586j89953K18104M83063
4064H427618K56036m9382P2590N6251l53448k07792L72083k11734l22394k75987
4054G763841m17306m05342k02798l01418m14085j55857j10491k20665j18164q7050
4044E330665l11490j18307j61574j82932J13425K13588j58930O0591j46734l3371
4034D604931j48340m9782J10101j28422J27490J7330j20536n4466j8389r0108
4024D249809L9186L5360o2168j16769j07949j14110K8481j84646k83399K12236
4014C696031J80331r5516k4032K5109P2686k34937J06523j22516k42765M6726
$$ plain form
4084 8579841 8404087 8183285 7976340 7672535 7520713 7416399 7098205 7288762 7352659 7306533
4074 7306533 7547386 7420842 7379267 7742425 7844886 7910818 7916404 7726451 7944555 8427618
4064 8427618 8683654 8634272 8706862 8763113 8409665 8201873 8573956 8362222 8039828 7763841
4054 7763841 7346535 6941193 6738395 6436977 6022892 5867035 5756544 5535879 5417715 5330665
4044 5330665 5019175 4900868 4739294 4556362 4669787 4883375 4724445 4785036 4638302 4604931
4034 4604931 4456591 4406809 4516910 4388488 4515978 4533308 4412772 4358306 4339917 4249809
4024 4249809 4288995 4324355 4262187 4145418 4037469 3923359 3951840 3767194 3483795 3696031
4014 3696031 3876362 3780846 3756814 3781923 3854609 3619672 3726195 3603679 3360914 3407640
4004C407640R1005J13660K93772r8127r8289j42616m5259J16694M9321o4282l32412
3993C291107K97060Q8009M8550j99765P470m2515J41210k854l34263j80548L8881
3982C152342M639L134J2208p3788l7940P8278j32637L8877P3319m0944J42407
3971C219895P0117p9758J4543m0501l18351p0740J24451J09674j23687j93727
3961B711916J48683o9847K08345j05280P9440n3401j86522J55372j71461r7405
3951B619840M1928M60j48821L50993L62767o6200k32766m8638j86122J52089R542
3940B855072k7990k56941j28512L14319K07186K2220j49834l2203k1425L3084
3930B814976r5683K24552n9845k06809o1054J3528J19959k21304J55295J94515
$$ plain form
4004 3407640 3498645 3612305 3906077 3807950 3709661 3567045 3521786 3638480 3687801 3623519 3291107
3993 3291107 3588167 3676176 3724726 3524961 3532431 3489916 3631126 3628272 3294009 3113461 3152342
3982 3152342 3156981 3160115 3172323 3098535 3060595 3138873 3006236 3045113 3118432 3077488 3219895
3971 3219895 3290012 3210254 3224797 3184296 2865945 2795205 2919656 3029330 2905643 2711916
3961 2711916 2860599 2790752 2999097 2893817 2973257 2919856 2733334 2888706 2717245 2619840
3951 2619840 2661768 2662228 2513407 2864400 3227167 3160967 2928201 2879563 2693441 2845530 2855072
3940 2855072 2827082 2570141 2441629 2755948 2963134 2985354 2835520 2803317 2781892 2814976
3930 2814976 2719293 2943845 2884000 2677191 2616137 2629665 2749624 2528320 2683615 2878130
3920B878130o8829j55411Q5601Q5783j39817N2417L2546j26445k3844p9257M5751
3909B586625q8373K6516K29986J38829r0150J75420J57087N12903l2263L00734
3899C917314L46271j20693K77726J54400p1638j37144K45474p1844O523j84435
3889D361954n32978q9404J9389j63608R0556k4884J48396j52713q7338o1665J27164
3878C634869J33657l8122k6755N8947J80029o6341r9671J08369n8295L12905j15446
3867D024146K11953N26613k30373J36301J12529j81612J01761m5716k31900k6742
3857D396960M5752r7832k42162j16306k60344k2587O5713J82860k49163J27439
3847C830330k18242k09504M3910j32162j607J22354Q7781j96045J40558j19481
$$ plain form
3920 2878130 2809301 2653890 2739491 2825274 2685457 2737874 2770420 2643975 2620131 2540874 2586625
3909 2586625 2498252 2524768 2754754 2893583 2803433 2978853 3135940 3648843 3616580 3917314
3899 3917314 4263585 4142892 4420618 4575018 4503380 4366236 4611710 4539866 4546389 4361954
3889 4361954 3828976 3739572 3758961 3595353 3685909 3661025 3809421 3656708 3569370 3507705 3634869
3878 3634869 3768526 3730404 3703649 3762596 3942625 3876284 3776613 3884982 3826687 4139592 4024146
3867 4024146 4236099 4762712 4532339 4668640 4781169 4599557 4701318 4655602 4423702 4396960
3857 4396960 4442712 4344880 4102718 3986412 3726068 3703481 3769194 3952054 3702891 3830330
3847 3830330 3612088 3402584 3446494 3314332 3312725 3435079 3522860 3326815 3467373 3347892
3837C347892j20740N8131J535o7447p4163K12198O0911k22409Q3590r2632r2726
3826C094140J402o4490J4639j36044J8857K3115J34907L17600j15444J04782M6428
3815C439892j24521k76947o0918R1872j66831j2105j7294k65965K32510K82657
3805C122350J45180r9865j13946r1176j57290J10685Q4238j86670J09301R2694
3795C015501j80605J24608q5997j55872J71289J74876j5835N2462j38943n7222
3785B904262k8690O5424J01746J04836J675k64789n366J36875j15593k71692J22780
3774B751468L37969j859j2098L1566l1407j92115p7044K10659l1975J82152j5850
3763C151466n516K86035k11265j41119Q4956J06031N5161j25258r8139j6000n1729
$$ plain form
3837 3347892 3227152 3285283 3286818 3219371 3145208 3357406 3418317 3195908 3279498 3186866 3094140
3826 3094140 3095542 3031052 3045691 2909647 2928504 2951619 3086526 3404126 3288682 3393464 3439892
3815 3439892 3315371 3038424 2977506 3069378 2902547 2890442 2873148 2607183 2839693 3122350
3805 3122350 3267530 3167665 3053719 2962543 2805253 2915938 3000176 2813506 2922807 3015501
3795 3015501 2834896 2959504 2873507 2717635 2888924 3063800 3047965 3100427 2961484 2904262
3785 2904262 2875572 2940996 3042742 3147578 3149253 2884464 2879098 3015973 2900380 2628688 2751468
3774 2751468 3089437 3087578 3075480 3107046 3075639 2883524 2806480 3017139 2985164 3167316 3151466
3763 3151466 3145950 3431985 3220720 3079601 3164557 3270588 3325749 3200491 3102352 3086352 3034623
3752C034623m6996j35845r0805L7260N5921J55750J90589r3376o0869l7335K73658
3741C282575l7829L5341j21187L31895K2871j06741Q2955J03292K7929m9806j29930
3730C441365k22484j34955J2583j9488J81108r9922k82462K03721J5981N9754
3720C155201k98891K1806P5607r8511Q5542j77750l3918J0174l0521K25959q4582
3709B850116K833Q8425n3086K93201n3182K33457n1398j40686J75494k40851j98460
3698B905863q6058Q3688k07612K34721J11530j35860j83300k11040j07123J82177
3688B586986P0445l3464k36294j45535r3643j12812j09787j53330J41144L7958
3678A951668j3596j8679J28580p6660j99627J56523j51459J70501K59235r5089
$$ plain form
3752 3034623 2987627 2851782 2760977 2798237 2854158 3009908 3200497 3107121 3046252 3008917 3282575
3741 3282575 3244746 3280087 3158900 3490795 3513666 3406925 3489880 3593172 3621101 3571295 3441365
3730 3441365 3218881 3083926 3096509 3077021 3258129 3158207 2875745 3079466 3095447 3155201
3720 3155201 2856310 2878116 2953723 2855212 2940754 2763004 2729086 2739260 2708739 2934698 2850116
3709 2850116 2852949 2941374 2888288 3181489 3128307 3361764 3310366 3169680 3345174 3104323 2905863
3698 2905863 2819805 2903493 2695881 2930602 3042132 2906272 2722972 2511932 2404809 2586986
3688 2586986 2657431 2623967 2387673 2242138 2148495 2035683 1925896 1772566 1913710 1951668
3678 1951668 1938072 1919393 2047973 1971313 1771686 1928209 1776750 1947251 2206486 2111397
3668B111397j09726j63164j19850J86012j96733J55526m5532q3727L33104J42932
3658B210239j18004k55718J2275j45266o4556k2765J08875J55613j84070Q8849
3648A785472J41449k329j28456l0924j42218o3021K8397O5135N459K45123J23536
3637B027623j79932j18797J23712J65415R1381k06822j80320Q6527j47102j42072
3627A519613M7938L7249L0648j98949M4174Q2487o3205L1798Q679o2945j9398
3616A458089J59726N5564r633J16309K65089q1365k83139o4065K1703O0299K23010
3605A921587p2763j8674Q6601p8723q3630J28862j00096M1862J29647J50678k66520
3594A838831n4328o9526R5690J03562r4029r8183L04950k45631k8880J86174j678
$$ plain form
3668 2111397 2001671 1838507 1718657 1904669 1707936 1863462 1817930 1734203 2067307 2210239
3658 2210239 2092235 1836517 1848792 1703526 1638970 1616205 1725080 1880693 1696623 1785472
3648 1785472 1926921 1924592 1796136 1765212 1622994 1559973 1588370 1653505 1658964 1904087 2027623
3637 2027623 1847691 1728894 1852606 2018021 2109402 1902580 1722260 1808787 1661685 1519613
3627 1519613 1567551 1604800 1635448 1436499 1480673 1563160 1499955 1531753 1540432 1477487 1458089
3616 1458089 1617815 1673379 1663746 1780055 2045144 1963779 1680640 1616575 1638278 1698577 1921587
3605 1921587 1848824 1830150 1916751 1838028 1754398 1883260 1783164 1825026 1954673 2105351 1838831
3594 1838831 1784503 1714977 1810667 1914229 1820200 1722017 2026967 1781336 1752456 1938630 1936952
3583A936952J9652J40792j9950J09453k55294N4393k520q9376J80983k4545r8464
3572A952076R7551K9976j34641p6138K11769N9466k78816K42017N7262M3835l4315
3561B170042j42053k8276O6501j53277K85647N1242N4903k7192q9570q2876K01941
3550B307032J24807N0119j8872J10549J5559J1314j70941m8713K11604j09538
3540B482920L19439J30845j51047o2303n9376j74265l3467O8505N6150O1641j16943
3529B522099P0360q2318r7238o648K17158K66004l1020k70399j22683K31180n8550
3518B637945L42578P4007o7394n75J29113r2697k87434j08332L31991R4151r8420
3507B954933L05000J79095J16011J46599k4435j79446j6068J28062J08056j9772
$$ plain form
3583 1936952 1956604 2097396 2077446 2186899 1931605 1985998 1983478 1894102 2075085 2050540 1952076
3572 1952076 2049627 2079603 1944962 1868824 2080593 2140059 1861243 2103260 2160522 2204357 2170042
3561 2170042 2027989 1999713 2066214 1912937 2198584 2249826 2304729 2277537 2187967 2105091 2307032
3550 2307032 2431839 2481958 2463086 2573635 2589194 2600508 2429567 2380854 2592458 2482920
3540 2482920 2802359 2933204 2782157 2719854 2660478 2486213 2452746 2521251 2577401 2639042 2522099
3529 2522099 2592459 2510141 2412903 2406255 2623413 2889417 2858397 2587998 2465315 2696495 2637945
3518 2637945 2980523 3054530 2987136 2986561 3115674 3022977 2735543 2627211 2959202 3053353 2954933
3507 2954933 3259933 3439028 3555039 3701638 3677203 3497757 3481689 3609751 3717807 3698035
3497C698035r0286J59081J40224J14087J08035J6387n6169Q2981J48142J4120
3487D334637J2448q4100j22032J44049L73756J29705J54806j34790J82956J59357
3477E150792K59311J08139K42597K56114L49582J91960L19571J73789L57917J35098
3467G544870J00219K96929L26642K4614J44722Q3243R4419J01874l19908q8629
3457H308995j12075J75172J86816Q1083m5176L31356N91985O66074J035713Q12854
3447A2032797Q88002j9149q00659o77373n00835n58230o99498k74237m14652m72331
3437H503835m70577j00473j42594Q4261J00889m7517m17292k61053r301j48922
3427G091256L55109L06978J50711L37352M87116M45888N91939R32818J017409
$$ plain form
3497 3698035 3607749 3766830 3907054 4021141 4129176 4145563 4089394 4172375 4320517 4334637
3487 4334637 4347085 4262985 4140953 4285002 4658758 4788463 4943269 4808479 4991435 5150792
3477 5150792 5410103 5518242 5760839 6016953 6366535 6558495 6878066 7051855 7409772 7544870
3467 7544870 7645089 7942018 8268660 8293274 8437996 8521239 8615658 8717532 8397624 8308995
3457 8308995 8196920 8372092 8558908 8639991 8594815 8926171 9518156 10184230 11219943 12032797
3447 12032797 12920799 12901650 12100991 11423618 10922783 10364553 9665055 9390818 8976166 8503835
3437 8503835 8033258 7932785 7790191 7874452 7975341 7927824 7510532 7249479 7240178 7091256
3427 7091256 7446365 7753343 7904054 8241406 8728522 9174410 9766349 10699167 11716576
3418A1716576J615164K182916J950376J205510m24034j268836j311006j618308
3410A4048358j396735j054511p88697o55869n64165o47432m17582l02261l27679
3401G893427l17185k62301j57447j65861k04186k79966j40228M8057N1944n802
3391F460452J16454K54626Q2606K31887M83265R59068J030741Q06140J48594l77770
3381A0196063n70221o22193n19801q12176o68133l54228o00716m58712k87002
3372E302881K6318l59404m3419j39021k95305j70928J83679p4563l58083j00006
3362C972149k18944k065J45528J40287k7581k50698j75907k6280m7406J17651
3352C626734k31482N3060j08502K9771p5000k12424N1411l17670p121m112P9400
$$ plain form
3418 11716576 13331740 15514656 17465032 18670542 18246508 16977672 15666666 14048358
3410 14048358 12651623 11597112 10808415 10152546 9588381 8940949 8523367 8221106 7893427
3401 7893427 7576242 7313941 7156494 6990633 6786447 6506481 6366253 6414310 6466254 6460452
3391 6460452 6576906 6831532 6914138 7146025 7629290 8588358 9619099 10425239 10573833 10196063
3381 10196063 9625842 9003649 8483848 7671672 7003539 6649311 6048595 5589883 5302881
3372 5302881 5329199 4969795 4926376 4787355 4492050 4321122 4504801 4430238 4072155 3972149
3362 3972149 3753205 3751140 3896668 4036955 4009374 3758676 3582769 3556489 3509083 3626734
3352 3626734 3395252 3448312 3339810 3369581 3294581 3082157 3133568 2815898 2808777 2804665 2884065
3341B884065M8899K5r8535L24532r9797k52485N4455N3236j30358j11098J92140
3330B865079j9976J82865j70120J01882j41582Q899J95935K76456J90345L61586
3320C851369o3636n14814j11555q5108j94222N732j47239k30630J54313p5577
3310B588633m8447J5577k57737j52909J62601k0371n7776O8958k25909r8757J55850
3299B129713O1239j9567o0421j87481J26246L20249j17358o637j42382K01741
3289B305342K01911N7833P7232o31075j27016P6818l5343j60726K57209j06539
3279A915646j61328J38174K31874l9838p8305K7947o3276m1k1421k37465k26574
3268A485393J52818l9882k50723m7694k1212R5210K16434R6050k52042J02211
$$ plain form
3341 2884065 2932964 2932989 2834454 3158986 3059189 2806704 2861159 2914395 2784037 2672939 2865079
3330 2865079 2845103 3027968 2857848 2959730 2818148 2827047 3022982 3299438 3489783 3851369
3320 3851369 3787733 3272919 3161364 3076256 2882034 2887766 2740527 2509897 2664210 2588633
3310 2588633 2540186 2555763 2298026 2145117 2307718 2287347 2229571 2298529 2072620 1973863 2129713
3299 2129713 2190952 2171385 2110964 1923483 2049729 2369978 2252620 2245983 2103601 2305342
3289 2305342 2507253 2565086 2642318 2011243 1884227 1961045 1925702 1764976 2022185 1915646
3279 1915646 1754318 1892492 2124366 2084528 2006223 2034170 1970894 1970853 1949432 1711967 1485393
3268 1485393 1638211 1598329 1347606 1299912 1278700 1373910 1590344 1686394 1434352 1536563
3258A536563j56721j0967p9647j2323L39968j56895j94985J5852M76903m018m3208
3247A710522k47397k8105L9935L3940l6288q9743p7399L3034j55P886j25889k58414
3235I61927n2668q6401J47576O6969q9107J20848J20351J00581q4682j28158k51455
3224H25781O180k0874r2943o382J94035N5462l5428q8210J51905o6788J00044
3213A022782L9927k53917L5741m900L6013L0964q1569j49058m1607K52601K26112
3202A113089j49448M0403r975j09093r7100q2851l7065J60278j58213l45869p5403
3191B48753J94679J72788J64351j02690j21684J58348O1596J0121K73034j22875
3181I36421j67603j5809K22654j66053K9513j61739j78966K38046k41129K74987
$$ plain form
3258 1536563 1379842 1368875 1289228 1276905 1616873 1459978 1264993 1280845 1757748 1753730 1710522
3247 1710522 1463125 1435020 1474955 1508895 1472607 1382864 1305465 1338499 1338344 1346230 1220341 961927
3235 961927 909259 822858 970434 1037403 948296 1069144 1189495 1290076 1205394 1077236 825781
3224 825781 831961 811087 718144 711762 905797 961259 925831 837621 989526 922738 1022782
3213 1022782 1062709 808792 844533 839633 875646 906610 825041 675983 634376 886977 1113089
3202 1113089 963641 1004044 994069 884976 787876 705025 667960 828238 670025 324156 248753
3191 248753 443432 616220 780571 677881 556197 714545 776141 786262 1059296 936421
3181 936421 768818 753009 975663 809610 839123 677384 498418 736464 495335 770322
3171G70322K01709n3836K6192J91662P8543k47326m8075r5018K20278L87405j60707
3160A271149l15474k02342K72225J53457Q2142J3759P0703j86868l9394K68601
3150A387958N1593q8478j52291r2987M6131L03961M3321j10229J98046r5320j84658
3139A307047k52325K79995J22919j7517P4820O4184L57141J01700J6418n4443
3129A999939l1031O5222J82537p3376Q6007L1946J10555j4370p1473p7471P8469
3118B286954J24915K9002j05831j12829r4143j92997K26101J0566o6523J60466
3108B265681o3818K99140K7030l19285J53833J42790P9613j38066O2729J88168
3098B697815m0042j64503J53928k455l28315j13362j69332L26504J41214r3985
$$ plain form
3171 770322 972031 918195 944387 1136049 1214592 967266 919191 824173 1044451 1431856 1271149
3160 1271149 955675 753333 1025558 1179015 1261157 1274916 1345619 1158751 1119357 1387958
3150 1387958 1439551 1351073 1198782 1105795 1151926 1455887 1499208 1388979 1587025 1491705 1307047
3139 1307047 1054722 1334717 1457636 1440119 1514939 1579123 1936264 2037964 2054382 1999939
3129 1999939 1968908 2034130 2216667 2143291 2229298 2261244 2371799 2357429 2285956 2208485 2286954
3118 2286954 2411869 2440871 2335040 2222211 2128068 1935071 2161172 2171738 2105215 2265681
3108 2265681 2201863 2501003 2528033 2208748 2362581 2505371 2584984 2446918 2509647 2697815
3098 2697815 2657773 2493270 2647198 2644743 2316428 2203066 2033734 2360238 2501452 2407467
3088B407467j74923k04774J4319K64396j22824k72542J54373k0384k16284q9701
3078A739123O8371N986K25867j37041o9607j28302k0795j7041l23226J40583J5136
3067A499054o1897N0433k7206N2786r8096L0668P649k31298K8838j4701m0631
3056A195599P5834l4231k09292j44825j46622o962n7196J44226K22290j42112
3046H96709J19065j47650j20237k65331l0519J06931K52328J41303j98923j85177
3036E68499K8041p8997k27527J57977j3349M1689k70461N1047J60937o4657P6227
3025D29426J39916l3573j29059K01108j49614j15922k56073K78431J51365k19477
3015B96528r6489j91486M42776K3346J43403j31669j35748K83982J05018k71762
$$ plain form
3088 2407467 2232544 2027770 2042089 2306485 2183661 1911119 2065492 2045108 1828824 1739123
3078 1739123 1807494 1813480 2039347 1902306 1832699 1704397 1683602 1666561 1343335 1483918 1499054
3067 1499054 1437157 1487590 1460384 1513170 1415074 1445742 1453391 1222093 1250931 1236230 1195599
3056 1195599 1271433 1237202 1027910 883085 736463 729501 672305 816531 1038821 896709
3046 896709 1015774 868124 747887 482556 452037 558968 811296 952599 753676 568499
3036 568499 596540 517543 290016 447993 434644 476333 205872 256919 417856 353199 429426
3025 429426 569342 535769 406710 607818 458204 342282 86209 364640 516005 296528
3015 296528 200039 8553 451329 474675 618078 486409 350661 634643 739661 467899
3005D67899k49837J96335J24845j26320j0346k30417Q6684J75806q0248K18636
2995E73037P9525j39177j15374j06417J46311J03058p298l59198j27115k2573
2985B4779m3222J18442O8020o2575J61450J66083k14287K01194n9381j93731l1280
2974A35492J46857j06331O8603l022r3951Q7184K04249k863p9921l0383j30235
2963A95679j08317K9918K4199m8188J26228J29288k42988j47781K04351j22K21248
2952C83515j15183r6305R3533L5142q0931o4187j42829J04647J79478m0571q7729
2941A68580j459m0008j8020J40839M0839k4362j89290j497K58039j1024m16459
2930i3822K57595J43785j8925j96722J5875R88k6250N7406m5234M4117J94636
$$ plain form
3005 467899 218062 414397 539242 412922 402576 172159 258843 434649 354401 573037
2995 573037 652562 513385 398011 291594 437905 540963 533665 174467 47352 24779
2985 24779 -18443 99999 168019 105444 266894 432977 218690 419884 360503 166772 135492
2974 135492 282349 176018 244621 241599 147648 234832 439081 436218 356297 325914 195679
2963 195679 87362 117280 141479 93291 219519 348807 105819 -41962 162389 162267 383515
2952 383515 268332 172027 265560 300702 219771 155584 12755 117402 296880 256309 168580
2941 168580 167121 127113 109093 249932 290771 266409 77119 75622 333661 322637 -93822
2930 -93822 163773 307558 288633 91911 107786 108774 82524 139930 94696 138813 333449
2919C33449Q463j55828K13661N1504O5752j42157n1295o5062O0392N0755K7181
2908C96815M2252j40295r3824K7617j04075m8391K0987j54616M5119j5154J48219
2897A24654N0575Q7870K39170j21544j28472j52185k61264N9851k19194R6795
2887b23744K28578n0088J35627r1278j54454J31958J03291J96612k08123J35625
2877B04004p0090o4497r6471L19564j37347j81572J66663J62Q1352k75859L8517
2866a5574k6771K54049j67969j37491L54921J15663j26827O5303k38521J3279
2856I0062J02001J16000M9055q1507k86029O5473J20124l9930j44777L5460J35853
2845A61785k9144Q9074j09146p9016N9306j40148O0098k157q2924J40984j64653
$$ plain form
2919 333449 341912 186084 399745 451249 517001 374844 323549 258487 318879 369634 396815
2908 396815 439067 298772 204948 232565 128490 80099 101086 -53530 -8411 -23565 124654
2897 124654 175229 263099 502269 380725 252253 100068 -161196 -101345 -320539 -223744
2887 -223744 4834 -45254 90373 -905 -155359 -23401 79890 276502 68379 204004
2877 204004 133914 69417 -27054 292510 155163 -26409 140254 140416 221768 -54091 -15574
2866 -15574 -42345 211704 43735 -93756 261165 376828 250001 315304 76783 90062
2856 90062 192063 308063 357118 275611 -10418 55055 175179 135249 -9528 25932 161785
2845 161785 132641 221715 112569 33553 92859 -47289 12809 10652 -72272 68712 -95941
2834i5941k46419M84613j05522k7888J07826J07560j98481q3460J61661j51697
2824d7748j51152L40262r0967k4011Q5740j5912N2473r9824k60530O7203M45646
2813C01180L0904J19013O1053o1263n46088R8703Q53J73359j71681K66837j42546
2802A30324k43151J68133Q6956j3458j54860r168j01403l3816J57713j13504p2783
2791a99017J27087J93152l225R4323o1627L0599M5747k92887j02599K53572P4733
2780A59858k29522k26169j5935L75187N3173N4353k05410m2783K6215J41047L0663
2769A20677L8803j8279n7745P7901j14695m0247N0259Q3512J94540J10228J62477
2758F07431j04921k82457k79375J30613R6711k8794k30839Q3064N0732o2941o8537
$$ plain form
2834 -95941 -342360 142253 36731 8843 116669 224229 25748 -57712 103949 -47748
2824 -47748 -198900 141362 50395 26384 112124 96212 148685 48861 -211669 -144466 301180
2813 301180 332084 451097 512150 450887 -95201 3502 4355 177714 6033 272870 130324
2802 130324 -112827 55306 142262 128804 -26056 -35224 -136627 -170443 -12730 -126234 -199017
2791 -199017 -71930 121222 117997 212320 150693 181292 227039 -65848 -168447 85125 159858
2780 159858 -69664 -295833 -311768 63419 116592 170945 -34465 -77248 -51033 90014 120677
2769 120677 159480 141201 83456 161357 46662 6415 56674 140186 334726 444954 607431
2758 607431 502510 220053 -59322 71291 168002 139208 -91631 -8567 42165 -20776 -89313
2747h9313M06741J26334m52277j11514K9338J06196k32870K94740N3566k7653
2737A03288j15446q2444j08983K67933J08356q9612J44011J5270j6263R7762j70857
2726A53015k33814j6484P2970K42978j64144j97901J87252J63053k17640l72j14843
2715a25930k10134j06841k9692K35328l6897J13805K862M5342M14570k19672J035
2704H3776J69515k301q1696P91n7107j69142P2819K19059J10662j1138j46318
2693A88920J0262j1292K6352p1453j09594J79562L3692N101O4372o0142J6704
2682B72484j88461n2653J06931k82720Q7720K97246M1505r4435J01726j58149
2672A31194J3524K60297j31856q9255m2488J15128K9525j92707l9297P4308L23085
$$ plain form
2747 -89313 317428 443762 -8515 -120029 -90691 15505 -217365 77375 130941 103288
2737 103288 -12158 -94602 -203585 64348 172704 83092 227103 242373 226110 323872 153015
2726 153015 -80799 -97283 -24313 218665 54521 -143380 43872 206925 -10715 -11087 -125930
2715 -125930 -336064 -442905 -472597 -237269 -274166 -160361 -157499 -112157 302413 82741 83776
2704 83776 253291 250990 169294 170085 112978 -56164 16655 235714 346376 335238 188920
2693 188920 199182 187890 214242 142789 33195 212757 246449 251550 315922 255780 272484
2682 272484 84023 31370 138301 -144419 -56699 240547 282052 187617 289343 131194
2672 131194 144718 405015 273159 183904 141416 256544 286069 93362 54065 128373 451458
2661D51458l7766o6572L1129j64230J11097J31524q9450p6585p3366r8665j5272
2650A03302Q4447J54140L5393k08000r8181L31449K53493l25255k58151L9303
2640A11940o0456K56342J18408j46099o0687K74461Q3781k95963J319J28160q8010
2629C23196O0930l3733M3110J94661j81676j04062j08783J08823k70820R9592
2619A31238j6391j18744K94022K71305J10681j51439l07393J22598k2525j96506
2609A16846Q6536J24844k68798j55468M84171J5938q9677M0650j01272j31596
2599A22174L9629N5183J26130K48437L34365m184m918P6347l9086j90449l7614
2588G26014P2215j33915n5599M8267k3767j43795J5684q7502L7803k13146J12724
$$ plain form
2661 451458 413692 347120 378249 214019 325116 456640 367190 290605 217239 118574 103302
2650 103302 187749 341889 377282 169282 71101 402550 656043 330788 72637 111940
2640 111940 51484 307826 426234 280135 219448 493909 577690 281727 283046 411206 323196
2629 323196 384126 350393 393503 588164 406488 302426 193643 302466 31646 131238
2619 131238 114847 -3897 290125 561430 672111 520672 213279 335877 313352 116846
2609 116846 203382 328226 59428 -96040 388131 404069 314392 355042 253770 122174
2599 122174 161803 216986 343116 591553 925918 921734 916816 993163 954077 763628 726014
2588 726014 798229 664314 608715 656982 633215 489420 505104 417602 455405 242259 354983
2577C54983r2714j20936K53531R4017R7075K4276K18739k0021j23460k26944j77778
2566B80768J97174L81343O8251m91976j26739k4966r0930J61115R8174m9308N335
2555D08241K91369l36142j8159K67696n3484M2538L3566k1986j4280M2665k81151
2544C60873m4451J98610j04019K59680R3444o7737l74539J9031K08588n3669K09024
2533G04835p6626j77712p380N3482K84699O3533Q6593j05773l4181J2036k16020
2522E87486j79868K4794n2488J43830q0605j39918K6J92110K8505p2965k47915
2511B02992K11659J11573J8645R8467j37228j00025K24100R1381R056J36255J06947
2500I73822n8079j68342K83479k24089L8268P4649J17595R2248j19450j49601
$$ plain form
2577 354983 262269 141333 394864 488881 585956 610232 828971 808950 685490 458546 280768
2566 280768 477942 859285 927536 435560 308821 283855 192925 354040 452214 402906 408241
2555 408241 699610 363468 345309 613005 559521 602059 635625 613639 599359 642024 360873
2544 360873 316422 515032 411013 670693 764137 696400 321861 340892 549480 495811 704835
2533 704835 628209 450497 443117 496599 781298 844831 931424 825651 791470 803506 587486
2522 587486 407618 432412 379924 523754 443149 303231 303257 495367 523872 450907 202992
2511 202992 414651 526224 544869 643336 506108 406083 630183 721564 730620 866875 973822
2500 973822 915743 747401 1030880 806791 845059 919708 1037303 1129551 1010101 860500
2490H60500k17054Q0219Q828j4109J91495j67647N84j04584P9597K8303L5707
2479G81839K35099m1345o1731m0490j86461J70603K707r091R7784J11952M2549
2468A103415R7182j23428n4759J02027J23647k51078j6382J41721j0356K08040
2458A320029M0232L271m5339j71921M5974K511k0384o3086M5255N0981M4223J2684
2446A264430K01735J81180j57685k7477J09356j6621j64115q4515J61497J09864
2436A577649J32106p6687j92017J1090J82307k2837o9683J7461m6049o8457p5601
2425A369282K73348r6662J50654j52969k30081J40861j80814J74179J30979j0855
2415A567922M0004n723K1315j07611j84754J98440K89751J26743Q66K6861k4617
$$ plain form
2490 860500 643446 723665 732493 718384 909879 742232 742816 638232 717829 746132 781839
2479 781839 1016938 975593 913862 873372 686911 857514 860221 851130 948914 1060866 1103415
2468 1103415 1200597 1077169 1022410 1124437 1248084 997006 980624 1122345 1111989 1320029
2458 1320029 1360261 1363532 1318193 1146272 1192246 1194757 1174373 1111287 1156542 1207523 1251746 1264430
2446 1264430 1466165 1647345 1489660 1462183 1571539 1554918 1390803 1306288 1467785 1577649
2436 1577649 1709755 1633068 1441051 1452141 1634448 1611611 1541928 1559389 1513340 1444883 1369282
2425 1369282 1642630 1545968 1696622 1543653 1313572 1454433 1273619 1447798 1578777 1567922
2415 1567922 1607926 1602203 1623518 1515907 1331153 1529593 1819344 1946087 1946953 1973814 1949197
2404A949197J7269Q5821n972K10790o637k33422k5935K98452J75867o7193r255
2393B388982K4065Q5128K14666q3489J58707o4683j4330M9202j64905K26895J88152
2382C008390J12052j3905P379k2855K8155j14899n172K42176J08697L25105N1751
2371C726874R8460K17136R6981K0882J76922J14700L0077K95917l9905J67673
2361D905717N8082L06320J12358K80748J70497J83677L50652M02916L75863k24424
2351F922406K10291O29457M39650M31646P60625L52829Q07265R27938Q10153O73812
2341A2966072J269905J175370P73491P17662J246059J595652J887056K280634
2333B3911901L287468L621999M547337M946659O216313Q302682J3388636J7865603
$$ plain form
2404 1949197 1966466 2052287 2046315 2257105 2250468 2017046 1991111 2289563 2465430 2398237 2388982
2393 2388982 2413047 2498175 2712841 2629352 2788059 2723376 2709046 2758248 2593343 2820238 3008390
2382 3008390 3120442 3106537 3113916 3091061 3119216 3004317 2999145 3241321 3350018 3675123 3726874
2371 3726874 3825334 4042470 4139451 4160333 4337255 4451955 4482032 4777949 4738044 4905717
2361 4905717 4963799 5270119 5382477 5663225 5833722 6017399 6368051 6770967 7146830 6922406
2351 6922406 7132697 7762154 8201804 8633450 9394075 9746904 10554169 11482107 12292260 12966072
2341 12966072 14235977 15411347 16184838 16902500 18148559 19744211 21631267 23911901
2333 23911901 27199369 30821368 35368705 40315364 46531677 54834359 68222995 86088598
2325H6088598J1072456o027531j2904621j0064938q600611p155216o255911n390741
2317D0761485m861906m077386l301132k531389k436868j779221j434002j441546
2309A8898035j778995j704675j267690q65217j110189j200065r49797l77860q25684
2300H817863p21521p08568p35348m87433m74063l76724k39872k98269l69983k68700
2290D137382j04319m00692l34317m7963k09781j22824K8570l77015o5197j00718
2280B403126o0584l30654M3248J61645j87517j71648m5203j90039k29130l89197
2270A004047l8954o8199R8806K90169J14200j7736k39069j01874K4144l4666j00558
2259I30310J33130l28297P3575J47446p3582j67646M2970j09313j63890k1475
$$ plain form
2325 86088598 97161054 91133523 78228902 68163964 59563353 52408137 46152226 40761485
2317 40761485 35899579 31822193 28521061 25989672 23552804 21773583 20339581 18898035
2309 18898035 17119040 15414365 14146675 13281458 12171269 10971204 10021407 9643547 8817863
2300 8817863 8096342 7387774 6652426 6164993 5690930 5314206 5074334 4776065 4406082 4137382
2290 4137382 4033063 3632371 3298054 3250091 3040310 2917486 2946056 2569041 2503844 2403126
2280 2403126 2342542 2011888 2055136 2216781 2029264 1857616 1812413 1622374 1393244 1004047
2270 1004047 965093 896894 995700 1285869 1400069 1382333 1143264 1041390 1065534 1030868 930310
2259 930310 1063440 735143 808718 956164 882582 714936 757906 648593 484703 463228
2249D63228R2129J36918k04867J1068K28247j90741k9867m3548l8965J37858k35461
2238C25999N8196q6756j7911N9834l8469j269N3487O9342j6556q7517O4996l3501
2226C49875J4566J1061l2953n7100N0130k04971J33192K58510j08677k96144j261
2215A16228j1909J30712J25664L516j55575Q0250r70l19616J07543q0139J9195
2204A4899p8654k83400j0636J24321J52598J71669r2757N9623m7591p275n2801
2193e0004q270M5406j24295r399J52277J39371m4704k33104M999M0848J94299
2182A07424j18626K11229o6515j63113J43890j07861j92377J89650j21624r2974
2172b10897o0211J43157q5604J4113J64062j52126N883J57917J13789k33078j44960
$$ plain form
2249 463228 555357 692275 487408 498476 726723 535982 506115 462567 423602 561460 325999
2238 325999 384195 297439 279528 339362 300893 299624 353111 422453 405897 318380 383376 349875
2226 349875 364441 375502 342549 285449 335579 130608 263800 522310 413633 117489 116228
2215 116228 104319 235031 360695 364211 208636 288886 287916 -31700 75843 -4296 14899
2204 14899 -63755 -347155 -357791 -233470 -80872 90797 -1960 57663 10072 2797 -50004
2193 -50004 -58274 -12868 -137163 -146562 5715 145086 100382 -132722 -127723 -86875 107424
2182 107424 -11202 200027 133512 -29601 114289 6428 -185949 3701 -117923 -210897
2172 -210897 -271108 -127951 -213555 -199442 -35380 -187506 -181623 -23706 90083 -142995 -287955
2161b87955o0347O0212P4562P5586n8132J45593M6306k17592k29967R8132O2651
2150b90951J9611K03003J21651J01585K08501l41119k20484j7765r5199L5469
2140b75698r4798K18185m1296Q1212K5307P8423J32786P4191o4396L370k90177
2129a52891n9308k2897M4443r4608K20146K9098j38474J70007K3719j29964r9314
2118b10043L4597j89351J47496K48993J72589j38309m684j34507l10677m2853
2108d26749j7763Q0950K75867k08558r8543M4509k7167K2351J12656j24154k8875
2097c95476J2954K75911J50814l15585k69797Q0000J34595j32042J62953J41564
2087a54109n1405K5451R714j03953J91913j90374j15033K49176k33543j43985
$$ plain form
2161 -287955 -348302 -288090 -213528 -137942 -196074 -50481 -4175 -221767 -451734 -353602 -290951
2150 -290951 -271340 -68337 53314 154899 363400 22281 -198203 -215968 -311167 -275698
2140 -275698 -370496 -152311 -193607 -112395 -87088 -8665 124121 198312 133916 137286 -152891
2129 -152891 -212199 -235096 -190653 -285261 -65115 -36017 -174491 -4484 19235 -110729 -210043
2118 -210043 -175446 -364797 -217301 31692 204281 65972 61288 -73219 -383896 -426749
2108 -426749 -444512 -363562 -87695 -296253 -394796 -350287 -377454 -355103 -242447 -366601 -395476
2097 -395476 -382522 -106611 44203 -271382 -541179 -461179 -326584 -458626 -295673 -154109
2087 -154109 -205514 -180063 -170349 -274302 -82389 -272763 -387796 -138620 -372163 -516148
2077e16148N00146K97972j97627L5592n066l32079k96884K23658N0540J35578
2067a04318K4155q7385R8858p845J27402J30042k68079K25297K44762p0602R3782
2056D06069J48345n3763j10817r0854j36351j38057J79924j28570l2694q3539
2046d0307l8375j45637J12375J20488l46961L0974J41679j10450Q2669K43551
2036E0006n1896n6491J05665K1041Q4865o7444k06661N6698k02964j79398j22493
2025e69072K85850Q0788l7234K58249j20612k04519L07523k9869j00170j45462
2015b74528N131l2284K31974K1971j36011n158q6125k60386r1529L42275K60583
2004b4087l9125k76685M9239J12965k96718p7786P5424j50995O1002L65583l2452
$$ plain form
2077 -516148 -16002 281970 84343 119935 114869 -217210 -514094 -290436 -239896 -104318
2067 -104318 -80163 -167548 -68690 -76535 50867 180909 -87170 138127 382889 312287 406069
2056 406069 554414 500651 389834 298980 162629 24572 204496 75926 43232 -40307
2046 -40307 -78682 -224319 -111944 8544 -338417 -307443 -165764 -276214 -193545 50006
2036 50006 -1890 -58381 47284 68325 153190 85746 -120915 -64217 -267181 -446579 -569072
2025 -569072 -283222 -202434 -239668 18581 -102031 -306550 973 -28896 -129066 -274528
2015 -274528 -269397 -301681 -69707 -47736 -183747 -188905 -275030 -535416 -626945 -284670 -24087
2004 -24087 -63212 -339897 -290658 -177693 -474411 -552197 -476773 -627768 -566766 -201183 -233635
1993b33635j31352j60463R1644L42585k4176k04519J1519J64488j10063J71004
1983h2968L8975l30l08764J17217j13327Q5493l4548J5787J28861o0774N1273
1972a63105J81265l60023j19330R5346n8665J53786K90571k28429j95962M20841
1962A6295R6433n4276j83683N3484p7791j37786j95979K7009K01440J04082j88179
1951c38951J44128P0961k3828K5910l9262j64768R5715K98660l41835j74145J06161
1940c41254j71193L36426J84864j02081j03738K6737k58578j39540K64570L63602
1930E9815p6999j27939k52884j62137J72403L52936q2543l08375n7519K58659
1920b24583q9516M2080N270k05094L85277o7929j67948j32588J20874o470j06733
$$ plain form
1993 -233635 -364987 -525450 -433806 -91221 -115397 -319916 -308397 -143909 -253972 -82968
1983 -82968 -43993 -44323 -353087 -235870 -349197 -263704 -298252 -282465 -153604 -214378 -163105
1972 -163105 18160 -341863 -461193 -365847 -424512 -270726 19845 -208584 -404546 16295
1962 16295 112728 58452 -125231 -71747 -149538 -287324 -483303 -456294 -254854 -150772 -338951
1951 -338951 -194823 -123862 -147690 -121780 -161042 -325810 -230095 68565 -273270 -447415 -341254
1940 -341254 -512447 -176021 8843 -93238 -196976 -170239 -428817 -568357 -303787 59815
1930 59815 -17184 -145123 -398007 -560144 -387741 -34805 -117348 -425723 -483242 -224583
1920 -224583 -314099 -272019 -266749 -471843 -86566 -154495 -322443 -455031 -334157 -340627 -447360
1909d47360J63932M6574j5481P6255K05294j17230j10656p08j35331k4044J14073
1898b44682K2580Q7810Q3610K4731j15013j31366n1555N974J7751M358J23158
1887a72644O4738k30945p1197K34416Q3021j35663m9239N4852J88647L1158j03929
1876a06785p4517k52539l677K76269m7289n1592p6975j8531J87018O4265k18077
1865c22430O3374k29499R1010J91872l12396L39724m3894J05223Q6763j09286
1855a39539j9145M8996j89614P4498j16613J45027L4800k22272K15908O6482O7429
1844c4043J15086m16451n5584M159K02675r2426n2738k93164M9131K59555j0454
1833c24254j8288K7102j09549k693K10990N9637P7318j80793o8986O517q3679
$$ plain form
1909 -447360 -283428 -236854 -252335 -176080 29214 -88016 -198672 -199380 -334711 -358755 -244682
1898 -244682 -222102 -134292 -50682 -25951 -140964 -272330 -323885 -317911 -300160 -295802 -172644
1887 -172644 -107906 -338851 -410048 -175632 -92611 -228274 -277513 -222661 -34014 -2856 -106785
1876 -106785 -181302 -433841 -437518 -161249 -208538 -260130 -337105 -355636 -168618 -104353 -322430
1865 -322430 -259056 -488555 -397545 -205673 -518069 -178345 -222239 -117016 -30253 -139539
1855 -139539 -158684 -109688 -299302 -224804 -341417 -196390 -161590 -383862 -167954 -101472 -34043
1844 -34043 81043 -335408 -390992 -386833 -184158 -276584 -329322 -622486 -573355 -313800 -324254
1833 -324254 -342542 -315440 -424989 -427682 -216692 -157055 -79737 -260530 -329516 -322999 -406678
1822d06678J72514K68973k46578j21879k20R131N1034j0515O9692p5694O4O2870
1810b27286p679j61575k26884J03334N6368K40053l0020J6826J4835L5461l48859
1799e35426N3385L77455R9323j67814k81484J7841K67239k3477k21073L01076
1789a12955O3359j53390j00136o5142o8115J03185K5232J69346j16853J04354
1779a51115j04591M1018J01301l45797N4321K97230J57044k91542n5370p5677
1769c73178j30708k8360K65955J96j34407J08390N1322r7602M4133K82416R1219
1758G9376j40406j9144k70924l7134K96321l4634k93297q3506K34905P1847J09900
1747h6696j718q3091J11644k21912l0049k0685J78126K1485O5164m15j82529P562
$$ plain form
1822 -406678 -234164 34809 -211769 -333648 -333868 -324737 -273703 -284218 -214526 -290220 -290156 -227286
1810 -227286 -234965 -396540 -623424 -520090 -463722 -223669 -253689 -236863 -222028 -186567 -535426
1799 -535426 -482041 -104586 -5263 -173077 -454561 -436720 -169481 -192958 -414031 -112955
1789 -112955 -49596 -202986 -303122 -368264 -436379 -333194 -307962 -138616 -255469 -151115
1779 -151115 -255706 -214688 -113387 -459184 -404863 -107633 49411 -242131 -297501 -373178
1769 -373178 -503886 -532246 -266291 -266095 -400502 -292112 -240790 -338392 -294259 -11843 79376
1758 79376 -61030 -80174 -351098 -388232 -91911 -126545 -419842 -503348 -268443 -196596 -86696
1747 -86696 -88414 -171505 -59861 -281773 -311822 -332507 -154381 -132896 -67732 -68147 -250676 -243114
1735b43114J03464q0586j632r5955Q4120R6931j79333L4407J91123M1303j97241
1724b46513k7462J41228j58892k2519J60469J98247q4846q2028J87936k81249
1714b15629J19292J5085k6260J1264j64868j2436J55383j60680L483J11536j89911
$$ plain form
1735 -243114 -139650 -220236 -221868 -317823 -233703 -136772 -316105 -281698 -90575 -49272 -246513
1724 -246513 -273975 -132747 -291639 -314158 -153689 44558 -40288 -122316 65620 -215629
1714 -215629 -96337 -81252 -107512 -96248 -261116 -273552 -118169 -278849 -275366 -163830 -353741
$$ [...]
##END NTUPLES=NMR SPECTRUM
##END=
