##TITLE=1H_EC-3361(VI-22)
 200.13MHz, CDCl3,
 8 sc
 
 2.10.2025
##JCAMPDX= 6.0         $$ Bruker NMR JCAMP-DX V2.0
##DATA TYPE= NMR SPECTRUM
##DATA CLASS= NTUPLES
##ORIGIN= UXNMR, Bruker Analytische Messtechnik GmbH
##OWNER= pz
$$ XWIN-NMR		Version 3.5
$$ Thu Oct  2 13:55:45 2025 Russian Standard Time (UT+4h)  she@DPX200
##.OBSERVE FREQUENCY= 200.1313
##.OBSERVE NUCLEUS= ^1H
##.ACQUISITION MODE= SIMULTANEOUS
##.ACQUISITION SCHEME= undefined
##.AVERAGES= 8
##.DIGITISER RES= 18
##SPECTROMETER/DATA SYSTEM= spect
##.PULSE SEQUENCE= zg30
##.SOLVENT NAME= CDCl3
##.SHIFT REFERENCE= (INTERNAL, CDCl3, 0, 15.4957)
##AUDIT TRAIL= $$ (NUMBER, WHEN, WHO, WHERE, WHAT)
$$ ##TITLE= Audit trail, XWIN-NMR		Version 3.5
$$ ##JCAMPDX= 5.01
$$ ##ORIGIN= Bruker BioSpin GmbH
$$ ##OWNER= she
$$ F:/spectra/data/she/nmr/H-C/1/pdata/1/auditp.txt
$$ ##AUDIT TRAIL=  $$ (NUMBER, WHEN, WHO, WHERE, WHAT)
(   1,<2025-10-02 13:54:18.87 +0400>,<she>,<DPX200>,
      <created by zg, POWCHK disabled, PULCHK disabled
       configuration hash MD5:
       00 E9 B6 7A A2 85 ED C7 34 08 36 98 17 FE 4E 26
       data hash MD5: 16K
       62 19 4B AA 1A 24 55 A0 3C 58 2A 45 80 A8 3B 75>)
(   2,<2025-10-02 13:54:21.32 +0400>,<she>,<DPX200>,
      <Start of raw data processing
       efp BC_mod = 2 LB = 0.25 FT_mod = 6 PKNL = 1 PHC0 = -1901.401 PHC1 = -0.4077463 SI = 16K 
       data hash MD5: 16K
       E4 79 5F 7B 9F CB CD DF 18 1B 5D 34 F7 39 C2 41>)
(   3,<2025-10-02 13:54:54.89 +0400>,<she>,<DPX200>,
      <pk PHC0 = -7.595078 PHC1 = 13.8 
       data hash MD5: 16K
       A2 16 48 DA 08 FE C3 9F 02 4D 83 6B 3D 1B F1 C7>)
(   4,<2025-10-02 13:54:58.78 +0400>,<she>,<DPX200>,
      <abs ABSG = 5 
       data hash MD5: 16K
       1D A1 8C 4A 87 33 DB 6A 69 B5 B7 1A C1 DD 8F 16>)
$$ ##END=
$$ 
$$ hash MD5
$$ 85 07 55 02 B0 20 37 D2 E0 12 E0 02 7C 95 34 45
##$RELAX= 
##$RELAX= 
##$RELAX= 
##$RELAX= 
##$RELAX= 
##$RELAX= 
$$ Bruker specific parameters
$$ --------------------------
##$DU= <F:/spectra>
##$EXPNO= 1
##$NAME= <H-C>
##$PROCNO= 1
##$TYPE= <nmr>
##$USER= <she>
##$AMP= (0..31)
100 100 100 100 100 100 100 100 100 100 100 100 100 100 100 100 100 100 
100 100 100 100 100 100 100 100 100 100 100 100 100 100 
##$AQSEQ= 0
##$AQ_mod= 1
##$AUNM= <au_zg>
##$AUTOPOS= <>
##$BF1= 200.13
##$BF2= 200.13
##$BF3= 200.13
##$BF4= 200.13
##$BF5= 200.13
##$BF6= 200.13
##$BF7= 200.13
##$BF8= 200.13
##$BYTORDA= 1
##$CFDGTYP= 0
##$CFRGTYP= 5
##$CHEMSTR= <none>
##$CNST= (0..31)
1 1 145 1 1 1 1 1 1 1 1 1 1 1 1 1 1 1 1 1 1 1 1 1 1 1 1 1 1 1 1 1 
##$CPDPRG= <>
##$CPDPRG1= <>
##$CPDPRG2= <>
##$CPDPRG3= <>
##$CPDPRG4= <mlev>
##$CPDPRG5= <mlev>
##$CPDPRG6= <mlev>
##$CPDPRG7= <mlev>
##$CPDPRG8= <mlev>
##$CPDPRGB= <>
##$CPDPRGT= <>
##$D= (0..31)
0 0.7 0 0 0 0 0 0 0 0 0 0.03 0 0 0 0 0 0 0 0 0 0 0 0 0 0 0 0 0 0 0 0 
##$DATE= 1759398858
##$DBL= (0..7)
120 120 120 120 120 120 120 120 
##$DBP= (0..7)
150 150 150 150 150 150 150 150 
##$DBP07= 0
##$DBPNAM0= <>
##$DBPNAM1= <>
##$DBPNAM2= <>
##$DBPNAM3= <>
##$DBPNAM4= <>
$$ [...]
##$SUBNAM3= <"">
##$SUBNAM4= <"">
##$SUBNAM5= <"">
##$SUBNAM6= <"">
##$SUBNAM7= <"">
##$SUBNAM8= <"">
##$SUBNAM9= <"">
##$SW= 18.0517328524113
##$SWIBOX= (0..15)
0 0 2 0 0 0 0 0 0 0 0 0 0 0 0 0 
##$SW_h= 3612.71676300578
##$TD= 16384
##$TD0= 1
##$TE= 0
##$TE2= 300
##$TE3= 300
##$TEG= 300
##$TL= (0..7)
0 120 120 120 120 120 120 120 
##$TP= (0..7)
150 150 150 150 150 150 150 150 
##$TP07= 0
##$TPNAME0= <>
##$TPNAME1= <>
##$TPNAME2= <>
##$TPNAME3= <>
##$TPNAME4= <>
##$TPNAME5= <>
##$TPNAME6= <>
##$TPNAME7= <>
##$TPOAL= (0..7)
0.5 0.5 0.5 0.5 0.5 0.5 0.5 0.5 
##$TPOFFS= (0..7)
0 0 0 0 0 0 0 0 
##$TUNHIN= 0
##$TUNHOUT= 0
##$TUNXOUT= 0
##$USERA1= <user>
##$USERA2= <user>
##$USERA3= <user>
##$USERA4= <user>
##$USERA5= <user>
##$V9= 5
##$VALIST= <valist>
##$VCLIST= <CCCCCCCCCCCCCCC>
##$VD= 0
##$VDLIST= <DDDDDDDDDDDDDDD>
##$VPLIST= <PPPPPPPPPPPPPPP>
##$VTLIST= <TTTTTTTTTTTTTTT>
##$WBST= 1024
##$WBSW= 4
##$XGAIN= (0..3)
0 0 0 0 
##$XL= 0
##$YL= 0
##$YMAX_a= 241955
##$YMIN_a= -395698
##$ZGOPTNS= <>
##$ZL1= 120
##$ZL2= 120
##$ZL3= 120
##$ZL4= 120
##$ABSF1= 15.49128
##$ABSF2= -2.56057
##$ABSG= 5
##$ABSL= 3
##$ALPHA= 0
##$AQORDER= 0
##$ASSFAC= 0
##$ASSFACI= 0
##$ASSFACX= 0
##$ASSWID= 0
##$AUNMP= <proc_1d>
##$AZFE= 0.1
##$AZFW= 0.1
##$BCFW= 0
##$BC_mod= 2
##$BYTORDP= 0
##$COROFFS= 0
##$CY= -3
##$DATMOD= 1
##$DC= 0
##$DFILT= <>
##$DTYPP= 0
##$F1P= 0
##$F2P= 0
##$FCOR= 1
##$FTSIZE= 16384
##$FT_mod= 6
##$GAMMA= 0
##$GB= 0
##$INTBC= 1
##$INTSCL= 3.241238e-09
##$ISEN= 128
##$LB= 0.25
##$LEV0= 0
##$LPBIN= 0
##$MAXI= 10000
##$MC2= 0
##$MEAN= 0
##$ME_mod= 0
##$MI= 1.114404
##$NCOEF= 0
##$NC_proc= -7
##$NLEV= 6
##$NOISF1= 3.799351
##$NOISF2= 2.8
##$NSP= 0
##$NTH_PI= 0
##$NZP= 0
##$OFFSET= 15.49568
##$PC= 1
##$PHC0= -1908.996
##$PHC1= 13.39225
##$PH_mod= 1
##$PKNL= yes
##$PPARMOD= 0
##$PSCAL= 0
##$PSIGN= 0
##$REVERSE= no
##$SF= 200.130005208717
##$SI= 16384
##$SIGF1= 3
##$SIGF2= 2
##$SINO= 0.751879
##$SIOLD= 32768
##$SREGLST= <19F.Aceton>
##$SSB= 0
##$STSI= 16384
##$STSR= 0
##$SW_p= 3612.71676300578
##$SYMM= 0
##$S_DEV= 0
##$TDeff= 16384
##$TDoff= 0
##$TI= <>
##$TILT= no
##$TM1= 0
##$TM2= 0
##$TOPLEV= 0
##$USERP1= <user>
##$USERP2= <user>
##$USERP3= <user>
##$USERP4= <user>
##$USERP5= <user>
##$WDW= 1
##$XDIM= 16384
##$YMAX_p= 407599249
##$YMIN_p= -815043
$$ End of Bruker specific parameters
$$ ---------------------------------
##NTUPLES= NMR SPECTRUM
##VAR_NAME=  FREQUENCY,     SPECTRUM/REAL,   SPECTRUM/IMAG
##SYMBOL=    X,             R,               I
##VAR_TYPE=  INDEPENDENT,   DEPENDENT,       DEPENDENT
##VAR_FORM=  AFFN,          ASDF,            ASDF
##VAR_DIM=   16384,         16384,           16384
##UNITS=     HZ,            ARBITRARY UNITS, ARBITRARY UNITS
##FACTOR=    0.220516191357247, 1,           1
##FIRST=     3101.15049016314, 0,            0
##LAST=      -511.566272842638, 0,           0
##MIN=       -511.566272842638, -815043,     0
##MAX=       3101.15049016314, 407599249,    0
$$ Real data points
##PAGE= N=1
##DATA TABLE= (X++(R..R)), XYDATA
$$ [...]
8002b0804J61517J68458j72038k96315K11993R6046m7951K38336l39068n9786
7992e9612p8099P5645J37537N7041J43606K7409P9407p1357j97809L5053J01191
7981B50012P653q5509r5705j10058k04031J66489J33050K25040J16066p4494O7208
7970C95721j08478Q9016j9199j15119J92068m09199P9047O5466K12570n3708j61469
7959A66716K01198l4415M2006j01418r3118O9561K44931J34173K88513j37318
7949G80829l63982O0686K99802q7589q9561j4554P9242l5182k1293j76668J30746
7938E62476J02141Q0295Q9258M9873l9188l11662j53401J98528K69738k12672
7928F35386j70344j76732j09212p733M7986J16678L57652j2588j49699m25297
$$ y = [-20804, 140713, 309171, 137133, -159182, 52811, 148857, 100906, 339242, 174, -59612, -137711, -62066, 75471, 132512, 276118, 303527, 382934, 311577, 113768, 148821, 250012, 257665, 172156, 76451, -33607, -237638, -71149, 61901, 286941, 403007, 328513, 395721, 287243, 376259, 357060, 241941, 434009, 24810, 103857, 169323, 381893, 328185, 166716, 367914, 333499, 375505, 274087, 180969, 250530, 495461, 629634, 918147, 780829, 416847, 477533, 777335, 689746, 600185, 585631, 664873, 629691, 608398, 431730, 562476, 664617, 744912, 834170, 884043, 844855, 533193, 379792, 578320, 848058, 635386, 465042, 288310, 179098, 171365, 219351, 336029, 693681, 681093, 531394, 106097]
7918A06097k07040J49047M2460k07625J18235J38440J8278J4337j05027J51908
7908B19110k52677j40216K00877j59968J09620K01495J85626L787K3485k16379
7898A74760l1095K43376P4143j70977l2431k7813k25703j7470L6659L24121j11480
7887B36090k22053k3291m1312j46795p1510J53058J61588P1955k54207J36728
7877B51j30873J20375J33140p6479J45029n2314j45776K01106j61664m6599n543
7866a9347k3681m3280o6488Q4234J74416J19145k37278J29152J7270l7672J34325
7855B30796N7204j22969m70446l27524M26900K45399j87383p0313L21185O3348
7845A66197m2327j16239m3500R77k41115J23299L37024M5194K2552j64034J52225
$$ y = [106097, -100943, 48104, 90564, -117061, 1174, 139614, 157892, 172229, 67202, 219110, -33567, -173783, 27094, -132874, -23254, 178241, 363867, 367654, 391139, 174760, 143665, 387041, 461184, 290207, 257776, 229963, 4260, -13210, 23449, 347570, 236090, 14037, -9254, -50566, -197361, -268871, -115813, 45775, 117730, -136477, 251, -130622, -10247, 122893, 46414, 191443, 139129, -6647, 194459, 32795, -13804, -19347, -43028, -86308, -152796, -68562, 105854, 224999, -12279, 116873, 134143, 96471, 230796, 288000, 165031, -305415, -632939, -206039, 39360, -148023, -218336, 102849, 166197, 123870, 7631, -35869, -34892, -276007, -152708, 184316, 229510, 252062, 88028, 240253]
7834B40253M4341j84701J96288n2395l7653k5739J17096L00707J1922k94632R748
7823C25235O4792j057k74868K8784j92959l5930K15063n974K7543j81217K2348
7812h240N3853K00573k55863j69769L35672j21077m51139L03965L11305K66075
7802D65355j66761j12714r9375q6745J61831P8897p9755k3483J471N9913J02893
7791C01527J45044k59326j00766K39980j10012k36391J31112L8894P3997J39704
7781C63763j58083J67431k2918j54078L2387L48196j8434k47208P2531L434J37486
7770E24507J7676R3269N6841q409R8224j63258n7427J04382Q5467q6566m3438
7759F21268l5538J56806J34864k16425j03637N9645j05793k13614M945M7822j4709
$$ y = [240253, 284594, 99893, 296181, 243786, 206133, 180394, 297490, 598197, 610119, 315487, 325235, 390027, 388970, 114102, 142886, -50073, -86003, 129060, 123086, 150629, -30588, -8240, 45613, 246186, -9677, -179446, 156226, 35149, -415990, -112025, 199280, 465355, 298594, 185880, 86505, -240, 161591, 240488, 160733, 137250, 138721, 198634, 301527, 446571, 187245, 86479, 326459, 216447, -19944, 111168, 150062, 224059, 363763, 205680, 373111, 350193, 196115, 228502, 576698, 558264, 311056, 383587, 387021, 524507, 542183, 635452, 692293, 683884, 782108, 618850, 561423, 665805, 751272, 664706, 621268, 585730, 742536, 877400, 660975, 557338, 616983, 511190, 297576, 302521, 350343, 335634]
7748C35634J8244L9222o987P169R4200j5748p3894l0615J7835k02146L9332L4385
7736B56631N8404O6519o524J15670K2328J27353J80305J39697k30901K8860j31061
7725F27281r5693L4103l1057j12132J91361R7083j82937k6123J0157k20011J87748
7714D79780q0960k38320K84789j94723n0421J5774J81921L9211Q5O1480Q9785
7703E88401k86674j50537l2495M7898J61793R4145o6289j11371j36621K2401L9091
7692A69742j56585k0827l555p9231J60365K0505o9744K4921K06869p423k47724
7681b687J28968k2192L6195k90328j54898M34765M9701K474j27015j81854Q6168
7670d0703j00356J83051R3011r3658r9754J78682J98597J32906k9423j23722j48157
$$ y = [335634, 353878, 393100, 386113, 393282, 487482, 471734, 397840, 367225, 385060, 182914, 222246, 256631, 315035, 381554, 375030, 490700, 513028, 640381, 820686, 960383, 729482, 758342, 627281, 531588, 565691, 534634, 422502, 613863, 710946, 528009, 501886, 512043, 292032, 479780, 398820, 160500, 445289, 250566, 200145, 215919, 397840, 437051, 437136, 498616, 588401, 301727, 151190, 118695, 166593, 328386, 422531, 356242, 244871, 108250, 130651, 169742, 13157, -7670, -11225, -90456, 69909, 90414, 20670, 45591, 252460, 245037, -2687, 126281, 104089, 140284, -150044, -304942, 129823, 179524, 181998, 54983, -126871, -40703, -141059, 41992, 135003, 41345, -58409, 120273, 318870, 451776, 422353, 298631, 150474]
7659A50474j16702j03788m1975J65184j4006j5844j06406M1618J60740o950k3851
7648H8494L4947j21302j34929L1623J40665j68385p9339P8150R6018j04711K872
7637a35897K4102j81543j17917K12938J85351j63011r0622M7831N5822J77592
7627A4646M7187p4755j80862J16541K35634k80406j67556J26723J05129K4602
7617c3117P9984j49986P0408J34168k2349o3586P1789O0279m8850L66632j34739
7606C30633o3890r6149j60784Q6880Q8313k0901J59926R002n0871j33138N1668
7595B00689K089K8532J50432l3116j92916r6915J50074J32544J33908J16053j22632
7584D68742j46928l04489M1719L02314M6080J8413K1103J22044q536j45256P7054
$$ y = [150474, 33772, -70016, -111991, 53193, 39187, 23343, -83063, -41445, 119295, 112345, 88494, 123441, 2139, -132790, -101167, 39498, -128887, -208226, -130076, -34058, -138769, -135897, -111795, -293338, -411255, -198317, -12966, -175977, -266599, -218768, -162946, 14646, 61833, -12922, -193784, -77243, 158391, -122015, -289571, -162848, -57719, -33117, 46867, -103119, -32711, 101457, 79108, 15522, 87311, 147590, 98740, 465372, 330633, 266743, 170594, 9810, 96690, 185003, 164102, 324028, 333030, 282159, 149021, 200689, 202778, 231310, 381742, 348626, 155710, 58795, 208869, 341413, 475321, 591374, 468742, 321814, 17325, 59044, 361358, 407438, 425851, 446954, 568998, 560462, 415206, 492260]
7573D92260J67494q2758M8197J57969j5799o8295J38798J5719O2090l65703j71461
7562C78511L4841L28945k62402K3800P0031M1741j38589J5857l5747j25157K63863
7551E95694Q1976K3026j13348k47771k0298J54897o562o5340O5187j07551j3029
7540C46881q2620j77460j4470L44573k3336j9825m3551p1118J7942n4868k2138
7529B00010N0746J42085j38046m6580j05887j15015j87454j4523J31192o3683
7519a47155N8630J59970J04497j5003J88826j78565M1247R6631k23745j31987
7509d6654J86918Q4497O0663j06545K00444n5887j02736K72637j55069J60391
7499D98659k8353l91797J13081q8991m6544J70036J23165J05326R9677P407o4143
$$ y = [492260, 659754, 576996, 625193, 783162, 767363, 699068, 837866, 853585, 915675, 549972, 378511, 413352, 742297, 479895, 503695, 573726, 615467, 476878, 492735, 456988, 331831, 595694, 677670, 700696, 587348, 339577, 319279, 474176, 467614, 402274, 467461, 359910, 346881, 264261, 86801, 72331, 416904, 393568, 373743, 330192, 259074, 277016, 222148, 200010, 250756, 392841, 254795, 208215, 102328, -12687, -200141, -214664, -83472, -147155, -88525, 71445, 175942, 160939, 349765, 171200, 212447, 309078, 85333, -46654, 140264, 224761, 285424, 178879, 379323, 323436, 220700, 493337, 338268, 498659, 470306, 78509, 191590, 102599, 56055, 226091, 349256, 454582, 554259, 561666, 497523]
7488D97523o0412K92K80125l87144J78496J23759p5807j00744K397L6032p9437
7477D15080k3905K78673l10896j66806J19456J6646j51360J43283J3537q6308
7467B47400j64658J05296q5314K1121M7772K8183j56745K03892J49076m7906j34449
7456B13668K4737R9286m4804j6208k40672K75218J18729l4437K97110J9256j20689
7445E91194j6594N5392k29079J66871J43878j54196j47475Q8053L3896m0855K00788
7434F91873j63968j45004Q8020J73897j38507k7501j57464j02550J91879J10034
7424E20709j8365J23868M0830K7514J09282j01987r3626k77272j3497o1656J50296
7413D06096K66284J3329m2854k70093j22027L14935K61668l3077l15015k57255
$$ y = [497523, 437111, 437403, 717528, 330384, 508880, 632639, 556832, 456088, 458485, 494517, 415080, 391175, 669848, 358952, 192146, 311602, 328248, 176888, 320171, 333708, 247400, 82742, 188038, 102724, 123845, 171617, 199800, 43055, 246947, 396023, 348117, 213668, 238405, 337691, 292887, 276679, 36007, 311225, 429954, 395517, 692627, 711883, 591194, 574600, 629992, 400913, 567784, 711662, 557466, 409991, 498044, 531940, 491085, 691873, 527905, 382901, 470921, 644818, 506311, 478810, 321346, 218796, 410675, 520709, 502344, 626212, 667042, 694556, 803838, 701851, 608225, 330953, 317456, 255800, 406096, 672380, 685709, 642855, 372762, 250735, 565670, 827338, 794261, 479246, 221991]
7403B21991J24859R3868L3412M4423K16196q4319J1432K00430j01491j42101J82853
7392H01553k42935q2377m8397J57873j12640M2896J2857J53631p9680R128K01688
7381H13597Q1294p7873p8800j08631J93466p7779J12127J75556k72967p294O2732
7370H15428K39778m9699q4031K043l73079L20195J44954j14791J0285k2504j41642
7359G46937K56268K94265j01370r3282k52446J52108n6019j2866N1994J21931
7349A107520l3460M323k1816j64376j87581K35952J25273j63526J6379L7535L28447
7338A284670K53307L611j71011k16756J42113o0456j23187K74309L39572k99562
7328A426610m6677P6411O0537R648k96906J70872R4774n6969K49179k6087l1977
$$ y = [221991, 346850, 440718, 474130, 518553, 734749, 650430, 661862, 862292, 760801, 618700, 801553, 558618, 476241, 427844, 585717, 473077, 515973, 528830, 682461, 602781, 611909, 813597, 894891, 817018, 738218, 629587, 823053, 745274, 857401, 1032957, 759990, 752696, 815428, 1055206, 1005507, 921476, 923519, 550440, 870635, 1015589, 900798, 911083, 888579, 746937, 1003205, 1297470, 1196100, 1102818, 850372, 1002480, 946461, 933595, 985589, 1107520, 1074060, 1078383, 1056567, 892191, 704610, 940562, 1065835, 902309, 918688, 956223, 1284670, 1537977, 1541588, 1370577, 1153821, 1295934, 1235478, 1112291, 1386600, 1726172, 1426610, 1379933, 1456344, 1516881, 1526529, 1229623, 1400495, 1495269, 1438300, 1687479, 1661392, 1629415]
7317A629415R2294k9276l7747m48204L3564K73710q8392n9770J25711R5052l14663
7306A271694K62617L1895J1898J17606k8561J891m9414K20334r0798k82530J6717
7295A483349q5594j53981L31826J53315n8730j24689K41276J17122j59435P9713
7285A824172j19381O5489K89344N8158K12890j40641K60364J33728j22180k5753
7275B436190P9201J03274J14748Q3461K09940j19376l97546J53186K32553J61152
7265C056783p726L32380N6377k05744N4443K23182K50049M6648j52435K60570
7255C914527J84933j31252M93976L46498L59472L92498K9818J64203K88349K43073
7245F286095k03387O77689N11446L09881L66962L58656Q8406J90326N37911O85679
$$ y = [1629415, 1721709, 1692433, 1654686, 1206482, 1240046, 1513756, 1425364, 1365594, 1491305, 1586357, 1271694, 1534311, 1566206, 1578104, 1695710, 1667149, 1669040, 1619626, 1839960, 1749162, 1466632, 1483349, 1397755, 1243774, 1575600, 1728915, 1670185, 1545496, 1786772, 1903894, 1744459, 1824172, 1704791, 1770280, 2059624, 2117782, 2330672, 2190031, 2450395, 2584123, 2461943, 2436190, 2515391, 2618665, 2733413, 2816874, 3026814, 2907438, 2509892, 2663078, 2895631, 3056783, 3049057, 3381437, 3437814, 3232070, 3286513, 3509695, 3759744, 3806392, 3653957, 3914527, 4099460, 3968208, 4462184, 4808682, 5168154, 5560652, 5590470, 5754673, 6043022, 6286095, 6082708, 6760397, 7271843, 7581724, 7948686, 8307342, 8395748, 8586074, 9123985, 9809664]
7235I809664K25068N24953O18927L42450L58196O29224Q35235O83229P82182M61137
7225A5270265P60457R25479P83462O38600N17346N29650R99112Q09675L47737
7216B1581783P37981P74359N42820O27530M39385M30998O01823L26378L15054
7207B6378111J92738J75449J7611J19935m4948k16255l24371l73020n06630q04724
7197B4613896m18601q67073o66590m26733q59317p81773q16123p63692p22299
7188A8291695p52649q44423q29675n21063n93288p68410p06014n69768p27919
7179A1978486l66438l05914o96385p10676m84784l89159k14074m54906n75963
7170G780187l53738k6218j47280m30300m63541l73941l73414l67485Q40M3461
$$ y = [9809664, 10034732, 10559685, 11178612, 11521062, 11879258, 12508482, 13343717, 14026946, 14809128, 15270265, 16030722, 16956201, 17739663, 18378263, 18895609, 19425259, 20424371, 21234046, 21581783, 22319764, 23094123, 23636943, 24264473, 24703858, 25134856, 25736679, 26063057, 26378111, 26570849, 26746298, 26763909, 26883844, 26838896, 26622641, 26298270, 25925250, 25418620, 24613896, 24195295, 23328222, 22661632, 22234899, 21375582, 20593809, 19777686, 19013994, 18291695, 17539046, 16694623, 15864948, 15343885, 14750597, 13982187, 13276173, 12706405, 11978486, 11612048, 11306134, 10609749, 9899073, 9414289, 9025130, 8811056, 8356150, 7780187, 7426449, 7400231, 7252951, 6822651, 6359110, 5985169, 5611755, 5244270, 5245110, 5288571]
7160E288571l20894m17971J38779l1565o2927r9166k33106k60185j33780J64760
7150D032516k53106n6424l2546j51068J35955O2689m10815k05718k51103M6805
7140B917185K21029O4840m420j73380q2151l07304J09193J13194p2874j0446l22861
7129B452005P1372o8072J43408m5582m8943k73532M5486J20254j06249j2039K45736
7118B523844p1859r0096j24788o4720K78477P4110L1880j25512m4929r8456L73898
7107B661849P8084r9995J71221O9375r2401N2866P0518K52766J37731M32403M80864
7096D215281P7867M51003O20528J01783p9975j56582k12855l13579m76672l55239
7086C871560j28743m6794l69365k88424J13123j10507K3373q5588J0383m02539
$$ y = [5288571, 4967677, 4549706, 4688485, 4656920, 4593993, 4494827, 4261721, 4001536, 3867756, 4032516, 3779410, 3722986, 3690440, 3539372, 3675327, 3738016, 3327201, 3121483, 2870380, 2917185, 3138214, 3203054, 3198634, 3025254, 2943103, 2635799, 2744992, 2858186, 2785312, 2774866, 2452005, 2523377, 2455305, 2598713, 2553131, 2504188, 2230656, 2276142, 2396396, 2290147, 2278108, 2523844, 2451985, 2361889, 2237101, 2172381, 2450858, 2524968, 2556848, 2431336, 2386407, 2287951, 2661849, 2739933, 2639938, 2811159, 2880534, 2788133, 2840999, 2911517, 3164283, 3302014, 3734417, 4215281, 4293148, 4744151, 5364679, 5466462, 5386487, 5229905, 5017050, 4703471, 4226799, 3871560, 3742817, 3696023, 3326658, 3038234, 3151357, 3040850, 3064223, 2978635, 2989018, 2586479]
7076B586479j79843j25307P8407l28359k06483K46031P1904j14275j27000L4710
7066A936264m0309j24956m7651J11716j32562j97375l5729J83732k87712J63713
7056A529131N1416Q0696K67770j93670j45983J0556j35640j09237m038L8505J85905
7045A575411R2458m0024p3983l30486P5346J44426O6253J67979j81735n9096J996
7034A438545j62612K5104m5582k6297N7798p297o9903j15247J60513J7361j35512
7023A136871J21139K79533j42643j35230J0147J0176N8902q5969k759k00507R3286
7012A142946M8139j64672l09037J02666J97887J30371q3310K690p3656m739J90420
7001A179705J5319J37328j76413j20284K22736n3753j24374P7315j10952M7524
$$ y = [2586479, 2406636, 2281329, 2359736, 2031377, 1824894, 2070925, 2142829, 2028554, 1901554, 1936264, 1895955, 1770999, 1723348, 1835064, 1702502, 1505127, 1469398, 1653130, 1365418, 1529131, 1580547, 1661243, 1929013, 1735343, 1589360, 1599916, 1464276, 1355039, 1351001, 1389506, 1575411, 1667869, 1627845, 1553862, 1223376, 1298722, 1443148, 1509401, 1677380, 1495645, 1436549, 1438545, 1275933, 1301037, 1255455, 1229158, 1286956, 1279659, 1209756, 1094509, 1255022, 1272383, 1136871, 1258010, 1537543, 1394900, 1259670, 1269817, 1279993, 1338895, 1252926, 1250167, 1049660, 1142946, 1191085, 1026413, 717376, 820042, 1017929, 1148300, 1064990, 1067680, 994024, 989285, 1179705, 1195024, 1332352, 1155939, 1035655, 1258391, 1204638, 1080264, 1157579, 1046627, 1094151]
6991A094151j07829L016M3436M41370K17056j6300q478m9564M20743M33741M6474
6980B517816k20088k55288j16016N2676J1725J2768J27624J68357L44644K33204
6970B877422j26059k14430l93576k46032K1028k25633j9457K12562r2245l2695
6960A760885m9497p6201q0072q935k43246l4712Q1567j38143R4884J41330q2270
6949A365590p0913K83003k07048j89085L16370J53731r2481Q5213l3105r215o9635
6938A532425Q8000J59204q4332K00411l40181k17860M27121l02117q0424Q7120
6928A469367K3034L81383K86953j41760k76J00670M70209L39164L8548n55278
6918B412014k37112M9988P9465K8437p7770J08022Q5352k8334K08979M16635O9269
$$ y = [1094151, 986322, 989338, 1032774, 1474144, 1691200, 1674900, 1666422, 1616858, 2037601, 2471342, 2517816, 2297728, 2042440, 1926424, 1979100, 1990825, 2003593, 2131217, 2299574, 2644218, 2877422, 2751363, 2536933, 2143357, 1897325, 1918353, 1692720, 1673263, 1885825, 1793580, 1760885, 1711388, 1635187, 1555115, 1546180, 1302934, 1268222, 1349789, 1211646, 1306530, 1447860, 1365590, 1294677, 1577680, 1370632, 1181547, 1497917, 1651648, 1559167, 1644380, 1611275, 1602060, 1532425, 1620425, 1779629, 1695297, 1895708, 1555527, 1337667, 1764788, 1462671, 1382247, 1469367, 1492401, 1873784, 2160737, 2018977, 2018701, 2119371, 2589580, 2928744, 2967292, 2412014, 2174902, 2224890, 2304355, 2332792, 2255022, 2363044, 2448396, 2420062, 2629041, 3045676, 3114945]
6907C114945k76086m6308l5079k12140N0110k46740P7554R6171l6288k1420j11854
6896B352865L1903J79995J15652K2062k9487J09875j84552N7692m2621J4764k49051
6885B379097J43828K4299l7147j31282k57229j43320q3421K17631j56552L729
6875A959633J60168j35566P2523r2128k60067j2132J29420R247J11967q5252j03905
6864A753908Q3815j49992L5169L0565o5021l05707j65230L90434Q0250L4149j32487
6853A589853J46718J54201j31705j39686m9608K55809J55378j84543R5794L4094
6843A926305m7345Q0565K18235k056k08982J58361n9669O8180K84353K58934k82228
6832B394653r7159M68j06530j9256k56568J16225Q9008k86571j66236k26937r6251
$$ y = [3114945, 2838859, 2792551, 2757472, 2545332, 2595442, 2348702, 2426256, 2522427, 2486139, 2464719, 2352865, 2384768, 2564763, 2680415, 2702477, 2672990, 2782865, 2598313, 2656005, 2613384, 2628148, 2379097, 2522925, 2547224, 2510077, 2378795, 2121566, 1978246, 1894825, 2112456, 1955904, 1959633, 2119801, 1984235, 2056758, 1964630, 1704563, 1692431, 1821851, 1831098, 1943065, 1857813, 1753908, 1837723, 1687731, 1722900, 1753465, 1688444, 1382737, 1217507, 1607941, 1688191, 1722340, 1589853, 1736571, 1890772, 1759067, 1619381, 1569773, 1825582, 1980960, 1796417, 1892211, 1926305, 1878960, 1959525, 2177760, 2175704, 1966722, 2125083, 2065414, 2133594, 2417947, 2676881, 2394653, 2297494, 2297962, 2191432, 2172176, 1915608, 2031833, 2120841, 1834270, 1668034, 1441097, 1344846]
6821A344846p034J11751L78953p9594j10324j78279J67085j57553l14070P3187
6811A228968L99580r150l21507K2800O5072J26827J0272M3908M2314P7917n0941
6800A636060Q8392p000n2574j38704K08039k2497n8823Q4458L7920j93995J53711
6789A734987K83295k8921j0128r7813K30624J94396m1718M8209J07741l3291j70115
6778B217266j095k24709K12661J56692l57163m9940k7765j63481q3843p8327O1870
6767A662166J8560J68717j4484n8954M3846m4903j1624L26750J27425J04376k98365
6756B023510j55851K80003k69131l8664J93804K16686m4439m8410K63507j70495
6746B250520p0750L27781M48848j29774P3255J48634K21617l7866j05603K95893
$$ y = [1344846, 1337812, 1449563, 1828516, 1748922, 1638598, 1460319, 1627404, 1469851, 1155781, 1228968, 1628548, 1619398, 1297891, 1320691, 1385763, 1512590, 1522862, 1566770, 1609084, 1687001, 1636060, 1724452, 1717452, 1664878, 1526174, 1734213, 1711716, 1652893, 1737351, 1775271, 1581276, 1734987, 2018282, 1989361, 1979233, 1881420, 2112044, 2306440, 2264722, 2312931, 2420672, 2387381, 2217266, 2216171, 1991462, 2204123, 2360815, 2003652, 1953712, 1925947, 1762466, 1678623, 1600296, 1662166, 1680726, 1849443, 1834959, 1776005, 1819851, 1774948, 1763324, 2090074, 2217499, 2321875, 2023510, 1867659, 2147662, 1878531, 1839867, 2033671, 2250357, 2205918, 2157508, 2421015, 2250520, 2179770, 2507551, 2956399, 2826625, 2899880, 3048514, 3270131, 3232265, 3126662, 3422555]
6736C422555K32008K22630k3202K92257L56429L63547O1248l53641n6147p4861
6726D442823K002K553k58237K59613J69746J63728M38353L16100R916q2l02570
6715E243945j26211p4425l57019k5321J71092L50899l39186j24352K59737K9403
6705E008562L18209K75807l14349m70629K3530L07162p8782k29059J4172R199
6695D863822K16742J19763K74524j13900k33692k38929k7781k86490k46771k3710
6685D303578k18262j24621j47696M2379J59469j5767M7424m9312k6398K0404P7853
6674D069051K0723R6160j24115p494K45874J28158q1568l17811L7282R2752j1728
6663D147284J11661R3182j63038m9271N8634l38774M49655j09090l69299K20279
$$ y = [3422555, 3654563, 3877193, 3853991, 4146248, 4502677, 4866224, 4927472, 4573831, 4517684, 4442823, 4444825, 4447378, 4189141, 4448754, 4618500, 4782228, 5220581, 5536681, 5546597, 5546515, 5243945, 5117734, 5043309, 4686290, 4660969, 4832061, 5182960, 4843774, 4719422, 4979159, 5008562, 5326771, 5602578, 5288229, 4817600, 4841130, 5148292, 5069510, 4840451, 4854623, 4863822, 5080564, 5200327, 5474851, 5360951, 5127259, 4888330, 4860549, 4574059, 4327288, 4303578, 4085316, 3960695, 3812999, 3855378, 4014847, 3999080, 4046504, 3997192, 3970794, 3991198, 4069051, 4089774, 4185934, 4061819, 4054325, 4300199, 4428357, 4346789, 4028978, 4066260, 4159012, 4147284, 4258945, 4352127, 4189089, 4139818, 4198452, 3859678, 4309333, 4200243, 3830944, 4051223]
6653D051223O2058J28591k14381J15122j37161r0264J1318J90906P8356M13P3772
6642D269953k43711n4834J03723j6239o9066K25655J17475j92003m3362L2122
6632D129713L2314k10640K6038l4263j27694J67261k6802J02322K30457L36756
6622D625462r3109l8194M9241j28803J8981j52056J75776L05261n2198O5904L9137
6611D815402o3334K48317M9543L8418M0581k12439K15582j00924j03662n2324
6601D875160R1157J91235j6740k25190L28285Q2652J45312J36913n4226P6350
6591E630908M88434K38820J06660O0985O913L18057J85291J31144r3003L66982
6581G441191J58039k00802J11337M52869J55334M2839K02393K22173J84122j89175
$$ y = [4051223, 4113281, 4241872, 4027491, 4142613, 4005452, 3915188, 3926506, 4117412, 4195768, 4196181, 4269953, 4026242, 3971408, 4075131, 4058892, 3989826, 4215481, 4332956, 4140953, 4097591, 4129713, 4162027, 3951387, 3977425, 3943162, 3815468, 3982729, 3955927, 4058249, 4288706, 4625462, 4532353, 4494159, 4543400, 4414597, 4433578, 4281522, 4457298, 4762559, 4710361, 4776265, 4815402, 4752068, 5000385, 5049928, 5088346, 5128927, 4916488, 5132070, 5031146, 4927484, 4875160, 4966317, 5157552, 5140812, 4915622, 5243907, 5326559, 5471871, 5608784, 5554558, 5630908, 6119342, 6358162, 6464822, 6525807, 6532720, 6850777, 7036068, 7167212, 7074209, 7441191, 7599230, 7398428, 7509765, 7962634, 8117968, 8160807, 8363200, 8585373, 8769495, 8580320]
6571H580320M12393J62930j41683M13311L23025O10569O24581K78109L44386L58687
6561A1966628L98714N08545N17235R14265Q92908Q63944J285772J805174J655791
6552B0808976J910634K789405L363159L634904L636076K613159J019204m44166
6544C9331351j335955k244063k693273k358791k071857j994923j597962j666520
6536B3368007j141924r04409p24316n29331n58214m24120l93467o56791o28955
6527A7406480r16390o49969p82391q93959n93973m29130n96409m78592l12104
6518A1753563k49198l66551k69258o80244j75249n1137m46791r9197N6554k28377
6508I244115Q4406P3816p6023r3267j74525J31004J12835j74389j04453J41435
$$ y = [8580320, 8992713, 9155643, 9013960, 9427271, 9750296, 10360865, 10985446, 11263555, 11607941, 11966628, 12365342, 12873887, 13391122, 14305387, 15198295, 16062239, 17348011, 19153185, 20808976, 22719610, 25509015, 28872174, 32507078, 36143154, 38756313, 39775517, 39331351, 37995396, 35751333, 33058060, 30699269, 28627412, 26632489, 25034527, 23368007, 22226083, 21321674, 20597358, 20068027, 19509813, 19085693, 18692226, 18035435, 17406480, 16490090, 15840121, 15057730, 14163771, 13569798, 13140668, 12544259, 12065667, 11753563, 11504365, 11137814, 10868556, 10188312, 10013063, 9961926, 9515135, 9415938, 9472492, 9244115, 9328521, 9402337, 9326314, 9233047, 9058522, 9189526, 9302361, 9127972, 9023519, 9164954]
6498I164954n1015J53412k02380j60665N7427j09106j95909k8735N3839J64850
6488H846672k13331r1998j2239K5381M59695k4812k36665O9162l6055n4475R2529
6477H823864o854J09935J0132J06416N6663j17119k02008J90676J45565p4648
6467I042622p5198K1650n3188J62828L06468o0991o434M18631k01065j4119M54127
6456I995331J33336L65883Q2992K19918K44815K23328k991J57159J19951L05956
6446A1845678M8749K44574L0064j721L04350K18474N33981N6944J00457N58891
6436A3940441Q7580K48758q2447J82739M3577J04123J50271J57063k4209M3019
6426A4850915L6075J2622K04016N48164K57597N41013O5912J11991L95403K20862
$$ y = [9164954, 9113939, 9267351, 9064971, 8904306, 8961733, 8852627, 8656718, 8627983, 8681822, 8846672, 8633341, 8541343, 8529104, 8554485, 9014180, 8989368, 8752703, 8821865, 8785810, 8731335, 8823864, 8817010, 8926945, 8937077, 9043493, 9100156, 8983037, 8781029, 8971705, 9117270, 9042622, 8967424, 8989074, 8935886, 9098714, 9405182, 9344191, 9337757, 9756388, 9555323, 9541204, 9995331, 10128667, 10494550, 10577542, 10797460, 11042275, 11265603, 11262612, 11419771, 11539722, 11845678, 11894427, 12139001, 12169065, 12167344, 12471694, 12690168, 13224149, 13281093, 13381550, 13940441, 14028021, 14276779, 14194332, 14377071, 14420648, 14524771, 14675042, 14832105, 14807896, 14850915, 14886990, 14899612, 15103628, 15651792, 15909389, 16450402, 16516314, 16628305, 17023708, 17244570]
6416A7244570K60425M34235N27172L64017M10673K50753J53863N51058K70650
6407B0467416L50886J02276K30457J93830M93731N51881N74571N49258P80282
6398B4294588O79433J193201J004210J052454J312236J538319J662443K229221
6390C4966105J761624J879901K837727K864682L160339L550504L951359M587551
6382E9559792N503003P293526R142014J2862515J7670525K4430776L2711200M7045780
6374B16219131L0107086j7884384k8133501k1643452j6673901j4814654j3976237
6367A33200088j1994378j0888592j0149420q145745n897618m683471l528449l273620
6359G4638795k990908k884350k550988j758113j465283j444801j469682j752130
$$ y = [17244570, 17504995, 17939230, 18466402, 18830419, 19241092, 19491845, 19645708, 20196766, 20467416, 20818302, 20920578, 21151035, 21344865, 21838596, 22390477, 22965048, 23514306, 24294588, 24974021, 26167222, 27171432, 28223886, 29536122, 31074441, 32736884, 34966105, 36727729, 38607630, 41445357, 44310039, 47470378, 51020882, 54972241, 59559792, 65062795, 72356321, 81498335, 94360850, 112031375, 136462151, 169173351, 216219131, 246326217, 228441833, 200308332, 178664880, 161990979, 147176325, 133200088, 121205710, 110317118, 100167698, 92021953, 86124335, 81440864, 77912415, 74638795, 71647887, 68763537, 66212549, 64454436, 62989153, 61544352, 60074670, 58322540]
6351E8322540j697978j522680j185441p44496n40196p78822p87417p42509r93391
6342D9329610j087397n58782m14869m46060J02602L0779R36028J317389K162855
6333E1372155L012116L281736L348579K216858L81652j175705k596955k786198
6325E7054238k038128k083769j768971j546292j141280q00068l04226N0058Q33746
6316D8255308J406037K303854L020361L251568K625826J626370J340069P45614
6308F4575007o4541j905229l353028l508234l118015k770062k706481k180517
6300D4968900k011638j475655j173344r47770p71320m85030k06230l36071J57615
6291C7719457O58724P28089J045946J784374K247595K681802L468540L324333
$$ y = [58322540, 56624562, 55101882, 53916441, 53171945, 52631749, 51852927, 51065510, 50323001, 49329610, 48242213, 47683431, 47268562, 46822502, 46925104, 46955883, 47891911, 49209300, 51372155, 54384271, 57666007, 61014586, 63231444, 63613096, 62437391, 59840436, 57054238, 55016110, 52932341, 51163370, 49617078, 48475798, 47675730, 47371504, 47421562, 48255308, 49661345, 51965199, 54985560, 58237128, 60862954, 62489324, 63829393, 64575007, 64510466, 62605237, 59252209, 55743975, 52625960, 49855898, 47149417, 44968900, 42957262, 41481607, 40308263, 39360493, 38589173, 38104143, 37897913, 37561842, 37719457, 38378181, 39106270, 40152216, 41936590, 44184185, 46865987, 50334527, 53658860]
6283E3658860K703723J327207N12747K55389n39624j776131k405822k772919k414684
6274D8548746k146112k078825j390762q45785p24916m74019L21938N41801J427204
6265D3179270K357099K490704K577871K108722O50766p68047j819324k797041
6257D7980020k628653k402231k039445j954547j905418j405632r93740p57273
6249C3893081m08471l60087o88642r12989r73098r70330o78758k81672k96814
6240B8322220k06911l87088p66857n70194q52405o35896o87433m40933n15095
6231B3259408k00507k57854n71537l12719n31405n81677r97360j012416o06238
6222A8187695p74270n54685l23698m35095o62544k80794l29685j24427j87155
$$ y = [53658860, 56362583, 57689790, 58202537, 58457926, 57918302, 56142171, 53736349, 50963430, 48548746, 46402634, 44323809, 42933047, 42087262, 41362346, 40888327, 41210265, 41752066, 43179270, 45536369, 48027073, 50604944, 52713666, 53364432, 52596385, 50777061, 47980020, 45351367, 42949136, 40909691, 38955144, 37049726, 35644094, 34650354, 33893081, 33484610, 33124523, 32435881, 31522892, 30549794, 29579464, 28900706, 28619034, 28322220, 28115309, 27728221, 26961364, 26391170, 25538765, 24902869, 24215436, 23774503, 23259408, 23058901, 22801047, 22229510, 21916791, 21385386, 20803709, 19806349, 18793933, 18187695, 17413425, 16858740, 16535042, 16099947, 15437403, 15156609, 14826924, 14702497, 14515342]
6213A4515342l03859P6856N2999r5434O460j82148k46134j55628Q6844P1039M0355
6202A3866692J5956K24354r6320o1363L45975L17374M23105M10585M32023O34401
6192A6512782M25714M75397M71387L13346N65349J25435j69996j7845L9839M6702
6182A8788110k83835J3468J75544j08296r6504j90511P4741J3538J2272j41694
6172A8256833J05644n9768k12119o5631J70009k31249J09143j03458j32789j54000
6162A7682615L42475J19328k5458j65718m19265l8368l63359K0266K97832K20742
6152A7671090J14920K18907j0418N7332K35265k35831l88079m24950m38126n00490
6142A6299620p73128o25859p81143q53972o30836m30854m57956m97779k66415
$$ y = [14515342, 14211483, 14288339, 14341338, 14245904, 14252364, 14070216, 13824082, 13668454, 13755298, 13826337, 13866692, 13882648, 14107002, 14010682, 13949319, 14295294, 14612668, 15035773, 15446358, 15878381, 16512782, 16938496, 17413893, 17885280, 18198626, 18763975, 18889410, 18719414, 18701569, 18741408, 18788110, 18504275, 18517743, 18693287, 18584991, 18488487, 18297976, 18372717, 18386255, 18398527, 18256833, 18362477, 18302709, 18090590, 18024959, 18194968, 17963719, 18072862, 17969404, 17836615, 17682615, 18025090, 18144418, 18118960, 17953242, 17533977, 17495609, 17132250, 17152516, 17450348, 17671090, 17786010, 18004917, 17994499, 18051831, 18287096, 18051265, 17663186, 17238236, 16800110, 16299620, 15526492, 14900633, 14119490, 13265518, 12634682, 12203828, 11745872, 11248093, 10981678]
6133A0981678o08416k88855k64682p1850l96880m51685M992j84840l68363l38292
6123H012807k99878n0602n4762J01104j92305l07335J8061j83809k08053R2710
6113F927938J01656n3028l49315o2019j39318k0733k4957N9140k9954k25290p750
6102F176370J58311l0217K5809pJ57126J82233m9414j51804j70499K2105M5929
6091F365942l3652k29021j19932M31379K87237j44377J2999j47769M3554j1545
6081F454815L5533O5544K5901O6358n6839j36004q9803L621j02912N2275K04975
6070F523464q8596M2309J08349n0885O1444K16889R238K3154n4544L53040n2976
6059G090886p475P7584P2866k23990J45727k30064J02239L37788J14992J73775
$$ y = [10981678, 10373262, 10084407, 9819725, 9747875, 9350995, 8899310, 8904302, 8719462, 8351099, 8012807, 7712929, 7662327, 7607565, 7708669, 7516364, 7209029, 7227090, 7043281, 6835228, 6927938, 7029594, 6976566, 6627251, 6565232, 6425914, 6405181, 6380224, 6439364, 6409410, 6184120, 6176370, 6334681, 6304464, 6330273, 6330266, 6487392, 6669625, 6620211, 6468407, 6297908, 6320013, 6365942, 6332290, 6103269, 5983337, 6414716, 6701953, 6557576, 6570575, 6422806, 6466360, 6454815, 6490348, 6555892, 6581793, 6648151, 6591312, 6455308, 6365505, 6369126, 6266214, 6318489, 6523464, 6434868, 6477177, 6585526, 6534641, 6596085, 6812974, 6822212, 6845366, 6790822, 7143862, 7090886, 7083411, 7160995, 7233861, 7009871, 7155598, 6925534, 7027773, 7365561, 7480553, 7654328]
6049G654328J20998K91733k27161j53040O9630j328K6853J09532o5793p3883k82063
6038G469806n0355K01708l1290j16998n0122O2596J22917J21271k332J0599J54485
6027G892285M3980p772j17385K06977M0277O6072L76313j13808j86795K3646N1392
6016H275182K27435J98599L30298n0521K95531N06781J86377L14697N3693j42468
6006A0195604j67589K3431j09978j36887j24568n0759N6099K00243j73861j64164
5996I547571O0188J89696j68799Q9568k5788p8284k956L44107J62854J70243N55236
5985A0843636N85525M33874J42037N05093M72088N65596M79117O25157N28988
5976A5181111O19773N01221L00543O88839O82403P63921N99934Q92126J195196
$$ y = [7654328, 7775326, 8067059, 7839898, 7686858, 7756488, 7755160, 7782013, 7891545, 7825752, 7751869, 7469806, 7419451, 7621159, 7589869, 7472871, 7422749, 7485345, 7608262, 7729533, 7727201, 7737800, 7892285, 7936265, 7928493, 7811108, 8018085, 8058362, 8124434, 8500747, 8386939, 8200144, 8223790, 8275182, 8502617, 8701216, 9031514, 8980993, 9276524, 9783305, 9969682, 10284379, 10338072, 10195604, 10028015, 10051446, 9941468, 9804581, 9680013, 9629254, 9685353, 9885596, 9711735, 9547571, 9607759, 9797455, 9628656, 9718224, 9692436, 9614152, 9611196, 9955303, 10118157, 10288400, 10843636, 11429161, 11863035, 12005072, 12510165, 12982253, 13547849, 14026966, 14652123, 15181111, 15800884, 16302105, 16602648, 17291487, 17973890, 18737811, 19337745, 20229871, 21425067]
5967B1425067J465244J847684K206483K325075K761681K616411J993249J167067
5959C7807961p2177q21728j667005j839380k149512j950577j961632j654818j518461
5950B4172671j523323j092050j154087p56465p46194p28138l50331o99025m17838
5941A6705220o03467n82693l54392l31019k30127o59110o32096l08240n30762
5932A2473314m23928m35796j12145j79332l84106j76177j52650l94404j79903
5923A0034873R965j14353J45547l89664j22203k23395l25205M4030l7987K35712
5913I257320q6149q4603L5692k81201j20826l9638r1032J70128j93225K44486
5903H810952L31004k16575k90022l91011K57507j54252l50635j02402J42042j0994
$$ y = [21425067, 22890311, 24737995, 26944478, 29269553, 32031234, 34647645, 36640894, 37807961, 37735784, 36914056, 35247051, 33407671, 31258159, 29307582, 27345950, 25691132, 24172671, 22649348, 21557298, 20403211, 19646746, 18900552, 18172414, 17822083, 17123058, 16705220, 16101753, 15519060, 15164668, 14833649, 14603522, 13944412, 13312316, 13004076, 12473314, 12049386, 11613590, 11501445, 11322113, 10938007, 10761830, 10609180, 10214776, 10034873, 10044838, 9930485, 10076032, 9686368, 9564165, 9340770, 9015565, 9059595, 9021608, 9257320, 9171171, 9086568, 9122260, 8841059, 8720233, 8680595, 8589563, 8759691, 8566466, 8810952, 9141956, 8925381, 8635359, 8244348, 8501855, 8347603, 7996968, 7894566, 8036608, 8025614]
5893H025614J05304j47341l34154l2662k78109N0873J70805J54161p6646J10074
5883G747919P5169q8011P4358L5293j06265j23621j68238q0388J76177R8341l46147
5872G294587j7677J30670J22563k63486j51980j89715j26815R9148l7172L6668
5862F896791J6293m0771r5420k3127J80020q5955K11725k9484j68980M2354K72140
5851G175586J06451L4849j85224j38990L2671k70480P3841M3069k4691j65258
5841F681824M2292j00980q5790P1079J67759N309J08714l5279J48886K09412R6388
5830G309614N3595j97515n358J93480j3690J22104J26801j08607O8973K96250
5820G845647P8802j00618J7141J23147P080J11448j70927L3811j02981j84873
$$ y = [8025614, 8130918, 7983577, 7649423, 7616761, 7338652, 7389525, 7560330, 7714491, 7637845, 7747919, 7823088, 7735077, 7809435, 7844728, 7738463, 7614842, 7446604, 7366216, 7542393, 7640734, 7294587, 7276910, 7407580, 7530143, 7266657, 7114677, 6924962, 6798147, 6897295, 6860123, 6896791, 6913084, 6872313, 6776893, 6753766, 6933786, 6847831, 7059556, 7030072, 6861092, 6903446, 7175586, 7282037, 7316886, 7131662, 6992672, 7025343, 6754863, 6828704, 6871773, 6847082, 6681824, 6724116, 6623136, 6537346, 6608425, 6776184, 6781493, 6890207, 6854928, 7003814, 7213226, 7309614, 7363209, 7165694, 7160336, 7353816, 7340126, 7462230, 7589031, 7480424, 7549397, 7845647, 7924449, 7823831, 7840972, 7964119, 7971199, 8082647, 7911720, 7945531, 7842550, 7657677]
5810G657677j41405N5860K23469j06481N4747r3756j38157m4080N4933N5808k63437
5799G315178k09318j68419k38910J72581J12113m2869M11081j43508j03452K06088
5789G310565J00320J4536J9769n3010M8261r0400p3990j9178J32057o200k20300
5778G162430L07552j70719J45936K44970k3368M6067l6788l2847J69005j03203
5768G709035k81968j20389j47444L16813j18504j25925O3537j55102J49759n1080
5758G238732q1635k74932J82158J1012p4264K20372o5833K7431J3899M9747r9339
5747G147348k54198M7022M7761N7939j01890q9794N8789Q4818l5340L8607J28344
5736G129406Q8688p320m2662O2721Q4338j00159p2455M25798J49887N0651p4903
$$ y = [7657677, 7516272, 7572132, 7795601, 7689120, 7743867, 7650111, 7511954, 7467874, 7522807, 7578615, 7315178, 7105860, 6937441, 6698531, 6871112, 6983225, 6940356, 7351437, 7207929, 7104477, 7310565, 7410885, 7425421, 7445190, 7392180, 7440441, 7350041, 7276051, 7256873, 7388930, 7382730, 7162430, 7469982, 7299263, 7445199, 7690169, 7666801, 7712868, 7676080, 7643233, 7812238, 7709035, 7427067, 7306678, 7159234, 7476047, 7357543, 7231618, 7295155, 7140053, 7289812, 7238732, 7157097, 6882165, 7064323, 7075335, 7001071, 7221443, 7155610, 7183041, 7196940, 7246687, 7147348, 6893150, 6940172, 6987933, 7045872, 6943982, 6854188, 6912977, 6997795, 6962455, 7001062, 7129406, 7218094, 7210774, 7168112, 7230833, 7315171, 7215012, 7142557, 7568355, 7718242, 7768893, 7693990]
5725G693990j80537N7782R4456m0397q4402Q6712L18627L136J38934J5384J54845
5714H258530R686Q7679L2729k4137K68452L13089j20559M0415O8176J76678L0368
5703I141106r0801L086K3087Q7973j8282K01095J08288J33107P9892j127M2850
5692I710274L11822Q0907J79334J76771n4049J05497M09616L40900M88043M3426
5682A1792541O8585l19088k34933P0343R4728K08083k01415J57240J60803K74860
5672A2071747j09238k50503K48929J30857m584j45906J62778J99658M730j24013
5662A2184455p5726K19631M59535L7537O5338L39637N3612K34785K56531M81163
5652A4256498K71664J13629o1950j92873J20131j76423O8763l86606o1555K78511
$$ y = [7693990, 7513453, 7571235, 7665691, 7625294, 7540892, 7627604, 7946231, 7949367, 8088301, 8103685, 8258530, 8268216, 8355895, 8388624, 8364487, 8632939, 8946028, 8825469, 8865884, 8934060, 9110738, 9141106, 9050305, 9053391, 9076478, 9164451, 9146169, 9347264, 9455552, 9588659, 9668551, 9667424, 9710274, 10022096, 10103003, 10282337, 10459108, 10405059, 10510556, 10920172, 11261072, 11749115, 11792541, 11861126, 11542038, 11307105, 11377448, 11472176, 11680259, 11478844, 11636084, 11796887, 12071747, 11962509, 11712006, 11960935, 12091792, 12087208, 11941302, 12104080, 12303738, 12308468, 12184455, 12108729, 12328360, 12787895, 12825432, 12890770, 13230407, 13284019, 13518804, 13775335, 14256498, 14528162, 14641791, 14579841, 14386968, 14507099, 14330676, 14399439, 14012833, 13951278, 14229789]
5642A4229789J10144J28626K61785n3476L457O2131K36238K78241M900L93343
5632A5655178L21176J77127J69199L46096L51869K47885M00145L41972M87888
5623A8498535K27111O69963O46055M41509N20455N31423N12890M31142P01404
5614B3180487N46036N62288N46437N24166P65116R92323Q75051O98463J112835
5605B9803202J095613J142348J448099J037768J209230J882889J984979K013659
5597D1617787K081485K219128K394040K822900L537576L511196M098944M661849
5589F6944905M808267N223049M631298L474659L382168K693256J901188P03140
5581I3761930p17516j896899k891212k819831l288479l313979l563994l968773
$$ y = [14229789, 14339933, 14468559, 14730344, 14676868, 14680325, 14742456, 14978694, 15256935, 15261835, 15655178, 15976354, 16153481, 16322680, 16668776, 17020645, 17268530, 17668675, 18010647, 18498535, 18725646, 19395609, 20041664, 20483173, 21003628, 21535051, 22047941, 22479083, 23180487, 23726523, 24288811, 24835248, 25359414, 26124530, 27116853, 27991904, 28690367, 29803202, 30898815, 32041163, 33489262, 34527030, 35736260, 37619149, 39604128, 41617787, 43699272, 45918400, 48312440, 51135340, 54672916, 58184112, 62283056, 66944905, 71753172, 76976221, 81607519, 85082178, 88464346, 91157602, 93058790, 93761930, 93044414, 91147515, 88256303, 85436472, 82147993, 78834014, 75270020, 71301247]
5573G1301247m002865l987405l766631l947932l228158k763179k118780k311630
5565D5174667k079803j974023j677472j521208j073025p96869j098394j038625
5557C3915248o21729n01087p44856m23231m78662o66623j62899n14786k84990
5548B9516385k05462n94710n78693m52018n01976m96495l89221q4177l39194p34344
5538B5140095l95041n07909m61461n06441k44560j64226l66387l41365n31879
5529B1620826q52036m76803l14408l23670o98957p6733m09440m85357l61776n35781
5519A7085865o69646l06798k10458o39490n28547n17547l35210j11943m6156n24642
5509A3195428l11366p6268k34738k88157j81468r0294j23669n7830r7875N1037
$$ y = [71301247, 67298382, 63310977, 59544346, 55596414, 52368256, 49605077, 47486297, 45174667, 43094864, 41120841, 39443369, 37922161, 36849136, 36052267, 34953873, 33915248, 33293519, 32792432, 32047576, 31624345, 31145683, 30479060, 30316161, 29801375, 29516385, 29310923, 28716213, 28137520, 27685502, 27183526, 26687031, 26297810, 26213633, 25874439, 25140095, 24745054, 24237145, 23775684, 23269243, 23024683, 22860457, 22494070, 22152705, 21620826, 20768790, 20291987, 19977579, 19653909, 18954952, 18878219, 18468779, 17983422, 17621646, 17085865, 16416219, 16109421, 15898963, 15259473, 14730926, 14213379, 13878169, 13766226, 13720070, 13195428, 12884062, 12807794, 12573056, 12284899, 12103431, 12013137, 11889468, 11831638, 11733763, 11784800]
5499A1784800J9656R7455m0958j81717j33730K05030K2250m60109j45414n269
5489A1161994O0465j33266J09508k32151q1229J37119k03379k1992K44190l20220
5479A0721039j19011k91806j52907n3518j69882P2345k20406r58j11189j004j77856
5468I494847j89213J06255J03867j63070K38401K3827j15583J25778j33809j48643
5458I342657K9121j64540K63891o6148k02536K11910j35467j00380R271P030J93512
5447I388321J75405K03417L02111k50063n904K68199K46797K99615L16760K19287
5437A1163945L80772p9786k49361j51190l3260r701j201J59232j20924j30144
5427A0928382J9766J43647n0086k0204J42789n462j44619J6549M42776q9342K38418
$$ y = [11784800, 11804456, 11901911, 11860953, 11679236, 11545506, 11750536, 11772786, 11312677, 11167263, 11161994, 11222459, 11089193, 11198701, 10966550, 10885321, 11022440, 10819061, 10797069, 11041259, 10721039, 10602028, 10310222, 10157315, 10103797, 9933915, 10006260, 9785854, 9784896, 9673707, 9672703, 9494847, 9305634, 9411889, 9515756, 9352686, 9591087, 9614914, 9499331, 9625109, 9491300, 9342657, 9371778, 9207238, 9471129, 9404981, 9202445, 9414355, 9278888, 9178508, 9187779, 9194809, 9388321, 9563726, 9767143, 10069254, 9819191, 9813287, 10081486, 10328283, 10627898, 10944658, 11163945, 11544717, 11464931, 11215570, 11064380, 11031120, 11021419, 11020218, 11179450, 11058526, 10928382, 10948148, 11091795, 11041709, 11021505, 11164294, 11158832, 11014213, 11030762, 11473538, 11384196, 11622614]
5416A1622614K99935L22675J05019O3846P07975K00587K77176Q6646L53541N53540
5406A4593554N38155J37279M60516O0948j10925j6128k60442k34357k80445l02107
5396A4586048j87923j18536K77454o3711l44757j57742p1364J87300r7883o8639
5386A3940247j07476R685l83096j87768J64479l56124l67801R6301K054P6633
5376A2887134k14273j73229K15410k42258l0931l10430L8269j81410j09570j48131
5366A1730581r9754j43368k60019J77511L5623j60415q4925k78790k37694J85739
5356A0864489J36379k76747j62933J00489k19172M3339J11523O7369l66696K3420
5346A0321460J31563K7090k8661m2884K0603j74939j91974J5107N4721M1869J36281
$$ y = [11622614, 11922549, 12245224, 12350243, 12414089, 13122064, 13322651, 13599827, 13686473, 14040014, 14593554, 15131709, 15268988, 15729504, 15790452, 15679527, 15663399, 15402957, 15168600, 14888155, 14586048, 14398125, 14279589, 14557043, 14493332, 14148575, 13990833, 13919469, 14106769, 14008886, 13940247, 13832771, 13842456, 13459360, 13271592, 13436071, 13079947, 12712146, 12808447, 12810501, 12887134, 12672861, 12499632, 12715042, 12472784, 12441853, 12131423, 12169692, 11988282, 11878712, 11730581, 11630827, 11487459, 11227440, 11404951, 11440574, 11280159, 11195234, 10916444, 10678750, 10864489, 11000868, 10724121, 10561188, 10661677, 10442505, 10485844, 10597367, 10664736, 10298040, 10321460, 10453023, 10480113, 10451452, 10408568, 10429171, 10254232, 10062258, 10077365, 10132086, 10173955, 10310236]
5335A0310236P5055K31391k18478o7051j59062J48999L00258k08894j93738P9249
5325A0297965K58685Q0885R8115k84285k12865K83735K84099l13328j17036P8784
5315A0454754L81334K39979j84667K10749j60785k89108P7748J89342K08668Q0761
5305A1208775N2915p7597m9938q3121L959J19929K099J0359J83701N0111P2484
5294A1493676M2874L52601O5232j04952P2804Q5692J09487R6768L44186M010j46175
5283A2416203J64280L033m0702M4334O2501K83615K4471K1071J96272O0113Q1949
5272A3317140K90212L71756j28534L12461n5289j00058J92772J55924k7973R7208
5262A4425619q09L76641M88312J95022M3427K5946N24869L15189J34948O08444
$$ y = [10310236, 10385291, 10616682, 10398204, 10331153, 10172091, 10321090, 10621348, 10412454, 10218716, 10297965, 10556650, 10637535, 10735650, 10451365, 10238500, 10522235, 10806334, 10493006, 10375970, 10454754, 10836088, 11076067, 10891400, 11102149, 10941364, 10652256, 10730004, 10919346, 11128014, 11208775, 11261690, 11184093, 11134155, 11051034, 11054993, 11174922, 11177021, 11187380, 11371081, 11421192, 11493676, 11536550, 11889151, 11954383, 11849431, 11922235, 12007927, 12117414, 12214182, 12558368, 12562378, 12416203, 12580483, 12583516, 12542814, 12587148, 12649649, 12933264, 12957735, 12978806, 13175078, 13235191, 13317140, 13607352, 13979108, 13850574, 14163035, 14107746, 14007688, 14200460, 14356384, 14328411, 14425619, 14424810, 14801451, 15289763, 15484785, 15528212, 15554158, 16079027, 16394216, 16529164, 17137608]
5252A7137608N31161m1568r0650J31475M8010J62036J43295M8409j95702j04069
5242A7770005j54168k88253r2230Q6313k01244K6109J80984K15465J45076R7872
5232A7785929J14157J96322n3014K9328J2546J76918j435K42632M71292j20272
5222A8854403k24425J42817M75593M76476J32521R5812M70426O64697N74154L91045
5212B2053519M92431O79451Q59492N72867R51532Q81689O49373N56797O87493
5203B8384644K26865K88772P8188K03802J01329L11586N69167Q84950P82902J219166
5193C3051371J088843M20141J05889L35605n6557l92097o7021l74627l39244n49052
5183C3223251o37937k30402j19419J68892M02856L61135k11829K67308M54976
$$ y = [17137608, 17668769, 17627201, 17536551, 17668026, 17716036, 17878072, 18021367, 18069776, 17874074, 17770005, 17615837, 17327584, 17235354, 17321667, 17120423, 17146532, 17327516, 17542981, 17688057, 17785929, 17900086, 18096408, 18043394, 18072722, 18085268, 18262186, 18260751, 18503383, 18974675, 18854403, 18629978, 18772795, 19248388, 19724864, 19857385, 19953197, 20423623, 21088320, 21662474, 22053519, 22545950, 23225401, 24084893, 24657760, 25609292, 26490981, 27140354, 27697151, 28384644, 28611509, 28900281, 28978469, 29182271, 29283600, 29595186, 30164353, 31049303, 31832205, 33051371, 34140214, 34560355, 34666244, 35001849, 34945292, 34553195, 34486174, 34111547, 33772303, 33223251, 32585314, 32354912, 32235493, 32404385, 32807241, 33168376, 32956547, 33223855, 33678831]
5174C3678831M73248Q11579J047151R17780J350777J214960J746661J518569J270869
5165D4030425J091690J349872R01067R73458J010286J306954J444757J933559
5157E4042068K123105K318538J932414K163629J734663J292507M69518L98147
5149F6474589k3126n9973r3229L41192Q0771N02524P60699J414575J852270K414730
5139G3665022K846639L559950L702788N327936O136754O913717P806604J0313091
5131A20272501J3042091J4557822J3904470J8599658K5160611L3808342M5677078
5124B85022573O9236155N3340521k6614098m7582901l5027692k8411623k4508646
5117B45454289k0894451j7158993j5581731j2943872j2102105j2819250j0558790
$$ y = [33678831, 34152079, 34963658, 36010809, 36928589, 38279366, 39494326, 41240987, 42759556, 44030425, 45122115, 46471987, 47373054, 48346512, 49356798, 50663752, 52108509, 54042068, 56165173, 58483711, 60416125, 62579754, 64314417, 65606924, 66076442, 66474589, 66451463, 66391490, 66298261, 66639453, 66720224, 67222748, 67983447, 69398022, 71250292, 73665022, 76511661, 80071611, 83774399, 89102335, 95239089, 102152806, 109959410, 120272501, 133314592, 147872414, 161776884, 180376542, 205537153, 239345495, 285022573, 354258728, 407599249, 380985151, 333402250, 298374558, 269962935, 245454289, 224559838, 207400845, 191819114, 178875242, 166773137, 153953887, 143395097]
5110A43395097q625849q199577p638406o538879n684640n470565m981960m807802
5102I1447419m397323l663634k829086k718944k645154k133368k007699j830707
5094F9221504k304415k111902j465454j528358j606132j730190j228998j041604
5086E6204451r11937q25646p97988j166312j026377j138502p66676r86050r64577
5077D7620386p69631n50852p45075k69216p03888k44794k27232k25982l03604
5068D3580112J34580n43461l97458m52868o81363n81717p59981j238693m87360
5059C8571791p16839q18578p39026m24238m00890l96539l47936k54267m13547
5050C4059931j76802m67611q5005n93077m87064k64043k17575j77032k49847j42547
$$ y = [143395097, 134769248, 126569671, 118931265, 112392386, 106707746, 101237181, 96255221, 91447419, 87050096, 83386462, 80557376, 77838432, 75193278, 73059910, 71052211, 69221504, 66917089, 64805187, 63339733, 61811375, 60205243, 58475053, 57246055, 56204451, 55292514, 54466868, 53668880, 52502568, 51476191, 50337689, 49571013, 48584963, 47620386, 46850755, 46299903, 45554828, 45285612, 44581724, 44336930, 44109698, 43883716, 43580112, 43714692, 43171231, 42773773, 42320905, 41639542, 41057825, 40297844, 39059151, 38571791, 37854952, 37036374, 36297348, 35873110, 35472220, 35075681, 34727745, 34473478, 34059931, 33883129, 33415518, 33330513, 32737436, 32250372, 31986329, 31768754, 31591722, 31341875, 31199328]
5040C1199328j40189j91009j17596j69613r7996q7294k78250K2646m8807L2963
5030C0124183M5209L6249J00829J9897j0513J93410L29905M9214k1270l98157
5020C0468956l49041J68805L12234m9644k77956M37621L84930N4487k92050K25811
5010C1084153N83361L23736N24581R02166P09156K85372J54747m7778K68516L56058
5000C5144068L45506M71448K41263J27067J44104K08382K80062K43865M58148
4991C7663913K79615O44906J6697m76072q5806p1516Q0087L94312J13546J33796
4981C8693478L18070L62899K86648J25409L32748N4826O9672L49480N25280K78371
4971D1396881K23407K95565N83747O08724N97600P31697O60713R24884J088919
$$ y = [31199328, 31059139, 30868130, 30750534, 30580921, 30482925, 30395631, 30117381, 30140027, 30091220, 30124183, 30169392, 30205641, 30306470, 30326367, 30315854, 30509264, 30839169, 30888383, 30867113, 30468956, 30119915, 30288720, 30600954, 30551310, 30273354, 30710975, 31095905, 31150392, 30858342, 31084153, 31667514, 31991250, 32515831, 33417997, 34127153, 34412525, 34567272, 34519494, 34788010, 35144068, 35489574, 35961022, 36202285, 36329352, 36473456, 36681838, 36961900, 37205765, 37663913, 37943528, 38588434, 38605131, 38129059, 38043253, 37971737, 38051824, 38446136, 38559682, 38693478, 39011548, 39374447, 39661095, 39786504, 40119252, 40174078, 40243750, 40593230, 41118510, 41396881, 41620288, 41915853, 42499600, 43108324, 43705924, 44437621, 45098334, 46023218, 47112137]
4962D7112137R93292J085258J450949J603185J274968J134029O78953L79404m7279
4953E5664896m5696j81994R6240M21003L53581P58730R54159P90908J043152J463536
4943F1318515J641894J952193J656882K124802K026412J896342J916912J683406
4935G6217358J877712J679404J683007J510966J977006K344360K579971K573971
4927I2443755K806720L162970L663063M148074M589638N107541N547522N703218
4919A27172501O064380O401512O779138P158223P540585O992846O071153M187554
4911A78367892K689239Q54061p66622j990468l213667l128249l011619k675902
4903A67124665j735171j826023k454262l286388l767720m438770l994876m268109
$$ y = [47112137, 48105429, 49190687, 50641636, 52244821, 53519789, 54653818, 55332771, 55712175, 55664896, 55619200, 55437206, 55533446, 55954449, 56308030, 57066760, 58020919, 58811827, 59854979, 61318515, 62960409, 64912602, 66569484, 68694286, 70720698, 72617040, 74533952, 76217358, 78095070, 79774474, 81457481, 82968447, 84945453, 87289813, 89869784, 92443755, 95250475, 98413445, 102076508, 106224582, 110814220, 115921761, 121469283, 127172501, 133236881, 139638393, 146417531, 153575754, 161116339, 168109185, 174180338, 178367892, 181057131, 181911192, 181144570, 179154102, 175940435, 172812186, 169800567, 167124665, 165389494, 163563471, 161109209, 157822821, 154055101, 149616331, 145621455, 141353346]
4895A41353346m050725l853962m116585l948083m729788m574749m481542m198331
4887A07399581m021846l987882l799974l393525k902873k460463k607620k125273
4879H2100125j870402j896797k091425j998993j873955j577458j718910j632736
4871F7439449j259747j226302j108639q80402n52316o92134n63902n07151k78607
4862F0370249L71182P14426P92740R59405J378157J731540K136568K289068K341532
4853G3084867K179904J913896J845318R27417N84514l05823j279200j798855j989654
4844G5162384k123371k495072k493946k230185j955106j792502j466106j134913
4836E9471183j010848o73653p80380p72835p57686p44645l50606m56834J62690
$$ y = [141353346, 137302621, 133448659, 129332074, 125383991, 120654203, 116079454, 111597912, 107399581, 103377735, 99389853, 95589879, 92196354, 89293481, 86833018, 84225398, 82100125, 80229723, 78332926, 76241501, 74242508, 72368553, 70791095, 69072185, 67439449, 66179702, 64953400, 63844761, 62964359, 62412043, 61719909, 61156007, 60648856, 60370249, 60741431, 61455857, 62248597, 63208002, 64586159, 66317699, 68454267, 70743335, 73084867, 75264771, 77178667, 79023985, 79951402, 80535916, 80230093, 78950893, 77152038, 75162384, 73039013, 70543941, 68049995, 65819810, 63864704, 62072202, 60606096, 59471183, 58460335, 57786682, 57006302, 56233467, 55475781, 54731136, 54380530, 53923696, 54086386]
4827E4086386K64667L89999M15099o09459j447863j519559j363042j311642j301868
4818D7602718r88572j091983p17801j031371p33848l17893l02797o53207l41895
4809D1423351j28160k41298J01812N60398L21515l93425m32138k55517l68821
4800D0587717k74396P0789L06140J67841M9407L7368J85767L38938N1422k3553
4790D1497440K16163K75655K27466M50951Q74830N64391Q38314J014480q8831
4781D5870859k26868j83634m24675k53389j75425l46817k17983k8081l39199J37034
4771D3811822j21010J7912j00260N0442K73538P2688R9060K68947J44758L75043
4761D4892940K26052n1918K22089K09359M82539l3397l5877K27061O5541P0992
$$ y = [54086386, 54351053, 54741052, 55156151, 54546692, 53098829, 51579270, 50216228, 48904586, 47602718, 46614146, 45522163, 44804362, 43772991, 43039143, 42721250, 42418453, 41765246, 41423351, 41295191, 41053893, 41155705, 41716103, 42037618, 41644193, 41212055, 40956538, 40587717, 40313321, 40384110, 40690250, 40858091, 40907498, 40944866, 41130633, 41469571, 41520993, 41497440, 41713603, 41989258, 42216724, 42667675, 43542505, 44106896, 44945210, 45959690, 45870859, 45643991, 45460357, 45035682, 44782293, 44606868, 44260051, 44042068, 44013987, 43674788, 43811822, 43690812, 43708724, 43608464, 43658906, 43932444, 44005132, 44104192, 44373139, 44517897, 44892940, 45118992, 45067074, 45289163, 45498522, 45981061, 45947664, 45911787, 46138848, 46204389, 46275381]
4751D6275381M14421j4197N6120m89833J29597K33149K41403N82983J49992M10873
4741D7989889J76912j48068m8010K5264L6903J43919M15810K66515M81723L33524
4731D9674381Q61749Q50387P76476Q00140J189196J305353J576306J792841K008002
4722F0834831K408908K830110L060028M114558M888836O761274Q501938J1875616
4714A05276099J4038787J9139116K5701600L4256155J5753814j7081258k0383029
4707A76701284j6093040j3340221j1467220r441206q475274p751814p112837n381240
4699I7638432l590480k242146k266478k131078k516121j967567j910070j504545
4691G9509947j363847j641833r99510p89777n51596l02568n56648m72376o57894
$$ y = [46275381, 46689802, 46675605, 46731725, 46241892, 46371489, 46604638, 46846041, 47429024, 47579016, 47989889, 48166801, 48018733, 47970723, 47995987, 48032890, 48176809, 48592619, 48859134, 49340857, 49674381, 50536130, 51386517, 52162993, 52963133, 54152329, 55457682, 57033988, 58826829, 60834831, 63243739, 66073849, 69133877, 73248435, 78137271, 84898545, 93400483, 105276099, 119314886, 138454002, 164155602, 198411757, 214165571, 197084313, 176701284, 160608244, 147268023, 135800803, 126359597, 117884323, 110132509, 103019672, 97638432, 94047952, 91805806, 89539328, 87408250, 84892129, 82924562, 81014492, 79509947, 78146100, 76504267, 75504757, 74714980, 74163384, 73860816, 73304168, 72831792, 72173898]
4682G2173898m93251J59754M97531l09159m93086j67148j99119M97916R80236
4673G2647572J122324R98636J227185J241870Q91104R19707J293901J592476J857857
4664H3792632K682599L350017M028973N238144O321395N582663L855705J578947
4656A16431075o81064k032500k144212j645851q55031j60073J73295J354832K121428
4647A12561899K946557M037482N165478O577288Q139055R931172J1780204J2845678
4639A73984813J4143263J6647080K0073129J9559619R703837n052316j2648583
4632B36410842j3637087j2143973j0515506r169402p585569n525692l735793j566924
4624A72530896L35480J152141r93996m357708n628600n209363l764004k631607
$$ y = [72173898, 71680647, 71840401, 72337932, 72028773, 71535687, 71368539, 71169420, 71667336, 72647572, 73769896, 74768532, 75995717, 77237587, 78128691, 79048398, 80342299, 81934775, 83792632, 86475231, 89825248, 93854221, 99092365, 105413760, 110996423, 114852128, 116431075, 115750011, 113717511, 111573299, 109927448, 109072417, 108912344, 109085639, 110440471, 112561899, 115508456, 119545938, 124711416, 131288704, 139427759, 149358931, 161139135, 173984813, 188128076, 204775156, 224848285, 244407904, 254111741, 249059425, 236410842, 222773755, 210629782, 200114276, 190944874, 183359305, 177833613, 174097820, 172530896, 172866376, 174018517, 173024521, 168666813, 163038213, 157828850, 154064846, 151433239]
4616A51433239k448655l396681m473546n823128o786977o478417n851484m937001
4608A11237350m603909l926828l488217l284150k556454k552419k663426k660052
4600H5501895k907033k738286k775320k740504k454422k297674k141477j669454
4592F5777725j776241j542680j289098j059966q55726o16642q24206j90873J2814
4583E7635107r4277L94855M68276L05238l81931k36825m64574n88829l57395j78355
4573E6501290j10294J81439J62494K68824R58227Q90779Q51938J109588J124527
4564F1938812J694862J901480K390308J114471m63311j248820k119907k058971
4556F3148924k305813j716269j596724j625151j065019j106274p07024o67083
$$ y = [151433239, 148984584, 145587903, 141114357, 135291229, 128504252, 122025835, 116174351, 111237350, 106633441, 102706613, 99218396, 95934246, 93377792, 90825373, 88161947, 85501895, 82594862, 79856576, 77081256, 74340752, 71886330, 69588656, 67447179, 65777725, 64001484, 62458804, 61169706, 60109740, 59254014, 58637372, 57813166, 57622293, 57635107, 57540830, 57935685, 58403961, 58709199, 58327268, 58090443, 57625869, 57037040, 56679645, 56501290, 56390996, 56572435, 56734929, 57003753, 57961980, 58852759, 59704697, 60814285, 61938812, 63633674, 65535154, 67925462, 69039933, 68576622, 67327802, 65207895, 63148924, 60843111, 59126842, 57530118, 55904967, 54839948, 53733674, 53026650, 52359567]
4548E2359567l21818j74235M0972j36369J32173L82650O19150O15407R65230R53619
4538E5436346J540410J433637J998377K307373K465341K774953L107237K401982
4530G3465656K156148K597531K691708K375203K190213J737684J788097K388779
4522I1391019L106215L823657L800091M176197M810591N409518M836075K877337
4514A24230700J41734j290143j855466r52598n49774L58994J532307K800163L729020
4505A28144937N334318P338105R435130J1581300J4316132J6865126J9318919
4498B12333967K2679948K7633194L0639765J6729180j1470369k6022274k5896093
4491B46627318k2720296j9955058j7806451j5954663j4488046j3070583j1023772
$$ y = [52359567, 52037749, 51863514, 51904486, 51768117, 51900290, 52282940, 52902090, 53517497, 54482727, 55436346, 56976756, 58410393, 60408770, 62716143, 65181484, 67956437, 71063674, 73465656, 75621804, 78219335, 80911043, 83286246, 85476459, 87214143, 89002240, 91391019, 94497234, 98320891, 102120982, 106297179, 111107770, 116517288, 121353363, 124230700, 124372434, 123082291, 121226825, 120274227, 119724453, 120083447, 121615754, 124415917, 128144937, 133479255, 140817360, 150252490, 161833790, 176149922, 193015048, 212333967, 235013915, 262647109, 293286874, 310016054, 298545685, 272523411, 246627318, 223907022, 203951964, 186145513, 170190850, 155702804, 142632221, 131608449]
4484A31608449q980594p736790o983149o498750n726859n398477m464152m198820
4476H1620858l723107l788278l508717l042044k679980k098589k166975j971579
4468E8641589j750149j331051j546102j227035q16411n97424l91930N02283P37811
4459E2221581J000171J318552J011649O25208m05473j219240j868746j806762
4451E0876940j818190j535980j268627j083201r54473n08386M7528N55314J014321
4442D5325246J363034O02681j77794j273185j602661j575335j522936j270366
4434C9868684j339381r81213j082764j328402r46422p32638o45047l75532m87481
4425C1949804m74858m79209m27011k1044k18387J70320L75856L62201N40527R15689
$$ y = [131608449, 122627855, 114891065, 107907916, 101409166, 95682307, 90283830, 85819678, 81620858, 77897751, 74109473, 70600756, 67558712, 64878732, 62780143, 60613168, 58641589, 56891440, 55560389, 54014287, 52787252, 51970841, 51373417, 50981487, 51483770, 52221581, 53221752, 54540304, 55551953, 56177161, 55771688, 54552448, 52683702, 50876940, 49058750, 47522770, 46254143, 45170942, 44216469, 43708083, 43755611, 44310925, 45325246, 46688280, 47290961, 47113167, 45839982, 44237321, 42661986, 41139050, 39868684, 38529303, 37548090, 36465326, 35136924, 34190502, 33457864, 32812817, 32437285, 31949804, 31474946, 30995737, 30568726, 30547682, 30329295, 30499615, 30875471, 31237672, 31778199, 32693888]
4415C2693888J30963l66090o07204o34018p84111r40474o67199l57796n41863
4406B7926096j70922j8756K46493M97440L30387L33393K71107p5214o80015n84063
4396B8075946j014120p67821o73164n88907o06766n01947n78721l95504k58746
4387B2690250j61529k09555j17018l40505k86894k89463j5746O5474j72674m23387
4377B0738953l69761Q0360L2900J5256l6259j03662j18645j02871J36931J7839
4367B0291041j40739r1225j48995R9438k9680K2381J0476n77652l08631k90427
4357A8835987j63875n45405k91180m87741q2784J29817K5631k92538k47774j03766
4347A6776372l26059m57427l24258J29021j08884j06472m03276o42716j11696
$$ y = [32693888, 32824851, 32458761, 31851557, 31217539, 30433428, 29492954, 28825755, 28467959, 27926096, 27755174, 27736418, 27982911, 28480351, 28810738, 29144131, 29415238, 29340024, 28660009, 28075946, 27061826, 26294005, 25620841, 25031934, 24425168, 23923221, 23344500, 22948996, 22690250, 22528721, 22319166, 22202148, 21861643, 21574749, 21285286, 21269540, 21335014, 21162340, 20738953, 20369192, 20449552, 20482452, 20497708, 20461449, 20357787, 20239142, 20136271, 20273202, 20291041, 20150302, 20059077, 19910082, 20009520, 19979840, 20002221, 20012697, 19435045, 19126414, 18835987, 18672112, 18126707, 17835527, 17347786, 17265002, 17394819, 17420450, 17127912, 16880138, 16776372, 16450313, 15992886, 15668628, 15797649, 15688765, 15582293, 15179017, 14536301, 14424605]
4338A4424605j54773O3543P4439k42255o1130J31658L228k70451P5766r9275k69072
4327A3676283m51931N0913j05363k37927k42861j29708n5347k24033L68251J52620
4317A2800897k55165l25587j87744J6757J16939j27084m51989q8992j88190J72151
4307A1481993J3083K4593n40669N169K04997k80004l2927J81732j0590J00847
4297A1148224O6788j66489j22352k37563l8352J52884P5345J00945j16576l9636
4287A0823218O22668q6205J9609j78236o3531J16008l1877j1085j34091J55362
4277A1231840k30438j79004K2125p3857n0013J91056M1620n0891m6825K15624
4267A1071237J36025R7341m2443L57119M1202L34508r5296j70555L47994k29907
$$ y = [14424605, 14269832, 14333375, 14407814, 14165559, 14104429, 14236087, 14239315, 13968864, 14044630, 13945355, 13676283, 13224352, 13275265, 13169902, 12931975, 12689114, 12559406, 12504059, 12280026, 12648277, 12800897, 12545732, 12220145, 12032401, 12049158, 12166097, 12039013, 11587024, 11498032, 11309842, 11481993, 11495076, 11519669, 10979000, 10984169, 11189166, 10909162, 10876235, 11057967, 11047377, 11148224, 11215012, 11048523, 10926171, 10688608, 10650256, 10803140, 10878485, 10979430, 10862854, 10823218, 11445886, 11359681, 11379290, 11201054, 11137523, 11253531, 11221654, 11210569, 11076478, 11231840, 11001402, 10822398, 10844523, 10770666, 10720653, 10911709, 10953329, 10902438, 10855613, 11071237, 11207262, 11304603, 11262160, 11619279, 11660481, 11994989, 11899693, 11729138, 12077132, 11847225]
4257A1847225l95702j78717J9515k3832j86681m06744j59498m220N9184P7125
4247A0647655k45348j49610Q6044J28729K1502j55614j13069k2880L6383o1931
4237A0171861K25369n7741O7836j4102N3832J74025Q9503K04459J23986j06258
4227A0932770L17857K76474N06700K48455M74146M40944M38081J08267j66568
4218A3577126L16080L62220j61074m47274j81563n54272j35205R0223j29479k72339
4208A2464443j87488j62298O1785m43969p4371N6903j0809J56719q8991J33662
4198A1905586j752J71801L10710M04398J1698J59696O02379M51218N9090N27329
4188A4602153O30704L37350N69264M10349Q98774M95303N1208Q6050N14006L26857
$$ y = [11847225, 11451523, 11272806, 11292321, 11268489, 11081808, 10675064, 10515566, 10511346, 10570530, 10647655, 10402307, 10252697, 10338741, 10467470, 10488972, 10333358, 10220289, 10197409, 10233792, 10171861, 10397230, 10339489, 10407325, 10393223, 10447055, 10621080, 10710583, 10915042, 11039028, 10932770, 11250627, 11527101, 12033801, 12282256, 12756402, 13197346, 13635427, 13743694, 13577126, 13893206, 14255426, 14094352, 13647078, 13465515, 12911243, 12776038, 12866261, 12736782, 12464443, 12276955, 12114657, 12176442, 11732473, 11658102, 11715005, 11704196, 11860915, 11771924, 11905586, 11903834, 12075635, 12386345, 12790743, 12802441, 12962137, 13564516, 14015734, 14074824, 14602153, 15232857, 15570207, 16139471, 16549820, 17448594, 17943897, 17995105, 18081155, 18595161, 18922018]
4178A8922018j51749n52255o69311k33935j44494l01106k93597m5239J56204K84620
4168A6971156K08939P29583O27137O97944J225453J367235J393040J453516J394508
4159B6068511J229143R61791J64375j71007j45391p78614j061166j063527j019203
4150B4184912j171919j288370j064839p33795m44438n63616j04197K62684k76478
4141A8799944K62353L43597P34339K76985K14413O0464J92893K35272J38806o9027
4131B1190039m01984l87401k64064M1301J35394K96068P94503K09156j14545K12639
4121B1711106J85681Q4928j86488k91553j88367k71013n83262l33772l64131n99032
4111A9164097l11578j68369n05886l87258p75263k60156n5985J43082M35088L37867
$$ y = [18922018, 18770269, 18218014, 17548703, 17314768, 17170274, 16869168, 16575571, 16530332, 16686536, 16971156, 17180095, 17909678, 18536815, 19234759, 20460212, 21827447, 23220487, 24674003, 26068511, 27297654, 28259445, 28423820, 28252813, 28107422, 27328808, 26267642, 25204115, 24184912, 23012993, 21724623, 20659784, 19925989, 19481551, 18917935, 18813738, 19076422, 18799944, 19062297, 19405894, 20140233, 20417218, 20631631, 20692095, 20884988, 21120260, 21259066, 21190039, 20788055, 20400654, 20136590, 20177891, 20313285, 20609353, 21403856, 21613012, 21498467, 21711106, 21896787, 21981715, 21795227, 21503674, 21315307, 21044294, 20461032, 20127260, 19763129, 19164097, 18852519, 18684150, 18178264, 17791006, 17015743, 16755587, 16699602, 16842684, 17277772, 17615639]
4101A7615639L97136K52204j63443m3283j37504j72953m94946l58201p00347r73584
4091A5220718p30959n24052n77684n03371k67822k98707k72429J23967k8584j66576
4081A1974501j80788k09751j59930K18983J19279n9632P8358J79264J73592j188
4071A2132688J11859K96779J37432K63706M74770J73472N6630k82367m9970J42489
4061A3457488l26217n62946m56014n56443l76606o25770l16649m68617k70159
4052I498067k61137m97930K40394r6285n00346m54913J55121j39315J61563j85573
4042G919646k8493J89239l78330k34581j16415j03655o6357k41298k92125O6202
4032F713833N626J92345R052m1927k8959j75715k43457k54512q6840j70255o223
$$ y = [17615639, 18012775, 18264979, 18101536, 18058253, 17920749, 17747796, 17252850, 16894649, 16194302, 15220718, 14489759, 13965707, 13388023, 12884652, 12616830, 12318123, 12045694, 12169661, 12141077, 11974501, 11793713, 11583962, 11424032, 11643015, 11762294, 11702662, 11781020, 11960284, 12133876, 12132688, 12244547, 12541326, 12678758, 12942464, 13417234, 13590706, 13647336, 13364969, 13314999, 13457488, 13131271, 12568325, 12112311, 11555868, 11179262, 10553492, 10236843, 9768226, 9498067, 9236930, 8739000, 8979394, 8883109, 8382763, 7927850, 8082971, 7943656, 8105219, 7919646, 7891153, 8080392, 7702062, 7467481, 7351066, 7247411, 7181054, 6939756, 6647631, 6713833, 6719459, 6911804, 6920856, 6878929, 6849970, 6674255, 6430798, 6176286, 6089446, 5919191, 5912968]
4021E912968O2418n3735l6041K28252j01496p0990L54064j64632j37243j68201
4011E825364J7871j53916k55522M0292k81997J29587J66744Q8512l7484o4852
4001E474599k1224m5193o7856q6665j32280L36254J76337l52936j03741j28155
3991E049140K08707L945k24112N4134J05851k27484M2163k36588n9752K10258
3981D926262K87708k25468j23561m0470l63578K63422L72095k41042k9391m0286
3971D785691j20698j6753L4931l8095j97771J02832j2285K71739l6954O7934k58980
3960D581591k60316K89676j40926L82995J13039l25142k25953o9876m0286r8693
3950D206109R8238n7678m1617k79375j09553L88270J49735n4919Q0751L2796P8425
$$ y = [5912968, 5975386, 5921651, 5885610, 6113862, 6012366, 5941376, 6295440, 6130808, 5993565, 5825364, 5843235, 5689319, 5433797, 5474089, 5192092, 5321679, 5488423, 5576935, 5539451, 5474599, 5453375, 5408182, 5340326, 5253661, 5121381, 5457635, 5633972, 5281036, 5177295, 5049140, 5257847, 5261792, 5037680, 5091814, 5197665, 4970181, 5012344, 4775756, 4716004, 4926262, 5213970, 4988502, 4864941, 4824471, 4460893, 4724315, 5096410, 4855368, 4825977, 4785691, 4664993, 4648240, 4683171, 4645076, 4447305, 4550137, 4537852, 4809591, 4772637, 4840571, 4581591, 4321275, 4610951, 4470025, 4853020, 4966059, 4640917, 4414964, 4345088, 4304802, 4206109, 4304347, 4246669, 4205052, 3925677, 3816124, 4204394, 4354129, 4299210, 4379961, 4412757, 4491182]
3939D491182q858o1735M64457j06239j45635M4957K68783k86106j16329J4420
3929D558897L4033j43915K09405K34045j4724k5843M3899K28168J7221K7143J24269
3918E292598L43538J22643K85804J24915J30997Q3017K46458k6962k58320j6357
3908F328331o5150m07646k60391p6866J74278K4474k49919l41475Q1890j38316
3898E069210k43853Q3678J13250j91467j14662J05126K04947j57327p8117J95588
3888D986373J56939q7365K61697M05547K59759Q8335N1844J81034R2688p9204
3878F317647j16214j72144P6909K1407n31024j27460r9115p9236j20732L9963
3868E210001j06870p7791j67219m4426k20982k10395M8312K28511j71056j08937
$$ y = [4491182, 4482324, 4420589, 4885046, 4778807, 4633172, 4678129, 4946912, 4660806, 4544477, 4558897, 4592930, 4449015, 4658420, 4892465, 4877741, 4851898, 4895797, 5123965, 5141186, 5168329, 5292598, 5636136, 5758779, 6044583, 6169498, 6300495, 6383512, 6629970, 6603008, 6344688, 6328331, 6263181, 5855535, 5595144, 5518278, 5692556, 5717030, 5467111, 5125636, 5207526, 5069210, 4825357, 4909035, 5022285, 4830818, 4716156, 4821282, 5026229, 4868902, 4790785, 4986373, 5143312, 5055947, 5317644, 5723191, 5982950, 6071285, 6123129, 6304163, 6396851, 6317647, 6201433, 6029289, 6106198, 6127605, 5596581, 5469121, 5370006, 5290770, 5170038, 5210001, 5103131, 5025340, 4858121, 4813695, 4592713, 4382318, 4430630, 4659141, 4488085, 4379148]
3858D379148L9460K800L1856o5654l0071K05976k08674p4041j6700p5855l8522
3847D149723J90753J1416j37220K3380j66772L63410n5049q3240j0663Q7727j02482
3836D270983p9505j90084K3245k82431J66244m5271k44379j53172J42204J19090
3826C726924J99671N7822k28414R4135J00178q7645j98005m3686J09311p7835
3816C652456J83964K3657l14411J97138J00773j45154M6649J95634j52846k82000
3806C505860J25660P2486K01708j30538r1137j83919n752m2219K2235J6523n8389
3795C432518J53770J34302J46006N5077j4912m46445j99576J94920k1949j50287
3785C283424J68927r0593k96041j1187L3295k3572K06306J4470O7517k17517K48862
$$ y = [4379148, 4418608, 4421408, 4453264, 4387610, 4357539, 4563515, 4354841, 4280800, 4264100, 4188245, 4149723, 4340476, 4351892, 4214672, 4238052, 4071280, 4434690, 4379641, 4296401, 4285738, 4373465, 4270983, 4191478, 4001394, 4024639, 3742208, 3908452, 3863181, 3618802, 3465630, 3607834, 3726924, 3926595, 3984417, 3756003, 3850138, 3950316, 3862671, 3664666, 3620980, 3730291, 3652456, 3836420, 3860077, 3545666, 3742804, 3843577, 3698423, 3745072, 3940706, 3787860, 3505860, 3631520, 3704006, 3905714, 3775176, 3684039, 3500120, 3494368, 3452149, 3474384, 3490907, 3432518, 3586288, 3720590, 3866596, 3921673, 3906761, 3460316, 3260740, 3455660, 3433711, 3283424, 3452351, 3361758, 3065717, 3054530, 3087825, 3064253, 3270559, 3285029, 3352546, 3135029, 3383891]
3774C383891j7529J48229J7572j8446j68811n0312L48759N0146J24831j54751
3764C663579n1037j24726l23449k7811Q8826P4396q1722J89560q329p1785n3207
3753C274295J31299j58415j36175n194J39273L06117J1787o0411p2477k4862R0259
3742C495496k35482R621Q2561N4074P7896O5922l8547O721n6540j42031K17395
3731C537086K19873k12971K8532J19764k64482R9480j02666n9972J21923j06377
3721C380190k67590j00384j15745q8808K05231K24461K9819k66945J67222M1375
3711C208826j56056K39629q4284k3626j20508R1085J03153k27153k01400J78791
3701C008457k65059M2557J9349K3664R2055p6509O9226p2173R5427k91518K05375
$$ y = [3383891, 3366362, 3514591, 3532163, 3513717, 3344906, 3294594, 3643353, 3693499, 3818330, 3663579, 3612542, 3487816, 3164367, 3136556, 3225382, 3299778, 3218056, 3407616, 3399287, 3327502, 3274295, 3405594, 3247179, 3111004, 3105810, 3245083, 3551200, 3562987, 3502576, 3430099, 3405237, 3495496, 3260014, 3269635, 3352196, 3406270, 3484166, 3550088, 3511541, 3518262, 3461722, 3319691, 3537086, 3756959, 3543988, 3572520, 3692284, 3427802, 3527282, 3424616, 3364644, 3486567, 3380190, 3112600, 3012216, 2896471, 2807663, 3012894, 3237355, 3267174, 3000229, 3167451, 3208826, 3052770, 3292399, 3208115, 3184489, 3063981, 3155066, 3258219, 3031066, 2829666, 3008457, 2743398, 2785955, 2805304, 2828968, 2921023, 2844514, 2913740, 2841567, 2936994, 2645476, 2850851]
3690B850851K36718j5364j75688J65774m6089j33732O077J34362n9466j41956
3680B821487K34078k72929j9208Q340j7981j84554j0492J76172L0813k16478j91210
3669B358038K66922J32097J30336j70494Q6426O0389l94906N8601p2566R5928
3659B550771J25214p2701r6126K72537J75789r7085Q4484o9129J5672k53813q1855
3648B553758J05344j62404O6333j05552K99997q2672l48827q7764L37030N6534
3638B631777p3189n4330p7592M033K63667k87047J66640P5310j07520L3748P559
3627B583056l4363r3672J93415m728n0048n0063J18053M4622q3578J94660l24157
3616B493197j91043J85817J11859K40091j48607M9646j32470K74669k1327l36713
$$ y = [2850851, 3087569, 3072205, 2896517, 3062291, 3016202, 2882470, 2888547, 3022909, 2963443, 2821487, 3055565, 2782636, 2763428, 2771768, 2753787, 2569233, 2558741, 2734913, 2765726, 2549248, 2358038, 2624960, 2757057, 2887393, 2716899, 2803325, 2863714, 2468808, 2527409, 2454843, 2550771, 2675985, 2603284, 2507158, 2779695, 2955484, 2858399, 2942883, 2873754, 2889426, 2635613, 2553758, 2659102, 2496698, 2563031, 2457479, 2757476, 2674804, 2325977, 2238213, 2575243, 2631777, 2558588, 2504258, 2426666, 2430699, 2694366, 2407319, 2573959, 2649269, 2541749, 2575497, 2583056, 2548693, 2455021, 2648436, 2643708, 2593660, 2543597, 2661650, 2706272, 2622694, 2817354, 2493197, 2302154, 2487971, 2599830, 2839921, 2691314, 2740960, 2608490, 2883159, 2861832, 2525119]
3606B525119o9341M9595J78357k10897j35131M6939O7352M25235j0264j31951
3596B735013J44749j30422m7950J29247j42910J58889L2989K5004n3591J05672
3586B956690J6215k38162l8067J08706k09622Q1171o9958K00117q4247K70620
3576B993463J52581l29940L8962K6441J6825R2336j27567P7846J12095J86688
3566C239730m7541k88261J13054o6944p7046J60543R3127J18422l6337j46590
3556C062157j0425O0286J20219m9566L40337m9313l67219J51227J56460l07913
3546C106250K52230J02398j24337J66386J02617J1334M4751J84248p596Q3072
3536C921353K72447J06506L22203O54109L55788l592R8357j20105j82960j12033
$$ y = [2525119, 2455778, 2505373, 2683730, 2472833, 2337702, 2384641, 2451993, 2877228, 2866964, 2735013, 2879762, 2749340, 2701390, 2830637, 2687727, 2846616, 2879605, 2904609, 2851018, 2956690, 2972905, 2734743, 2696676, 2805382, 2595760, 2676931, 2606973, 2807090, 2722843, 2993463, 3146044, 2816104, 2855066, 2881507, 2898332, 2990668, 2863101, 2940947, 3053042, 3239730, 3192189, 2903928, 3016982, 2950038, 2872992, 3033535, 3126662, 3245084, 3208747, 3062157, 3051732, 3112018, 3232237, 3182671, 3523008, 3473695, 3106476, 3257703, 3414163, 3106250, 3358480, 3460878, 3336541, 3502927, 3605544, 3616878, 3661629, 3845877, 3838281, 3921353, 4193800, 4300306, 4622509, 5276618, 5632406, 5628814, 5727171, 5607066, 5424106, 5312073]
3526E312073n8183k77211Q4910k766j97298O9555r7819j03312J48585Q7968o1730
3515D904772k76264J9392J42302J6878k17925M8071J96242m3740R6129L40947
3505E226804L00163L55902J48747L47890K20160K67776P35907R26791L52816l12800
3495H570156m47829k14316l21864l86982n6361l16466o02755J24696J72452k29842
3485F290889M3505N0254j58051k22936M5625J71056K3473q6845L15379j4353J16601
3474F574597k4342K20995P0743K91465O07100L73279L12053O94946N47385L04763
3464I972984M74294M84108J49512L4767k25331m67855k18006l05671j28658l68118
3454I402026k71956k33831n60297k41816k40152l1126k69713k39114l5371j15621
$$ y = [5312073, 5253890, 4976679, 5061589, 5058823, 4861525, 4931080, 4833261, 4729949, 4878534, 4966502, 4904772, 4628508, 4647900, 4790202, 4807080, 4589155, 4637226, 4833468, 4789728, 4885857, 5226804, 5526967, 5882869, 6031616, 6379506, 6599666, 6867442, 7603349, 8530140, 8882956, 8570156, 8122327, 7908011, 7586147, 7199165, 7142804, 6826338, 6223583, 6348279, 6520731, 6290889, 6334394, 6384648, 6226597, 6003661, 6049286, 6220342, 6243815, 6156970, 6472349, 6457996, 6574597, 6550255, 6771250, 6841993, 7133458, 7740558, 8113837, 8425890, 9120836, 9668221, 9972984, 10447278, 10931386, 11080898, 11115665, 10890334, 10422479, 10204473, 9898802, 9770144, 9402026, 9130070, 8896239, 8335942, 8094126, 7853974, 7822848, 7553135, 7314021, 7278650, 7163029]
3444G163029k57227j11409J3822j3891k07245J25063j98199j41598J38855L26874
3434F838074K14185P06L26339N13129K7283m87099k6679k14747l54981j80419
3424F655791l61910n68820R5658k62041k24330j0970k2390J62398k51932k30151
3414D981303m6731J87263M2690j19459k31515l59078M4115j7517J58280l64r7562
3403D541425O2641m1709J16850K98086K83693N32l84721k43851K0621j63161k64987
3392D225419N9551j06535J75522N337k58995l56235K00524P2364r1715J76036
3382D101273m88592j68807J23806J3951O4331r5828Q6325j92088L3233m0503j72239
3371C264862J23106j18159o5168J26738j18042J04171j01081l39350o5636j90376
$$ y = [7163029, 6905802, 6794393, 6808215, 6794324, 6587079, 6712142, 6513943, 6372345, 6511200, 6838074, 7052259, 7052965, 7379304, 7892433, 7919716, 7432617, 7405938, 7191191, 6836210, 6655791, 6293881, 5725061, 5820719, 5558678, 5334348, 5323378, 5300988, 5463386, 5211454, 4981303, 4934572, 5121835, 5164525, 5045066, 4813551, 4454473, 4498588, 4481071, 4639351, 4638987, 4541425, 4604066, 4562357, 4679207, 4977293, 5260986, 5261518, 4876797, 4632946, 4653567, 4490406, 4225419, 4284970, 4178435, 4353957, 4359294, 4100299, 3744064, 3944588, 4016952, 3925237, 4101273, 3612681, 3443874, 3567680, 3581631, 3645962, 3550134, 3636459, 3444371, 3477604, 3437101, 3264862, 3387968, 3269809, 3204641, 3331379, 3213337, 3317508, 3216427, 2877077, 2811441, 2621065]
3361B621065N6714P9719J96067J6790l01209o6028P1100O2657J42309J02102o2085
3350B919201k12913L7662O2264K35674j23421j85728o510R7314j28927j76103
3340B518513J54229K7419m8864M980J12796J45919m7338j46664j19390j38116
3330B463484m5257O1902K51653o6492r9354Q1137n4271n8474J18989O1455J17333
3319B832105q6040j70504K00116J78667j50675l95861r0797Q3643j49715j26973
3309B123966o7265k03714Q3463J99832m7463o7662p1255n3076J50415J90001j29234
3298B108008m6211k1120Q1758K14599k52277j29736J53445n6315r2357L35079
3288B294873m2160j9733L5686J07362n9779J5254k30563k23897K10509m1378k02230
$$ y = [2621065, 2677779, 2757498, 2953565, 2970355, 2669146, 2603118, 2674218, 2736875, 2879184, 2981286, 2919201, 2706288, 2743950, 2806214, 3041888, 2918467, 2732739, 2726229, 2823543, 2694616, 2518513, 2672742, 2700161, 2651297, 2656277, 2769073, 2914992, 2867654, 2720990, 2601600, 2463484, 2418227, 2480129, 2731782, 2665290, 2565936, 2647073, 2592802, 2534328, 2653317, 2714772, 2832105, 2746065, 2575561, 2775677, 2954344, 2803669, 2407808, 2317011, 2400654, 2250939, 2123966, 2056701, 1852987, 1936450, 2136282, 2088819, 2021157, 1949902, 1896826, 2047241, 2237242, 2108008, 2061797, 2040677, 2122435, 2337034, 2084757, 1955021, 2108466, 2052151, 1959794, 2294873, 2252713, 2232980, 2268666, 2376028, 2316249, 2331503, 2100940, 1877043, 2087552, 2046174, 1843944]
3277A843944K25638R4615k80542P8864j59857j8315K03453j7760j28074K4232
3267A866198j94859J83763r4736k43843N9287J10229K35859K07779j17208r3268
3257A919201K9928m2779K80331j66124k0949M5074p5320j7850p7457j63874k7172
3246A683009k0372m7693n5528M689k38576K74772J03479J0026k36005P0694r5398
3235A453097l6907K04882Q6397k0852l70851J75651O4422N7063J5014P7599n2836
3224A652679j7529k80957J25753j06396Q3082K23633O6091l0137j0537j25384
3214A580298j85021j84506J71660q9353q7529M0260Q1843P8089J22112P637M1857
3203A577347o9486O7409K4202K33856j75830j27915K83379j88970K27273j8621
$$ y = [1843944, 2069582, 2164197, 1883655, 1962519, 1802662, 1784347, 1987800, 1970040, 1841966, 1866198, 1671339, 1855102, 1760366, 1516523, 1575810, 1686039, 1921898, 2129677, 2012469, 1919201, 1949129, 1906350, 2186681, 2020557, 1999608, 2044682, 1969362, 1951512, 1874055, 1710181, 1683009, 1662637, 1614944, 1559416, 1564105, 1325529, 1600301, 1703780, 1713806, 1477801, 1548495, 1453097, 1416190, 1621072, 1707469, 1686617, 1315766, 1491417, 1555839, 1612902, 1627916, 1705515, 1652679, 1635150, 1354193, 1479946, 1373550, 1456632, 1680265, 1746356, 1716219, 1705682, 1580298, 1395277, 1210771, 1382431, 1293078, 1205549, 1245809, 1327652, 1405741, 1527853, 1535490, 1577347, 1507861, 1575270, 1599472, 1833328, 1657498, 1529583, 1812962, 1623992, 1851265, 1832644]
3193A832644m31447J2577M899j95222Q6083K64895q6853j75899J15638j13369
3183A313946j7528K63752J38101j38773l02954Q7385J23869r6532K38385k3050
3173A586601J32281j72666k42474N9453J93841q6960j0732J16199l4066J32025
3163A673502J86747k60361J01230J72507K9513n25286k5073L06401J31710m1772
3153A749118R6002J58353L3839P2820k12976j75517r6309J22050J61173L5326
3143A943879J26982r6151j34060L35013R920k44637O3767M4304M1130j19310N7502
3132B028339l10680L71679K36219k55553J18799l1343L05436J39231q197j0177
3122B583753j81690R893M25452K56579j5067j87567j97736j48939k30698p2164
$$ y = [1832644, 1401197, 1413774, 1418673, 1223451, 1309534, 1574429, 1487576, 1311677, 1427315, 1313946, 1296418, 1560170, 1698271, 1559498, 1256544, 1343929, 1467798, 1371266, 1609651, 1586601, 1718882, 1546216, 1303742, 1363195, 1557036, 1470076, 1459344, 1575543, 1541477, 1673502, 1860249, 1599888, 1701118, 1873625, 1903138, 1377852, 1352779, 1659180, 1790890, 1749118, 1845120, 2003473, 2037312, 2110132, 1897156, 1721639, 1625330, 1747380, 1908553, 1943879, 2070861, 1974710, 1840650, 2175663, 2185583, 1940946, 2004713, 2049017, 2090147, 1970837, 2028339, 1717659, 2089338, 2325557, 2070004, 2188803, 2157460, 2462896, 2602127, 2593930, 2583753, 2402063, 2411956, 2837408, 3093987, 3078920, 2891353, 2693617, 2544678, 2313980, 2241816]
3112B241816L58136o1919n6976o7053J37756r4557r3584J63374M2343Q8186N5791
3101B713313o981o1455K27437r8363j51950r6203k6646J92855L7960K98277l33582
3090B694662N1682N3204p0141K31177o5226l23818J8948j71660r084r843j30653
3079B269248M8459J43051r4176j86413j42148J6866M1077J21072P4428k12015
3069B079449j28655K1378K95612N4668m0327j31865J44496Q70j2697o0779n0006
3058B172144k16938j18505m2442J27088J31894l931j09876j89240P3027J7432
3048A840653n0538k65811j06334P2244L6072j0718n3327o8962l9040m6559r6267
3037A211413O3948o9854J82468J90987j3428J2984k8423j39125k83138J4299j33042
$$ y = [2241816, 2599952, 2538033, 2481057, 2414004, 2551760, 2457203, 2363619, 2526993, 2569336, 2657522, 2713313, 2706332, 2644877, 2872314, 2773951, 2622001, 2525798, 2499152, 2692007, 2729967, 3028244, 2694662, 2746344, 2799548, 2729407, 2960584, 2895358, 2571540, 2590488, 2418828, 2409744, 2399901, 2269248, 2317707, 2460758, 2366582, 2180169, 2038021, 2054887, 2095964, 2217036, 2291464, 2079449, 1950794, 1972172, 2267784, 2322452, 2282125, 2150260, 2294756, 2295626, 2282929, 2222150, 2172144, 1955206, 1836701, 1794259, 1921347, 2053241, 2049310, 1939434, 1750194, 1823221, 1840653, 1790115, 1524304, 1417970, 1490214, 1526286, 1515568, 1462241, 1393279, 1354239, 1307680, 1211413, 1275361, 1205507, 1387975, 1578962, 1565534, 1578518, 1550095, 1410970, 1127832, 1142131, 1009089]
3026A009089n9583o721l2909K11838K16622j92907P1863j77173o6586K12147k95143
3015H90537k9113K50872K21861k96148j75680M2059P3734Q8393O4625p9944r8498
3004I52698J8089J78246J18565N4958j84920k12443m6669R7220J40727k49954
2994H66517M47n9605n0766j06566j7992K37770J11720J23616n8334j43937j26438
2983G76432j0974m9795J52271j45176l8943L5917N1224p0237N5573j94932K29428
2972G90788J07612k46594J26240j1815p4621L09693K6127j66034n9549j40262
2962F61585j2193n575J48872j15012m9430K46517O205j30192N8775L4628r1655
2951G52525j89117L63260j90065j99954J06495p3661K83738P0322l23013l770
$$ y = [1009089, 949506, 942785, 909876, 1121714, 1338336, 1145429, 1217292, 1040119, 973533, 1185680, 890537, 861424, 1112296, 1334157, 1038009, 862329, 904388, 978122, 1066515, 1131140, 1051196, 952698, 970787, 1149033, 1267598, 1322556, 1137636, 925193, 878524, 975744, 1116471, 866517, 866964, 807359, 756593, 650027, 632035, 869805, 981525, 1105141, 1046807, 902870, 776432, 765458, 715663, 867934, 722758, 683815, 719732, 770956, 700719, 756292, 561360, 790788, 898400, 651806, 778046, 766231, 691610, 1001303, 1027430, 861396, 801847, 661585, 649392, 643817, 792689, 677677, 628247, 874764, 880969, 750777, 809552, 844180, 752525, 563408, 926668, 736603, 536649, 643144, 569483, 853221, 923543, 600530, 596760]
2941E96760j12572j01996J69503L71232k76112k79214R2987L19647N1893m70936
2931C61192Q8907L03066K2226j96146O008L5987M20546o6801r1578k87588j23531
2920D72288J03337K62489n2912l16350l45500L76248J06070j06694J51800k21790
2910D28986L10914R5777j33591J21593K6405l41536l4383J35247K1115q4151L37513
2899H83889j97445Q2781K372J12749k81308k9436R3765L5837K16841j85891P1143
2888H05297j60220N8372k66486l065J59426m5991r8946m0196J83145k3602j06329
2877D61405r6175K30331M9769m8185o255j9044J95706P9128l30312P007O2728
2866E86103j12394o5384J23207N2758L5547K0974m1585r4449O6988r8589J14985
$$ y = [596760, 484188, 382192, 551695, 922927, 646815, 367601, 460588, 780235, 832128, 361192, 450099, 753165, 775391, 579245, 585253, 621240, 1041786, 974985, 883407, 595819, 472288, 575625, 838114, 785202, 468852, 123352, 499600, 605670, 498976, 650776, 428986, 739900, 835677, 702086, 823679, 850084, 508548, 474165, 609412, 630527, 546376, 883889, 686444, 769225, 771597, 884346, 603038, 573602, 667367, 703204, 920045, 734154, 805297, 645077, 703449, 436963, 433898, 593324, 547333, 448387, 408191, 591336, 567734, 461405, 365230, 595561, 645330, 597145, 590890, 571846, 767552, 846680, 516368, 523375, 586103, 473709, 408325, 531532, 584290, 619837, 640811, 599226, 504777, 571765, 473176, 588161]
2855E88161L7348j46759K80834K38589k17910J39251k32824L9389j39852j73927
2845D12300J74959j63056J6778j86427J75237j53015L94112J3178l4949R8325
2835G47442j73521J27380M3525m8940r4228R1609J7400L9403j78615j54797l5867
2824C80791M8256J32326O1046q9038j02260J55841k7107j11589J28702P4715L8810
2813F90493r4046J23432L7841k7587J50227j09123l8369k325P089N425j50616
2802E92441m7878k0131P7275J35137J17684n6007k3680j48174j23391J71245j27717
2791E46804O7061k14603L6130k5260k2032J94381P5701j79632k28595p382M9670
2780B92243n9634N23509j08138j35823K84874N2721l73721J60659n6814j23390
$$ y = [588161, 625509, 478750, 759584, 998173, 780263, 919514, 686690, 726079, 586227, 412300, 587259, 424203, 440981, 254554, 429791, 276776, 670888, 684066, 649117, 747442, 573921, 701301, 744826, 695886, 601658, 693267, 710667, 750070, 571455, 416658, 380791, 429047, 561373, 622419, 533381, 431121, 586962, 559855, 448266, 576968, 651683, 690493, 596447, 719879, 757720, 730133, 880360, 771237, 732868, 730543, 737632, 743057, 592441, 544563, 524432, 601707, 736844, 854528, 798521, 774841, 626667, 503276, 674521, 546804, 613865, 399262, 435392, 410132, 388100, 582481, 658182, 478550, 249955, 242573, 292243, 232609, 756118, 647980, 512157, 797031, 849752, 476031, 636690, 579876, 456486]
2770D56486N2684K8546J26473J61404j978m65010j58585K13464J7213j78690m1515
2759B10492K8303K82385Q7487P234q3909l17569L26135N5064k20019R3788L1561
2748E00952L0626R1960q4080L8310N5286l5002j65367j63708K50126k9068k07551
2737B82484O3726J89669m4747p0178k80283R5972L8944K34322j29693k62935N1142
2726A68423J36109J38492J48204j94523Q724L254M9080o7484Q7286K48159k48921
2715D76803Q4035R5835r7065J3390N2318P3437j61892j19201j75548N8153K29170
2704E29435M1998j45810k29636k15J10720J11412J89384M6942l24037j51190K22004
2693D01007K33051J11832p6497J7311J47953j15764k81262l578J00961j48471
$$ y = [456486, 509170, 537716, 664189, 825593, 823615, 358605, 200020, 413484, 430697, 252007, 210492, 238795, 521180, 608667, 615901, 531992, 214423, 540558, 595622, 375603, 469391, 500952, 531578, 623538, 539458, 577768, 633054, 598052, 432685, 268977, 519103, 490035, 282484, 346210, 535879, 491132, 420954, 140671, 236643, 275587, 509909, 380216, 117281, 168423, 304532, 443024, 591228, 396705, 405429, 408683, 457763, 390279, 477565, 725724, 476803, 560838, 656673, 559608, 572998, 625316, 698753, 536861, 417660, 242112, 300265, 529435, 571433, 425623, 195987, 195772, 306492, 417904, 607288, 654230, 330193, 179003, 401007, 634058, 745890, 669393, 686704, 834657, 718893, 437631, 434053, 535014, 386543]
2683C86543J36554K9268j67463L1682K60425j42892k71225J64120q5889j82520
2673A58603J68040J82232l1774j13718j43786J11781j35773J73560K23548j00726
2663D91987k4258Q2015j57393j28412K08364M2878M3012J81154j394k06599O6930
2652E98284k28535O6136J03391J0704N8775J38728j78299j41413K0782j67090
2642B81463N0681k5907J4751r6594K34932p8008o3020J67497j31821M2477L9696
2631D36147J14182r6271j32146P0812r604J6499Q1164L3145m3818n647J29781
2620E94244J12021j36801R287j63812m8133j57551m0369M51445N0784j75878K06964
2609G02201j60268k53247j79557K84105J08777j15093N4180q0240j15738k9280
$$ y = [386543, 523097, 552365, 384902, 416584, 677009, 534117, 262892, 427012, 341123, 158603, 326643, 508875, 477101, 363383, 219597, 331378, 195605, 369165, 592713, 491987, 467729, 549744, 392351, 263939, 472303, 515181, 558193, 739347, 737953, 531354, 598284, 369749, 435885, 539276, 549980, 608755, 747483, 569184, 427771, 448553, 281463, 332144, 306237, 320988, 224394, 459326, 381318, 318298, 485795, 353974, 396451, 436147, 550329, 454058, 321912, 392724, 383120, 399619, 480783, 513928, 470110, 464463, 594244, 706265, 569464, 578751, 414939, 366806, 209255, 168886, 620331, 671115, 495237, 702201, 541933, 288686, 109129, 393234, 502011, 386918, 441098, 360858, 245120, 215840]
2599B15840K11595J79106n2175N2510j9498k7251j2839k3267M3476Q3390J08218
2588G59105R7049J20447K51580o6107l52394l8131j36163O238q8913J09185J02918
2577G64814m3373j63079J24787k04235j03162J71552J82197l09101j41751K31142
2567E09791j03627J61129L5956l1205p605r6859o3359K00572J36878j53893n0431
2556E37347J59973J73228r4388r5346k54083K35271r8803k5011P3519l04290K48829
2545E56246L4429q9729J89317q0768R2249l1311j86202k56492J56152N7164Q8232
2534E29287M8683j04844K37521j98393L58577j99367k13764l0715k72837M49709
2524F03857J74165J12682l2994L9011j86041j9693j04701O8693J56263O5621J13366
$$ y = [215840, 427435, 606541, 554366, 606876, 587378, 560127, 547288, 524021, 567497, 650887, 759105, 856154, 976601, 1228181, 1162074, 809680, 771549, 635386, 641624, 552711, 661896, 764814, 721441, 558362, 683149, 478914, 375752, 547304, 729501, 420400, 278649, 509791, 406164, 567293, 603249, 572044, 564439, 467580, 404221, 604793, 741671, 587778, 537347, 697320, 870548, 776160, 680814, 426731, 662002, 563199, 538188, 611707, 307417, 556246, 590675, 500946, 690263, 609495, 701744, 670433, 484231, 227739, 383891, 441055, 529287, 577970, 473126, 710647, 512254, 870831, 671464, 457700, 426985, 154148, 603857, 778022, 890704, 857710, 896721, 710680, 690987, 586286, 654979, 811242, 876863, 990229]
2513I90229j51100p7496j84134Q4515J21424k64794j80774M1979J91476M0711
2503F12036j22995m5561J32818Q8974j82643J39228J70526j21118J85646j16107
2493G40804k16149J18839J04645j77792o1886K52556j7951K20863j0597q7860
2483H65472J24674P6943L9570R9336k28795k53294j31658j19442q5245K25999
2473F13560J69187K20743k2126n4809R53j22766J0028j06731J63138J7405Q9893
2462I78475L1219j85814k44931L15321L14912j34030r7389J54116J45619l64915
2452I12583J05745N5811j06403O5214J28975n749J15964j60748L9023J41560j13895
2441A178080L409J34936m6696n1666o5820K59785n0925j35010J23537J87105m0386
$$ y = [990229, 839129, 761633, 577499, 662014, 783438, 518644, 337870, 379849, 571325, 612036, 489041, 443480, 576298, 665272, 482629, 621857, 792383, 671265, 856911, 740804, 524655, 643494, 748139, 570347, 508461, 761017, 743066, 963929, 953332, 865472, 990146, 1067089, 1106659, 1205995, 977200, 723906, 592248, 472806, 387561, 613560, 782747, 1003490, 981364, 926555, 927508, 804742, 814770, 708039, 871177, 888582, 978475, 1009694, 823880, 578949, 894270, 1209182, 1075152, 977763, 1131879, 1277498, 912583, 1018328, 1074139, 967736, 1032950, 1161925, 1156176, 1272140, 1111392, 1150415, 1291975, 1178080, 1181489, 1316425, 1269729, 1218063, 1152243, 1412028, 1361103, 1226093, 1349630, 1536735, 1496349]
2430A496349l32814J97346j86047J53703M0366j15026Q2479P8300J03484l65345
2420A152795J39062r7032N933N179K95071l4339n6708m6827J74961O1131m3124
2409A556102n531K36257k06944q1065o5728N6480J05020r7124K32689k4668k05237
2398A500251m5237K05640l2271J509j14071l2628k823J54757K35030j9971Q1054
2387A931240K4155Q551K7617r5454Q0865P4547k56850J56417K93514j30484K53346
2376B367464L2015j20037j10513O0841J04002K706P6709J40319J54314j41612
2366B566208K0191K31857J12090r4856J16331J49565j8789L52341J40470L35502
2356C910910L2278K99314J24696j5008j8737J49283J94959K77068M47222J55454
$$ y = [1496349, 1163535, 1360881, 1174834, 1328537, 1368903, 1253877, 1336356, 1414656, 1518140, 1152795, 1291857, 1194825, 1200758, 1205937, 1501008, 1466669, 1409961, 1363134, 1538095, 1599226, 1556102, 1550571, 1786828, 1579884, 1498819, 1433091, 1489571, 1594591, 1497467, 1730156, 1705488, 1500251, 1455014, 1660654, 1628383, 1629892, 1515821, 1483193, 1480370, 1635127, 1870157, 1850186, 1931240, 1955395, 1963946, 1991563, 1896109, 1976974, 2051521, 1794671, 1951088, 2244602, 2114118, 2367464, 2399479, 2279442, 2168929, 2229770, 2333772, 2336478, 2413187, 2553506, 2707820, 2566208, 2586399, 2818256, 2930346, 2835490, 2951821, 3101386, 3082597, 3434938, 3575408, 3910910, 3943188, 4242502, 4367198, 4352190, 4333453, 4482736, 4677695, 4954763, 5401985, 5557439]
2346E557439J96808N09188M13179L90526M03719O75472P61847P59308O96157J249241
2336A1612884J311686R57386M66445J158110R37749J503325J574288K144016K397407
2327B4063296L762464M905349O043799O567121J0276744J4412844K0956411K956014
2319I3944042j4618973j0803969q747504o033013n504725m252249m772658m253102
2311C4957849l922836k628456k333220j746116j489362j028339j529149j802182
$$ y = [5557439, 5754247, 6263435, 6676614, 7067140, 7470859, 8146331, 8908178, 9667486, 10363643, 11612884, 12924570, 13881956, 14348401, 15506511, 16444260, 17947585, 19521873, 21665889, 24063296, 27825760, 32731109, 38774908, 45342029, 55618773, 70031617, 90988028, 93944042, 79325069, 68521100, 59773596, 53740583, 48235858, 43983609, 39210951, 34957849, 31035013, 28406557, 26073337, 24327221, 22837859, 21809520, 20280371, 18478189]
$$ [...]
##END NTUPLES=NMR SPECTRUM
##END=
