##TITLE=1H_EC-3361(II-25)
 200.13MHz, CDCl3,
 8 sc
 
 12.9.2025
##JCAMPDX= 6.0         $$ Bruker NMR JCAMP-DX V2.0
##DATA TYPE= NMR SPECTRUM
##DATA CLASS= NTUPLES
##ORIGIN= UXNMR, Bruker Analytische Messtechnik GmbH
##OWNER= pz
$$ XWIN-NMR		Version 3.5
$$ Fri Sep 12 14:02:19 2025 Russian Standard Time (UT+4h)  she@DPX200
##.OBSERVE FREQUENCY= 200.1313
##.OBSERVE NUCLEUS= ^1H
##.ACQUISITION MODE= SIMULTANEOUS
##.ACQUISITION SCHEME= undefined
##.AVERAGES= 8
##.DIGITISER RES= 18
##SPECTROMETER/DATA SYSTEM= spect
##.PULSE SEQUENCE= zg30
##.SOLVENT NAME= CDCl3
##.SHIFT REFERENCE= (INTERNAL, CDCl3, 0, 15.5001)
##AUDIT TRAIL= $$ (NUMBER, WHEN, WHO, WHERE, WHAT)
$$ ##TITLE= Audit trail, XWIN-NMR		Version 3.5
$$ ##JCAMPDX= 5.01
$$ ##ORIGIN= Bruker BioSpin GmbH
$$ ##OWNER= she
$$ F:/spectra/data/she/nmr/H-C/1/pdata/1/auditp.txt
$$ ##AUDIT TRAIL=  $$ (NUMBER, WHEN, WHO, WHERE, WHAT)
(   1,<2025-09-12 14:00:43.87 +0400>,<she>,<DPX200>,
      <created by zg, POWCHK disabled, PULCHK disabled
       configuration hash MD5:
       00 E9 B6 7A A2 85 ED C7 34 08 36 98 17 FE 4E 26
       data hash MD5: 16K
       0A 52 C3 71 97 C2 E2 76 B9 AB 1E B1 D1 A7 58 DE>)
(   2,<2025-09-12 14:00:51.90 +0400>,<she>,<DPX200>,
      <Start of raw data processing
       efp BC_mod = 2 LB = 0.25 FT_mod = 6 PKNL = 1 PHC0 = -1718.781 PHC1 = 13.79226 SI = 16K 
       data hash MD5: 16K
       0A ED 69 F4 2A FE D6 C8 2C A0 47 1B BF 3E 21 25>)
(   3,<2025-09-12 14:01:18.40 +0400>,<she>,<DPX200>,
      <pk PHC0 = -0.4879839 PHC1 = -2 
       data hash MD5: 16K
       C9 95 65 89 B6 C0 41 AE AC F9 C9 75 D2 FF 48 5C>)
(   4,<2025-09-12 14:01:23.18 +0400>,<she>,<DPX200>,
      <abs ABSG = 5 
       data hash MD5: 16K
       FA 16 25 42 46 F3 1C B6 0B CC D8 7A 97 50 30 E8>)
$$ ##END=
$$ 
$$ hash MD5
$$ 2C D7 1A CD DA 8B 2B A6 8A A4 44 9C 13 37 1A 63
##$RELAX= 
##$RELAX= 
##$RELAX= 
##$RELAX= 
##$RELAX= 
##$RELAX= 
$$ Bruker specific parameters
$$ --------------------------
##$DU= <F:/spectra>
##$EXPNO= 1
##$NAME= <H-C>
##$PROCNO= 1
##$TYPE= <nmr>
##$USER= <she>
##$AMP= (0..31)
100 100 100 100 100 100 100 100 100 100 100 100 100 100 100 100 100 100 
100 100 100 100 100 100 100 100 100 100 100 100 100 100 
##$AQSEQ= 0
##$AQ_mod= 1
##$AUNM= <au_zg>
##$AUTOPOS= <>
##$BF1= 200.13
##$BF2= 200.13
##$BF3= 200.13
##$BF4= 200.13
##$BF5= 200.13
##$BF6= 200.13
##$BF7= 200.13
##$BF8= 200.13
##$BYTORDA= 1
##$CFDGTYP= 0
##$CFRGTYP= 5
##$CHEMSTR= <none>
##$CNST= (0..31)
1 1 145 1 1 1 1 1 1 1 1 1 1 1 1 1 1 1 1 1 1 1 1 1 1 1 1 1 1 1 1 1 
##$CPDPRG= <>
##$CPDPRG1= <>
##$CPDPRG2= <>
##$CPDPRG3= <>
##$CPDPRG4= <mlev>
##$CPDPRG5= <mlev>
##$CPDPRG6= <mlev>
##$CPDPRG7= <mlev>
##$CPDPRG8= <mlev>
##$CPDPRGB= <>
##$CPDPRGT= <>
##$D= (0..31)
0 0.7 0 0 0 0 0 0 0 0 0 0.03 0 0 0 0 0 0 0 0 0 0 0 0 0 0 0 0 0 0 0 0 
##$DATE= 1757671243
##$DBL= (0..7)
120 120 120 120 120 120 120 120 
##$DBP= (0..7)
150 150 150 150 150 150 150 150 
##$DBP07= 0
##$DBPNAM0= <>
##$DBPNAM1= <>
##$DBPNAM2= <>
##$DBPNAM3= <>
##$DBPNAM4= <>
$$ [...]
##$SUBNAM3= <"">
##$SUBNAM4= <"">
##$SUBNAM5= <"">
##$SUBNAM6= <"">
##$SUBNAM7= <"">
##$SUBNAM8= <"">
##$SUBNAM9= <"">
##$SW= 18.0517328524113
##$SWIBOX= (0..15)
0 0 2 0 0 0 0 0 0 0 0 0 0 0 0 0 
##$SW_h= 3612.71676300578
##$TD= 16384
##$TD0= 1
##$TE= 0
##$TE2= 300
##$TE3= 300
##$TEG= 300
##$TL= (0..7)
0 120 120 120 120 120 120 120 
##$TP= (0..7)
150 150 150 150 150 150 150 150 
##$TP07= 0
##$TPNAME0= <>
##$TPNAME1= <>
##$TPNAME2= <>
##$TPNAME3= <>
##$TPNAME4= <>
##$TPNAME5= <>
##$TPNAME6= <>
##$TPNAME7= <>
##$TPOAL= (0..7)
0.5 0.5 0.5 0.5 0.5 0.5 0.5 0.5 
##$TPOFFS= (0..7)
0 0 0 0 0 0 0 0 
##$TUNHIN= 0
##$TUNHOUT= 0
##$TUNXOUT= 0
##$USERA1= <user>
##$USERA2= <user>
##$USERA3= <user>
##$USERA4= <user>
##$USERA5= <user>
##$V9= 5
##$VALIST= <valist>
##$VCLIST= <CCCCCCCCCCCCCCC>
##$VD= 0
##$VDLIST= <DDDDDDDDDDDDDDD>
##$VPLIST= <PPPPPPPPPPPPPPP>
##$VTLIST= <TTTTTTTTTTTTTTT>
##$WBST= 1024
##$WBSW= 4
##$XGAIN= (0..3)
0 0 0 0 
##$XL= 0
##$YL= 0
##$YMAX_a= 229428
##$YMIN_a= -183361
##$ZGOPTNS= <>
##$ZL1= 120
##$ZL2= 120
##$ZL3= 120
##$ZL4= 120
##$ABSF1= 15.49678
##$ABSF2= -2.555069
##$ABSG= 5
##$ABSL= 3
##$ALPHA= 0
##$AQORDER= 0
##$ASSFAC= 0
##$ASSFACI= 0
##$ASSFACX= 0
##$ASSWID= 0
##$AUNMP= <proc_1d>
##$AZFE= 0.1
##$AZFW= 0.1
##$BCFW= 0
##$BC_mod= 2
##$BYTORDP= 0
##$COROFFS= 0
##$CY= -3
##$DATMOD= 1
##$DC= 0
##$DFILT= <>
##$DTYPP= 0
##$F1P= 0
##$F2P= 0
##$FCOR= 1
##$FTSIZE= 16384
##$FT_mod= 6
##$GAMMA= 0
##$GB= 0
##$INTBC= 1
##$INTSCL= 3.241238e-09
##$ISEN= 128
##$LB= 0.25
##$LEV0= 0
##$LPBIN= 0
##$MAXI= 10000
##$MC2= 0
##$MEAN= 0
##$ME_mod= 0
##$MI= 1.114404
##$NCOEF= 0
##$NC_proc= -7
##$NLEV= 6
##$NOISF1= 3.799351
##$NOISF2= 2.8
##$NSP= 0
##$NTH_PI= 0
##$NZP= 0
##$OFFSET= 15.50009
##$PC= 1
##$PHC0= -1719.269
##$PHC1= 11.79226
##$PH_mod= 1
##$PKNL= yes
##$PPARMOD= 0
##$PSCAL= 0
##$PSIGN= 0
##$REVERSE= no
##$SF= 200.130004326614
##$SI= 16384
##$SIGF1= 3
##$SIGF2= 2
##$SINO= 0.751879
##$SIOLD= 32768
##$SREGLST= <19F.Aceton>
##$SSB= 0
##$STSI= 16384
##$STSR= 0
##$SW_p= 3612.71676300578
##$SYMM= 0
##$S_DEV= 0
##$TDeff= 16384
##$TDoff= 0
##$TI= <>
##$TILT= no
##$TM1= 0
##$TM2= 0
##$TOPLEV= 0
##$USERP1= <user>
##$USERP2= <user>
##$USERP3= <user>
##$USERP4= <user>
##$USERP5= <user>
##$WDW= 1
##$XDIM= 16384
##$YMAX_p= 357479472
##$YMIN_p= -344189
$$ End of Bruker specific parameters
$$ ---------------------------------
##NTUPLES= NMR SPECTRUM
##VAR_NAME=  FREQUENCY,     SPECTRUM/REAL,   SPECTRUM/IMAG
##SYMBOL=    X,             R,               I
##VAR_TYPE=  INDEPENDENT,   DEPENDENT,       DEPENDENT
##VAR_FORM=  AFFN,          ASDF,            ASDF
##VAR_DIM=   16384,         16384,           16384
##UNITS=     HZ,            ARBITRARY UNITS, ARBITRARY UNITS
##FACTOR=    0.220516191357247, 1,           1
##FIRST=     3102.03300779395, 0,            0
##LAST=      -510.683755211827, 0,           0
##MIN=       -510.683755211827, -344189,     0
##MAX=       3102.03300779395, 357479472,    0
$$ Real data points
##PAGE= N=1
##DATA TABLE= (X++(R..R)), XYDATA
$$ [...]
7344C598119P4823J14986J17322J46889l3946J20273K38109K23318P3264M2581
$$ 3598119 3672942 3787928 3905250 4052139 4018193 4138466 4376575 4599893 4673157 4715738
7334D715738J0548J44397L63863L9257K79387J63963J98726K04679P6090M23832
$$ 4715738 4726286 4870683 5234546 5273803 5553190 5717153 5915879 6120558 6196648 6620480
7324F620480L35532L35649L37626L06408N92204K72512M00443M36047M37796M71922
$$ 6620480 6956012 7291661 7629287 7935695 8527899 8800411 9200854 9636901 10074697 10546619
7314A0546619N77657O62470O09549P68520P49330Q07390Q52421R01488R60667
$$ 10546619 11124276 11786746 12396295 13164815 13914145 14721535 15573956 16475444 17436111
7305A7436111R99657R85004J159676J248824J180502J117902J318805J387964
$$ 17436111 18435768 19420772 20580448 21829272 23009774 24127676 25446481 26834445
7297B6834445J530817J486061J477069J415906J363791J405870J152172J198405
$$ 26834445 28365262 29851323 31328392 32744298 34108089 35513959 36666131 37864536
7289C7864536R36393O96004O39314M93621J32028j22474m55926n78699p23383
$$ 37864536 38800929 39496933 40136247 40629868 40761896 40639422 40183496 39604797 38881414
7280C8881414r91390r80212j261116j252772j248190j307557j434364j151346
$$ 38881414 37890024 36909812 35648696 34395924 33147734 31840177 30405813 29254467
7272B9254467j347443j342946j391522j025583j035291j194170j120491r06261
$$ 29254467 27907024 26564078 25172556 24146973 23111682 21917512 20797021 19890760
7264A9890760q66016q61168q81464q31813p05189o24741n98635n79005o35082
$$ 19890760 19024744 18163576 17282112 16450299 15745110 15120369 14521734 13942729 13307647
7255A3307647o08438m34788n50309n71636l67584k31178l86583l52101m07114
$$ 13307647 12699209 12264421 11714112 11142476 10774892 10543714 10157131 9805030 9397916
7246I397916k56564n09918k90113k33481l22281k75130j81533j83562k01226k40068
$$ 9397916 9141352 8631434 8341321 8107840 7785559 7510429 7328896 7145334 6944108 6704040
7236F704040j06799r8126j55197j65818j64164k14842j59006n1898j75291k04375
$$ 6704040 6597241 6499115 6343918 6178100 6013936 5799094 5640088 5588190 5412899 5208524
7226E208524j98465q1568k09667k25234j69335j6448P2925j04668l02152j26768
$$ 5208524 5010059 4928491 4718824 4493590 4324255 4307807 4380732 4276064 3973912 3847144
7216C847144j4909j74052k2031l3881j29091l1772j11152q6891K2075j20044j32246
$$ 3847144 3832235 3658183 3636152 3602271 3473180 3441408 3330256 3243365 3265440 3145396 3013150
7205C013150n7201j2221r7166q0591j33778j08705K5049k5801j09222q6587q260
$$ 3013150 2955949 2943728 2846562 2765971 2632193 2523488 2548537 2522736 2413514 2326927 2318667
7194B318667J9557l724j668L2513k01102j7742q0108n7606J25035P397j59825
$$ 2318667 2338224 2334500 2332832 2365345 2164243 2146501 2066393 2008787 2133822 2141219 1981394
7183A981394N8783j12227j44805J50700j02118j29653Q8619J7573j33947J23388
$$ 1981394 2040177 1927950 1783145 1933845 1831727 1702074 1790693 1808266 1674319 1797707
7173A797707K856q6090J13557m4003q3762j8302j25284J36183J753n6405R932
$$ 1797707 1800563 1714473 1828030 1784027 1700265 1681963 1556679 1692862 1694615 1638210 1648142
7162A648142n9145q1281k4564L1260Q2596J6438o5771o3753r4983n8688j8881
$$ 1648142 1588997 1507716 1483152 1514412 1597008 1613446 1547675 1483922 1388939 1330251 1311370
7151A311370k4121P6827N8339q3305L7505k4172l5550J8881R9718n8657L7104
$$ 1311370 1287249 1364076 1422415 1339110 1376615 1352443 1316893 1335774 1435492 1376835 1413939
7140A413939J7197j08643J6926J0560l4255p1954j4174k4403J15650j10782M1139
$$ 1413939 1431136 1322493 1339419 1349979 1315724 1243770 1229596 1205193 1320843 1210061 1251200
7129A251200r6721q8116k6607J0467P0003o7640k7437N0569O6887R2576k6388
$$ 1251200 1154479 1066363 1039756 1050223 1120226 1052586 1025149 1075718 1142605 1235181 1208793
7118A208793L4654L3149O641k3225k5416J55439l5614j21851R1938l1585q5715
$$ 1208793 1243447 1276596 1283237 1260012 1234596 1390035 1354421 1232570 1324508 1292923 1207208
7107A207208J01171j8429M0315p6419k7249k9499m5987p5560J43355J17535J11150
$$ 1207208 1308379 1289950 1330265 1253846 1226597 1197098 1151111 1075551 1218906 1336441 1447591
7096A447591l7865j6104L140J52446K17552N7370R610J02788M0469k3219Q0316
$$ 1447591 1409726 1393622 1396762 1549208 1766760 1824130 1833740 1936528 1976997 1953778 2034094
7085B034094J4813r6033j05113j09244O846j4347J7767o5999j77313k0344m0525
$$ 2034094 2048907 1952874 1847761 1738517 1745363 1731016 1748783 1682784 1505471 1485127 1444602
7074A444602j04894j8636j11956O9068j8738q7455m6345L2702l2913k47424p0931
$$ 1444602 1339708 1321072 1209116 1278184 1259446 1171991 1125646 1158348 1125435 878011 807080
7063H07080J66471Q0205p6033R7210J54383m3248j29522N0649N807n2433m6107
$$ 807080 973551 1053756 977723 1074933 1229316 1186068 1056546 1107195 1113002 1060569 1014462
7052A014462K7199o3338q1908k7543j694n7215p536L547n6436J67624M4070j36936
$$ 1014462 1041661 978323 896415 868872 867178 809963 802427 805974 749538 917162 961232 824296
7040H24296p0374M3963J07853j66901P7901q8098l7342O0470Q3940k2328j22082
$$ 824296 753922 797885 905738 738837 816738 728640 691298 751768 835708 813380 691298
7029F91298j26165J9715M6720l4954r6614J01292n0627p894k024P9283l5575k590
$$ 691298 565133 584848 631568 596614 500000 601292 550665 542771 540747 620030 584455 581865
7017E81865m2940o7479J46884L9367j11493o7398O7988j2582J77272j41152l6458
$$ 581865 538925 471446 618330 657697 546204 478806 546794 534212 711484 570332 533874
7006E33874l0931R0426J18404j27622o1682J35047l9625k02738M1111m6510O68
$$ 533874 502943 593369 711773 584151 522469 657516 617891 415153 456264 409754 410422
6995D10422p8509J06383M6873K974j0908n3925m5494O9475J03218n7018J16705
$$ 410422 331913 438296 485169 488143 477235 423310 377816 447291 550509 493491 610196
6984F10196r2804n9003J61728p4521j20409J36291J3703k6247j03323M3815o6173
$$ 610196 517392 458389 620117 545596 425187 561478 575181 548934 445611 489426 423253
6973D23253M7032J29427m8866j50842M9785o966m343N7097k6821L8938O0186l9386
$$ 423253 470285 599712 550846 400004 449789 442823 438480 495577 468756 507694 567880 528494
6961E28494K5513J6745K7371M3503l8089O4456J9298j7674O5156q5302K0325J15054
$$ 528494 554007 570752 598123 641626 603537 667993 687291 669617 734773 649471 669796 784850
6949G84850N7602j01134J8027o142j7352M015J23663k9340j37182q7709P4202
$$ 784850 842452 741318 759345 753203 735851 739866 863529 834189 697007 609298 683500
6938F83500r7627o4889J21398p0230k3516J17863o4094q9836J50263K894M2714
$$ 683500 585873 520984 642382 572152 548636 666499 602405 512569 662832 665726 708440
6927G08440j36652Q2059J04328j31344l2521j04284j27284J95363n9583o6235
$$ 708440 571788 653847 758175 626831 594310 490026 362742 558105 498522 432287
6917D32287M8689k3110O1825J73892j98543M9759j41546O9546Q8998o4765J04127
$$ 432287 480976 457866 519691 693583 495040 544799 403253 472799 561797 497032 601159
6906F01159l3228j73071n4078J74245o30N6305n577p1061N4195k5522J91694l8133
$$ 601159 567931 394860 340782 515027 514397 570702 565125 494064 548259 522737 714431 676298
6894F76298l9770M7650p3101R1790j5787O137R4607q4020j65962k143n2548R0264
$$ 676298 636528 684178 611077 702867 687080 693217 787824 703804 537842 535699 483151 573415
6882E73415q7572J18467p0680M7558q5844p4728J8180n5388J25596m9615q7387
$$ 573415 485843 604310 533630 581188 495344 420616 438796 383408 509004 459389 372002
6871C72002J08036J1317N8092K0336j88614n033M4582R7510R5934o1134j25735
$$ 372002 480038 491355 549447 569783 381169 376136 420718 518228 614162 553028 427293
6860D27293P785P8767M8899j3082q7957K7275m2730O5560J00902j45181r2370
$$ 427293 435078 513845 562744 549662 461705 488980 446250 511810 612712 467531 375161
6849C75161J81789P1408j6840L4025N0248r074q6442j5837M413J02830j20708
$$ 375161 556950 628358 611518 645543 695791 686717 600275 584438 588851 691681 570973
6838E70973J0491K2873K06453P4957N9028j8628j27410p9442J4469R4477j27364
$$ 570973 581464 604337 810790 885747 944775 926147 798737 719295 733764 828241 700877
6827G00877l1097j8299Q7544l7822r379o4078l3835j23141P8001P1123o0202k3626
$$ 700877 669780 651481 739025 701203 691824 627746 593911 470770 548771 619894 559692 536066
6815E36066r4956M6004m7371n2847m5136m386P3438O3185O1298l488M3329M2289
$$ 536066 441110 487114 439743 386896 341760 337374 410812 473997 535295 531807 575136 617425
6803F17425n5424r2769Q9738K6189o1217k119l8707j41423N2095J00442o5183
$$ 617425 562001 469232 558970 585159 523942 521823 483116 341693 393788 494230 429047
6792D29047K6644j03775P9048J12731Q2059j23346j56416Q190L8056J4392P6255
$$ 429047 455691 351916 430964 543695 625754 502408 345992 354182 392238 406630 482885
6781D82885l2807L2897J55768K3510r9203m6168k0353L8259m7838O0633j11269
$$ 482885 450078 482975 638743 662253 563050 516882 496529 534788 486950 547583 436314
6770D36314N5398J6694J6599k0264Q0059k1616O885j06422L8580J05804k6258
$$ 436314 491712 508406 525005 504741 584800 563184 570069 463647 502227 608031 581773
6759E81773K951m7334l4544j02801P3207k7171K0648M7332J4167j31522n4412
$$ 581773 584724 537390 502846 400045 473252 446081 466729 514061 528228 396706 342294
6748C42294R5062M6367r9088O7169l5491L2928N8509k1117L9026n9297R2999J18658
$$ 342294 437356 483723 384635 451804 416313 449241 507750 486633 525659 466362 559361 678019
6736F78019k78137j11066J78437J81112N277J06719M6098q2862p486P6282M2643
$$ 678019 399882 288816 467253 648365 653642 760361 806459 723597 716111 792393 835036
6725H35036N3319O7648o2665j19397K26976N6234j36951p1845K06573j4022j4211
$$ 835036 888355 956003 893338 773941 1000917 1057151 920200 848355 1054928 1040906 1026695
6714A026695l2303J2799k9308j17692j60470K8402l686L6575p5705m4481J59261
$$ 1026695 994392 1007191 977883 860191 699721 728123 724437 761012 685307 640826 800087
6703H00087l5024M111j497p8242O0171M6322J1591n9487o3863Q6139K3411R7098
$$ 800087 765063 769174 767677 689435 749606 795928 807519 748032 684169 770308 793719 890817
6691H90817J5232n5346j36282O7044j16831L3945j5589J4989J18191Q7418J055
$$ 890817 906049 850703 714421 781465 664634 698579 682990 697979 816170 903588 904643
6680I04643j28759J3925K1010j17023N5589P8143p5488L5603N6645K08627R3195
$$ 904643 775884 789809 810819 693796 749385 827528 752040 787643 844288 1052915 1146110
6669A146110j18628k1170J59345N9565K0594N0990K9619m8862n8294J68296J1002
$$ 1146110 1027482 1006312 1165657 1225222 1245816 1296806 1326425 1277563 1219269 1387565 1398567
6658A398567k2578J7017p2564M1269J00740K0832q4036p7373j90216o5541O567
$$ 1398567 1375989 1393006 1320442 1361711 1462451 1483283 1399247 1321874 1131658 1066117 1072684
6647A072684K6654m4942j1555j5600J6400P087o2001J33202o611l9755j7235J04037
$$ 1072684 1099338 1054396 1042841 1027241 1043641 1050728 988727 1121929 1115318 1075563 1058328 1162365
6635A162365L9506k6822p1159r2151Q4302J25575j6812q9140j07962N7457r5148
$$ 1162365 1201871 1175049 1103890 1011739 1096041 1221616 1204804 1115664 1007702 1065159 970011
6624I70011J20843j20870j5843N4823R4977n3601j08668j2208J9377J03680J2772
$$ 970011 1090854 969984 954141 1008964 1103941 1050340 941672 929464 948841 1052521 1065293
6613A065293M6841M6649j91769p993L6720Q4633n474J2717J21579n2422J503K2685
$$ 1065293 1112134 1158783 967014 959021 995741 1080374 1074900 1087617 1209196 1156774 1158277 1180962
6601A180962o5645P558M336R7958O9929r1873Q5833o3644l0610j3409r629n2341
$$ 1180962 1115317 1122875 1127211 1225169 1295098 1203225 1289058 1225414 1194804 1181395 1171766 1119425
6589A119425n0891m1353J33494K1196K5713P6289N418n4698M5836N7950R2655
$$ 1119425 1068534 1027181 1160675 1181871 1207584 1283873 1289291 1234593 1280429 1338379 1431034
6578A431034l8777P7573L7741o3405J27436J50635o0429L6991J9911n5677q339
$$ 1431034 1392257 1469830 1507571 1444166 1571602 1722237 1661808 1698799 1718710 1663033 1654694
6567A654694J9835l5405J0561L7030l6687p9882k1478J91681n632k284n3931j1826
$$ 1654694 1674529 1639124 1649685 1686715 1650028 1570146 1548668 1740349 1734717 1732433 1678502 1666676
6555A666676J360J01437J58745j29913J79766J85042J89963J52457J32542K85761
$$ 1666676 1668036 1769473 1928218 1798305 1978071 2163113 2353076 2505533 2638075 2923836
6545B923836J73245J13858O1886O4576J83193k4823N5404r5486m0135j47465k71019
$$ 2923836 3097081 3210939 3272825 3337401 3520594 3495771 3551175 3455689 3415554 3268089 2997070
6534B997070O2557l8641n1396q0006K6649N0001K5312K9552J09195R3510j38641
$$ 2997070 3059627 3020986 2969590 2889584 2916233 2966234 2991546 3021098 3130293 3223803 3085162
6523C085162P7468q3534j46016j14515r7869o0519o8383q7631j03432J952n5979
$$ 3085162 3162630 3079096 2933080 2818565 2720696 2660177 2591794 2504163 2400731 2402683 2346704
6512B346704p3067m7704j7760p6930o5185p9885N5221M9071K5085m2451p3022
$$ 2346704 2273637 2225933 2208173 2131243 2066058 1986173 2041394 2090465 2115550 2073099 2000077
6501B000077j3115j01271j33586r3091M7255J3786k1617O6279j5085O2976q3601
$$ 2000077 1986962 1885691 1752105 1659014 1706269 1720055 1698438 1764717 1749632 1812608 1729007
6490A729007n3026q4884R151Q2717J11325j3161j12647j27855M3572N9751J33406
$$ 1729007 1675981 1591097 1600248 1682965 1794290 1781129 1668482 1540627 1584199 1643950 1777356
6479A777356m2928r501M331r4144K18523j6642q6516k5234j2900J00987m7060
$$ 1777356 1734428 1724927 1729258 1635114 1853637 1836995 1750479 1725245 1712345 1813332 1766272
6468A766272L8035l8900o3683M7996j9528j1286J17906O2315N2790L1315j43687
$$ 1766272 1804307 1765407 1701724 1749720 1730192 1718906 1836812 1899127 1951917 1983232 1839545
6457A839545K9213J05380K1895m6245J26440J63366K8609r101l1539M3900Q0502
$$ 1839545 1868758 1974138 1996033 1949788 2076228 2239594 2268203 2259102 2227563 2271463 2351965
6446B351965n983M9039O9800j9218r9092K06109R5580n7360J31481k808L9347
$$ 2351965 2345982 2395021 2464821 2445603 2346511 2552620 2648200 2590840 2722321 2719513 2758860
6435B758860N8010J87938O0022j72408O3840j2384J38331l3737q3969j1383N8858
$$ 2758860 2816870 3004808 3064830 2892422 2956262 2943878 3082209 3048472 2964503 2953120 3011978
6424C011978p8860N4825l6603N4364K6331j14131K032J18454K19822K0339J16004
$$ 3011978 2933118 2987943 2951340 3005704 3032035 2917904 2919936 3038390 3258212 3278551 3394555
6413C394555K3931O5007R4136p8786M9671J28333O9657l2846L5440M868M2331
$$ 3394555 3418486 3483493 3577629 3498843 3548514 3676847 3746504 3713658 3749098 3753966 3796297
6402C796297l9600m3516N1338o4216L9407l420J68694R0142p3266Q2525K16459
$$ 3796297 3756697 3713181 3764519 3700303 3739710 3736290 3904984 3995126 3921860 4004385 4220844
6391D220844o9074J53871K84824N5540m1397l0639J8804J31532J19633K24490
$$ 4220844 4151770 4305641 4590465 4646005 4604608 4573969 4592773 4724305 4843938 5068428
6381E068428K26743J53169J94419O6788K36156J65826K70401L35504K45602L10906
$$ 5068428 5295171 5448340 5642759 5709547 5945703 6111529 6381930 6717434 6963036 7273942
6371G273942M54325M17441K45127L70978M01482O29030O47205N03275P44490Q18677
$$ 7273942 7728267 8145708 8390835 8761813 9163295 9792325 10439530 10942805 11687295 12505972
6361A2505972R10496J040078J083434J259567J066887R73948Q96627P85576N55177
$$ 12505972 13416468 14456546 15539980 16799547 17866434 18840382 19737009 20522585 21077762
6352B1077762O50464Q15292Q36915R89081R96706J142012J156983Q56653R16312
$$ 21077762 21728226 22543518 23380433 24369514 25366220 26508232 27665215 28521868 29438180
6343B9438180N83012M94719Q53506P50490R32810J099784J042114Q85677Q03963
$$ 29438180 30021192 30515911 31369417 32119907 33052717 34152501 35194615 36080292 36884255
6334C6884255Q51138R47892J486255J974597K493144L404132M183180M298078
$$ 36884255 37735393 38683285 40169540 42144137 44637281 48041413 52224593 56522671
6326E6522671M534225M096186L481056K323766Q21550p59825k311691l133756
$$ 56522671 61056896 65153082 68634138 70957904 71779454 71019629 68707938 65574182
6318F5574182l028382k525215j870449r87955k57266M31497J289430K098026K605924
$$ 65574182 62545800 60020585 58150136 57162181 56904915 57336412 58625842 60723868 63329792
6309F3329792L257886L841437M140690M016160L412124K382367J232535l72030
$$ 63329792 66587678 70429115 74569805 78585965 81998089 84380456 85612991 85240961
6301H5240961j535869k397973l606322m405114m563791m217050l576885l122795
$$ 85240961 83705092 81307119 77700797 73295683 68731892 64514842 60937957 57815162
6293E7815162k525146k018423j696128j312483n30317j40660L05375Q89274J469696
$$ 57815162 55290016 53271593 51575465 50262982 49732665 49592005 49897380 50786654 52256350
6284E2256350K030274K816613L430980L881385M139066L984652L822852L056615
$$ 52256350 54286624 57103237 60534217 64415602 68554668 72539320 76362172 79418787
6276G9418787J924358M40570o55028j657664k641326l342582l616672l139311
$$ 79418787 81343145 81783715 81128687 79471023 76829697 73487115 69870443 66731132
6268F6731132k990124k460041j719177j045632m88954L45696J268955J916462
$$ 66731132 63741008 61280967 59561790 58516158 58027204 58372900 59641855 61558317
6260F1558317K289094K586126K271168K079416J117570k16154j720388k848731
$$ 61558317 63847411 66433537 68704705 70784121 71901691 71685537 69965149 67116418
6252F7116418l799086l997290l536145l144046k684371k189784j734914j438518
$$ 67116418 63317332 59320042 55783897 52639851 49955480 47765696 46030782 44592264
6244D4592264j476549j103790r63330j118427j082399j184510j059402j051765
$$ 44592264 43115715 42011925 41048595 39930168 38847769 37663259 36603857 35552092
6236C5552092p77790p60199p34164n84950q21326j089960r54881j082480j054408
$$ 35552092 34774302 34014103 33279939 32694989 31873663 30783703 29828822 28746342 27691934
6227B7691934r70797p55404o07898o83151p05911p51108q23233j250088j320170
$$ 27691934 26721137 25965733 25357835 24674684 23968773 23217665 22394432 21144344 19824174
6218A9824174j125314j061362j001888r20673p45715o93293o80744p70298n31778
$$ 19824174 18698860 17637498 16635610 15714937 14969222 14275929 13595185 12824887 12293109
6209A2293109m56612n41305l87322l11880m25093k92902m64183j15535j86181
$$ 12293109 11836497 11295192 10907870 10595990 10170897 9877995 9413812 9298277 9112096
6200I112096l39640k10294k21806k35915j45653k10226j15356j17452j99954k44044
$$ 9112096 8772456 8562162 8340356 8104441 7958788 7748562 7633206 7515754 7315800 7071756
6190G071756p7354j74531j21094m0951R264j18721k597j71940q6693p9368r3760
$$ 7071756 6994402 6819871 6698777 6657826 6667090 6548369 6545772 6373832 6287139 6207771 6114011
6179F114011N6805j46973j66096j07643j49333k0794j36172k15613r278J8097
$$ 6114011 6170816 6023843 5857747 5750104 5600771 5579977 5443805 5228192 5218914 5237011
6169E237011q8851k9358n840j40709P337m3732j07354r127m8383N404J04464j36301
$$ 5237011 5148160 5118802 5112962 4972253 4979590 4935858 4828504 4819377 4770994 4776398 4880862 4744561
6157D744561r6372L7017k2630q3881l5805k07344p8395M8681m6576j09347R016
$$ 4744561 4648189 4685206 4662576 4578695 4542890 4335546 4257151 4305832 4259256 4149909 4158925
6146D158925N4286j35734l1671m1143r9097l1938P9534N4816q8762o7842j9619
$$ 4158925 4213211 4077477 4045806 4004663 3905566 3873628 3953162 4007978 3919216 3851374 3831755
6135C831755K0794j72219o4218k2674n3328q3655j9894j11206p0387j52479Q5131
$$ 3831755 3852549 3680330 3616112 3593438 3540110 3456455 3436561 3325355 3254968 3102489 3187620
6124C187620o5568k39886j43227R1252k1828o0426J52616o4306j81913k5258j01654
$$ 3187620 3122052 2882166 2738939 2830191 2808363 2747937 2900553 2836247 2654334 2629076 2527422
6113B527422J372k0907r279J43257Q2534m4243o9559r40J3626r330Q8467n2152
$$ 2527422 2528794 2507887 2498608 2641865 2724399 2680156 2610597 2609657 2623283 2613953 2702420 2650268
6101B650268j35008J11987J7972r0888L866J47503p798k9751o9745M7962J02047
$$ 2650268 2515260 2627247 2645219 2554331 2558197 2705700 2697902 2668151 2598406 2646368 2748415
6090B748415Q3713k1656q1964m7822j50582M264n6570O3841J36039k0152r0832
$$ 2748415 2832128 2810472 2728508 2680686 2530104 2534368 2477798 2541639 2677678 2657526 2566694
6079B566694r0589L2436K3618J30625q0048j25496m0379P3325Q2894R0676j4165
$$ 2566694 2476105 2508541 2532159 2662784 2582736 2457240 2416861 2490186 2573080 2663756 2649591
6068B649591L9797j52516N1257J27442n7378m9808O3808M2585N5391m9768p690
$$ 2649591 2689388 2536872 2588129 2715571 2658193 2608385 2672193 2714778 2770169 2720401 2712711
6057B712711L0646k730J50743r9504J12029N4768j02139o5383L9099j25479J35070
$$ 2712711 2743357 2740627 2891370 2791866 2903895 2958663 2856524 2791141 2830240 2704761 2839831
6046B839831o0725j32480J20933N8154l9761J89134j40972l8817Q125k3263P8675
$$ 2839831 2779106 2646626 2767559 2825713 2785952 2975086 2834114 2795297 2803422 2780159 2858834
6035B858834j18820r822k4776J9120J05915j30822j11434L6382k1669J66527l7447
$$ 2858834 2740014 2730192 2705416 2724536 2830451 2699629 2588195 2624577 2602908 2769435 2731988
6024B731988m7217M0811O6213L5931m2394j40317P173K7605J7334K6095n4938
$$ 2731988 2684771 2725582 2791795 2827726 2785332 2645015 2652188 2679793 2697127 2723222 2668284
6013B668284l2779M4849l2087l3377m0352J18037J07837P1756q43J71350P2517
$$ 2668284 2635505 2680354 2648267 2614890 2574538 2692575 2800412 2872168 2871325 3042675 3115192
6002C115192j01838M381J3739J11633j03546M8483l0427k26864m9892L8909o197
$$ 3115192 3013354 3017735 3031474 3143107 3039561 3088044 3057617 2830753 2780861 2819770 2813573
5991B813573q3140k9263J16742M0588k0674O88K5921J06083o6282L3455J21139
$$ 2813573 2730433 2701170 2817912 2858500 2837826 2838514 2864435 2970518 2904236 2937691 3058830
5980C058830J28149p0552M8329P4103K9307j44913K4008J81924K3115J50728j04656
$$ 3058830 3186979 3116427 3164756 3238859 3268166 3123253 3147261 3329185 3352300 3503028 3398372
5969C398372l0055O9399r8668L4417J30179J34185J00215J29252J3465O008J75603
$$ 3398372 3368317 3437716 3339048 3373465 3503644 3637829 3738044 3867296 3880761 3886769 4062372
5958D062372J37863J52076N8841J26066p3196j20070q5549r8042n33l10162l08110
$$ 4062372 4200235 4352311 4411152 4537218 4464022 4343952 4258403 4160361 4159828 3849666 3541556
5947C541556M8055j1377Q7129r1969M4192n9351o3338L8538m9383J0303m0653
$$ 3541556 3589611 3578234 3665363 3573394 3617586 3558235 3494897 3533435 3484052 3494355 3453702
5936C453702m339L1519P4543r1584O1413k6359q8745M7325j8595o2167m1539J31205
$$ 3453702 3449363 3480882 3555425 3463841 3525254 3498895 3410150 3457475 3438880 3376713 3335174 3466379
5924C466379j7469K9381o7314k2245L6456P9760J16150l1431J33643k8251j00270
$$ 3466379 3448910 3478291 3410977 3388732 3425188 3504948 3621098 3589667 3723310 3695059 3594789
5913C594789O4414N8453K3362M5817p2814n0941O380K37483P3986j1885J74959
$$ 3594789 3659203 3717656 3741018 3786835 3714021 3663080 3669460 3906943 3980929 3969044 4144003
5902D144003K50384q943J28283K34555P1058n2740K114K9903J07773r8633k8997
$$ 4144003 4394387 4385444 4513727 4748282 4819340 4766600 4768714 4798617 4906390 4807757 4778760
5891D778760K5402J75598K74236m9389j6961K4096K7160K2846m6324J66306R6512
$$ 4778760 4804162 4979760 5253996 5204607 5187646 5211742 5238902 5261748 5215424 5381730 5478242
5880E478242m3924k50649j66644k9502P9565j00099l1304P6696j47833K2987N0469
$$ 5478242 5434318 5183669 5017025 4987523 5067088 4966989 4935685 5012381 4864548 4887535 4938004
5869D938004j39158o0281l2192J20830J76794K3909j52670r4281m7172N7817o95
$$ 4938004 4798846 4738565 4706373 4827203 5003997 5027906 4875236 4780955 4733783 4791600 4790905
5858D790905l15206r4729n6519M762j86045J99804K51829P9549q9623r4536K8922
$$ 4790905 4475699 4380970 4324451 4329213 4143168 4342972 4594801 4674350 4584727 4490191 4519113
5847D519113J68635p632l3j40295J3868N6532J05628n0300m2140j39664j01994
$$ 4519113 4687748 4680116 4680083 4539788 4553656 4610188 4715816 4665516 4623376 4483712 4381718
5836D381718j10139j8626O8374j8296L7311J05441K21214J44755O81K40450J14866
$$ 4381718 4271579 4252953 4321327 4303031 4340342 4445783 4666997 4811752 4812433 5052883 5167749
5825E167749J19988R5811J03240J50887J57752K63019J60344J47817J11477K10588
$$ 5167749 5287737 5383548 5486788 5637675 5795427 6058446 6218790 6366607 6478084 6688672
5815F688672K70606k704j08283L5542J74962l6573j18495j86903k45764j55827
$$ 6688672 6959278 6956574 6848291 6883833 7058795 7022222 6903727 6716824 6471060 6315233
5805F315233j22144j09328j02034j87070j62129k8242j43288j34305j67727q2640
$$ 6315233 6193089 6083761 5981727 5794657 5632528 5604286 5460998 5326693 5158966 5076326
5795E076326p2367j17018k13209J1830k40816O55j57966p2983j2015r1688J412
$$ 5076326 5003959 4886941 4673732 4685562 4444746 4445401 4287435 4214452 4202437 4110749 4112161
5784D112161J27482L0687J7466J01983O9755J37380Q1459k8453J8452m4449p8594
$$ 4112161 4239643 4270330 4287796 4389779 4459534 4596914 4678373 4649920 4668372 4623923 4545329
5773D545329P566R8215O8970q1181j37691m21k5396j94944L8042N4355j27077
$$ 4545329 4552895 4651110 4720080 4638899 4501208 4500787 4475391 4280447 4318489 4372844 4245767
5762D245767q8855o7041O4483N6837k07434R6827Q7810o0443n3305q6841j13861
$$ 4245767 4156912 4089871 4154354 4211191 4003757 4100584 4188394 4127951 4074646 3987805 3873944
5751C873944j30129J6227p9817m7326j78108n535P7838m4476P8094j73344o7113
$$ 3873944 3743815 3760042 3680225 3632899 3454791 3449256 3527094 3482618 3560712 3387368 3320255
5740C320255q5985p8121r8773j52622R0689K01309J10733p9979J23729j90232
$$ 3320255 3234270 3156149 3057376 2904754 2995443 3196752 3307485 3227506 3351235 3161003
5730C161003n8504M9212J20565J8551k7167J04997m102o8810M2878J80559m9359
$$ 3161003 3102499 3151711 3272276 3290827 3263660 3368657 3364555 3295745 3338623 3519182 3469823
5719C469823J02992J79648p769J36269k1406R4590K12043J55087J02790R8703
$$ 3469823 3572815 3752463 3744694 3880963 3859557 3954147 4166190 4321277 4424067 4522770
5709D522770K05622K50427Q4441J83041K30987M0916J61775j06175P5170K25631
$$ 4522770 4728392 4978819 5063260 5246301 5477288 5518204 5679979 5573804 5648974 5874605
5699E874605L0628k3582J31375j08665Q6564K28736l8986q9105j5507L3643J09637
$$ 5874605 5905233 5881651 6013026 5904361 5990925 6219661 6180675 6091570 6076063 6109706 6219343
5688F219343R7133O9602J36645J44355j2879J51082K41193J46009J72297J55377
$$ 6219343 6316476 6386078 6522723 6667078 6654199 6805281 7046474 7192483 7364780 7520157
5678G520157L02890L49260L69190K20501J54890J45300n6289k6416l5913J3120
$$ 7520157 7823047 8172307 8541497 8761998 8916888 9062188 9005899 8979483 8943570 8956690
5668H956690o9555q3657j03595l0398m8242k07170J1207M5278l7063m1543P1362
$$ 8956690 8887135 8803478 8699883 8669485 8621243 8414073 8425280 8470558 8433495 8391952 8463314
5657H463314J25423Q7645M7270N9808J30046K32522J31339J29525K90225J70451
$$ 8463314 8588737 8676382 8723652 8783460 8913506 9146028 9277367 9406892 9697117 9867568
5647I867568L22785K99336L08317K16722L73767L93463K63938J72604J26707J00650
$$ 9867568 10190353 10489689 10798006 11014728 11388495 11781958 12045896 12218500 12345207 12445857
5637A2445857j53570M8791O4744r1325j1539R7411L614J52595J27457J43927J38871
$$ 12445857 12292287 12341078 12405822 12314497 12302958 12400369 12403983 12556578 12684035 12827962 12966833
5626A2966833K20077K27349J77514J27604K58413L89651L04758N17002M56763
$$ 12966833 13186910 13414259 13591773 13719377 13977790 14367441 14672199 15189201 15645964
5617A5645964M40243N07432O52465P16272P11631N68557P54813Q01774R94684
$$ 15645964 16086207 16593639 17246104 17962376 18674007 19242564 19997377 20799151 21793835
5608B1793835J052728J107179J117959J114953J301800J405236J671652J826643
$$ 21793835 22846563 23953742 25071701 26186654 27488454 28893690 30565342 32391985
5600C2391985J815419K260759K456521K803126L244707L629985L946619M473293
$$ 32391985 34207404 36468163 38924684 41727810 44972517 48602502 52549121 57022414
5592E7022414N269641N639606O200102O556208O877705P185716P054574O846654
$$ 57022414 62292055 67931661 74131763 80687971 87565676 94751392 101805966 108652620
5584A08652620O098323M749169L453237J873020n885k088132l346119m524115
$$ 108652620 114750943 119500112 122953349 124826369 124820484 122732352 119386233 114862118
5576A14862118n207827n526088n707737n870691o143914o301273o105145n787065
$$ 114862118 109654291 104128203 98420466 92549775 86405861 80104588 73999443 68212378
5568F8212378n328151m898806m538309m099090l676050l194848k788596k632315
$$ 68212378 62884227 57985421 53447112 49348022 45671972 42477124 39688528 37056213
5560C7056213k360080k059633j987539j607161j389156j332012j319565j303518
$$ 37056213 34696133 32636500 30648961 29041800 27652644 26320632 25001067 23697549
5552B3697549j012922q68067r00785q83955q07671o05282o17119o04742n10041
$$ 23697549 22684627 21816560 20915775 20031820 19224149 18618867 18001748 17397006 16886965
5543A6886965o02838o65283m18149n05906l03487n02873m39387m29736n43377
$$ 16886965 16284127 15618844 15200695 14694789 14391302 13888429 13449042 13019306 12475929
5534A2475929l73587l97550m18470m58095j47176l00976k45955m73535l66054
$$ 12475929 12102342 11704792 11286322 10828227 10681051 10380075 10134120 9660585 9294531
5525I294531l20448k06260j68146k35262k30987k02934r4214k27432k21517j81772
$$ 9294531 8974083 8767823 8599677 8364415 8133428 7930494 7836280 7608848 7387331 7205559
5515G205559k00675k06803r9135j47797q7943j16571j42993J1173j27680o0160
$$ 7205559 7004884 6798081 6698946 6551149 6463206 6346635 6203642 6214815 6087135 6026975
5505F026975k4258k3496n6115l1906q2799P0213l2006j12308R3626o8245N3603
$$ 6026975 6002717 5979221 5923106 5891200 5808401 5878614 5846608 5734300 5827926 5759681 5813284
5494E813284R0915m8434r8665N0580m5505j99047K29021Q0140j30509M018L3445
$$ 5813284 5904199 5855765 5757100 5807680 5762175 5563128 5792149 5872289 5741780 5745798 5779243
5483E779243k6575j50614r5587j29671n0939L182n4614k52214j42366P3868q6280
$$ 5779243 5752668 5602054 5506467 5376796 5325857 5329039 5274425 5022211 4879845 4953713 4867433
5472D867433l32504j21091l5252J1272k8020o7646N5321K3412j27960j92658j12828
$$ 4867433 4534929 4413838 4378586 4389858 4361838 4294192 4349513 4372925 4244965 4052307 3939479
5461C939479j85809j13156j0430j5698J4117p4608n391M681o3565j26582Q9482
$$ 3939479 3753670 3640514 3630084 3614386 3628503 3553895 3548504 3553185 3489620 3363038 3452520
5450C452520J44054l5440o9315r2349r4756J50324J04974k686P7878O3392j27662
$$ 3452520 3596574 3561134 3491819 3399470 3304714 3455038 3560012 3557326 3635204 3698596 3570934
5439C570934n2111l8901R5676J18832j7254P1849n0726k3K5642J17417j13664
$$ 3570934 3518823 3479922 3575598 3694430 3677176 3749025 3698299 3698276 3723918 3841335 3727671
5428C727671p708J6348j404N3237N2088j40634L208O0986j1475M9681J09825K9670
$$ 3727671 3719963 3736311 3734907 3788144 3840232 3699598 3702806 3763792 3752317 3801998 3911823 3941493
5416C941493j9235L5989n2609m6590P0380n985n8610O3600j06363r4877j80446
$$ 3941493 3922258 3958247 3905638 3859048 3929428 3923443 3864833 3928433 3822070 3727193 3546747
5405C546747j23186J3091L1272j99780k1731Q394K5437r4357j56615O4345l8732
$$ 3546747 3423561 3436652 3467924 3268144 3246413 3254807 3280244 3185887 3029272 3093617 3054885
5394C054885J7391j15611o7513k6690K0146J4103l8410Q3190j49524p0964m4024
$$ 3054885 3072276 2956665 2889152 2862462 2882608 2896711 2858301 2941491 2791967 2721003 2676979
5383B676979J15738J30380j12174p9962O7326Q2277k9443m0439M3532j32084j22495
$$ 2676979 2792717 2923097 2810923 2730961 2798287 2880564 2851121 2810682 2854214 2722130 2599635
5372B599635O0490K47085M8028l2958J1326q997p848j8567q3673n8381j06735
$$ 2599635 2660125 2907210 2955238 2922280 2933606 2924609 2916761 2898194 2814521 2756140 2649405
5361B649405k9416k3125J7810j04029o1035L3910o8351M5445l1072N7153j05048
$$ 2649405 2619989 2596864 2614674 2510645 2449610 2483520 2415169 2460614 2429542 2486695 2381647
5350B381647p0997k606O9892J0451l418r4839r3017M5254K1873R9803l0388n6938
$$ 2381647 2310650 2308044 2377936 2388387 2384969 2290130 2197113 2242367 2264240 2364043 2333655 2276717
5338B276717O5087j12583N8595K5850O747R98j2378j523j5433J641M3068K258
$$ 2276717 2341804 2229221 2287816 2313666 2320413 2321411 2309033 2307510 2292077 2293718 2336786 2339044
5326B339044l2036O6579j19198L8372J23969J1325p9699Q8386P2264j49820m1066
$$ 2339044 2307008 2373587 2254389 2292761 2416730 2428055 2348356 2436742 2509006 2359186 2318120
5315B318120r419M1531r8744N6868R1388j599j18261O0007J53340N2904p6937
$$ 2318120 2308701 2350232 2251488 2308356 2399744 2398145 2279884 2339891 2493231 2546135 2469198
5304B469198j3199r1091L9939O0340o9926j8149L4765J53984k8979m3618P4555
$$ 2469198 2455999 2364908 2404847 2465187 2395261 2377112 2411877 2565861 2536882 2493264 2567819
5293B567819K3600R3185K28006n9785o1907Q3529J26262j8689K8296o0224K00333
$$ 2567819 2591419 2684604 2912610 2852825 2790918 2874447 3000709 2982020 3010316 2950092 3150425
5282C150425K0764k3579K51891N5047P9312J17553J00736O6783m3504J31199J62930
$$ 3150425 3171189 3147610 3399501 3454548 3533860 3651413 3752149 3818932 3775428 3906627 4069557
5271D069557M7527P7165K09177K32455J41162J81334J44924K57887L94244N48718
$$ 4069557 4117084 4194249 4403426 4635881 4777043 4958377 5103301 5361188 5755432 6304150
5261F304150N48494N74851M61471M73963M03553L36975K6207r0130m49804n98209
$$ 6304150 6852644 7427495 7888966 8362929 8766482 9103457 9129664 9039534 8589730 7991521
5251G991521m26228l00705m91739l86380j73467k61113k10848j92915j62935l6034
$$ 7991521 7565293 7264588 6772849 6386469 6213002 5951889 5741041 5548126 5385191 5349157
5241E349157j40601j47079j796j06466r0680N5941l6048J3692J18122J22044l4319
$$ 5349157 5208556 5061477 5059681 4953215 4862535 4918476 4882428 4896120 5014242 5136286 5101967
5230E101967o8629R3921P6154J5657O9493j668Q4152J61190J18257J45727L44295
$$ 5101967 5033338 5127259 5203413 5219070 5288563 5286895 5371047 5532237 5650494 5796221 6140516
5219F140516L25368J23928K36937L68258M24515L26503L09767L37945M30312N11105
$$ 6140516 6465884 6589812 6826749 7195007 7619522 7946025 8255792 8593737 9024049 9535154
5209I535154P28071P25736J050881R37825R12062J065450R46208Q93781P85237
$$ 9535154 10263225 10988961 12039842 12977667 13889729 14955179 15901387 16795168 17580405
5200A7580405N47547L57557Q8188J07542k1075Q5506J45661O9977L84422O69244
$$ 17580405 18127952 18485509 18573697 18681239 18660164 18745670 18891331 18961308 19345730 20014974
5190B0014974N91169M13661N08518L13414J61964N1438k37157m42784o85742o09729
$$ 20014974 20606143 21019804 21528322 21841736 22003700 22055138 21817981 21375197 20689455 20079726
5180B0079726n70320n60378p00726m70751k53630j94352k5251j1946Q7833J71932
$$ 20079726 19509406 18949028 18248302 17777551 17523921 17329569 17304318 17292372 17380205 17552137
5170A7552137L35393O85938N81049Q37837R28732J283856J278202J218714J158465
$$ 17552137 17887530 18573468 19154517 19992354 20921086 22204942 23483144 24701858 25860323
5161B5860323J323439J280590J141406J164256J126391J146885J202472J414027
$$ 25860323 27183762 28464352 29605758 30770014 31896405 33043290 34245762 35659789
5153C5659789J336721J440118J049463J028544N60245K68127j36452p05874j065930
$$ 35659789 36996510 38436628 39486091 40514635 41074880 41343007 41206555 40500681 39434751
5144C9434751j449139j585149j817572j876626j697925j544408j232828r92287
$$ 39434751 37985612 36400463 34582891 32706265 31008340 29463932 28231104 27238817
5136B7238817q98466n59902m31174j82334K56855O02841P99858J099021J276119
$$ 27238817 26340351 25780449 25349275 25166941 25423796 26026637 26826495 27925516 29201635
5127B9201635J418571J720499J537887J073409R04937M66552n32326j196750j062862
$$ 29201635 30620206 32340705 33878592 34952001 35856938 36323490 35791164 34594414 33531552
5118C3531552j217413j521318j809187j530513j554473j527553j482934j478821
$$ 33531552 32314139 30792821 28983634 27453121 25898648 24371095 22888161 21409340
5110B1409340j052284j141602q95773p62325n04557o76820o31161n16283m62151
$$ 21409340 20357056 19215454 18319681 17557356 17052799 16375979 15744818 15228535 14766384
5101A4766384m73111m23386l73760l21609k23431j11448j23663j77413l29135
$$ 14766384 14293273 13869887 13496127 13174518 12951087 12839639 12715976 12538563 12209428
5092A2209428j12071q7103R0728K0040K46764J60456k6340L7677Q6129r4736Q0722
$$ 12209428 12097357 12010254 12100982 12121022 12367786 12528242 12501902 12539579 12625708 12530972 12611694
5081A2611694l5177k46534j15986l43245j71801k66125m35468j07907n6755k17992
$$ 12611694 12576517 12329983 12213997 11870752 11698951 11432826 10997358 10889451 10832696 10614704
5071A0614704k19190q3481k8211k69610j68631R1873O8562m0033j09645o5644
$$ 10614704 10395514 10312033 10283822 10014212 9845581 9937454 10006016 9965983 9856338 9790694
5061I790694j47810J86759q1764j55269J02255M3403p3030p7411R2963j32244
$$ 9790694 9642884 9829643 9747879 9592610 9694865 9738268 9665238 9587827 9680790 9548546
5051I548546J56164K4374O8050K73021J20551n0801m89J18734R203k9671L5798
$$ 9548546 9704710 9729084 9797134 10070155 10190706 10139905 10139416 10258150 10267353 10237682 10273480
5040A0273480R9385R5734P3713R9199q086j6584J83914J82846R3841J98622K15836
$$ 10273480 10372865 10468599 10542312 10641511 10633425 10616841 10800755 10983601 11077442 11276064 11491900
5029A1491900L22841J17963J06014R2646J47402J34486J20933K22430K66448K81222
$$ 11491900 11814741 11932704 12038718 12131364 12278766 12413252 12534185 12756615 13023063 13304285
5019A3304285M2080K06161L65488J82843K06630J1241j6958N0509j69585O3810
$$ 13304285 13346365 13552526 13918014 14100857 14307487 14318728 14301770 14352279 14182694 14246504
5009A4246504J79582N6444J86653K31227L23706J22882L25193L05565K51499L64226
$$ 14246504 14426086 14482530 14669183 14900410 15224116 15346998 15672191 15977756 16229255 16593481
4999A6593481O44855M03464L97128L79663L42269M59605L84555L61555K74718
$$ 16593481 17238336 17641800 18038928 18418591 18760860 19220465 19605020 19966575 20241293
4990B0241293K20084J92406K66002L36904L10003J95678J74467L40939K27937
$$ 20241293 20461377 20653783 20919785 21256689 21566692 21762370 21936837 22277776 22505713
4981B2505713K24867K77473L94341N46887L96455N64450M84988M48172M98807
$$ 22505713 22730580 23008053 23402394 23949281 24345736 24910186 25395174 25843346 26342153
4972B6342153O08287O61860P11000M52832N18998M39049N04904P83099N90538
$$ 26342153 26950440 27612300 28323300 28776132 29295130 29734179 30239083 31022182 31612720
4963C1612720O29484N23271M84259M82912L97212M99099N11758M44931M13678
$$ 31612720 32242204 32765475 33249734 33732646 34129858 34628957 35140715 35585646 35999324
4954C5999324L46245N16453N14401P10269P39112N53769O49953P07536O51021
$$ 35999324 36345569 36862022 37376423 38086692 38825804 39379573 40029526 40737062 41388083
4945D1388083Q82525P89986O71086Q29580R95142J062601J158660J273388J469166
$$ 41388083 42270608 43060594 43731680 44561260 45556402 46619003 47777663 49051051 50520217
4936E0520217J762168J863673K227727K363843K708289K980226L225752L448733
$$ 50520217 52282385 54146058 56373785 58737628 61445917 64426143 67651895 71100628
4928G1100628L748838M064325M204726M516372M980370N459239N816562O496854
$$ 71100628 74849466 78913791 83118517 87634889 92615259 98074498 103891060 110387914
4920A10387914P131051P567594Q110143Q558788R098659R543534R930782R776735
$$ 110387914 117518965 125086559 133196702 141755490 150854149 160397683 170328465 180105200
4912A80105200R614784Q843051P778672O081906L723839J390387j146394l206501
$$ 180105200 189719984 198563035 206341707 212423613 216147452 217537839 216391445 213184944
4904B13184944m645078n374822o124683o104351n699272n447275n445737n786713
$$ 213184944 208539866 203165044 197040361 190936010 185236738 179789463 174343726 168557013
4896A68557013o042534o542778o548961o215470o191322o076743n715510n652389
$$ 168557013 162514479 155971701 149422740 143207270 137015948 130939205 125223695 119571306
4888A19571306n604288n625205n500523n427632n281881m998678m784756m425719
$$ 119571306 113967018 108341813 102841290 97413658 92131777 87133099 82348343 77922624
4880G7922624m026134l570682l213743k898655k626632k402787k114261k101927
$$ 77922624 73896490 70325808 67112065 64213410 61586778 59183991 57069730 54967803
4872E4967803j889875j590925j503266j373654j203850r29028q08274o13187n74753
$$ 54967803 53077928 51487003 49983737 48610083 47406233 46477205 45668931 45055744 44480991
4863D4480991l21695P6972K88062N17799Q85193J157600J642261J962294K274564
$$ 44480991 44159296 44236268 44524330 45042129 45927322 47084922 48727183 50689477 52964041
4854E2964041K583001K790943K805039K636945K531258J985951J265263M48946
$$ 52964041 55547042 58337985 61143024 63779969 66311227 68297178 69562441 70011387
4846G0011387k77739j225750k005512k642191l221253l358775l224039l315230
$$ 70011387 69733648 68507898 66502386 63860195 60638942 57280167 54056128 50740898
4838E0740898l265847l008708k613243k387209k113923j986363j479060j457584
$$ 50740898 47475051 44466343 41853100 39465891 37351968 35365605 33886545 32428961
4830C2428961j304654j098815j076065r42816q75250q14890p25409o71845o86178
$$ 32428961 31124307 30025492 28949427 28006611 27131361 26316471 25591062 24919217 24233039
4821B4233039p09536o47081o50097p03597m09476m32250n03019n02431l60337
$$ 24233039 23523503 22876422 22226325 21522728 21113252 20681002 20177983 19675552 19315215
4812A9315215m18483k71516k95996k44370j88924k76122k94381l31608j12094
$$ 19315215 18896732 18625216 18329220 18084850 17895926 17619804 17325423 16993815 16881721
4803A6881721k33592k02681L0906j41025o8035j61099Q3704J60701j04854R3634
$$ 16881721 16648129 16445448 16476354 16335329 16267294 16106195 16189899 16350600 16245746 16339380
4793A6339380J28115r1518j00874j40183l43071l11733m6994J03326J277j9341
$$ 16339380 16467495 16375977 16275103 16134920 15791849 15480116 15433122 15536448 15537725 15518384
4783A5518384P6831k7175J29768J80565K96045K25797P5743M6896K31051Q2152
$$ 15518384 15595215 15568040 15697808 15878373 16174418 16400215 16475958 16522854 16753905 16836057
4773A6836057k51736j29411j54958J4138k12872j14748Q7528R8766q5295j47509
$$ 16836057 16584321 16454910 16299952 16314090 16101218 15986470 16073998 16172764 16087469 15939960
4763A5939960o741l2990J14348O666l1466K14968M4010J55877L02236K07471L09482
$$ 15939960 15933219 15900229 16014577 16021243 15989777 16204745 16248755 16404632 16706868 16914339 17223821
4752A7223821J76594K73740M69888K42898L98J70059K49469J78366J2030J24595
$$ 17223821 17400415 17674155 18144043 18386941 18387339 18557398 18806867 18985233 18997263 19121858
4742A9121858k7287M339J39304K84696J83719L23895M09185M16854M46460L53739
$$ 19121858 19094571 19098910 19238214 19522910 19706629 20030524 20439709 20856563 21303023 21656762
4732B1656762N34568O12392P16327R66622R37808J168422J442316J549911J704116
$$ 21656762 22191330 22803722 23520049 24486671 25424479 26592901 28035217 29585128 31289244
4723C1289244J989137K042881K267327K643909L214682L520694M229850M412064
$$ 31289244 33278381 35321262 37588589 40232498 43447180 46967874 51197724 55609788
4715E5609788N079177N614370O446694P226831R183767J1684475J5162722J9322668
$$ 55609788 60688965 66303335 72750029 79976860 89160627 100845102 116007824 135330492
4707A35330492K3645543K4546862K4736131K3903603J9721774J2066293L195237
$$ 135330492 158976035 183522897 208259028 232162631 251884405 263950698 267145935
4700B67145935j3845283k9366073k6659141k1655764j7635720j5020690j2398888
$$ 267145935 253300652 223934579 197275438 175619674 157983954 142963264 130564376
4693A30564376j0502024q778859p809497p213592o924631n868678n157168m358326
$$ 130564376 120062352 111283493 103473996 96260404 89335773 83467095 78309927 73951601
4685G3951601l778923k939505k415818j987407j318708q32801k68579L70358N50849
$$ 73951601 70172678 67233173 64817355 62829948 61511240 60678439 60409860 60780218 61331067
4676F1331067Q62905J029482J036586R49735N77885J49587J24939L56534M14894
$$ 61331067 62193972 63223454 64260040 65209775 65787660 65937247 66062186 66418720 66833614
4667F6833614K60257M90209O76965R91144J515222K227914L015035L773492M807307
$$ 66833614 67093871 67584080 68261045 69252189 70767411 72995325 76010360 79783852 84591159
4658H4591159N457401N661598N253369M534084L180334J276111n57534j756732
$$ 84591159 90048560 95710158 100963527 105497611 108677945 109954056 109396522 107639790
4650A07639790j974992j343008o78506N09942J702224K752221L765995M836571
$$ 107639790 105664798 104321790 103643284 104153226 105855450 108607671 112373666 117210237
4642A17210237O343220Q258480J0774808J3708348J6141143J8028083J8709975
$$ 117210237 123553457 131811937 142586745 156295093 172436236 190464319 209174294
4635B09174294J8053848J5554427J0631364L765399m754796j3745904j8564139
$$ 209174294 227228142 242782569 253413933 257179332 252424536 238678632 220114493
4628B20114493j8477169j6511878j4373029j2313416j0409605q833900p584935
$$ 220114493 201637324 185125446 170752417 158439001 148029396 139195496 131610561
4621A31610561o390638n656097m489560l293885k268780j391398o77412l03236
$$ 131610561 125219923 119563826 115074266 111780381 109511601 108120203 107442791 107139555
4613A07139555j65881m83989j282362k383077l547688m371489m657146m231634
$$ 107139555 106973674 106489685 105207323 102824246 99276558 94905069 90247923 86016289
4605H6016289l430449k900125k376560k076124j658963j655916k044041k255549
$$ 86016289 82585840 79685715 77309155 75233031 73574068 71918152 69874111 67618562
4597F7618562k391288k553454k693803k863345k673322k535204k112490j854384
$$ 67618562 65227274 62673820 59980017 57116672 54443350 51908146 49795656 47941272
4589D7941272j776600j613176j324547j149801j062052r20890q51052n67604l07506
$$ 47941272 46164672 44551496 43226949 42077148 41015096 40094206 39243154 38675550 38368044
4580C8368044j83522j0492J46564N32874N10281P42731R32914P53060Q86357R15040
$$ 38368044 38184522 38174030 38320594 38853468 39363749 40106480 41039394 41792454 42678811 43593851
4570D3593851Q58712P51792P31751P18391J053433J140489J313955J681855J789651
$$ 43593851 44452563 45204355 45936106 46654497 47707930 48848419 50162374 51844229 53633880
4561E3633880J837032K052595J951102J753641J368897P05502m98385j697282
$$ 53633880 55470912 57523507 59474609 61228250 62597147 63302649 62804264 61106982
4553F1106982k715847l363489l268935k763731k487746k041889j655623j346355
$$ 61106982 58391135 55027646 51758711 48994980 46507234 44465345 42809722 41463367
4545D1463367j001404r17813n87884n27754m32879j80551k60626j79695Q7775
$$ 41463367 40461963 39544150 38956266 38428512 37995633 37815082 37554456 37374761 37462536
4536C7462536K89695L19120O84655J083196J114408J499752J953423K162513K609306
$$ 37462536 37752231 38071351 38756006 39839202 40953610 42453362 44406785 46569298 49178604
4527D9178604K909735L106780L185359K970753K966422K619256J949943J666721
$$ 49178604 52088339 55195119 58380478 61351231 64317653 66936909 68886852 70553573
4519G0553573J563808J525866J514259J548202J440763J486205J736076J882662
$$ 70553573 72117381 73643247 75157506 76705708 78146471 79632676 81368752 83251414
4511H3251414K294887K656351L266654L997583M782989N473080O699324P952199
$$ 83251414 85546301 88202652 91469306 95466889 100249878 105722958 112422282 120374481
4503A20374481R369802J1314152J3424586J6184572J9919943K3840076K7350471
$$ 120374481 129744283 141058435 154483021 170667593 190587536 214427612 241778083
4496B41778083K8872665K8065958K5418674K0150347J1912976J280769j2487457
$$ 241778083 270650748 298716706 324135380 344285727 356198703 357479472 344992015
4489C44992015k7285962l2854313l0082467k5913041k2328172j9235943j6522965
$$ 344992015 317706053 284851740 254769273 228856232 206528060 187292117 170769152
4482A70769152j4520063j2669321j1519336j0889349r953443q805132p773957
$$ 170769152 156249089 143579768 132060432 121171083 111217640 102412508 94638551
4475I4638551o915276n978720n365444m603590l899479l326981l136268k693111
$$ 94638551 87723275 81744555 76379111 71775521 67876042 64549061 61412793 58719682
4467E8719682k253058k117652j791771j443110j305223j078623r91894n40797
$$ 58719682 56466624 54348972 52557201 51114091 49808868 48730245 47738351 47197554
4459D7197554k39727J90547M89571O69517J031301J083288J072059M59171J31645
$$ 47197554 46957827 47148374 47637945 48307462 49338763 50422051 51494110 51953281 52084926
4450E2084926l99281j096857j676674j987962j856436j493023j286657r55307
$$ 52084926 51685645 50588788 48912114 46924152 45067716 43574693 42288036 41332729
4442D1332729n44407r3111J40656L50554K33031r274k74978o89275j355271j918916
$$ 41332729 40788322 40695211 40835867 41186421 41419452 41410178 41135200 40445925 39090654 37171738
4432C7171738k124329k079513j730556j645493j382256j223495r61897r36149
$$ 37171738 35047409 32967896 31237340 29591847 28209591 26986096 26024199 25088050
4424B5088050q22737o67778o61925m20257l00776k16492j014J40598K88774M57206
$$ 25088050 24265313 23597535 22935610 22515353 22214577 21998085 21997071 22137669 22426443 22883649
4414B2883649O82884O50077O09099M17836K14431L7617l68843o04661o81647r11841
$$ 22883649 23566533 24216610 24825709 25243545 25457976 25495593 25126750 24522089 23840442 22928601
4404B2928601n29486k41902j89158O9570J74599K99598L54320J18714L5347l6947
$$ 22928601 22399115 22157213 21968055 22037625 22212224 22511822 22866142 22984856 23020203 22983256
4394B2983256m06656p37070j063966j025996r80672q54709q83730n50124l50626
$$ 22983256 22576600 21839530 20775564 19749568 18768896 17914187 17030457 16480333 16129707
4385A6129707o25419n90814n70635o31312m53718n64398n25937k46206k42468
$$ 16129707 15504288 14913474 14342839 13711527 13257809 12693411 12167474 11921268 11678800
4376A1678800l23925j44173j37407j69922k15231j96971l6276o0209k51153j49847
$$ 11678800 11354875 11210702 11073295 10903373 10688142 10491171 10454895 10394686 10143533 9993686
4366I993686j41713k04930j42881k58487j79857j95722j59756m4486m4772k73862
$$ 9993686 9851973 9647043 9504162 9245675 9065818 8870096 8710340 8665854 8621082 8347220
4356H347220r2020K6471K4832K7974l57986j870o7889j28233j80991j19533k20375
$$ 8347220 8255200 8281671 8306503 8334477 7976491 7974621 7906732 7778499 7597508 7477975 7257600
4345G257600j42330j15879q9418j03622k68016j17400L7670q2941K8427l9624
$$ 7257600 7115270 6999391 6909973 6806351 6538335 6420935 6458605 6375664 6404091 6364467
4335F364467j84540o0694J37562K06334j6259q9951N2328j64669k22381j81092
$$ 6364467 6179927 6119233 6256795 6463129 6446870 6356919 6409247 6244578 6022197 5841105
4325E841105p5891j20197k38287n5877j07894k23292j1490l8310k31183j43365
$$ 5841105 5765214 5645017 5406730 5350853 5242959 5019667 5008177 4969867 4738684 4595319
4315D595319q571p8802M089o4860k01342N8670o2651k06918L3724N3781j50455
$$ 4595319 4586748 4507946 4512035 4447175 4245833 4304503 4241852 4034934 4068658 4122439 3971984
4304C971984o5865l1604J4311p9768n057j46901n2639J1438j5578L3884N080m0458
$$ 3971984 3906119 3874515 3888826 3809058 3804001 3657100 3604461 3615899 3600321 3634205 3639285 3598827
4292C598827j05008M6341J36424L063j1762K7665N9464m1476N1345q782K639j13590
$$ 3598827 3493819 3540160 3676584 3679647 3667885 3695550 3755014 3713538 3764883 3756101 3758740 3645150
4280C645150j55870K0360j629j618J19560j00516n1928O4009r5609R675J56112
$$ 3645150 3489280 3509640 3508011 3506393 3625953 3525437 3473509 3537518 3441909 3451584 3607696
4269C607696j73015j6928p9570m4454Q9463L5101O3088k0585n9602J55080l9967
$$ 3607696 3434681 3417753 3338183 3293729 3383192 3418293 3481381 3460796 3401194 3556274 3516307
4258C516307k6956R4896j2898k3581L8787N7001M6904n9179o0221r8045J04584
$$ 3516307 3489351 3584247 3571349 3547768 3586555 3643556 3690460 3631281 3571060 3473015 3577599
4247C577599M8699r8955K4785q7039P2132J36821l0507O8372q295p0105n28l8839
$$ 3577599 3626298 3527343 3552128 3465089 3537221 3674042 3643535 3711907 3703612 3633507 3632979 3594140
4235C594140J62099J92869O5J64439M8626J18342K00503K52522K52562J90049
$$ 3594140 3756239 3949108 3949173 4113612 4162238 4280580 4481083 4733605 4986167 5176216
4225E176216K87554L28740M42198M45998M14141L79451M35677M91782M63455J80151
$$ 5176216 5463770 5792510 6234708 6680706 7094847 7474298 7909975 8401757 8865212 9045363
4215I045363p6222j51594n9927k69145k31184l13164l15201l57471l40075k19530
$$ 9045363 8969141 8817547 8757620 8488475 8257291 7944127 7628926 7271455 6931380 6711850
4205F711850j74893k59385l0286j18523p6175l7412J19130K10651J92162J49683
$$ 6711850 6536957 6277572 6247286 6128763 6052588 6015176 6134306 6344957 6537119 6686802
4195F686802K83750J18177K12084M50109L76377L78327N40083O34378N56851O12960
$$ 6686802 6970552 7088729 7300813 7750922 8127299 8505626 9045709 9680087 10236938 10849898
4185A0849898P51735O56055O59757P70475Q02761O02143K97027K86164j49131
$$ 10849898 11601633 12257688 12917445 13687920 14490681 15092824 15389851 15676015 15526884
4176A5526884j09366j45443l88350m00755k72676j94844l00883J38503J93097
$$ 15526884 15417518 15272075 14883725 14482970 14210294 14015450 13714567 13853070 14046167
4167A4046167K64000L25686N25679Q11007J071447J271845J502975J560905J787131
$$ 14046167 14310167 14635853 15161532 15972539 17043986 18315831 19818806 21379711 23166842
4158B3166842J760494J575263J144604J060548N94435R4159l21235p88752j119719
$$ 23166842 24927336 26502599 27647203 28707751 29302186 29396345 29075110 28286358 27166639
4149B7166639j292302j439346j503945j255251j365296r32477o45658n30804m33158
$$ 27166639 25874337 24434991 22931046 21675795 20310499 19378022 18732364 18201560 17768402
4140A7768402j53304j4831L92107K90911L71402N00144N24450M03862J26590J7842
$$ 17768402 17615098 17600267 17992374 18283285 18654687 19154831 19679281 20083143 20209733 20227575
4130B0227575J39888k4319j24350r5540j3589r348J65830M76401M42056M75164
$$ 20227575 20367463 20343144 20218794 20123254 20109665 20100317 20266147 20742548 21184604 21659768
4120B1659768J37659J16974J18945j43575j13797l41614l44296n56695m10153
$$ 21659768 21797427 21914401 22033346 21889771 21775974 21434360 21090064 20533369 20123216
4111B0123216m05905n12608m83663n36978l87136l62995l02724m01360k16509
$$ 20123216 19717311 19204703 18721040 18184062 17796926 17433931 17131207 16729847 16513338
4102A6513338k27395j9038J53837J33374J87549K78525J69221j18799k67725l53860
$$ 16513338 16285943 16266905 16420742 16554116 16741665 17020190 17189411 17070612 16802887 16449027
4092A6449027l86961o82831q37690q42045r48860o85797o35011o93466m01446
$$ 16449027 16062066 15379235 14541545 13699500 12750640 12064843 11429832 10736366 10334920
4083A0334920k39966k78023l74186k30496j20364j4209N323q4185j19664K49393
$$ 10334920 10094954 9816931 9442745 9212249 9091885 9077676 9082999 8998814 8879150 9128543
4073I128543J57272J03148J89240K04886K43526K78481K50071L14615K77024K41727
$$ 9128543 9285815 9388963 9578203 9783089 10026615 10305096 10555167 10869782 11146806 11388533
4063A1388533K95610J73857O3168k40046l65299l22884m29812n23125o53999p81172
$$ 11388533 11684143 11858000 11921168 11681122 11315823 10992939 10563127 10040002 9386003 8604831
4053H604831n89337n36947m19241m30455n16969l39116m19338k15087j48666j04466
$$ 8604831 8015494 7478547 7059306 6628851 6111882 5772766 5353428 5138341 4989675 4885209
4043D885209j10138j90648k56932j18638j48907k00783k30835j35074n4409j52960
$$ 4885209 4775071 4584423 4327491 4208853 4059946 3859163 3628328 3493254 3438845 3285885
4033C285885l1341L0865j43139p4648o1192j22545J683j46348Q4714j86310p0213
$$ 3285885 3254544 3285409 3142270 3067622 3006430 2883885 2885568 2739220 2823934 2637624 2567411
4022B567411R9156p2964q2162O3058p3847q4598n6342q3424j53608p7278R7792
$$ 2567411 2666567 2593603 2511441 2574499 2500652 2416054 2359712 2276288 2122680 2045402 2143194
4011B143194j5599o3961J47685j09090q31m9332j0442K7041p6818k6984o5410
$$ 2143194 2127595 2063634 2211319 2102229 2101398 2052066 2041624 2068665 1991847 1964863 1899453
4000A899453M1379j71468j04239L0623Q5347J16202J6640l0262O6113l0877r5138
$$ 1899453 1940832 1769364 1665125 1695748 1781095 1897297 1913937 1883675 1949788 1918911 1823773
3989A823773M7334j5153j10879j31430O5690M5613q4391j05023j1980l5659M8031
$$ 1823773 1871107 1855954 1745075 1613645 1679335 1724948 1640557 1535534 1523554 1487895 1535926
3978A535926n4142N4109m5651n9067P4588m8180P3366j52862j54160J02050Q6578
$$ 1535926 1481784 1535893 1490242 1431175 1505763 1457583 1530949 1378087 1223927 1325977 1412555
3967A412555L8316m0896j78808N970N1532l6858l5291M9891K1974J5701j23248
$$ 1412555 1450871 1409975 1231167 1237137 1288669 1251811 1216520 1266411 1288385 1304086 1180838
3956A180838N5632J94088j8787r9872N8273j1965j18238k3961N4915k6039L3818
$$ 1180838 1236470 1430558 1411771 1311899 1370172 1358207 1239969 1216008 1270923 1244884 1278702
3945A278702n046j19816n820O9463p5134J84150L6191n1555k8849Q938M3592o4815
$$ 1278702 1273656 1153840 1148020 1217483 1142349 1326499 1362690 1311135 1282286 1291224 1334816 1270001
3933A270001K1899q520j4160p7554L4831N6481K6040l5433M8103L3233p3445k190
$$ 1270001 1291900 1283380 1269220 1191666 1226497 1282978 1309018 1273585 1321688 1354921 1281476 1279286
3921A279286J7285M0587L195J06293L0372r835J3192N5869j7922K5620l0615j39450
$$ 1279286 1296571 1337158 1340353 1446646 1477018 1467183 1480375 1536244 1518322 1543942 1513327 1373877
3909A373877J47913p3218K7602M5770l9024R9888p5733J00150p0144q2169N3292
$$ 1373877 1521790 1448572 1476174 1521944 1482920 1582808 1507075 1607225 1537081 1454912 1508204
3898A508204L3090p4320q634J06356N2211j07382o8104J36824j5465m6167m9684
$$ 1508204 1541294 1466974 1458340 1564696 1616907 1509525 1441421 1578245 1562780 1516613 1466929
3887A466929J3352J24856K4728m0109j2326L4181r326N9393M9510l9791k0912
$$ 1466929 1480281 1605137 1629865 1589756 1577430 1611611 1602285 1661678 1711188 1671397 1650485
3876A650485J6661J38649M4505j9316m6465O6218J4128j24700p938Q0547j9039
$$ 1650485 1667146 1805795 1850300 1830984 1784519 1850737 1864865 1740165 1732227 1812774 1793735
3865A793735Q5889K698r1762q5249J45592j0565r6268m555O2521j18783k7657
$$ 1793735 1879624 1882322 1790560 1705311 1850903 1840338 1744070 1739515 1802036 1683253 1655596
3854A655596J77903J16762q1773j09323m4273J72996O8990J07952j27796R7641
$$ 1655596 1833499 1950261 1868488 1759165 1714892 1887888 1956878 2064830 1937034 2034675
3844B034675J43743q9013j3067p7283O441O2997k6686j4395j02505O3899K47089
$$ 2034675 2178418 2089405 2076338 1999055 2005496 2068493 2041807 2027412 1924907 1988806 2235895
3833B235895q5576n2572j36993m655O6261l5394L5658k0625p3072j07603M6440
$$ 2235895 2150319 2097747 1960754 1956099 2022360 1986966 2022624 2001999 1928927 1821324 1867764
3822A867764J32459j33194o8936j3340L6379n0757N0649m8032Q5963q0279O3197
$$ 1867764 2000223 1867029 1798093 1784753 1821132 1770375 1821024 1772992 1858955 1778676 1841873
3811A841873N7111m4654j67141j5631Q5267k1723o0781K9784J11653p2899L811
$$ 1841873 1898984 1854330 1687189 1671558 1756825 1735102 1674321 1704105 1815758 1742859 1746670
3800A746670K998n839L7967J7098M3689j05103J67544j19867r4910L4924k6757
$$ 1746670 1749668 1743829 1781796 1798894 1842583 1737480 1905024 1785157 1690247 1725171 1698414
3789A698414R116K7525q9723p8500K49929J5697m0605N3756j34446K0739K9167
$$ 1698414 1707530 1735055 1645332 1566832 1816761 1832458 1791853 1845609 1711163 1731902 1761069
3778A761069r5925M8209p7755J0938P0224n7367l0683Q1170J30611o9707l2522
$$ 1761069 1665144 1713353 1635598 1646536 1716760 1659393 1628710 1709880 1840491 1770784 1738262
3767A738262Q6197l7363J01787n7628l8388o640n9464M5407K3086k4777L0568
$$ 1738262 1824459 1787096 1888883 1831255 1792867 1786227 1726763 1772170 1795256 1770479 1801047
3756A801047J43222r195l1404k8251q51r0879j28493k5436p164m3042j13111P2332
$$ 1801047 1944269 1935074 1903670 1875419 1874568 1783689 1655196 1629760 1622596 1579554 1466443 1538775
3744A538775O1720M2797r8635J2581p2864P0532N5614r3658O9070O0371j68144
$$ 1538775 1600495 1643292 1544657 1557238 1484374 1554906 1610520 1516862 1585932 1646303 1478159
3733A478159n4473o797R8429m8483K759k5983L3385p3234J04287M9950q0175J4621
$$ 1478159 1423686 1416889 1515318 1466835 1469594 1443611 1476996 1403762 1508049 1557999 1477824 1492445
3721A492445R2806K2905k00012J22866j12332p0510N2731Q893Q7493q6744N3910
$$ 1492445 1585251 1608156 1408144 1531010 1418678 1348168 1400899 1409792 1497285 1410541 1464451
3710A464451K2213q6327J7720J33995k6942N1066N051j64293M085j15749l8876
$$ 1464451 1486664 1400337 1418057 1552052 1525110 1576176 1581227 1416934 1421019 1305270 1266394
3699A266394k5044Q8048R6055Q141J6956L9218k9869j21245q0045Q544J8333k0920
$$ 1266394 1241350 1329398 1425453 1433594 1450550 1489768 1459899 1338654 1258609 1267153 1285486 1264566
3687A264566K7426m5386k4273J06721N2273o3224p9692J39323P093R720o9062
$$ 1264566 1291992 1246606 1222333 1329054 1381327 1318103 1238411 1377734 1384827 1394547 1325485
3676A325485m0738j02356J83271j3304j36536j4738R3196J9765q0475r771K6886
$$ 1325485 1284747 1182391 1365662 1352358 1215822 1201084 1294280 1314045 1233570 1223799 1250685
3665A250685r110L7931L6214J323O5000k11359j21222J08248J35811o9566L651
$$ 1250685 1241575 1279506 1315720 1317043 1382043 1170684 1049462 1157710 1293521 1223955 1227606
3654A227606L1734J20788o5383j18417N0467R9469r362M9303j68815Q6540J26976
$$ 1227606 1259340 1380128 1314745 1196328 1246795 1346264 1336902 1386205 1217390 1303930 1430906
3643A430906k7802l4673q7323o9958O4987J05602k15802o4656K8199J47392k3354
$$ 1430906 1403104 1368431 1281108 1211150 1276137 1381739 1165937 1101281 1129480 1276872 1253518
3632A253518j70878O7759K04068j3880j98088Q3999J21922o5501J71368L1591
$$ 1253518 1082640 1150399 1354467 1340587 1142499 1226498 1348420 1282919 1454287 1485878
3622A485878K9811j91287Q359N8979Q0792K036j05480j2463l5623J25197m4732
$$ 1485878 1515689 1324402 1332761 1391740 1472532 1474568 1369088 1356625 1321002 1446199 1401467
3611A401467M2807K294J6468k0210P6612J58469J3070j45341k4776j1892p5698
$$ 1401467 1444274 1446568 1463036 1442826 1519438 1677907 1690977 1545636 1520860 1508968 1433270
3600A433270O8896N8027O2840r8093o1414k0034m3778N6808N7065K14282l8339
$$ 1433270 1502166 1560193 1623033 1524940 1463526 1443492 1399714 1456522 1513587 1727869 1689530
3589A689530q2602J8970K8020J26801j42590K3013O6290J10472k4596n3166K3440
$$ 1689530 1606928 1625898 1653918 1780719 1638129 1661142 1727432 1837904 1813308 1760142 1783582
3578A783582K5348K0820k8196M0272J8095J30746J36407o6877O372n9568k1362
$$ 1783582 1808930 1829750 1801554 1841826 1859921 1990667 2127074 2060197 2066569 2007001 1985639
3567A985639P862N6290K3650l805O9592p9109j8801p648L8396K2910L1269p9264
$$ 1985639 1993501 2049791 2073441 2069636 2139228 2060119 2041318 2033670 2072066 2094976 2126245 2046981
3555B046981J90908K9397j08542o46M6413m478L1522J59966J6033J2368K6965
$$ 2046981 2237889 2267286 2158744 2158098 2204511 2200033 2231555 2391521 2407554 2419922 2446887
3544B446887j10575J4548J20918R3956N290n0498J04231J93603P1779o632k0809
$$ 2446887 2336312 2350860 2471778 2565734 2571024 2520526 2624757 2818360 2890139 2883507 2862698
3533B862698J37733P4780p6989o6997Q8011M7823N6860j8326N1656J25633q663
$$ 2862698 3000431 3075211 2998222 2931225 3019236 3067059 3123919 3105593 3157249 3282882 3274219
3522C274219J72534n2192m0708R2060Q53O9831J89441J56480J30951P216o078
$$ 3274219 3446753 3394561 3353853 3445913 3446766 3516597 3706038 3862518 3993469 4000685 3994607
3511C994607J83404J79390l8556M4072L5030J24090M9780J08041Q8188J0520J67419
$$ 3994607 4178011 4357401 4318845 4362917 4397947 4522037 4571817 4679858 4768046 4778566 4945985
3500D945985J48649K00454n539K8138J75910J51217J46903J15535J20703K10603
$$ 4945985 5094634 5295088 5289549 5317687 5493597 5644814 5791717 5907252 6027955 6238558
3490F238558j8085R5314J45239K57428K53455K23709K81330J39057K32667K71318
$$ 6238558 6220473 6315787 6461026 6718454 6971909 7195618 7476948 7616005 7848672 8119990
3480H119990L19369M04841M16463L18307K48461L30109M23453M32534N92045O20019
$$ 8119990 8439359 8844200 9260663 9578970 9827431 10157540 10580993 11013527 11605572 12225591
3470A2225591O23959O22538N73943Q71123Q24713R31025R07700Q34486R32722
$$ 12225591 12849550 13472088 14046031 14917154 15741867 16672892 17580592 18415078 19347800
3461A9347800Q12073P71590O43848N68536K27890n450k49499m13443p04895o95851
$$ 19347800 20159873 20931463 21575311 22143847 22371737 22366287 22116788 21703345 20998450 20302599
3451B0302599p50971q06612p72001m92605o45035o61771n35042n04895k92807
$$ 20302599 19551628 18745016 17973015 17480410 16835375 16173604 15638562 15133667 14840860
3442A4840860m07887k77700m43491n59272k88220j13542k05220j58786r8728k78557
$$ 14840860 14432973 14155273 13711782 13152510 12864290 12750748 12545528 12386742 12288014 12009457
3432A2009457j56027O4720Q6391J73302O4602J49200M6581k4293M4184J18671
$$ 12009457 11853430 11918150 12004541 12177843 12242445 12391645 12438226 12413933 12458117 12576788
3422A2576788k37672n39198l94813m36971n50495n16346l32567l25866k95492
$$ 12576788 12339116 11799918 11405105 10968134 10417639 9901293 9568726 9242860 8947368
3413H947368k15315k34885l24055o5533j62943k64224j99036k42976j38441l124
$$ 8947368 8732053 8497168 8173113 8107580 7944637 7680413 7481377 7238401 7099960 7096836
3403G096836j15399k34654R0882o2303k7507K5507N8638k6816R8893J39506K5774
$$ 7096836 6981437 6746783 6837665 6775362 6747855 6773362 6832000 6805184 6904077 7043583 7069357
3392G069357M6377j75941r0254k25937k87457j20058j93518l38622j33546j17005
$$ 7069357 7115734 6939793 6849539 6623602 6336145 6216087 6022569 5683947 5550401 5433396
3382E433396j65378j26904j04857j49131j5656q9871r8762j31481j02638K1216
$$ 5433396 5268018 5141114 5036257 4887126 4871470 4781599 4682837 4551356 4448718 4469934
3372D469934l6552j84509m7691N5065o4507p8379n9462k5035p0540r1105n9230
$$ 4469934 4433382 4248873 4201182 4256247 4191740 4113361 4053899 4028864 3958324 3867219 3807989
3361C807989j21992r7794N5051J29908R78j55319j52184P8561O8153j12722j24740
$$ 3807989 3685997 3588203 3643254 3773162 3774140 3618821 3466637 3545198 3613351 3500629 3375889
3350C375889J39967R2031k97903j29K658M9549k3836k00346o0091n2008j08517
$$ 3375889 3515856 3607887 3309984 3309855 3312513 3362062 3338226 3137880 3077789 3025781 2917264
3339B917264R0055N70O3104R4562p4503j19827j6546l9828K2491o918r808p4875
$$ 2917264 3007319 3007889 3070993 3165555 3091052 2971225 2954679 2914851 2937342 2930424 2920616 2845741
3327B845741j51056K2493J4974j6440l6135J09600o3841p3600m7420m3984O4671
$$ 2845741 2694685 2717178 2732152 2715712 2679577 2789177 2725336 2651736 2604316 2560332 2625003
3316B625003p0838j13958L9119M6175J0047N440K2377l5182k85413k6772J33949
$$ 2625003 2554165 2440207 2479326 2525501 2535548 2540988 2563365 2528183 2242770 2215998 2349947
3305B349947J30608q705p4041j691O5224l4576q9918K0307p8340m9147J1577J08206
$$ 2349947 2480555 2471850 2397809 2396118 2461342 2426766 2336848 2357155 2278815 2229668 2241245 2349451
3293B349451J00947j7195j2543K2728j43172p0588o4819N2287j06419j31163m9177
$$ 2349451 2450398 2433203 2420660 2443388 2300216 2229628 2164809 2217096 2110677 1979514 1930337
3282A930337k7958O7073M7907R8318l9487m9959r4864l5554n91p9610J11443j7264
$$ 1930337 1902379 1969452 2017359 2115677 2076190 2026231 1931367 1895813 1895222 1815612 1927055 1909791
3270A909791l7610L0689k0699M6539m1355L9090j1181r7546O4651M0551k8219
$$ 1909791 1872181 1902870 1882171 1928710 1887355 1926445 1915264 1817718 1882369 1922920 1894701
3259A894701j56986J2690J00740P0253M9576j26020k8793j42218k3068P570O287
$$ 1894701 1737715 1750405 1851145 1921398 1970974 1844954 1816161 1673943 1650875 1658445 1664732
3248A664732O7113j23818K8381l3994j2506M6838n683O7952q4048P2126l3937
$$ 1664732 1731845 1608027 1636408 1602414 1589908 1636746 1631063 1699015 1614967 1687093 1653156
3237A653156n3637m8628M619L7624k932l1095j0006k7836j08918M6015q6948o5416
$$ 1653156 1599519 1550891 1555510 1593134 1590202 1559107 1549101 1521265 1412347 1458362 1371414 1305998
3225A305998j4360J05333P6484j1006n1493j6617R0595m340j27204q120L8777
$$ 1305998 1291638 1396971 1473455 1462449 1410956 1394339 1484934 1480594 1353390 1345270 1384047
3214A384047L4113O1538j02815L322J21247L7259p5521L6169N475J13018m836
$$ 1384047 1418160 1479698 1376883 1380205 1501452 1538711 1463190 1499359 1504834 1617852 1613016
3203A613016n9038L558P7026J1282p8372J9741Q05J94000J9854j16812o4811m5261
$$ 1613016 1553978 1557536 1634562 1645844 1567472 1587213 1588018 1782018 1801872 1685060 1620249 1574988
3191A574988K600p4939J4165K09734P5625j6205q3124J4242m9618M577L1011J16255
$$ 1574988 1577588 1502649 1516814 1726548 1802173 1785968 1702844 1717086 1667468 1672045 1703056 1819311
3179A819311l7923j26199K19499O6018q2248q1386O5758M3527J64095o8470L4030
$$ 1819311 1781388 1655189 1874688 1940706 1858458 1777072 1842830 1886357 2050452 1981982 2016012
3168B016012J27012k39180J02523R5408K1232J30642J70539m0313r6695R4558
$$ 2016012 2143024 1903844 2006367 2101775 2123007 2253649 2424188 2383875 2287180 2381738
3158B381738J96645J16254J31383K4699J9370J62913N7713m789J62589O7445M1621
$$ 2381738 2578383 2694637 2826020 2850719 2870089 3033002 3090715 3085926 3248515 3315960 3357581
3147C357581Q8433M6043K42287J32754J0669K5774N5541J62383K06966r597J37406
$$ 3357581 3446014 3492057 3734344 3867098 3877767 3903541 3959082 4121465 4328431 4318834 4456240
3136D456240O1762n6809J97500J7238J14601J80282o4247R9304J65942P9075J53946
$$ 4456240 4518002 4461193 4658693 4675931 4790532 4970814 4906567 5005871 5171813 5250888 5404834
3125E404834K39863K34190K45094K89060K05289K02621L67568J48474J24363K06185
$$ 5404834 5644697 5878887 6123981 6413041 6618330 6820951 7188519 7336993 7461356 7667541
3115G667541J60932J08876l1303j40277j77547j53704j4797q1417q8948K8879
$$ 7667541 7828473 7937349 7906046 7765769 7588222 7434518 7419721 7338304 7249356 7278235
3105G278235j14586p2738N432J8385J07210J47880M3589J97307K27070J14726
$$ 7278235 7163649 7090911 7096343 7114728 7221938 7369818 7413407 7610714 7837784 7952510
3095G952510J64034J44076P5774J23804J35253J52275J04795r0326p3787l2017
$$ 7952510 8116544 8260620 8336394 8460198 8595451 8747726 8852521 8762195 8688408 8656391
3085H656391k07242l1652j66754j43420k51248k97185k33138j03754j5223k76803
$$ 8656391 8449149 8417497 8250743 8107323 7856075 7558890 7325752 7221998 7206775 6929972
3075F929972j02200j14716L6095K7459p9679K120j52342p9818k8973j8963k47866
$$ 6929972 6827772 6713056 6749151 6776610 6696931 6699051 6546709 6466891 6437918 6418955 6171089
3064F171089j86081j26251n2620j09140j33288j76515o8948j92671l55851p2454
$$ 6171089 5985008 5858757 5806137 5696997 5563709 5387194 5318246 5125575 4769724 4697270
3054D697270k02770j13278j94071o4967k22408l05567j31143L0097j14365q9641
$$ 4697270 4494500 4381222 4187151 4122184 3899776 3594209 3463066 3493163 3378798 3289157
3044C289157j77856p1188j05098l3477n8631M3267j59702q9827o7806q2431p6051
$$ 3289157 3111301 3040113 2935015 2901538 2842907 2886174 2726472 2636645 2568839 2486408 2410357
3033B410357p9256m4278K2169p2874K944n5918P5345q2031k00888j1957m0161
$$ 2410357 2331101 2286823 2308992 2236118 2239062 2183144 2258489 2176458 1975570 1963613 1923452
3022A923452m7768j86277P74j0314j13307r2539M7807q1183L4926n6598n1294
$$ 1923452 1875684 1689407 1690181 1679867 1566560 1474021 1521828 1440645 1475571 1418973 1367679
3011A367679p5931J52411L9617M1636j18826q6191l2110J15402j01809k10366
$$ 1367679 1291748 1444159 1483776 1525412 1406586 1320395 1288285 1403687 1301878 1091512
3001A091512m5416L0032N7492l6850j75050m5454K26781K3364p8913K1741o716
$$ 1091512 1046096 1076128 1133620 1096770 921720 876266 1103047 1126411 1047498 1069239 1062523
2990A062523N7061n9930o6360n3796l698P873o1055K5801K9956m0596p7431P9454
$$ 1062523 1119584 1059654 993294 939498 935800 943673 882618 908419 938375 897779 820348 899802
2978H99802j1009k20986K8671N1990m8522j9014N2902j0124Q0150k3382j01870
$$ 899802 888793 667807 696478 748468 699946 680932 733834 723710 803860 780478 678608
2967F78608J4957m8923N5614j13323j25639J67612M3621j73388m5860j0811N8058
$$ 678608 693565 644642 700256 586933 461294 628906 672527 499139 453279 442468 500526
2956E00526R7981o3385r0018r9313K0875R0269j01038q1673J28391P5141Q5392
$$ 500526 598507 535122 445104 345791 366666 456935 355897 274224 402615 477756 563148
2945E63148l2551Q4960j22495k15601J00929O6258J75519j81530j37331j0849
$$ 563148 530597 615557 493062 277461 378390 444648 620167 438637 301306 290457
2935B90457K8198m7142M3507O7853O1673j30317J2745Q0884n5055j54125Q644
$$ 290457 318655 271513 315020 382873 444546 314229 326974 407858 352803 198678 207322
2924B07322L3926J23904O8155k4257M540L3131O1331O315k3425j59603n2110J12044
$$ 207322 241248 365152 433307 409050 413590 446721 508052 514367 490942 331339 279229 391273
2912C91273P5855k718j27527J04894j57917o2427K06760j06309L3359j56344O1594
$$ 391273 467128 464410 336883 441777 283860 221433 428193 321884 355243 198899 260493
2901B60493j8436j91664O6505R9170l2903r866j4252n6404J39219M7705N8293
$$ 260493 242057 50393 116898 216068 183165 173299 159047 102643 241862 289567 347860
2890C47860q7662M0512N9168r7042O9053K2993m9493j12291O4012M4998q8011
$$ 347860 260198 300710 359878 262836 331889 354882 305389 193098 257110 302108 214097
2879B14097J3843N8970o4002J72791j32669j09084J13323k6213j043n7850K1359
$$ 214097 227940 286910 222908 395699 263030 153946 267269 241056 240013 182163 203522
2868B03522R3782j35273J13495k6540j55829K3581O0568n1793J06247q0515r723
$$ 203522 297304 162031 275526 248986 93157 116738 177306 125513 231760 151245 141522
2857A41522L1925N9746N2318L064K1177O756k389r0197j08260L9908J16818J80157
$$ 141522 173447 233193 285511 288575 309752 316508 314119 223922 115662 155570 272388 452545
2845D52545n9813m0218q4660o047j1201k3406L5207p7476J2534q5262J24312n8575
$$ 452545 392732 352514 267854 261807 250606 227200 262407 184931 197465 112203 236515 177940
2833A77940R1993J5581l5145p8642K6171O7941L4488L3909K2256j45501J31222
$$ 177940 269933 285514 250369 171727 197898 265839 300327 334236 356492 210991 342213
2822C42213O636N315l00243r297J00825l9516R8288J5024R1244P7238k10982n7306
$$ 342213 348849 354164 53921 44624 145449 105933 204221 219245 310489 387727 176745 119439
2810A19439K8839J02600o9098j1979j4347m7167O8406k4323P5158L583j06046
$$ 119439 148278 250878 181780 169801 155454 108287 176693 152370 227528 231111 125065
2799A25065J5793J97116M1798j96629r5687J26518M0442P3788p5161j1403J0237
$$ 125065 140858 337974 379772 183143 87456 213974 254416 328204 253043 241640 251877
2788B51877j38711j31113n4386J4280L8805j2581o9352Q5721K29032K3761n1675
$$ 251877 113166 -17947 -72333 -58053 -19248 -31829 -101181 -15460 213572 237333 185658
2777A85658L8807n3662r1744J7893l8791J04345r1816L4521Q3204n4266m5097
$$ 185658 224465 170803 79059 96952 58161 162506 70690 105211 188415 134149 89052
2766H9052q9857n8650K09387l2814p8921l2277P3060r91P0393m2491J40123O6587
$$ 89052 -805 -59455 149932 117118 38197 5920 78980 77989 148382 105891 246014 312601
2754C12601j43166m626l3431M0048n1797j6824K9247k5839n7930O3546R728K1663
$$ 312601 169435 164809 131378 171426 119629 102805 132052 106213 48283 111829 121557 143220
2742A43220q3890m4803M2447J0292M9324r8845L1375r0319O7523k8497j0513P4155
$$ 143220 59330 14527 56974 67266 116590 17745 49120 -41199 26324 -2173 -12686 61469
2730F1469k0611J24955k6373l5506j5675n0967K1625Q2459O546L9926Q231l6992
$$ 61469 40858 165813 139440 103934 88259 37292 58917 141376 147922 187848 196079 159087
2718A59087m3j2649m1247J77420l5309j28738P7739J9929j21473J7852l4777M7816
$$ 159087 159044 146395 105148 282568 247259 118521 196260 216189 94716 112568 77791 125607
2706A25607o4739M6318l0694o9582j2519L2983Q7200L915r5974n1362O5214J2399
$$ 125607 60868 107186 76492 6910 -5609 27374 114574 118489 22515 -28847 36367 48766
2694D8766p0874j9002J62354P5468r0898q1611R3007K4442p6749R3286j6557j7665
$$ 48766 -22108 -41110 121244 196712 105814 24203 117210 141652 64903 158189 141632 123967
2682A23967J4514K4595k3737j5400O5823r6424r7048L7071N5775P60p907l0061
$$ 123967 138481 163076 139339 123939 189762 93338 -3710 33361 89136 89896 81989 51928
2670E1928r146k3770K8421m9391J3246J5543j8685J9791l5278j02711J50625O5722
$$ 51928 42782 19012 47433 -1958 11288 26831 8146 27937 -7341 -110052 40573 106295
2658A06295J2344q4333r4853M4227Q0087j69781K5059p86L1469J11150J3375J15423
$$ 106295 118639 34306 -60547 -16320 63767 -106014 -80955 -81741 -50272 60878 74253 189676
2646A89676j35698K0615j8338P8874J5401j21070L8923r1350J3517N0425j0631
$$ 189676 53978 74593 56255 135129 150530 29460 68383 -22967 -9450 40975 30344
2635C0344K10824q5249k00613K6841Q5682j32698l2881O7132p604r8308L5716
$$ 30344 241168 155919 -44694 -17853 67829 -64869 -97750 -30618 -38222 -136530 -100814
2624a00814R3843j9546K5234P2854q0728K15N8390m7781M297k3941Q6754N4534
$$ -100814 -6971 -26517 -1283 71571 -9157 -8942 49448 1667 5964 -17977 68777 123311
2612A23311N2604j22346L2763R8035p2015L2978m4039q7450Q7992p1813r6145
$$ 123311 175915 53569 86332 184367 112352 145330 101291 13841 101833 30020 -66125
2601f6125m454R8117j8358L5398m9066J7276O6288l2154r9521j71279K81198Q8334
$$ -66125 -70579 27538 9180 44578 -4488 12788 79076 46922 -52599 -223878 57320 145654
2589A45654J53726n7050j13811R7785r7654j1283j19512O7990J36494j09472m4106
$$ 145654 299380 242330 128519 226304 128650 117367 -2145 65845 202339 92867 48761
2578D8761o4460P4387j1864O393o3937r4158J01954J01161j162j02944J38388
$$ 48761 -15699 58688 46824 53217 -10720 -104878 -2924 98237 97075 -5869 132519
2567A32519l2353j3932j0378j04985n7221O1852L5163j27683K35996J3880p409
$$ 132519 100166 86234 75856 -29129 -86350 -24498 10665 -117018 118978 132858 125449
2556A25449j3443M9299R906p8773p2637q597J8749J22198n9188q7579l8925P8299
$$ 125449 112006 161305 171211 92438 19801 11204 29953 152151 92963 5384 -33541 44758
2544D4758j16032j45241R8828P9635M0779l8400L7549j3985r7862O3565K26194
$$ 44758 -71274 -216515 -117687 -38052 2727 -35673 1876 -12109 -109971 -46406 179788
2533A79788K4626j22313j31455K7164l234q2539J20352Q5026o7595J08218O791
$$ 179788 204414 82101 -49354 -22190 -25424 -107963 12389 97415 29820 138038 144829
2522A44829k7061j10657k1233n1809K2285J3178K8760Q8110N9322o6572P5703
$$ 144829 117768 7111 -14122 -65931 -43646 -30468 -1708 86402 145724 79152 154855
2511A54855q581P8220l9057j00180o5867p6189J23748j24044K7825J4497m0652
$$ 154855 146274 224494 185437 85257 19390 -56799 66949 -57095 -29270 -14773 -55425
2500e5425j0319j41472J85540J9174N3573m7698n725K3762O8511J21680q6128
$$ -55425 -65744 -207216 -21676 -2502 51071 3373 -2352 21410 89921 211601 125473
2489A25473n9981r3560k194l8944J01699j6215K9674m010N1181L389j6514J4581
$$ 125473 65492 -28068 -30262 -69206 32493 16278 45952 41942 93123 96512 79998 94579
2477I4579p8722k7369j00015J28995L3000J08189K8238n2406o6261J8935Q3991
$$ 94579 15857 -11512 -111527 17468 50468 158657 186895 134489 68228 87163 171154
2466A71154J21926l7807j2859j70912l7288M484P6720L5883K3418k41265j14797
$$ 171154 293080 255273 242414 71502 34214 38698 115418 151301 174719 -66546 -181343
2455a81343J1132J43370J36443o3567M8326p3082O5801k6755o3124M2864M4858
$$ -181343 -170211 -26841 109602 46035 94361 21279 87080 60325 -2799 40065 84923
2444H4923M871m4750o0786J62738l1322N4009j16079K3959O5585k8275l480J45885
$$ 84923 89794 45044 -15742 146996 115674 169683 53604 77563 143148 114873 111393 257278
2432B57278m8119Q462K280r941m6446Q2222k6924j90399L7487J00540l2414J3944
$$ 257278 209159 217621 219901 209960 163514 245736 218812 28413 65900 166440 134026 147970
2420A47970Q535O2560k1930j37310k4957K7728J30188r7992n0807J67434m0996
$$ 147970 156505 219065 197135 59825 34868 62596 192784 94792 43985 211419 170423
2409A70423j38992p3254J67738q1039m2039k6356R1971J18125n3279j18199N2637
$$ 170423 31431 -41823 125915 44876 2837 -23519 68452 186577 133298 15099 67736
2398F7736n1091P4740m2053J25431R2785n2928O0727L507k2356P9942K6461j74933
$$ 67736 16645 91385 49332 174763 267548 214620 275347 278854 256498 336440 362901 187968
2386A87968K7460j0836J43278j2535m5581J50743l5732J0686p6891j09611m6772
$$ 187968 215428 204592 347870 335335 289754 440497 404765 415451 338560 228949 182177
2375A82177k6321J54765J64050j1570m9362O670K4177M1252o3826J6476m2826
$$ 182177 155856 310621 474671 463101 413739 420409 444586 485838 422012 438488 395662
2364C95662J822N4965Q4979P6085L7598N596R4889m2714J04003k639j23963K14622
$$ 395662 397484 452449 537428 613513 651111 656707 751596 708882 812885 810246 686283 900905
2352I00905J04157J48541L4995p8498L7394R1259K22242N7830M4749K31016K13356
$$ 900905 1005062 1153603 1188598 1110100 1147494 1238753 1460995 1518825 1563574 1794590 2007946
2341B007946k0992K43571K48940K92098K35338K49651J71842N21618N39796N55144
$$ 2007946 1986954 2230525 2479465 2771563 3006901 3256552 3428394 3950012 4489808 5044952
2331E044952N24068M97530L34165N94583P20216R64933J128770J637434K060778
$$ 5044952 5569020 6066550 6400715 6995298 7715514 8680447 9809217 11446651 13507429
2322A3507429K749485K824779K812822K949067K526043J469105N35077j482005
$$ 13507429 16256914 19081693 21894515 24843582 27369625 28838730 29373807 27891802
2314B7891802l921900l223679k536750k106590j672108j421495j253190r66350
$$ 27891802 23969902 20746223 18209473 16102883 14430775 13009280 11756090 10789740
2306A0789740r24372q12721p32207o99152o72590m84622n52987o25627m16318
$$ 10789740 9865368 9052647 8320440 7621288 6948698 6464076 5911089 5285462 4869144
2297D869144k33282k27526l23772l20840k82020k75153k00158j89619j13464j54582
$$ 4869144 4635862 4408336 4084564 3763724 3481704 3206551 3006393 2816774 2703310 2548728
2287B548728j63446j00524n9669n0424j31837k4018k4395j90632j84306R207k2731
$$ 2548728 2385282 2284758 2225089 2174665 2042828 2018810 1994415 1803783 1619477 1628684 1605953
2276A605953j14436m6798j02846J2262o1051r9501J8489j40435j38410j20436
$$ 1605953 1491517 1444719 1341873 1354135 1293084 1193583 1212072 1071637 933227 812791
2266H12791p7769J35256L215j7065j19351k6816l351n4886L558j35754M4570N684
$$ 812791 735022 870278 873493 856428 737077 710261 706910 652024 655582 519828 564398 570082
2254E70082k2233N4083p6386M5715J29666r3407p136L0808L685P3979q0511n6541
$$ 570082 547849 601932 525546 571261 700927 607520 600384 631192 634877 708856 628345 571804
2242E71804J1367j0447n8516k8658j07623j53020O6321J89126L4424j14035o4311
$$ 571804 583171 572724 514208 485550 377927 224907 291228 480354 514778 400743 336432
2231C36432m6289k1131O5012J33034R7130k1207j60511Q087J52084j29795j57822
$$ 336432 290143 269012 334024 467058 564188 542981 382470 390557 542641 412846 255024
2220B55024R9803K8458q5568N4202n8763K9871k7630K5339R0520j59118j8606
$$ 255024 354827 383285 297717 351919 293156 323027 295397 320736 411256 252138 233532
2209B33532J1294m3811M5543J35003k6157j50222O8558l0455Q0342M3865n3341
$$ 233532 244826 201015 246558 381561 355404 205182 273740 243285 323627 367492 314151
2198C14151o4001n3863N7578P3228p6398O6453p2970o3614l6987O6727o572J7798
$$ 314151 250150 196287 253865 327093 250695 317148 244178 180564 143577 210304 203732 221530
2186B21530k0103j54973M9371J20401P90n4932o2720k1162l5656M4654M6727m7474
$$ 221530 201427 46454 95825 216226 217016 162084 99364 78202 42546 87200 133927 86453
2174H6453J03525M8556p1055j00561O3936K6428l4518m2570P086j765L6126J33170
$$ 86453 189978 238534 167479 66918 130854 157282 122764 80194 87280 85515 121641 254811
2162B54811m0805j76773o3660Q1810L8358p3055Q8966n4610n0050J43138Q7839
$$ 254811 214006 37233 -26427 55383 93741 20686 109652 55042 4992 148130 235969
2151B35969n4670n1279N9043j00143o4042K7653m0938N0460J38581M9280j62077
$$ 235969 181299 130020 189063 88920 24878 52531 11593 62053 200634 249914 87837
2140H7837q1413n6794J20466l0593Q8820J2627O7769J2855k07870J9825J58986
$$ 87837 6424 -50370 70096 39503 128323 140950 208719 221574 13704 33529 192515
2129A92515n5653q5330N0576R9558K0906j43301k5365n1913K9000J40339L8476
$$ 192515 136862 51532 102108 201666 222572 79271 53906 1993 30993 171332 209808
2118B09808j00834r0214K8383M2037N1040o5844m1500J4208N9163k4453J40990
$$ 209808 108974 18760 47143 89180 140220 74376 32876 47084 106247 81794 222784
2107B22784j5809q3669q7889j60820N5942R1929R8749N9905N7194l4032j82962
$$ 222784 206975 123306 35417 -125403 -69461 22468 121217 181122 238316 204284 21322
2096B1322L1661J9693j36667N1906J21817k8186l0364q5029L0603N9657J07225
$$ 21322 52983 72676 -63991 -12085 109732 81546 51182 -33847 -3244 56413 163638
2085A63638j06612n7956P1253L6660n3976L5870K0181j9369M9873j8973j6155
$$ 163638 57026 -930 70323 106983 53007 88877 109058 89689 139562 120589 104434
2074A04434j81355j21722J55808K18973P7627j56900r1554J48389L5170m4561
$$ 104434 -76921 -198643 -42835 176138 253765 96865 5311 153700 188870 144309
2064A44309j23185k6245J07835M878L2069m3415k4383J25543l1594o9913p5568
$$ 144309 21124 -5121 102714 107592 139661 96246 71863 197406 165812 95899 20331
2053B0331J63216j09977J28412J34632r4416j72202J43458j03374r0107M1635
$$ 20331 183547 73570 201982 336614 242198 69996 213454 110080 19973 61608
2043F1608j6482o9012J5867k6436N2361L3160o6296l9601m9289K42630M6668j0799
$$ 61608 45126 -23886 -8019 -34455 17906 51066 -15230 -54831 -104120 138510 185178 174379
2031A74379j1619j9915k0300o5563j16322o1070J8601K193J85088l4111n8788
$$ 174379 162760 142845 122545 56982 -59340 -120410 -101809 -99616 85472 51361 -7427
2020g427O0147r1218p6255M7802J40447p1239j0089J6218m3731j13167J30291
$$ -7427 52720 -38498 -114753 -66951 73496 2257 -7832 8386 -35345 -148512 -18221
2009a8221K0082Q0232l9712j41183M1185L7995J3781l217R8525p3116k5992r0599
$$ -18221 1861 82093 42381 -98802 -57617 -19622 -5841 -9058 89467 16351 -9641 -100240
1997a00240R4571N4363O18k5610Q8453j47540n729L7413j45509L9344J20359o8722
$$ -100240 -5669 48694 49312 23702 112155 -35385 -41114 -3701 -149210 -109866 10493 -58229
1985e8229n3507K167k5395l3553j06669K40312J42701M0669j41623j26758J5648
$$ -58229 -111736 -109569 -134964 -168517 -275186 -34874 107827 148496 6873 -119885 -104237
1974a04237j3464N0228N5237j1316r3240k8928N3474N9559K5320J5298J43117
$$ -104237 -117701 -67473 -12236 -23552 -116792 -145720 -92246 -32687 -7367 7931 151048
1963A51048n5796k4908K5766n7230k8176J1491p0056J62225k0619j53505j15270
$$ 151048 95252 70344 96110 38880 10704 22195 -47861 114364 93745 -59760 -175030
1952a75030k4536K9463k0819J53689k2082j4628L2652o4551m3166R8492j33141
$$ -175030 -199566 -170103 -190922 -37233 -59315 -73943 -41291 -105842 -149008 -50516 -183657
1941a83657n4775R1363j26119L9684J60049R4718j2157J24771J71450j15770j19919
$$ -183657 -238432 -147069 -273188 -233504 -73455 21263 9106 133877 305327 189557 69638
1930F9638j39372j62814P5356Q5628j1313M2976j01027n2190K4154R6693O3508
$$ 69638 -69734 -232548 -157192 -71564 -82877 -39901 -140928 -193118 -168964 -72271 -8763
1919h763q9590j34550J15058j802r521J79946p4324J6249P4209R6297q1669K0707
$$ -8763 -98353 -232903 -117845 -119647 -129168 50778 -23546 -7297 66912 163209 81540 102247
1907A02247J5088L1r256j7004R8159j8829j92291R990J8180q0754r2428p0968
$$ 102247 117335 117366 108110 91106 189265 170436 -21855 -11865 6315 -74439 -166867 -237835
1895b37835J63817K06316n1111j31267K4291L8984m432r7482p014N5167o0558
$$ -237835 -74018 132298 81187 -50080 -25789 13195 8763 -88719 -95733 -40566 -101124
1884a01124R3655p0882J8040k3937j0046K7663M9517k8368L7060N1899o4977j30581
$$ -101124 -7469 -78351 -60311 -84248 -94294 -66631 -17114 -45482 -8422 43477 -21500 -152081
1872a52081J20848K29706o1409j11805p3888j0781J535j32276k3447N7875J66026
$$ -152081 -31233 198473 137064 25259 -48629 -59410 -57875 -190151 -213598 -155723 10303
1861A0303L0405j24190J33999J5697k3859Q2767r5611j21350J34824L7802o465
$$ 10303 40708 -83482 50517 66214 42355 125122 29511 -91839 42985 80787 74322
1850G4322l7508P4795p608j62303j93095J04637J10522N3971j6914O4396R594
$$ 74322 36814 111609 104001 -58302 -251397 -146760 -36238 17733 819 65215 74809
1839G4809j18953q8044Q9773J09407n7202l9560L8302j3925j36010j5190N2774
$$ 74809 -44144 -132188 -42415 66992 9790 -29770 8532 -5393 -141403 -156593 -103819
1828a03819J67059M3164l21629M2678K21794Q8609o9407k7039m3753J8109J12198
$$ -103819 63240 106404 -215225 -172547 49247 137856 68449 41410 -2343 15766 127964
1817A27964r1722L1508M9612n7642j42340k3807P0349J8224J4305j2581J30436
$$ 127964 36242 67750 117362 59720 -82620 -106427 -36078 -17854 -3549 -16130 114306
1806A14306Q3550j90444j68210J23744K0427Q2615p4880q5631J10267J4696j25051
$$ 114306 197856 7412 -160798 -37054 -16627 65988 -8892 -94523 15744 30440 -94611
1795i4611p4375N810M9665O8209O5999l3563L4802Q2258J8874p672m6229p5882
$$ -94611 -168986 -163176 -113511 -45302 20697 -12866 21936 104194 123068 115396 69167 -6715
1783f715k3607J12463m3876k08348P6639J05881n9143J15062q3076j73757N4936
$$ -6715 -30322 82141 38265 -170083 -93444 12437 -46706 68356 -14720 -188477 -133541
1772a33541j4433K5876j7578Q7657J10910R3756j41889o623O4118n8677M4647
$$ -133541 -147974 -122098 -139676 -52019 58891 152647 10758 4135 68253 9576 54223
1761E4223J0875Q605M6786n8081j18313J22902n0128j61216N3842M1169o4936
$$ 54223 65098 73703 120489 62408 -55905 66997 16869 -144347 -90505 -49336 -114272
1750a14272K01247q2576j03594q2928Q2398K6660M4803k9953J36934M3586j59572
$$ -114272 86975 4399 -99195 -182123 -99725 -73065 -28262 -58215 78719 122305 -37267
1739c7267l2289O1571N0428J20005n337j48896O780o1115o4970L2463N054J43021
$$ -37267 -69556 -7985 42443 162448 157111 8215 14995 -46120 -111090 -78627 -73573 69448
1727F9448L4113j30806P4919k4638k535j96939k8282J20997N5287M0713j29626
$$ 69448 103561 -27245 47674 23036 20501 -176438 -204720 -83723 -28436 12277 -117349
1716a17349l9353J18639L8943l3696p8759R2349k038l9604K9187J10958j1855
$$ -117349 -156702 -38063 880 -32816 -111575 -19226 -21264 -60868 -31681 79277 67422
1705F7422j19365K6071j8622M1926j9105N9620j36122o8877j7611R5817J44812
$$ 67422 -51943 -25872 -44494 -2568 -21673 37947 -98175 -167052 -184663 -88846 55966
1694E5966Q6247o0248J5433J9111j62734n3037m489M7969K8410P3056l8291M0735
$$ 55966 142213 81965 97398 116509 -46225 -99262 -103751 -55782 -27372 45684 7393 48128
1682D8128K0894Q6099J24817j91963j13451N9505J8122o5893J10871K2021j15750
$$ 48128 69022 155121 279938 87975 -25476 34029 52151 -13742 97129 119150 3400
1671C400L494P8666k8164O8310P91j6566o7637m2294m0285P0420N2457J00722
$$ 3400 6894 85560 57396 125706 126497 109931 42294 0 -40285 30135 82592 183314
1659A83314m8342p1900r6850J11683O5382j30756p865M2102J6886K239j8909N6381
$$ 183314 134972 63072 -33778 77905 143287 12531 4666 46768 63654 65893 46984 103365
1647A03365O4242l8832k4776r9359j915O5740L6414n4213j6093j10375j6684j67604
$$ 103365 167607 128775 103999 4640 2725 68465 104879 50666 34573 -75802 -92486 -260090
1635b60090L4336J04673R3570K3962Q1326p8808j8316K0062J5336j11722J09264
$$ -260090 -225754 -121081 -27511 -3549 77777 -1031 -19347 715 16051 -95671 13593
1624A3593J5549j36814j38725J25635P2366k1198R0738m2715K8919j7059j09762
$$ 13593 29142 -107672 -246397 -120762 -48396 -69594 21144 -21571 7348 -9711 -119473
1613a19473p561J20092J9849p5180N5426L3502m0726P0556j20708K6432M3665
$$ -119473 -127034 -6942 12907 -62273 -6847 26655 -14071 56485 -64223 -37791 5874
1602E874m6100m4329l2374J26183k1460m1103j3167K3354k6395L275J21045m523
$$ 5874 -40226 -84555 -116929 9254 -12206 -53309 -66476 -43122 -69517 -66242 54803 50280
1590E0280k4647j07009N4246R1996l4425j0295j18575k9412J42109N8484r4340
$$ 50280 25633 -81376 -27130 64866 30441 20146 -98429 -127841 14268 72752 -21588
1579b1588k5153p5113J5125J20m6131Q1817Q9573l9416K3461m6235n2990P4837
$$ -21588 -46741 -121854 -106729 -106609 -152740 -70923 18650 -20766 2695 -43540 -96530 -21693
1567b1693K292k0022N5576j0991j94300q648J27043l5J24063L584r0968l6984
$$ -21693 -19401 -39423 16153 5162 -189138 -197786 -70743 -70778 53285 56869 -34099 -71083
1555g1083o5316J41616m6013p4125O8738o9053q8176J14896k528j7011M2883O1078
$$ -71083 -136399 5217 -40796 -114921 -46183 -115236 -203412 -88516 -91044 -108055 -65172 -4094
1543d094Q882n7085j955O701J48387j62294P5162P4734o0848q0355l0507L4512
$$ -4094 4788 -52297 -54252 -47551 100836 -61458 13704 88438 27590 -52765 -83272 -48760
1531d8760n5940k604j9158J16863j7970N7887m8340j29513j57575K07743J24045
$$ -48760 -104700 -107304 -126462 -9599 -27569 30318 -18022 -147535 -305110 -97367 26678
1520B6678n0964J10107J4334p275J01763j7611k19978n3698J35593J4733j9033
$$ 26678 -24286 85821 100155 92880 194643 177032 -42946 -96644 38949 53682 34649
1509C4649q2345L2040l7386L9426j1791K8771j10287K1656M9946K10980m7962
$$ 34649 -47696 -15656 -53042 -13616 -25407 3364 -106923 -85267 -35321 175659 127697
1498A27697p3383j04869q4198P4767l3567k2931j1318p1617P4152J47981j15395
$$ 127697 54314 -50555 -134753 -59986 -93553 -116484 -127802 -199419 -125267 22714 -92681
1487i2681Q0170l0435m2307J33450r5727r498l2602J3235J28375r4330k6817q878
$$ -92681 -12511 -42946 -85253 48197 -47530 -57028 -89630 -76395 51980 -42350 -69167 -78045
1475g8045L484J8543J21209j1982j03861j52994M4406M2153N5930o4337J01085
$$ -78045 -74561 -56018 65191 53209 -50652 -203646 -159240 -117087 -61157 -125494 -24409
1464b4409J1344J9741J1864m6605J5361l1199Q1765j25475q194O4112M4009k7192
$$ -24409 -13065 6676 18540 -28065 -12704 -43903 37862 -87613 -95807 -31695 12314 -14878
1452a4878q4173n968O9339Q526j14365o6533p6843L3195J46437R8249q6009j6735
$$ -14878 -99051 -105019 -35680 -27154 -141519 -208052 -284895 -251700 -105263 -7014 -93023 -109758
1440a09758J59504j78895m8772M4062L3807J13717p0848q212j07026J05304P5702
$$ -109758 49746 -129149 -177921 -133859 -100052 13665 -57183 -65395 -172421 -67117 8585
1429H585Q6503k12343J19738N2764k2516L2695R4885k9945q6530O123M3557k9956
$$ 8585 95088 -117255 2483 55247 32731 65426 160311 130366 43836 49959 93516 63560
1417F3560O713J47152p7853q4503p0445Q5892p2785O550p6288o4477k5280O0215
$$ 63560 70273 217425 139572 55069 -15376 70516 -2269 4281 -72007 -136484 -161764 -101549
1405a01549N5595L5867L7606m612K1613J3905L1471M9581n2728n0571p6140J05134
$$ -101549 -45954 -10087 27519 22907 44520 58425 89896 139477 86749 36178 -39962 65172
1393F5172M342K413J21656j12740m7088q3137K7154k8086o166o999j02424R3215
$$ 65172 69514 71927 193583 80843 33755 -49382 -22228 -50314 -56480 -63479 -165903 -72688
1381g2688J20386o4757J3256K5339q5572N4024J49639N072j43471j43651L5521
$$ -72688 47698 -17059 -3803 21536 -64036 -10012 139627 144699 1228 -142423 -106902
$$ [...]
##END NTUPLES=NMR SPECTRUM
##END=
