##TITLE=1H_EC-3361(II-24)
 200.13MHz, CDCl3,
 8 sc
 
 12.9.2025
##JCAMPDX= 6.0         $$ Bruker NMR JCAMP-DX V2.0
##DATA TYPE= NMR SPECTRUM
##DATA CLASS= NTUPLES
##ORIGIN= UXNMR, Bruker Analytische Messtechnik GmbH
##OWNER= pz
$$ XWIN-NMR		Version 3.5
$$ Fri Sep 12 14:08:53 2025 Russian Standard Time (UT+4h)  she@DPX200
##.OBSERVE FREQUENCY= 200.1313
##.OBSERVE NUCLEUS= ^1H
##.ACQUISITION MODE= SIMULTANEOUS
##.ACQUISITION SCHEME= undefined
##.AVERAGES= 8
##.DIGITISER RES= 18
##SPECTROMETER/DATA SYSTEM= spect
##.PULSE SEQUENCE= zg30
##.SOLVENT NAME= CDCl3
##.SHIFT REFERENCE= (INTERNAL, CDCl3, 0, 15.5056)
##AUDIT TRAIL= $$ (NUMBER, WHEN, WHO, WHERE, WHAT)
$$ ##TITLE= Audit trail, XWIN-NMR		Version 3.5
$$ ##JCAMPDX= 5.01
$$ ##ORIGIN= Bruker BioSpin GmbH
$$ ##OWNER= she
$$ F:/spectra/data/she/nmr/H-C/1/pdata/1/auditp.txt
$$ ##AUDIT TRAIL=  $$ (NUMBER, WHEN, WHO, WHERE, WHAT)
(   1,<2025-09-12 14:06:54.15 +0400>,<she>,<DPX200>,
      <created by zg, POWCHK disabled, PULCHK disabled
       configuration hash MD5:
       00 E9 B6 7A A2 85 ED C7 34 08 36 98 17 FE 4E 26
       data hash MD5: 16K
       99 48 2B 86 69 CE AC 30 C8 F4 B6 BA 12 1C DE DB>)
(   2,<2025-09-12 14:07:28.40 +0400>,<she>,<DPX200>,
      <Start of raw data processing
       efp BC_mod = 2 LB = 0.25 FT_mod = 6 PKNL = 1 PHC0 = -1719.269 PHC1 = 11.79226 SI = 16K 
       data hash MD5: 16K
       EE 72 7D 3A 8D 37 54 93 D8 24 F2 3A F8 19 5D 57>)
(   3,<2025-09-12 14:07:47.79 +0400>,<she>,<DPX200>,
      <pk PHC0 = 0.3086281 PHC1 = 0 
       data hash MD5: 16K
       81 15 DC 48 6B 96 49 D2 FE 3E E6 87 76 E1 09 6C>)
(   4,<2025-09-12 14:07:52.39 +0400>,<she>,<DPX200>,
      <abs ABSG = 5 
       data hash MD5: 16K
       F4 F2 15 A6 C1 09 77 3B A0 D7 12 11 BD B0 34 27>)
(   5,<2025-09-12 14:08:19.40 +0400>,<she>,<DPX200>,
      <abs ABSG = 5 
       data hash MD5: 16K
       0D AF 07 15 51 C8 67 05 0A E0 23 3C 75 21 07 FF>)
$$ ##END=
$$ 
$$ hash MD5
$$ BB 78 BA 43 8D 75 3C EC D5 35 08 C2 8C 69 A2 13
##$RELAX= 
##$RELAX= 
##$RELAX= 
##$RELAX= 
##$RELAX= 
##$RELAX= 
$$ Bruker specific parameters
$$ --------------------------
##$DU= <F:/spectra>
##$EXPNO= 1
##$NAME= <H-C>
##$PROCNO= 1
##$TYPE= <nmr>
##$USER= <she>
##$AMP= (0..31)
100 100 100 100 100 100 100 100 100 100 100 100 100 100 100 100 100 100 
100 100 100 100 100 100 100 100 100 100 100 100 100 100 
##$AQSEQ= 0
##$AQ_mod= 1
##$AUNM= <au_zg>
##$AUTOPOS= <>
##$BF1= 200.13
##$BF2= 200.13
##$BF3= 200.13
##$BF4= 200.13
##$BF5= 200.13
##$BF6= 200.13
##$BF7= 200.13
##$BF8= 200.13
##$BYTORDA= 1
##$CFDGTYP= 0
##$CFRGTYP= 5
##$CHEMSTR= <none>
##$CNST= (0..31)
1 1 145 1 1 1 1 1 1 1 1 1 1 1 1 1 1 1 1 1 1 1 1 1 1 1 1 1 1 1 1 1 
##$CPDPRG= <>
##$CPDPRG1= <>
##$CPDPRG2= <>
##$CPDPRG3= <>
##$CPDPRG4= <mlev>
##$CPDPRG5= <mlev>
##$CPDPRG6= <mlev>
##$CPDPRG7= <mlev>
##$CPDPRG8= <mlev>
##$CPDPRGB= <>
##$CPDPRGT= <>
##$D= (0..31)
0 0.7 0 0 0 0 0 0 0 0 0 0.03 0 0 0 0 0 0 0 0 0 0 0 0 0 0 0 0 0 0 0 0 
##$DATE= 1757671613
##$DBL= (0..7)
$$ [...]
##$SUBNAM3= <"">
##$SUBNAM4= <"">
##$SUBNAM5= <"">
##$SUBNAM6= <"">
##$SUBNAM7= <"">
##$SUBNAM8= <"">
##$SUBNAM9= <"">
##$SW= 18.0517328524113
##$SWIBOX= (0..15)
0 0 2 0 0 0 0 0 0 0 0 0 0 0 0 0 
##$SW_h= 3612.71676300578
##$TD= 16384
##$TD0= 1
##$TE= 0
##$TE2= 300
##$TE3= 300
##$TEG= 300
##$TL= (0..7)
0 120 120 120 120 120 120 120 
##$TP= (0..7)
150 150 150 150 150 150 150 150 
##$TP07= 0
##$TPNAME0= <>
##$TPNAME1= <>
##$TPNAME2= <>
##$TPNAME3= <>
##$TPNAME4= <>
##$TPNAME5= <>
##$TPNAME6= <>
##$TPNAME7= <>
##$TPOAL= (0..7)
0.5 0.5 0.5 0.5 0.5 0.5 0.5 0.5 
##$TPOFFS= (0..7)
0 0 0 0 0 0 0 0 
##$TUNHIN= 0
##$TUNHOUT= 0
##$TUNXOUT= 0
##$USERA1= <user>
##$USERA2= <user>
##$USERA3= <user>
##$USERA4= <user>
##$USERA5= <user>
##$V9= 5
##$VALIST= <valist>
##$VCLIST= <CCCCCCCCCCCCCCC>
##$VD= 0
##$VDLIST= <DDDDDDDDDDDDDDD>
##$VPLIST= <PPPPPPPPPPPPPPP>
##$VTLIST= <TTTTTTTTTTTTTTT>
##$WBST= 1024
##$WBSW= 4
##$XGAIN= (0..3)
0 0 0 0 
##$XL= 0
##$YL= 0
##$YMAX_a= 430869
##$YMIN_a= -290720
##$ZGOPTNS= <>
##$ZL1= 120
##$ZL2= 120
##$ZL3= 120
##$ZL4= 120
##$ABSF1= 15.5056
##$ABSF2= -2.546249
##$ABSG= 5
##$ABSL= 3
##$ALPHA= 0
##$AQORDER= 0
##$ASSFAC= 0
##$ASSFACI= 0
##$ASSFACX= 0
##$ASSWID= 0
##$AUNMP= <proc_1d>
##$AZFE= 0.1
##$AZFW= 0.1
##$BCFW= 0
##$BC_mod= 2
##$BYTORDP= 0
##$COROFFS= 0
##$CY= -3
##$DATMOD= 1
##$DC= 0
##$DFILT= <>
##$DTYPP= 0
##$F1P= 0
##$F2P= 0
##$FCOR= 1
##$FTSIZE= 16384
##$FT_mod= 6
##$GAMMA= 0
##$GB= 0
##$INTBC= 1
##$INTSCL= 3.241238e-09
##$ISEN= 128
##$LB= 0.25
##$LEV0= 0
##$LPBIN= 0
##$MAXI= 10000
##$MC2= 0
##$MEAN= 0
##$ME_mod= 0
##$MI= 1.114404
##$NCOEF= 0
##$NC_proc= -7
##$NLEV= 6
##$NOISF1= 3.799351
##$NOISF2= 2.8
##$NSP= 0
##$NTH_PI= 0
##$NZP= 0
##$OFFSET= 15.5056
##$PC= 1
##$PHC0= -1718.96
##$PHC1= 11.79226
##$PH_mod= 1
##$PKNL= yes
##$PPARMOD= 0
##$PSCAL= 0
##$PSIGN= 0
##$REVERSE= no
##$SF= 200.130003222764
##$SI= 16384
##$SIGF1= 3
##$SIGF2= 2
##$SINO= 0.751879
##$SIOLD= 32768
##$SREGLST= <19F.Aceton>
##$SSB= 0
##$STSI= 16384
##$STSR= 0
##$SW_p= 3612.71676300578
##$SYMM= 0
##$S_DEV= 0
##$TDeff= 16384
##$TDoff= 0
##$TI= <>
##$TILT= no
##$TM1= 0
##$TM2= 0
##$TOPLEV= 0
##$USERP1= <user>
##$USERP2= <user>
##$USERP3= <user>
##$USERP4= <user>
##$USERP5= <user>
##$WDW= 1
##$XDIM= 16384
##$YMAX_p= 458174481
##$YMIN_p= -332359
$$ End of Bruker specific parameters
$$ ---------------------------------
##NTUPLES= NMR SPECTRUM
##VAR_NAME=  FREQUENCY,     SPECTRUM/REAL,   SPECTRUM/IMAG
##SYMBOL=    X,             R,               I
##VAR_TYPE=  INDEPENDENT,   DEPENDENT,       DEPENDENT
##VAR_FORM=  AFFN,          ASDF,            ASDF
##VAR_DIM=   16384,         16384,           16384
##UNITS=     HZ,            ARBITRARY UNITS, ARBITRARY UNITS
##FACTOR=    0.220516191357247, 1,           1
##FIRST=     3103.1357730849, 0,             0
##LAST=      -509.580989920877, 0,           0
##MIN=       -509.580989920877, -332359,     0
##MAX=       3103.1357730849, 458174481,     0
$$ Real data points
##PAGE= N=1
##DATA TABLE= (X++(R..R)), XYDATA
$$ [...]
9391 978065 898657 840010 874109 804907 949444 1110724 1066062 1063494 1019284 1025921 1119384 1052942
9379 1052942 1104283 1031659 1121770 1148825 1058712 934249 853314 867000 894425 800315 789609
9368 789609 810537 794013 744669 680753 800902 829696 729635 652527 758117 854507 801209
9357 801209 689031 586165 631067 736027 752624 608437 701611 726792 700271 729169 827757
9346 827757 827459 799774 844359 742651 662835 635783 734655 633821 518595 615355 524223
9335 524223 482814 609456 687427 735717 754968 770422 786092 747262 762142 692968 629325
9324 629325 610470 634626 674088 708170 668743 621106 566788 593280 714680 658897 646440
9313 646440 646069 612273 647350 648820 672764 686134 734273 754533 816032 745358 639178 617911
9301 617911 705196 637163 521745 686883 709884 855457 876521 703078 657917 625791 762813
9290 762813 641412 502052 456016 606253 746163 645407 821953 915008 862671 894640
9280 894640 953102 916937 802286 898972 816390 758089 737228 749607 832726 827896 893556 886921
9268 886921 841852 677019 636260 809182 836976 803832 804016 826290 821531 737136 737499 868654
9256 868654 913488 915287 811595 802875 803225 802915 978186 885135 811411 822681 939285 995595
9244 995595 933669 1001575 1059501 1075953 1106742 1021320 1038043 1167233 1205980 1198206 1157116 900916
9232 900916 933706 960808 952317 937328 1059555 1124062 1001582 947794 925399 972453 1102473
9221 1102473 1124410 1230834 1183701 1091359 1110855 1150806 1145912 1117721 1166254 1245673 1207725
9210 1207725 1139624 1104888 1151923 1213393 1254209 1291011 1162615 1208657 1258185 1292317 1443328
9199 1443328 1416087 1280008 1210990 1195018 1314905 1289017 1216776 1214590 1065276 1052781 1115628
9188 1115628 1086438 1196196 1196716 1178227 1173240 1185536 1206900 1103536 1128832 1115908 1170737 1313067
9176 1313067 1304047 1372494 1299295 1255665 1267772 1214292 1254988 1219628 1296487 1365292 1295393 1269702
9164 1269702 1296175 1315350 1389242 1402237 1575692 1666360 1427878 1327898 1331843 1268752 1229935
9153 1229935 1281316 1278941 1270984 1372816 1405627 1303176 1372540 1493564 1429013 1363029 1516022
9142 1516022 1572164 1559610 1511231 1441048 1366287 1418673 1440425 1352954 1344027 1359383 1340941 1331254
9130 1331254 1435786 1418220 1450937 1496708 1479916 1471609 1426201 1370927 1612621 1603109 1491128
9119 1491128 1465185 1503023 1672962 1522779 1564861 1646732 1645065 1681768 1776528 1763140 1757925
9108 1757925 1723566 1750604 1806032 1855499 1811265 1926467 1974184 1914611 1861554 2009644 2040584
9097 2040584 1978503 1942740 1966000 2107104 2185456 2081730 2129003 2232446 2182986 2215611 2248389
9086 2248389 2291274 2348015 2378210 2356514 2483566 2518231 2613574 2583989 2636979 2769525 2933939
9075 2933939 2967824 3037977 3096754 3239168 3294633 3284378 3346469 3217447 3274118 3195811 3239207
9064 3239207 3173239 3117841 3168185 3236375 3369734 3318155 3283348 3410201 3547433 3656807 3639144
9053 3639144 3771827 3785160 4012566 3998888 3835128 3873868 3858001 3816477 3840922 3784960 3719090
9042 3719090 3870340 3899968 3916778 3795887 3898161 3970473 4109364 4081620 4206287 4280034
9032 4280034 4171116 4145470 4315631 4437208 4340953 4313506 4325752 4280142 4262084 4267513 4131353
9021 4131353 4148277 4207475 4219160 4226695 4200667 4253894 4439264 4509590 4616374 4676531 4696468
9010 4696468 4722041 4663154 4701489 4597053 4576222 4565895 4384145 4310306 4263247 4336481 4500626
8999 4500626 4380165 4413741 4335299 4311832 4286446 4469922 4565074 4555230 4534994 4469374 4602151
8988 4602151 4749933 4645836 4617508 4671010 4783393 4936786 5110063 5178652 5290517 5340662
8978 5340662 5379487 5357781 5467090 5450789 5457479 5508423 5734652 5892794 5961891 6128962 6340112
8967 6340112 6594585 6674897 6798738 7137230 7259273 7445935 7783106 7878475 8144988 8365123
8957 8365123 8633728 8954930 9344850 9706248 10159391 10481406 10949835 11367557 11706160 12221801
8947 12221801 12692321 13137490 13872650 14543765 15431799 16351542 17675270 19032936 20610845
8938 20610845 22315027 24246300 26299992 28910633 31574988 34768605 38869369 43851664
8930 43851664 49887912 57178330 64628816 70548862 76955336 83801271 87646543 87845112
8922 87845112 80784907 70534911 63269325 57473424 52884957 48991474 46465213 44599786
8914 44599786 43110326 41844750 40862734 40089868 39826779 39949916 40556362 41679975 43101219
8905 43101219 44810149 46639169 48490743 50110075 51561615 52877945 53889315 54694854
8897 54694854 55537229 56549891 57626784 59210289 61309198 63236774 65216767 66769834
8889 66769834 67491951 67510658 66712822 65153651 63258511 61619609 60177779 59402736 59221491
8880 59221491 59557576 60436560 61727929 63546059 65910514 68292062 70130765 71043720 71250222
8871 71250222 71423431 72670943 74160757 75648878 77388061 79039568 80684040 82484041
8863 82484041 84216039 85909569 87285438 88652048 90125148 91771395 93401684 93868483
8855 93868483 93115927 91321567 88447305 84539919 80718368 77303309 74329508 72025917
8847 72025917 70716281 70229973 70590686 71630288 73390124 75755730 78580145 81816392
8839 81816392 85201916 88569695 91803196 94518102 95622449 93778686 89508551 84851303
8831 84851303 81274283 79074958 77635852 76950792 77193606 77809252 79002009 80611796 82148851
8822 82148851 82566086 81422125 79499292 77633242 76333589 75201134 73579627 71205123
8814 71205123 68613220 65771454 63084907 60938327 59302195 58040227 57404788 57186500
8806 57186500 57382648 58156454 59501823 61110628 62963594 65157463 67450498 69524808
8798 69524808 71705639 73470375 73835746 72519939 69344694 65255417 61325172 58369987
8790 58369987 56150993 54576035 53442052 52708958 52388048 52287982 52041783 51364491 49784717
8781 49784717 47195059 44483191 42175205 40296948 38564546 37061067 35687774 34278531
8773 34278531 33173833 32190911 31175259 30437290 29711889 29091134 28715346 28382923 28112805
8764 28112805 27932926 27590396 27528662 27431200 27164857 26863226 26545747 26383552 26192998 25985600
8754 25985600 25492443 25106549 24978308 24995016 25133031 25198753 25123346 25236083 25301194 25285911
8744 25285911 25253721 25309758 25517684 25852634 26192030 26539195 27345085 28029552 28827047 29849466
8734 29849466 31043985 32475336 34121839 35993180 37784138 39781995 41569426 43122911
8726 43122911 44385309 44988657 45150463 45065482 45059969 45316754 45877152 46669784 47583973 48451599
8716 48451599 49193808 49380472 48801629 47255004 45197353 43030860 40931543 39293316 37777635
8707 37777635 36472884 35472318 34420518 33533064 32888596 32377166 31951342 31509192 31245640
8698 31245640 31281150 31500368 31803803 32312223 33059420 34071100 35067335 36594561 38287912
8689 38287912 39814520 41214956 42852223 44398888 45831229 46914918 47408403 47362694 46964290
8680 46964290 46452985 46091877 46268649 46438031 46895932 47506146 48066846 48517341 48336212
8671 48336212 47208269 45236706 42773414 40280457 38021559 36055327 34611133 33237254
8663 33237254 32165448 31442094 30582468 29954463 29220685 28358345 27804661 27284436 26833485
8654 26833485 26583739 26267213 25996121 25816528 25579765 25433838 25426080 25421303 25325305 25303789
8644 25303789 25475762 25631139 25676707 25794459 25687433 25447968 25326287 25024907 24818273 24568695
8634 24568695 24481079 24626551 24842840 25079004 25417667 25649423 25958388 26146755 26287067 26539983
8624 26539983 26864403 27264309 27914464 28587153 29661329 30718542 31771325 32874232 33672300
8615 33672300 34207217 34012895 33451810 32741613 32246339 31871522 31576876 31588070 31697636 32070728
8605 32070728 32597649 32750440 32423903 31723550 30854102 30044683 29389245 28984271 28687030
8596 28687030 28295020 28042694 27683712 27420018 27399584 27475154 27787680 28032485 28300231 28758916
8586 28758916 29370736 30061264 30575799 31410502 32542452 33919994 35378572 36953478 38617793
8577 38617793 39712758 41527389 43170665 43836454 43973728 43458165 42524265 41544297 40955212
8568 40955212 40460562 40358400 40423621 40497640 40507932 40215970 39172822 37784182 35930299
8559 35930299 33909272 31823693 30200544 28859663 27725902 26857784 26136931 25621262 25182870
8550 25182870 24742991 24394266 24229633 24163866 24147845 24079774 24265013 24529066 25093750 25753035
8540 25753035 26459705 27310583 28262241 28965652 29855563 30680924 31142154 31389516 31197176
8531 31197176 30588586 29967828 29354499 29044420 28827867 28562685 28414003 28325384 28135963 27734818
8521 27734818 26812381 25752146 24571383 23273894 22074636 21205480 20479378 19703677 19156017
8512 19156017 18750916 18232474 17963776 17807057 17595847 17452425 17299036 17509835 17462565 17639135
8502 17639135 17791324 18064726 18357391 18871619 19320918 19701820 20022037 20221695 20380853
8493 20380853 20571360 20830370 20978439 20936346 21006342 21168203 21487312 21755610 21960090 22137294
8483 22137294 22358191 22776944 23222619 23705320 24477931 25365302 26315351 27686571 29413601
8474 29413601 31301841 33314196 35735150 38251985 40935819 43804481 46436409 48145980
8466 48145980 48962503 48935139 48246624 46907716 45021147 43075414 41925074 41384403 41463962
8457 41463962 41952875 42943173 44249773 45909731 47611172 49650916 51505345 52587069
8449 52587069 52738210 51750003 50193937 47812805 44752040 41598202 38862928 36838302
8441 36838302 35390813 34304186 33529052 32881724 32762911 33051077 33485907 34064020 34969015
8432 34969015 36146735 37604392 39295068 40971378 42237057 42601894 42268201 41675171 40336676
8423 40336676 38300344 36121040 34462309 33326398 32787629 32676247 32681229 33261881 34212094
8414 34212094 35135066 36237542 37678073 38690228 39140203 38662137 37512234 35616170 33046089
8405 33046089 30145645 27302418 24875146 22906948 21102399 19476282 18401771 17186313
8397 17186313 16144097 15148724 14333176 13593001 12722037 12156129 11547954 10933027 10460274
8388 10460274 10203591 9740743 9383495 9117686 8778953 8400675 8168722 7961256 7506170
8379 7506170 7443146 7298952 7038253 6935265 6727122 6466649 6494219 6500560 6416466 6325592 6297315
8368 6297315 6189925 6111387 5890519 5691394 5618060 5478654 5411923 5232011 4865980 4753372
8358 4753372 4727746 4722555 4814010 4719595 4682908 4801768 4688590 4630059 4617336 4458021 4387102
8347 4387102 4476359 4440666 4308426 4208519 4099676 3959708 3736882 3634838 3683752 3686821 3467346
8336 3467346 3482414 3443464 3342359 3401348 3283441 3263558 3208832 3099878 3229851 3283394 3221844
8325 3221844 3216714 3088099 3112366 3203642 3106049 3061046 2945266 2895049 2819701 2834286 2886714
8314 2886714 2731740 2670314 2762614 2919884 2839333 2747492 2737799 2681592 2740756 2676566 2659791
8303 2659791 2672478 2553781 2402679 2375242 2486445 2387153 2299016 2348421 2200214 2171331 2129540
8292 2129540 2302933 2224096 2176281 2119603 2123810 2186668 2237712 2346906 2215450 2231368 2434172
8281 2434172 2290112 2093092 2214229 2331698 2307596 2308747 2286119 2344322 2439133 2432531 2544587
8270 2544587 2456511 2613036 2610730 2675437 2769540 2863706 3038549 3168826 3251322 3407056 3541026
8259 3541026 3731015 3932331 4138704 4379710 4564962 4969791 5094725 5147783 5298947 5466880
8249 5466880 5764685 5921526 6057868 6069214 6028512 5888061 5703917 5296957 5012135 4840377
8239 4840377 4549867 4402842 4340304 4104386 4015820 3943634 3882184 3782948 3945776 4106413
8229 4106413 4201711 4342149 4478501 4742554 4999311 5229365 5525439 5809731 6023284 6236248
8219 6236248 6310143 6209490 5959824 6058555 5906852 5834384 5759269 5511859 5185380 4929962
8209 4929962 4574124 4343661 4015576 3691082 3312691 3223462 3023412 2906817 2717421 2612347
8199 2612347 2677684 2552685 2333503 2412478 2206860 1955073 1656372 1877599 2451076 2244973
8189 2244973 2203423 1936244 1775099 1699512 1697067 1556722 1710791 1591890 1542697 1522565 1395146
8178 1395146 1269718 1338820 1370309 1314452 1430727 1442869 1472345 1320378 1128015 1107565 1257158
8167 1257158 1284697 1341373 1502841 1406307 1329164 1361066 1261248 1237364 1172477 1203574 1248979
8156 1248979 1213815 1217657 1267891 1225261 1224609 1130933 1097023 1102738 1096107 1226915 1168061 1117615
8144 1117615 1138060 1113306 1074569 1030885 953339 901435 910934 857842 751243 757607 770311 694700
8132 694700 742652 740100 771717 918640 832199 830685 837412 783354 554130 615554 765348 666057
8120 666057 699740 891451 927558 780882 645785 707958 564373 599082 755871 665674 656826
8109 656826 694048 701192 696579 686779 608456 725383 732873 755194 679418 618833 590133 589555 567121
8096 567121 643476 637763 757905 815807 882867 799549 614673 620063 693429 773886 736201 689408
8084 689408 726943 689238 621033 710021 730635 726661 601923 547122 631588 687931 686551 597043
8072 597043 548294 625860 780361 924589 857040 710414 525496 572233 567816 527432 559350
8061 559350 600378 685517 859300 762878 577693 568689 686814 652992 602492 501004 542344
8050 542344 624095 654284 602798 632248 607087 694739 541500 318241 513471 494134 486358
8039 486358 542938 455971 470978 510323 510270 502430 483641 531557 398834 346597 262536 238031
8027 238031 251823 303339 417981 514853 436597 521717 494021 359212 309415 183999 252660
8016 252660 392334 418784 419541 345110 447619 389501 360226 376827 339849 405555 364768 382986
8004 382986 308708 334245 466045 388981 431737 351779 128146 235711 368768 381098 288346
7993 288346 432883 452510 411878 388815 314112 372084 368854 359044 291162 377509 290753 389230
7981 389230 452860 293675 371675 365873 155581 339831 346814 334845 371107 336965 319583
7970 319583 325521 245257 268320 224577 195644 242613 183898 218869 287651 197014 175740 233503
7958 233503 275048 355264 198173 216786 355547 218113 266755 313563 289661 376435 418694
7947 418694 524874 422736 437428 362429 414109 491982 425523 488317 590181 567090 477531
7936 477531 408159 436895 360566 342313 394698 414571 284916 229375 267411 370154 271071
7925 271071 232181 378971 430160 547445 588199 524806 553999 603657 550260 472722 414108
7914 414108 491573 531832 547940 519500 463926 531365 530644 479987 576133 545786 575265 497307
7902 497307 476242 527124 540681 634363 670058 723785 656078 553927 533140 588972 517688
7891 517688 382456 318023 494352 478013 346245 269210 390196 403591 286634 253608 361206
7880 361206 326449 314946 431276 422805 422826 306480 302245 323996 370101 313245 208438 159835
7868 159835 175371 229536 102617 158119 158751 150156 183932 256892 213565 340256 390411 317834
7856 317834 330622 375164 347698 314714 305701 273514 366547 392045 271759 280125 309582 201510
7844 201510 244065 335027 265945 150013 217662 233625 173329 161262 298140 319571 409127
7833 409127 415556 368122 458045 302639 276156 278197 189009 87495 154065 356593 400009
7822 400009 440370 456402 427101 360335 277164 283143 306271 307423 365483 338466 306130 394786
7810 394786 431991 545503 291476 260681 765634 657005 541218 451405 577804 607048
7800 607048 422507 285126 382559 422795 533275 641349 605701 657613 686150 716668 701152
7789 701152 605353 658033 740903 803174 640234 763296 786105 874040 916252 833702 897440
7778 897440 755145 692953 674719 662145 773142 710254 690692 819294 930416 842633 831829
7767 831829 920813 1001762 1030868 1068187 1068078 1044405 1185767 1257391 1270740 1376895 1477867
7756 1477867 1562487 1635437 1703592 1581822 1514868 1611372 1597514 1458098 1631965 1736931 1615114
7745 1615114 1577854 1500062 1520347 1718303 1767249 1747247 1820393 1814267 1918700 1934344 1916792
7734 1916792 1910084 2035223 2044751 1956608 1993061 1993043 2109633 2303711 2263005 2206557 2174895 2381771
7722 2381771 2370187 2386435 2232621 2306321 2286187 2256859 2309888 2276944 2294908 2351463 2186751
7711 2186751 2181021 2127782 2014848 2003404 1984834 1878252 1851331 1834485 1797651 1727590 1611587
7700 1611587 1591552 1591242 1636274 1702837 1565266 1629652 1562114 1534211 1543023 1472972 1375802 1418618
7688 1418618 1486680 1444051 1278914 1167033 1170295 1189881 1088069 1254230 1141216 1075817 1169396
7677 1169396 1133498 1129379 994013 916000 968696 962722 793920 800100 716598 819711 763040
7666 763040 759812 778567 696022 693115 807131 722981 819980 796121 707003 893652 979257 942761
7654 942761 987614 882257 838172 822498 757929 694954 741428 708037 711830 677964 582886 577811
7642 577811 754001 674080 579972 587060 623312 661655 807323 693383 747999 762140 637097
7631 637097 748608 638526 752465 759088 719369 705501 561504 620232 692670 573146 694387
7620 694387 889351 922553 958977 912623 1006735 955757 911647 945916 1071681 981853 1026350
7609 1026350 1019576 1067687 1102133 1200170 1353643 1432072 1445344 1429473 1435110 1553851 1599054
7598 1599054 1694018 1868864 1902692 1899484 1973296 1999705 1900554 2053151 2107981 2052499 2057570
7587 2057570 2018700 1989108 1966117 2055357 2227929 2252358 2350851 2371514 2515584 2390820 2284756
7576 2284756 2186840 2320509 2397163 2380323 2382574 2507643 2717368 2869649 2902690 2861147 2824805
7565 2824805 2756788 2810916 2809194 2776404 2780765 2923420 2886655 2829622 2837037 2767337 2759524 2626739
7553 2626739 2620762 2721091 2535157 2458919 2475919 2430783 2436497 2329731 2288245 2192581 2110882
7542 2110882 2254524 2267072 2330320 2406117 2284424 2090224 1979228 2187852 2249958 2237866
7532 2237866 2184540 2298186 2342844 2361954 2319225 2142902 2120947 2171356 2102038 2022388 2025723
7521 2025723 2039076 2112235 2098790 1902751 1810920 1784134 1838057 1838783 1857672 1938536 1744284
7510 1744284 1759316 1728612 1756571 1895649 1914542 1967983 1812372 1888021 2002753 1921347 1959263
7499 1959263 1844372 1730837 1818261 1895255 1932023 1820552 1734991 1854716 1895860 1921205 1788356
7488 1788356 1914626 1999028 1879021 1846056 2007309 2204941 2145742 1987724 1981864 2153594
7478 2153594 2175391 2203265 2156179 2191573 2203379 2265282 2184039 2245675 2400079 2361539 2335290
7467 2335290 2347518 2353332 2269593 2416524 2358403 2411140 2503422 2539821 2494465 2526524 2593349
7456 2593349 2594034 2733687 2721861 2820123 2968578 3038055 3206536 3309680 3318243 3219784 3272686
7445 3272686 3466092 3653731 3743445 3738154 3797748 3826282 4003385 4140379 4225089 4324472 4665128
7434 4665128 4904510 4909036 5041721 5212995 5409895 5741142 5920687 6101890 6325886 6510578
7424 6510578 6694109 6862210 7171743 7414655 7660066 8028054 8248449 8668957 9056652 9429875
7414 9429875 9978821 10473369 10847462 11366311 12035077 12557032 13318677 14089932 14697970 15560388
7404 15560388 16351904 17165331 18039641 19206297 20535202 21548815 22765068 23998967 25505641
7395 25505641 26959210 28429353 29960103 31709928 33364902 35019106 36871642 38778233
7387 38778233 40528574 42284918 44169465 46023029 47603181 49386828 50858584 52131620
7379 52131620 53123238 54086848 54793625 55093344 55228665 54824709 54232556 53578117 52574821
7370 52574821 51296271 49891301 48325341 46784852 44944647 43162628 41273809 39420749
7362 39420749 37615338 35842603 34121454 32624312 31165698 29908160 28441503 26894411
7354 26894411 25605149 24448091 23363749 22380476 21520281 20565946 19716493 18851859 18036714
7345 18036714 17443007 16763975 16058600 15292620 14627410 14187455 13650454 13141781 12678614
7336 12678614 12205079 11898311 11453389 11147178 10713715 10363630 10007195 9624103 9499582
7327 9499582 9203446 8839657 8514857 8230125 8086692 7984187 7837128 7635400 7387806 7181523
7317 7181523 7011149 6814880 6580810 6373928 6138146 5971275 5911078 5727626 5618450 5506078
7307 5506078 5300408 5153738 4993961 5008623 4889772 4731020 4525165 4425780 4366678 4146308
7297 4146308 4053430 4103668 4130705 3922134 3908842 3920389 3809463 3741776 3699990 3552660 3449508
7286 3449508 3392473 3423862 3421036 3120499 3246283 3179314 3177922 3078203 2993353 3026994 2967526
7275 2967526 2905103 2772945 2746773 2799620 2855783 2729980 2767930 2687012 2611710 2530630 2520713
7264 2520713 2467586 2492795 2544282 2426807 2291980 2227453 2124232 2154232 2132039 2096028 1996915
7253 1996915 2030700 2089181 2026220 2128320 2143642 2074667 1995318 2000145 2091216 1850606 1864125
7242 1864125 1974013 1898860 1911590 1858314 1891179 1855335 1907694 1894777 1833959 1677456 1665949
7231 1665949 1697536 1734182 1687184 1625902 1590950 1604899 1611627 1556746 1545558 1674452 1584970
7220 1584970 1618013 1571543 1540791 1503989 1461226 1559314 1381100 1384169 1341173 1286547 1370303
7209 1370303 1205925 1223505 1343184 1355780 1325759 1316192 1421918 1382610 1325762 1334855 1318626
7198 1318626 1188921 1160222 1176967 1245366 1121834 989411 1067342 1052146 1071583 1107988 1176693
7187 1176693 1088633 1149335 1127654 1154666 1169195 1222768 1325002 1308182 1356385 1396382 1434354
7176 1434354 1297623 1343989 1156962 1258686 1272282 1253641 1222335 1366182 1448726 1371339 1202102
7165 1202102 1166285 1267762 1350613 1300077 1307173 1342647 1177936 1064647 1136159 1134773 1255872
7154 1255872 1428957 1198624 1103935 1130092 1126626 1046098 1009001 981700 1025802 899218 821207
7143 821207 838712 1077889 1090933 974246 971521 1108557 1127070 1100487 1043715 1059502 1109623
7132 1109623 1015351 1043433 1137843 1076705 993504 1082937 1243537 1168644 1178600 1152628 1068067
7121 1068067 915035 896695 892312 949951 994441 1140058 1163612 966155 923183 955489 969846
7110 969846 891371 957487 872958 878672 1067871 1052340 882452 901121 1003852 1037424 982386
7099 982386 1098253 1096155 1074564 1101606 1414118 1380904 1329313 1424897 1419178 1594721 1615048
7088 1615048 1683637 1821453 1787465 1921607 2120315 2097150 2252577 2352042 2628145 2816553
7078 2816553 3040283 3319726 3517916 3793058 3917100 4037278 4175210 4226151 4092930 4179634
7068 4179634 4211403 4126510 4058186 3811427 3566846 3351486 3154290 2902067 2837440 2817852
7058 2817852 2794898 2696776 2495301 2419884 2385429 2415028 2208621 2127012 1931930 1849999 1786037
7047 1786037 1622054 1560519 1551137 1541075 1486457 1405270 1354943 1440784 1456532 1382900 1247064
7036 1247064 1258377 1264986 1217554 1175338 1114691 1180095 1181675 1105822 1146476 1082200 1156162 1134435
7024 1134435 1044232 959515 963441 1144094 972934 843990 793574 831140 916006 980905 936295
7013 936295 817796 853036 829238 793708 878267 892443 918134 919199 981035 1062250 986951 1021778
7001 1021778 953310 810142 925607 998033 986724 1008797 914959 918244 896260 951192 994238
6990 994238 1042286 900316 980523 1127568 1207146 1124392 949392 990379 1030633 975041 1009600
6979 1009600 1127331 1193758 1045721 934901 931058 942370 937421 1001567 1151503 1141623 1114755
6968 1114755 1261788 1253921 1225550 1222647 1169808 1185877 1043415 1215303 1160351 1063605 1090720
6957 1090720 1128397 1093491 1019246 1201219 1173646 1255976 1313805 1272012 1371161 1262865 1199816
6946 1199816 1182745 1207819 1289176 1484735 1584989 1614041 1554638 1477574 1490001 1630107 1502961
6935 1502961 1446223 1386062 1202041 1223286 1150543 1056755 1108892 1035560 990057 1092126 1036199
6924 1036199 996373 1063515 995244 935408 1004986 941725 989442 1087127 971260 1013368 1002650
6913 1002650 1023233 1036838 1014748 926699 952541 941682 901663 886518 979223 995067 1025200
6902 1025200 1029595 1141042 1348831 1251945 1311683 1460149 1483837 1524174 1533633 1497574 1702701
6891 1702701 1730316 1871205 2065208 2388826 2496953 2628006 2704986 2821307 2780687 2861740
6881 2861740 2863973 2756465 2563335 2469379 2440609 2372706 2181083 1980252 2087170 2133522 1964313
6870 1964313 1680503 1671239 1796487 1620574 1510105 1384622 1232794 1275766 1346483 1318150
6860 1318150 1382304 1316104 1165397 1278991 1229247 1122241 1203807 1262173 1219637 1219199 1174368
6849 1174368 1167575 1208989 1197977 1255873 1314031 1386189 1462702 1395284 1470767 1584410 1613935
6838 1613935 1678994 1803268 1936397 2129610 2265756 2514911 2744165 2882086 3079070 3173958
6828 3173958 3265184 3212495 3155016 2861785 2696740 2620927 2263895 2150151 2031112 1927431
6818 1927431 1707384 1737716 1573317 1591089 1547552 1566132 1559535 1424023 1386339 1308845 1278971
6807 1278971 1240988 1178408 1221748 1184266 1109264 1021383 899810 926001 1005447 1084594 924158
6796 924158 946608 1071723 1081738 1034564 1013320 1060240 1072070 968259 955853 1017380 1087874
6785 1087874 1115126 1164688 1148409 1174853 1398454 1334467 1443022 1532159 1636875 1729222 1689000
6774 1689000 1793982 1775960 1784170 1765416 1601361 1613495 1484224 1179529 1167490 1074602 1043537
6763 1043537 1053102 1006715 1198441 1147186 1132787 1103068 930869 948945 944083 945312 945006 951896
6751 951896 942509 924010 1021844 1130306 1052124 989103 898407 937889 830941 907148 961114
6740 961114 841458 903252 964461 881606 830272 906290 871770 904514 1068467 1116692 1057911
6729 1057911 1045647 1043238 1194234 1141428 1174631 1157435 1065102 1184439 1313380 1303593 1284414
6718 1284414 1433132 1533131 1731574 1924589 2019831 2077979 2302868 2348179 2302069 2202326 1982044
6707 1982044 2024201 2005963 1985502 2011553 1894031 1832067 1732115 1733393 1791867 1647851 1579142
6696 1579142 1568911 1586979 1644633 1729334 1714523 1721329 1655715 1489162 1545158 1591779 1621855
6685 1621855 1600508 1672462 1666281 1685999 1685291 1709682 1732983 1678761 1628651 1586456 1679132 1732777
6673 1732777 1785388 1776941 1753887 1877297 1861404 1798442 1670379 1708551 1676296 1656579 1522629
6662 1522629 1580960 1664915 1679168 1794576 1829942 1782335 1782886 1946787 2006834 2048886 2132186
6651 2132186 2170449 2119396 2211065 2122260 2199015 2349838 2255883 2330205 2259620 2132053 2225385
6640 2225385 2168854 2093670 1955495 1980749 2138232 2199183 2079520 2027692 2070264 1973357 1868526
6629 1868526 1951258 1976695 1924783 2070967 2156879 2221547 2258979 2359331 2435922 2389521 2294878
6618 2294878 2268035 2281662 2206704 2169514 2218506 2231879 2246460 2276894 2232238 2266623 2364623
6607 2364623 2368064 2386145 2280373 2240309 2283152 2204186 2218520 2221407 2296521 2264759 2284240 2270966
6595 2270966 2364480 2382607 2377673 2382421 2416768 2431021 2563069 2682597 2650037 2606246 2631492
6584 2631492 2598375 2533490 2397189 2483886 2753531 2814181 2804021 2782906 2728967 2743555 2758845
6573 2758845 2890194 2849080 2778427 2830280 2980748 3191721 3236526 3243917 3245912 3339810 3228751
6562 3228751 3299407 3396095 3535862 3570162 3792398 3915730 3888231 3938095 3929054 4183682 4332787
6551 4332787 4313675 4497917 4697355 4959769 5184826 5213572 5491834 5804885 6034244 6328294
6541 6328294 6795249 7311873 7933675 8519360 9079029 9936251 10893031 11776894 12780008
6532 12780008 13852556 14932894 15980937 17020952 17829147 18303987 18381532 18167659 17638428
6523 17638428 16778510 15715666 14760210 13853500 13073099 12503163 12013531 11605344 11129712
6514 11129712 10910597 10699691 10434028 10122555 9936533 9747677 9268754 8692134 8383646
6505 8383646 8018570 7570523 7018692 6731173 6338115 6003744 5734610 5560470 5454147 5178782
6495 5178782 5026680 4942505 4800457 4613175 4503674 4287717 4206487 4238548 4187699 4005085
6485 4005085 3852099 3746235 3773029 3639708 3656988 3703664 3653667 3460435 3444697 3517417 3415754
6474 3415754 3396101 3326765 3345203 3395644 3347865 3356854 3437719 3366316 3319261 3284173 3312084 3384143
6462 3384143 3270027 3412132 3499568 3511539 3380345 3246305 3314588 3337538 3373951 3377862 3343694
6451 3343694 3224027 3331158 3163174 3264736 3388745 3336334 3502983 3482611 3451277 3519446
6441 3519446 3642435 3864763 3844730 3904458 4095557 4188290 4215086 4281764 4470164 4673352
6431 4673352 4716173 4780781 4739936 4771675 4903844 4954393 4986003 5128703 5250791 5390816 5596063
6420 5596063 5701614 5707896 5862465 5881754 5920588 5898915 5987347 6120270 6009630 6046246 6177057
6409 6177057 6103741 6099895 6165613 6184857 6274317 6393445 6523664 6586085 6700645 6767311 6933592
6398 6933592 7001461 7138890 7290571 7323636 7387884 7484656 7487611 7712022 7623469 7603651 7577545
6387 7577545 7630942 7707244 7734534 7816747 7748345 7873800 7938890 7874736 8002941 8276255 8484157
6376 8484157 8539571 8814722 9196506 9445201 9695498 10161350 10745566 11122622 11423537 12040995
6366 12040995 12544904 13296328 14064729 15068881 16052527 17222240 18420265 19936855 21709990
6357 21709990 23767957 26227851 28890291 31956549 35153360 38571280 42091975 46030458
6349 46030458 49990735 53908173 56908985 57043793 54830768 51810717 49090467 47361485
6341 47361485 46028949 44946975 43894362 43177208 42619106 42671154 42808524 43054466 42986590
6332 42986590 43175737 43281225 43204714 43189674 43421742 43855776 44293259 45028353 46026154 47353116
6322 47353116 48565197 49980047 51213442 52714393 54520502 56641541 59116153 62089037
6314 62089037 65324175 68597994 71896135 75003277 77508370 78776779 78586654 77009808
6306 77009808 74300140 71105084 68356195 66345258 64878127 64127351 64121580 64847606 66090492
6297 66090492 67925062 70127258 72642528 75469198 78481760 81454096 83558747 84621323
6289 84621323 84698764 83794435 81971104 78995955 75344732 70977390 66524489 62566926 59121602
6280 59121602 56201368 53703487 51600987 49762966 48362928 47272757 46646007 46405081
6272 46405081 46469956 47005439 47937173 49322696 51118301 53371060 56135566 59251108 62723130
6263 62723130 66307977 69996595 73723515 77030862 79425676 80732223 81112039 80486635
6255 80486635 79004064 76901629 74307852 71513965 68699266 66377802 64589540 63444270
6247 63444270 62859095 62961218 63456892 64583029 65915274 67518978 69524558 71500415 73382763
6238 73382763 74681303 75005973 73990351 71896442 68847150 65281057 62132294 59078504
6230 59078504 56420671 54188622 52421047 50800773 49297440 48082596 46818456 45357231
6222 45357231 43799692 42349555 41051554 39833699 38860909 38099531 37411819 36790768 36153522
6213 36153522 35304920 34240889 33160496 32048277 31174439 30438738 29550063 28800357 28092504
6204 28092504 27310195 26365593 25170396 24136687 23013276 21765472 20847476 20068019 19385981
6195 19385981 18725754 18113981 17586573 17196352 16859356 16319014 16002034 15741130 15433987
6186 15433987 15116125 14942901 14666085 14534537 14380284 14340228 14272034 14208737 14272322 14207022
6176 14207022 14348823 14455999 14532312 14612784 14610652 14559976 14285359 14065119 13943923 13887782
6166 13887782 13710374 13635969 13452990 13300123 13282498 13157568 13028776 12968382 12949783 12912683
6156 12912683 12734552 12622092 12593761 12457557 12560814 12499199 12361105 12385098 12440339 12462716
6146 12462716 12472537 12386051 12257771 12305375 12101012 12077974 12017319 12047426 12000122 11922755 11834726
6135 11834726 11520650 11386365 11307565 11103811 10914864 10801476 10582362 10192444 9646214 9313669
6125 9313669 9071603 8792693 8464766 8108955 7910185 7416401 7189305 7061187 6771552 6644049
6115 6644049 6387372 6163665 5895135 5766686 5771234 5529522 5351854 5153389 5063709 5026625
6105 5026625 4929834 4862039 4666132 4692985 4638802 4646012 4630329 4399497 4259732 4220010 4358905
6094 4358905 4318572 4283120 4250031 4136709 4080423 4063392 4059822 4057637 4117031 4181861 4179446 4185680
6082 4185680 4206715 4078947 3991624 3909064 3925030 4053831 4215542 4289970 4171236 4040357
6072 4040357 4080728 4152848 4104059 3928720 3945355 3873191 3955047 3973717 3955898 3905487 3941156
6061 3941156 4130343 4069071 4054414 4019588 4006947 3957692 3878462 4030620 4150608 4220608 4201437
6050 4201437 4309817 4489519 4419165 4266307 4357735 4482937 4547325 4410292 4303275 4339005
6040 4339005 4322280 4254689 4196161 4210186 4143677 4074389 4245344 4321577 4293653 4401500 4556856
6029 4556856 4396237 4420957 4481323 4411669 4442497 4446929 4404260 4494358 4627245 4538696 4524591
6018 4524591 4449542 4354080 4382346 4438655 4497614 4494429 4540573 4574512 4555625 4666491 4747719
6007 4747719 4690788 4675719 4634382 4748930 4801411 4915297 4959441 5000585 5049308 5007050 5174205
5996 5174205 5302228 5416563 5518261 5457708 5393891 5556343 5686501 5759057 5743714 5706216
5986 5706216 5849414 5771357 5759422 5727456 5648792 5729432 5807750 5811010 5878209 5857953 5842866
5975 5842866 5928264 6073865 6300038 6246281 6403881 6571597 6848418 6959663 7186542 7362865
5965 7362865 7571983 7835707 8130306 8295103 8578903 8867783 9356289 9715047 10054141 10574018
5955 10574018 11163758 11784932 12574722 13429825 14289695 15236137 16138972 16993284 17713929
5946 17713929 18383485 18881463 18924874 18631325 18031707 17146054 16250434 15304213 14510973 13802712
5936 13802712 13022641 12425548 11864179 11351798 10947547 10720607 10307363 9753843 9477939
5927 9477939 9184912 9101243 8972296 8918501 8717712 8489525 8420381 8307676 8246526 7970395
5917 7970395 7855335 7693678 7613757 7503075 7374732 7376767 7312383 7222482 7074144 7044023 7192465
5906 7192465 7179858 7086668 7233303 7274052 7354097 7355922 7407237 7381320 7310432 7226240 7339730
5895 7339730 7302440 7280441 7360680 7481546 7579061 7650193 7743033 7814064 7777376 7959789 8103896
5884 8103896 8015795 8016693 8000018 7995854 8039924 8261191 8464276 8479700 8434754 8432804 8618324 8597806
5872 8597806 8561047 8498221 8422434 8480828 8335866 8386937 8351415 8225303 8149791 8085085 7963859
5861 7963859 7986829 8004961 7953785 8032273 7895902 7939018 7963810 7985676 8014578 7873595 7784280
5850 7784280 7772229 7801256 7705170 7622716 7543756 7507356 7477601 7480981 7561406 7676709 7742218
5839 7742218 7678394 7641878 7650976 7565378 7477172 7523562 7565412 7416213 7326483 7226056 7199973
5828 7199973 7102133 7219572 7215605 7139231 7381131 7368203 7434672 7443805 7478590 7544162 7707718
5817 7707718 7976484 8233588 8381702 8556738 8759604 9061655 9277586 9456723 9721485 10003406
5807 10003406 10289311 10435810 10541594 10633485 10617119 10557911 10502292 10351998 10215831 10149842
5797 10149842 10071252 9963862 9854492 9727639 9550461 9250092 9057764 8762149 8443287 8122137
5787 8122137 7958241 7695525 7522980 7385507 7132122 6805747 6670456 6783254 6667555 6529989
5777 6529989 6442632 6431685 6440624 6577087 6560391 6524630 6606139 6576885 6564281 6467951 6392132
5766 6392132 6456972 6432973 6475912 6405359 6583932 6651913 6597788 6691672 6752534 6794690 6690804
5755 6690804 6672459 6655681 6495387 6440744 6426244 6536457 6454616 6387816 6370648 6141536 6171715
5744 6171715 6128920 5850553 5875610 5898078 5781528 5650667 5517392 5397034 5389998 5260078
5734 5260078 5152915 5127357 5012750 4904012 4968624 5035223 4886688 4789414 4813784 4962476
5724 4962476 5021279 5036611 5065017 5171781 5108090 5123367 5105134 5298557 5332422 5234279 5354218
5713 5354218 5359362 5472123 5586026 5570118 5617854 5570599 5773969 5862755 5999341 6119972 6467153
5702 6467153 6579326 6723350 6795820 7004694 7406803 7585401 7862532 7892761 7976582 8276764
5692 8276764 8434306 8582427 8836850 9144792 9252489 9136031 9085345 9150917 9143919 9221754
5682 9221754 9276209 9402771 9462214 9465454 9573346 9727503 9736286 9882942 9991386 9946219 10172801
5671 10172801 10268761 10318786 10306075 10215577 10253813 10437271 10448991 10645361 10819563 10771338 10787980
5660 10787980 10925651 11087024 11318603 11429863 11519261 11450363 11654448 11690440 11699105 11722824
5650 11722824 11885972 11910638 11876417 12043641 12174967 12163227 12141367 12153902 12308671 12519572
5640 12519572 12645021 12859114 13276592 13598886 13931583 14349484 14734986 15035318 15349628
5631 15349628 15725652 16156201 16531294 16921445 17315698 17782030 18109467 18328257 18641022
5622 18641022 18866475 19008673 19107888 19243594 19366093 19450680 19633620 19871427 20097947 20471613
5612 20471613 20896649 21242464 21684197 22376239 22953479 23687817 24411754 25205709 26348958
5603 26348958 27347938 28330324 29432886 30680129 31970767 33414980 34856387 36304229
5595 36304229 37889554 39479005 41294653 43311290 45545086 47848475 50386958 53148115
5587 53148115 56373656 59873163 63610972 67787850 72405807 77523985 83175344 89022139
5579 89022139 95309664 101929306 108844684 115961701 123264658 130492612 137456782 143449807
5571 143449807 148710991 152831902 155279253 155918496 154710621 151818371 146818895 140154066
5563 140154066 132447804 124529566 116666099 108944206 101459712 94298628 87443747 81255912
5555 81255912 75517331 70162315 65531802 61318838 57376952 53885127 50767108 47959699
5547 47959699 45285663 42969975 40816263 38907016 37108486 35759110 34524077 33191032
5539 33191032 32250290 31085900 30060905 29230524 28331537 27625387 26952147 26141649 25230663
5530 25230663 24570278 24047281 23297669 22487112 21837593 21326061 20721802 20065549 19381677
5521 19381677 18852176 18301270 17798659 17320030 16855929 16310329 15823120 15701197 15278523
5512 15278523 14875735 14482728 14062979 13697233 13376931 13060193 12827890 12649653 12297701
5503 12297701 12113672 11848598 11530223 11426477 11095807 10984280 10901978 10525561 10411387 10416182
5493 10416182 10385910 10271440 10124428 9987993 10075800 10036228 10030236 9957671 9935012 9928627 9906389
5482 9906389 9900473 9901243 9951346 9985507 9958336 9942854 9811146 9686769 9502350 9375100 9339622
5471 9339622 9257380 9067935 8745615 8617461 8440160 8210794 7967272 7888316 7888380 7747648 7534311
5460 7534311 7319743 7251129 7171162 7059419 7041499 6822232 6660944 6622460 6485441 6472338
5450 6472338 6511488 6560327 6586813 6549722 6430147 6307408 6276468 6296747 6202699 6208088 6273462
5439 6273462 6134880 6247792 6092580 6098369 6090157 6123825 6167962 6091627 6054892 6125062 6171840
5428 6171840 6226937 6333005 6320375 6509841 6628479 6681456 6663019 6689174 6748427 6972468 7143581
5417 7143581 7126854 7055930 7013793 7123152 7077749 7101664 7001231 7003468 6974782 7027205 6985751
5406 6985751 6881295 7096096 7187682 7242179 7360273 7418305 7465731 7615431 7631550 7918894
5396 7918894 8214897 8241873 8320029 8433517 8467639 8429015 8470097 8562678 8442420 8340120 8027449
5385 8027449 7954922 7868263 7749323 7763236 7593549 7481241 7417106 7338633 7246774 7041814 7056747
5374 7056747 7148822 7082890 6954625 6940603 6875705 6892760 6825737 6726506 6763769 6843539 6870017
5363 6870017 6898618 6979148 6880979 7008761 6886029 6928181 6980478 6980312 6992537 7053388 7076094
5352 7076094 7123048 7160802 7083998 7114728 7109577 7198884 7168595 7109051 7159948 7179439 7052921
5341 7052921 6826992 6945011 6989252 6928905 7023690 6972106 6867661 6736643 6565663 6466884
5331 6466884 6440611 6209290 6279646 6361452 6429400 6375464 6400973 6525152 6468357 6499951 6562272
5320 6562272 6552683 6692943 6659786 6594560 6631935 6771233 6784157 6580301 6419714 6403480 6362407
5309 6362407 6394192 6432488 6291892 6398736 6406811 6507000 6545401 6635888 6598451 6635993 6564850
5298 6564850 6522200 6668127 6748645 6819466 6892266 6892244 6987598 6986819 6954702 6924553 7105005 7131345
5286 7131345 7284476 7225875 7212588 7384985 7500757 7637169 7793135 7848110 7853791 7905652 7982287
5275 7982287 8180574 8287648 8301614 8408301 8433487 8496442 8688194 8756886 8945349 9009553
5265 9009553 8960565 9172515 9355127 9338736 9384281 9341873 9484435 9626258 9460976 9529645
5255 9529645 9820501 9877665 9965505 10078679 10190487 10365487 10551688 10479403 10611832 10647221
5245 10647221 10771557 10943796 11061623 11161526 11309794 11508955 11539133 11669201 11826449 11950573
5235 11950573 12070235 12264209 12479173 12616957 12914959 12968532 13153118 13484807 13781584 14043508
5225 14043508 14270045 14261161 14241825 14419951 14570850 14769597 14911348 15069608 15245472 15384586
5215 15384586 15635460 15900518 16124831 16337922 16553383 16779873 17232731 17564304 17931495
5206 17931495 18199822 18613405 19018497 19392898 19798790 20261360 20796422 21384379 21946427
5197 21946427 22615466 23352543 24165443 25162056 26075650 27017602 27996017 29176190 30473360
5188 30473360 31581202 32782050 33923658 34865313 35673208 36280643 36715412 36972951 37307825
5179 37307825 37528343 37876216 38217273 38610477 39334928 40028369 40787822 41275565 41653715
5170 41653715 42040048 42065265 42015712 41606025 40821890 39954913 39217651 38247563 37442624 36737721
5160 36737721 36177932 35835617 35782738 35938570 36250768 36684246 37366156 38297808 39457884
5151 39457884 40637242 42100115 43878629 45825823 47751757 49809564 51781570 53648059
5143 53648059 55568503 57403159 59091249 60728048 62231029 63641343 64799632 65980536
5135 65980536 66963705 67804916 68333574 68571756 68420292 67621529 66683349 65425318 63928776
5126 63928776 62501324 60926370 59341403 58134405 57424225 57089635 57361655 58128364 59461135
5117 59461135 61176480 63086547 65533747 68391119 71668701 75097452 78330315 81246602
5109 81246602 84383501 88329194 92429322 96582405 100477459 103873236 107708020 111172504
5101 111172504 112595999 109746634 102519973 93423728 85362047 78886150 73262967 68095899
5093 68095899 63608927 59830286 56554072 53483647 50747656 48229616 45689943 43594753
5085 43594753 41647462 40105227 38746241 37384035 36158843 35081252 34091445 33380771
5077 33380771 32710555 32037006 31414203 30986275 30484008 30085748 29671585 29145191 28978713
5068 28978713 28720221 28484413 28047447 27851054 27824714 27692610 27393605 27108117 26726568 26350312
5058 26350312 26019941 25609622 25188156 24915609 24363093 23860713 23304310 22836849 22264646
5049 22264646 21880587 21497258 20985485 20629511 20333652 20031978 19814070 19700022 19390747
5040 19390747 19061035 18945144 18791861 18546073 18284140 18220852 18245215 18163009 18091662 18040040
5030 18040040 17940785 17835329 17995638 17933234 17992129 18049108 18108034 18153490 18082833 18163187 18428850
5019 18428850 18402372 18294551 18330119 18380676 18368826 18444171 18458391 18502532 18635372 18790226 18997163
5008 18997163 19094593 19209802 19352041 19636745 19811105 19854250 19932954 20096410 20371241 20496842
4998 20496842 20904515 21354639 21718209 22096570 22452414 22766889 23001762 23173987 23260022 23370530
4988 23370530 23450366 23696690 23857429 23976910 24146464 24376150 24519719 24488143 24521846 24660120
4978 24660120 24918145 25195089 25389083 25583550 25810450 26013783 26249215 26455993 26734390
4969 26734390 26910759 27049895 27503339 27860887 28341981 28865652 29491005 30133574 30770398
4960 30770398 31284107 31981836 32690596 33293586 33893033 34546993 35090610 35628226 36210298
4951 36210298 36792076 37287297 37800448 38277984 38831600 39469596 40141927 40841965 41516037
4942 41516037 42253215 42881354 43533989 44323429 45194399 45919974 46578450 47308572 48374437
4933 48374437 49324281 50744508 52172838 53737016 55575713 57580630 59650399 61901651
4925 61901651 64263332 66902363 69864888 72952055 76076229 79438872 83110987 86932153
4917 86932153 90961836 95610602 100481455 105726449 111555483 117928003 124586427 132137312
4909 132137312 140298900 148849843 158133648 167750141 177577271 187611666 197636310 207724808
4901 207724808 217461471 226640697 234857318 241751332 247031185 250129176 251201146 250367836
4893 250367836 247930687 244166005 239696348 234947192 230161508 225360121 220460687 215205065
4885 215205065 209372069 202653178 195708336 188590698 181508218 174634751 167795242 161019301
4877 161019301 154642298 148068553 141503268 134887229 127960616 121093404 114652776 108562492
4869 108562492 102732613 97512392 92682765 88493556 84767568 81298162 78261922 75608002
4861 75608002 73074482 70701284 68458703 66509536 64830504 63426604 62331944 61538874
4853 61538874 60836509 60674235 60793289 61100546 61989917 62962675 64584752 66514881 68866067
4844 68866067 71507824 74717268 78277042 82187499 85905493 89535758 92705163 95292404
4836 95292404 96819109 97355463 96985767 95503675 93277428 89992368 86317083 82311817
4828 82311817 78099395 73857420 69731899 65815574 62407476 59274851 56438316 53953190
4820 53953190 51822021 49671593 47787137 45922540 44281605 42765789 41387138 40071498
4812 40071498 38568457 37340840 36405770 35385181 34438020 33513569 32701868 32006029 31231663
4803 31231663 30729930 30112378 29452097 28874225 28384361 27997264 27515291 27058344 26784841
4794 26784841 26421804 26265325 26145102 26008561 25924368 25832339 25659210 25616171 25625355 25816100
4784 25816100 25912231 25890012 25962694 26069243 26234615 26270980 26560140 26796613 27034515 27111847
4774 27111847 27072003 27254902 27365904 27530623 27610792 27859362 28198940 28595774 28727927 28667505
4764 28667505 28443352 28139253 27954465 27664852 27344243 27335488 27353550 27285259 27235085 27156742
4754 27156742 27261840 27182815 27230991 27359570 27298803 27423263 27572952 27635840 27748082 27809600
4744 27809600 28055126 28186156 28311182 28663690 29008221 29436721 29544282 29609673 29765134 30140338
4734 30140338 30466103 30625624 30849746 31074432 31312229 31562032 31746374 32013972 32486540
4725 32486540 32834591 33317218 33887281 34383802 34998661 35902084 36654615 37774136 39027891
4716 39027891 40372495 41835830 43447805 45365476 47585142 50062817 52888397 56381396
4708 56381396 60489309 65360703 71200357 77651762 84704103 92687635 101974691 113037750
4700 113037750 126884951 144050541 163858990 184307233 204272473 222942959 243155667
4693 243155667 264743828 282353202 287784866 274407403 247416908 220056691 198420516
4686 198420516 180598981 165514550 153152637 143100853 134756353 127439927 121164865
4679 121164865 115373842 109477207 104593459 100534101 97342029 94841889 92940127 91437097
4671 91437097 90247522 89434990 89061699 88734612 88090121 87302397 86591817 86246599 86567444
4662 86567444 87266011 88475453 89687800 90965252 92426995 93914812 95447678 97207574
4654 97207574 99390981 102471786 106299475 110841907 116201587 121956804 128051908 134043005
4646 134043005 139580886 144102319 146678017 146798176 144754153 141341842 137885583 135711922
4638 135711922 134921239 135488253 137373064 140686526 145316913 151024180 158056745 166638267
4630 166638267 177267426 190059588 205335413 222534840 240571581 258293566 275254899
4623 275254899 291844081 306754847 316434328 317274103 307651996 290440123 271192480 253250650
4615 253250650 237803486 224752240 213980378 205389315 198378358 192890289 188654154 185436460
4607 185436460 182774915 179971601 177283636 174562421 171638626 168477758 164239516 158615764
4599 158615764 151990069 144825046 137848828 131556777 126235505 121650700 117645056 114159065
4591 114159065 110808379 107429072 103866835 100030684 95972616 91771859 87695112 83589919
4583 83589919 79750721 76231368 73210371 70712439 68447394 66367166 64681930 63326099
4575 63326099 62139042 60920484 60248443 59730351 59474431 59523768 59839139 60504815 61365926
4566 61365926 62505421 63703167 65014827 66455311 68001032 69564446 71084725 72590943
4558 72590943 74308975 76180512 78234918 80680745 83416461 85909167 88438498 90938578
4550 90938578 93017622 94316660 94307241 92837174 90361139 87312118 83976389 80458156 77090645
4541 77090645 74285582 72057876 69864782 67983480 66433574 65168996 64170948 63443690
4533 63443690 62820038 62524770 62298712 61849020 61734818 61833653 62092366 62597090 63520847 64823506
4523 64823506 66722622 68933537 71898883 75424366 79148453 83349581 87714082 92290774
4515 92290774 96970691 101743323 106324518 109999758 112587649 114386733 115945190 117643742
4507 117643742 119504983 121430419 123143322 124752380 126472795 128271819 129974807 131529427
4499 131529427 132790338 134087634 135941534 138972816 143224868 148811188 156096046 165198859
4491 165198859 176053625 188546235 202802915 218884142 237014232 257475001 280758747
4484 280758747 306609582 333816966 360388100 384921900 407625396 429160463 448069347
4477 448069347 458174481 452118007 427068572 389561617 350620565 315945913 285823865
4470 285823865 259614657 237219574 218011828 200970105 185834287 171989053 159146791
4463 159146791 147055194 135811661 125810515 117024810 109529458 102912053 96977885 91866711
4455 91866711 87363702 83590755 80142600 77208060 74715836 72689677 71193417 70022861
4447 70022861 69109698 68489097 68153343 68077002 68424526 68945580 69778612 70829033 71672632
4438 71672632 72358182 72561630 72252950 71028373 69073787 66973853 64938430 63206610 61926696
4429 61926696 61022165 60437708 60181745 60090756 60056986 60234897 60339646 60094815 59111141 57140361
4419 57140361 54645843 51786249 49106131 46662452 44597997 42712407 41305338 40039490
4411 40039490 38938115 37817796 36898527 36165143 35561337 35231090 35034484 35166579 35284309
4402 35284309 35731491 36418392 36924110 37499032 38226367 38904377 39012155 38663471 37825020
4393 37825020 36921974 35991588 35134732 34469655 34172664 34163832 34173393 34258304 34471627 34669298
4383 34669298 35010857 35097101 34860949 34293837 33442623 32204500 30859795 29826259 28756938
4374 28756938 27724427 26740787 25774034 24916351 24373769 23841608 23419640 23192400 22866724
4365 22866724 22724636 22799694 22855186 22989519 23145801 23239378 23224704 23422750 23401706 23023210
4355 23023210 22550325 21725803 21062222 20651897 20178649 19783907 19416836 18899999 18638726
4346 18638726 18476098 18139381 17924798 17566121 17215087 16826690 16391539 15942739 15563923
4337 15563923 15224469 14757247 14415862 14116513 13848899 13455707 13158263 12847476 12686645
4328 12686645 12510694 12221507 11985372 11819273 11748559 11704018 11507335 11349287 11381002 11426759
4318 11426759 11222669 11111206 11017965 10946693 10887848 10521608 10234954 10087127 9988244 9866391
4308 9866391 9716067 9418576 9344158 9117889 8951613 8811618 8772103 8491654 8208142 8142304
4298 8142304 8014135 7803151 7793236 7798556 7737057 7673046 7697581 7655282 7536592 7546488 7607604
4287 7607604 7563828 7420962 7300854 7273031 7191437 7181788 7263181 7384562 7420460 7406440 7446921
4276 7446921 7382019 7269093 7284481 7353623 7347048 7210919 7103686 7035016 6997184 7104250 7148801
4265 7148801 7030078 6976180 6993247 7057916 7087094 7144134 7183372 7155704 7388091 7390142 7354037
4254 7354037 7461352 7532901 7478948 7410194 7514671 7532223 7463690 7501022 7518040 7523066 7488163
4243 7488163 7434925 7390261 7250067 7331952 7374783 7356777 7213298 7136691 7071718 7128815 7162161
4232 7162161 7073782 7080061 7061574 7036090 7197516 7300928 7383823 7373749 7369016 7467238 7459781 7695328
4220 7695328 8054440 8214903 8427051 8874261 9200087 9609914 10063830 10527471 11100959 11694405
4210 11694405 12226774 12667739 12812776 13116092 13306864 13447822 13366704 13299033 12863293 12499802
4200 12499802 12089080 11781354 11425156 11089868 10976476 10786771 10639878 10556423 10601269 10526562
4190 10526562 10620849 10568967 10815275 11094561 11347492 11483928 11764780 12358729 12958634 13503784
4180 13503784 14099605 14806078 15699357 16716090 17757456 18849199 20041744 21420292 22542315
4171 22542315 23517738 24137650 24476922 24502449 24378387 24132660 23784845 23092197 22437629 21959478
4161 21959478 21601475 21356151 21205487 21300326 21553221 22068441 22756700 23622099 24701507
4152 24701507 26021746 27645729 29404156 31257116 33375857 35600825 37795111 39497954
4144 39497954 40869579 41661523 41925299 41632760 40788956 39401314 37767129 35970827 33953304
4135 33953304 32136578 30446817 29239867 28390100 27599314 27082622 26783683 26629139 26761400
4126 26761400 27131882 27587404 28204734 28748934 29206690 29763637 29936445 30008503 30064586 29889715
4116 29889715 29852766 29678685 29510011 29622980 29904390 30286287 30871060 31375383 31601398 31528095
4106 31528095 31356139 31239086 30886028 30404516 29985481 29495006 29102495 28755426 28515025
4097 28515025 28180167 27952512 27692215 27391081 27144849 26906692 26779650 26394432 26259195
4088 26259195 26026108 26072153 26328974 26426306 26229050 25837842 25240074 24544076 23672021 22717232
4078 22717232 21660359 20403773 19216063 18180051 17415907 16645932 15969505 15445148 15064732
4069 15064732 14833158 14574349 14260357 14099693 14061511 14208304 14471909 14638576 14803154 14936954
4059 14936954 15188008 15550709 15857883 16305549 16592486 16927470 17483686 17999026 18095562 18170847
4049 18170847 18041651 17751287 17486452 16906806 16393557 15633449 14690490 13803286 12982482
4040 12982482 12472297 11932984 11324096 10985089 10551430 10014540 9654190 9358872 9139960
4031 9139960 8704412 8408659 8188156 8108160 7854781 7470460 7517618 7554365 7278775 7049375
4021 7049375 7016051 6877781 6708469 6619497 6544389 6535198 6326620 6204342 6195875 6125457 6064524
4010 6064524 5937194 5774848 5702615 5803238 5756191 5561400 5499041 5474488 5476590 5470348 5487834
3999 5487834 5372785 5362546 5226846 5241108 5188267 5063338 5194720 5247400 5253132 5107658 5144175
3988 5144175 5244443 5221770 5270579 5297409 5208118 5257985 5199837 5103854 5161621 5298684 5273847
3977 5273847 5147643 5315301 5217451 5172279 5417176 5216743 5261053 5276516 5203032 5113706 5108306
3966 5108306 5084049 5101145 5122149 5123932 5117385 5071984 5006244 5104112 5129395 4989500 4984896 5125487
3954 5125487 5239326 5187221 5071114 5137436 5193466 5100042 5141483 5198357 5292084 5254202 5309184
3943 5309184 5267218 5286328 5335853 5396099 5505573 5528894 5479149 5556082 5600486 5568251 5677554
3932 5677554 5666377 5819894 5887254 5897110 5971304 5994454 6039708 6243999 6413928 6628433 6647339
3921 6647339 6608186 6619625 6513803 6646992 6777563 6833269 6846815 6825852 7006393 7189739
3911 7189739 7260023 7287784 7267057 7369562 7432460 7507528 7742880 7800530 7819483 7948973 8104122
3900 8104122 8119410 8324824 8369665 8420906 8539888 8632925 8829625 8946403 9001481 9034392 8978193
3889 8978193 8939709 8734614 8639109 8695231 8654492 8663758 8667972 8771231 8842857 8983870 8951798
3878 8951798 8954195 8954626 9062052 9069788 9075283 9249061 9336592 9437899 9461738 9538174 9542171 9658289
3866 9658289 9864969 9913918 10040688 10180568 10143514 10154888 10180571 10074219 10051614 9925623
3856 9925623 9879642 9978172 9957096 10107595 10076451 10079279 10002215 9875821 9994280 10013864 9962944
3845 9962944 9874358 10057877 9980086 9912239 9873766 9911041 9989666 10031477 9925447 9800969 9944907
3834 9944907 10075652 10067862 10058458 10104359 10171659 10089332 9989392 10083681 10149223 10133555 10146215 10093091
3822 10093091 10044390 9990776 9851662 9752579 9812022 9840611 9866845 9838573 9751669 9770374 9623865
3811 9623865 9660191 9628193 9615744 9702196 9626634 9461505 9453282 9503909 9581041 9556032 9437222
3800 9437222 9455187 9245886 9146804 9166229 9142183 9044023 9102683 9012698 9089668 9028699 9043000
3789 9043000 8961652 8919188 8938819 8939739 9006887 8952768 8898264 8927208 8862547 8845687 8887398 8756826
3777 8756826 8816891 8684287 8619762 8813478 8799348 8860350 8866434 8884536 8735413 8683186 8701941
3766 8701941 8688656 8827489 8876263 8961971 8819484 8782940 8889024 9003575 9072112 9065861 9072953
3755 9072953 9115972 9240582 9402482 9337084 9332779 9385757 9404665 9494557 9516988 9500377 9552012
3744 9552012 9479461 9499554 9553859 9435537 9399512 9536818 9545549 9531286 9579922 9629190 9634075
3733 9634075 9624203 9594759 9557950 9535931 9635313 9597552 9667509 9781166 9872077 9845618 9785016
3722 9785016 9871545 10014106 9998778 10062330 9974256 10071547 10041420 10196593 10235645 10362589 10305640
3711 10305640 10231596 10303259 10233190 10078494 10191882 10124513 10103748 10216308 10189607 10163074 10124416
3700 10124416 10188119 10154703 10158720 10148906 10338166 10323363 10381275 10256186 10293303 10327333 10338457
3689 10338457 10386358 10412295 10449125 10543117 10568165 10471169 10453166 10455955 10281550 10210847 10194531
3678 10194531 10232944 10387901 10403084 10306176 10198763 10379144 10454199 10324797 10292669 10332353
3668 10332353 10399080 10430514 10571133 10492497 10505116 10475433 10511836 10629943 10617385 10668153 10669660
3657 10669660 10703827 10775468 10774364 10654048 10630749 10684037 10694682 10637937 10647244 10603835 10575693
3646 10575693 10557177 10619826 10671696 10618421 10648485 10714207 10711578 10829630 10797677 10764278 10904407
3635 10904407 10934935 10972216 11034853 11205064 11089831 11232004 11240800 11280866 11298169 11258606 11336213
3624 11336213 11425417 11407020 11470244 11546292 11605055 11628789 11698413 11589287 11495608 11719327 11827691
3613 11827691 11835848 11854426 11981551 12207232 12198635 12278680 12330451 12449896 12615122 12693048 12781476
3602 12781476 12820380 12838198 12981620 13075991 13241865 13355542 13473206 13439611 13517731 13715028
3592 13715028 13728502 13811934 13989086 14108981 14152092 14411168 14467084 14399754 14533618 14813887
3582 14813887 14862835 15023927 15266534 15457572 15536645 15694112 15836116 15925570 15968703 16021141
3572 16021141 16206780 16564985 16731019 16896291 16981556 16894603 17072882 17291139 17501664 17760734
3562 17760734 17920747 18011143 18086161 18418638 18561111 18639507 18770332 18999599 19158741 19340779
3552 19340779 19485873 19592069 19743401 19958836 20291758 20469515 20720538 21044475 21227287
3543 21227287 21637606 21922591 22076501 22396207 22670923 22982111 23430931 23776451 24149508
3534 24149508 24478890 24798205 25205317 25553995 25989791 26343922 26718701 27153227 27608009
3525 27608009 28030537 28513737 28977510 29519482 29969969 30575519 31153177 31799008 32352646
3516 32352646 32922322 33606871 34274987 35150350 35789530 36454962 36986044 37854002 38588430
3507 38588430 39318776 40235661 41042174 41814519 42602073 43524256 44355686 45431542 46424700
3498 46424700 47140916 48218671 49324778 50266271 51331879 52413018 53576626 54914920
3490 54914920 56211235 57447575 58861991 60221457 61735121 63484487 65063026 66955364
3482 66955364 68842829 70777183 72703843 74835445 77090837 79604155 82389741 85256334
3474 85256334 88390718 91875760 95770373 99749989 104132598 108955687 114279285 119948662
3466 119948662 126119441 132590638 139402973 146697039 154732952 162634005 170670062 178803958
3458 178803958 186465171 193601167 199683654 204614234 207929963 209353244 208904252 206552715
3450 206552715 202546379 197326631 191382890 185047608 178899268 172832698 167066379 161517552
3442 161517552 156227068 151133539 146266255 141763821 137510695 133637360 129837568 126385207
3434 126385207 123015386 119862361 117054910 114401689 111991443 109609679 107380060 105182007
3426 105182007 103001048 101098366 99133430 97191834 95307086 93326801 91446761 89628522
3418 89628522 87741118 85925053 84094205 82231751 80386839 78665596 77032299 75419315
3410 75419315 73742001 72045954 70425621 68785439 67214163 65786710 64363427 62902960
3402 62902960 61681568 60566511 59433775 58253483 57232372 56059516 55133867 54186986
3394 54186986 53264165 52477649 51738351 50995964 50252346 49473191 48842429 48327989 47535547
3385 47535547 46802920 46127695 45634719 45052788 44617789 44040601 43464928 43048135 42497397
3376 42497397 42079717 41635792 41028942 40457043 39958997 39572054 39263395 38850812 38613180
3367 38613180 38227202 37728822 37559993 37175695 36799973 36427536 36071843 35711605 35594669
3358 35594669 35109537 34691233 34504431 34181182 33951290 33653584 33273958 32918080 32520022
3349 32520022 32172582 31947161 31467487 31154775 31009735 30717417 30370552 30224805 29938748
3340 29938748 29663202 29557848 29352211 28943329 28547078 28416751 28186410 27969470 27754031
3331 27754031 27534559 27497420 27277703 27122764 26860708 26595702 26486360 26195667 26008100 25787219
3321 25787219 25612510 25555397 25418554 25275861 24992252 24917793 24860805 24586357 24363327 24263654
3311 24263654 24256710 24028559 23827867 23789176 23755566 23748406 23627114 23560532 23270687 23186463 23230861
3300 23230861 23072000 22967093 22960346 22872450 22700260 22659430 22426754 22270158 22150562 21989358
3290 21989358 21949721 21924779 21828801 21771746 21595056 21286403 21170835 21042152 20859217 20700611
3280 20700611 20531284 20464887 20388361 20339535 20097882 19889102 19669042 19479119 19310641 19173472
3270 19173472 19144362 19043178 18966924 18854146 18713520 18542803 18421851 18359456 18308408 18147158
3260 18147158 18104117 18000801 17799653 17788472 17694647 17428800 17204759 17121736 16964533 16819642
3250 16819642 16675198 16440220 16325068 16155076 15929289 15870090 15712438 15521404 15342946 15096651
3240 15096651 14981124 14818354 14791637 14644653 14534106 14499653 14347137 14249764 14224896 14221045
3230 14221045 14171205 14033474 14018321 14080489 14119198 14038208 13974970 14032862 13988080 13954654 13864740
3219 13864740 13991905 13890884 13760948 13682773 13716916 13730545 13736592 13781295 13596834 13617896 13599092
3208 13599092 13663599 13776228 13950928 13970939 13936709 14094203 14130842 14178593 14206825 14331863
3198 14331863 14476943 14642394 14837752 14803695 14793975 14951738 15200344 15335024 15301458 15600629
3188 15600629 15764888 15817733 15983379 16227364 16294611 16528565 16636036 16783417 16877036 17114189
3178 17114189 17232525 17316716 17353294 17338747 17658262 17888846 18114765 18264555 18411815 18687043
3168 18687043 18973155 19084795 19523119 19894168 20170618 20313914 20740376 21103024 21573701
3159 21573701 22053292 22606426 23188562 23787081 24333269 25000062 25688707 26389260 27227888
3150 27227888 27932410 28826324 29659629 30311914 31228850 32295913 33276460 34244237 35100411
3141 35100411 36126807 37132267 38123035 38969404 39669380 40369575 41115293 41815019 42445816
3132 42445816 43077676 43877596 44642693 45453461 46576927 47694488 48860933 50115292 51618074
3123 51618074 53306961 55219592 57101041 59160632 61388453 63641927 65959503 68551940
3115 68551940 70882049 73268706 75405792 77203721 78739002 79794736 80306487 80279072 79608663
3106 79608663 78718006 77748493 76550204 75652126 75075577 74787207 74767275 74988989 75360770
3097 75360770 76148512 77153473 78141169 79201798 80508051 82006015 83343502 84427776
3089 84427776 85659488 86858404 87815979 88443181 88836284 88976132 88713601 88153390 87244021
3080 87244021 85776788 84300939 82759628 81056643 79142064 77210372 75279623 73659253
3072 73659253 72299738 71202155 70146631 69320759 68660773 68036664 67495755 67093352 66819850
3063 66819850 66397756 65664523 64715928 63610180 62433271 61181268 59662821 58101751 56328351
3054 56328351 54342169 52369720 50391105 48358969 46443634 44663202 42929998 41374117
3046 41374117 39955712 38432749 37196372 36009461 34786665 33753473 32661106 31811399
3038 31811399 31118671 30417518 29689161 28969391 28144776 27411781 26685612 26083796 25396879
3029 25396879 24652150 24076839 23455405 22661191 22025855 21329391 20793897 20221349 19680304
3020 19680304 19153496 18655282 18256058 17846916 17416285 16925441 16593247 16121193 15722331
3011 15722331 15369516 14974243 14774404 14596201 14266803 13997572 13771069 13644018 13250006
3002 13250006 13034398 12943035 12800283 12608533 12419213 12202966 12153334 12041879 11842819 11672736
2992 11672736 11548446 11354311 11104986 10854802 10688107 10432712 10302376 9942128 9607597
2983 9607597 9567247 9481767 9345805 9177215 9051513 8701081 8580659 8559958 8484388 8370276
2973 8370276 8172540 8022101 7986318 7811161 7651673 7609846 7540502 7579055 7384620 7249128
2963 7249128 7296917 7101175 6881649 6743146 6655855 6567882 6418399 6429503 6382201 6238414
2953 6238414 5915425 5853721 5904358 5836069 5764961 5670227 5426447 5244152 5291582 5196654 5142111
2942 5142111 4961977 4955851 4950520 4830310 4736033 4576344 4636298 4645083 4502427 4263978 4328728
2931 4328728 4219853 4129956 4051330 4020571 4064686 4164893 4169317 3983874 3888595 3899084 3846840
2920 3846840 3827417 3853403 3784841 3851095 3837347 3670450 3637362 3641389 3614827 3655350 3588696
2909 3588696 3543038 3368965 3327675 3388686 3407432 3334728 3445975 3386601 3376385 3322251 3224937
2898 3224937 3088091 3181324 3273524 3079235 3058836 3053902 2966207 3082319 3040703 3059171 3006631
2887 3006631 3003586 2891104 2845171 2885851 2894501 3044510 2939859 2844330 2745794 2750274 2730208
2876 2730208 2686981 2710002 2809683 2827795 2652837 2634851 2645871 2701980 2867958 2761280 2556578
2865 2556578 2559098 2674244 2681539 2643807 2586443 2655810 2683286 2565482 2621108 2641975 2566489
2854 2566489 2523415 2479835 2458709 2459277 2432135 2452721 2533853 2594245 2611414 2538419 2571626 2559884
2842 2559884 2707121 2570426 2458232 2435455 2306018 2432105 2573961 2568565 2410962 2337920
2832 2337920 2526722 2544268 2392806 2370611 2362793 2328483 2263656 2275124 2384000 2457252 2331821
2821 2331821 2261390 2243154 2243046 2251912 2277295 2361954 2365601 2400971 2315610 2272794 2262787 2329640
2809 2329640 2371595 2390272 2409720 2280612 2271563 2381915 2197491 2097671 2168776 2165486 2213882
2798 2213882 2033716 1960079 2127702 2046606 1982926 2034142 2000239 2105545 2118258 2042264 1924788
2787 1924788 2022948 2073525 2059470 1960378 1812577 2000047 2017758 1945769 1981776 1829831 1780075
2776 1780075 1959675 1947740 1804707 1919880 1856755 1772467 1634369 1780515 1974637 1997605
2766 1997605 1853269 1827030 1883513 1693229 1569627 1494199 1563037 1651286 1551734 1427413 1423298
2755 1423298 1417166 1426313 1485306 1587114 1381833 1364293 1385659 1518078 1557474 1440600 1417132
2744 1417132 1383110 1374903 1364493 1279462 1200236 1242114 1274416 1297309 1238286 1179115 1277518 1221722
2732 1221722 1248639 1238768 1205511 1269507 1357621 1306366 1180866 1079461 1096411 1186484 1225957
2721 1225957 1137760 1008819 1049787 1091621 1203364 1232597 1181154 1305381 1229328 1185076 1334265
2710 1334265 1252116 970519 998260 1150662 1016113 1003080 995986 1002257 960007 1009473 973532
2699 973532 938083 931926 992948 1051693 1057101 995428 1094716 1047395 943295 903415 810698 867067
2687 867067 1071553 1092823 886834 990903 1070732 1012286 991968 923123 864034 863139 989920
2676 989920 945364 856331 897465 872346 787125 860879 955639 925774 764109 928278 911713
2665 911713 830589 814149 691920 692192 721170 729064 696850 799167 722178 675345 727473 733185
2653 733185 627697 658039 611429 654094 618832 679028 815760 762057 731619 637708 472115
2642 472115 616319 667613 547638 474783 494288 602276 590353 614881 680859 541130 581798
2631 581798 512444 530497 511763 483481 463417 362867 338185 483989 692932 691596 615089
2620 615089 705963 579591 507891 461061 529821 482801 435271 569091 535164 543843 511129
2609 511129 501482 389861 467912 498007 429145 374077 565945 366194 312350 297185 292856
2598 292856 322861 415375 285448 141904 321909 240191 255555 394841 411434 436102 378010
2587 378010 365770 354004 357477 382569 406946 502316 427271 527356 538043 499334 400056 405895
2575 405895 352082 241785 371770 393508 414047 495212 459191 258176 327434 446958 269911
2564 269911 190372 344153 347544 387056 359727 365081 309833 270432 143836 239964 299144 296523
2552 296523 405058 425011 340377 214264 238184 320151 291389 259697 247841 144748 110757
2541 110757 288896 340807 278412 184442 201872 198518 319511 260665 129113 279347 249170
2530 249170 327994 386329 406031 208783 258343 208689 237042 197622 244606 194871 184664
2519 184664 276932 351293 328522 175600 151370 171313 176246 196913 201526 119679 187460 237083
2507 237083 165590 167403 150690 104811 85833 75381 144234 127848 252862 286272 258751 103855
2495 103855 151597 398398 394865 437114 448035 358428 260897 240298 306363 422580 322667
2484 322667 220343 270824 257583 212387 109325 122953 173466 213639 258369 210752 226384
2473 226384 194563 288326 284403 143340 126491 178044 165411 208770 236121 276776 290781 317069
2461 317069 391724 273503 276558 227136 129211 124750 161691 119256 138607 193387 176179 159241
2449 159241 112123 117157 267466 315915 347160 279192 248051 262871 195305 176415 239448 217250
2437 217250 208811 227460 247739 311811 448718 419804 240912 283790 170418 181579 220400
2426 220400 175062 152605 259882 349111 290553 380889 255986 101318 262379 315820 186585
2415 186585 223009 124615 -33240 174790 162201 188155 126062 137310 230635 237658 163235
2404 163235 259864 279618 274599 232218 303618 235470 200550 269143 146123 182326 322587
2393 322587 521795 420470 271179 172549 347509 482782 447885 401593 293632 372409
2383 372409 529075 416639 343398 323047 355332 296858 239048 334300 409241 411749 470400
2372 470400 290869 281501 483432 425736 567148 608452 512256 579998 584188 529074 604242
2361 604242 646589 650498 729440 613428 606342 635007 760859 770464 847799 875764 944592 884574
2349 884574 867765 968101 1003996 1146078 1147905 1052194 1034716 1265130 1373723 1519447 1732408
2338 1732408 1827222 1963463 2061966 2142990 2332308 2499984 2769716 2990732 3376723 3921902
2328 3921902 4371101 4751530 5202605 5841626 6288638 6850940 7691178 8595903 9773894
2319 9773894 11366489 13154827 15273805 17389771 19021510 20797751 22936435 24645394
2311 24645394 25408451 23914203 20658294 17782483 15719938 13957710 12337966 10971318
2303 10971318 10013310 9207168 8503452 8030968 7345340 6758734 6309185 5751120 5141873
2294 5141873 4766477 4374486 4052039 3659191 3441744 3271918 3039723 2935917 2663297 2688268
2284 2688268 2551192 2203447 2113433 2023213 1965425 1866045 1819515 1747789 1591673 1588872 1584551
2273 1584551 1507229 1351272 1228997 1301854 1166767 1210574 1323722 1169674 1145037 1036012
2263 1036012 929266 879865 861492 774903 822054 892923 841946 743946 760333 741239 735625
2252 735625 738869 699946 736520 763734 830267 692568 652172 659556 629560 504072 558624 642741
2240 642741 573376 455870 504716 527513 542690 497571 420107 374318 316967 251894 366842
2229 366842 518585 460544 422063 444290 361474 325077 345577 473982 579521 631963 551406
2218 551406 346900 297559 283787 241815 343369 303266 235118 308826 303961 400895 319429
2207 319429 243547 326326 232538 202004 280627 299012 235772 217734 301376 300569 235106 113925
2195 113925 161690 157074 172585 281127 207812 185143 264539 276726 328716 320539 313777 283745
2183 283745 166908 101978 125799 140411 134258 245743 222948 224308 218231 183759 162560 73592
2171 73592 256713 267733 223640 260382 279798 237590 89938 102400 73197 152760 126109
2160 126109 92650 258482 296403 268715 293091 355304 249751 173724 -23785 99142 104210
2149 104210 115911 209972 58859 108840 173504 118435 266727 229819 183342 190391 142009
2138 142009 228260 115506 154357 298217 94176 102299 123805 107913 235053 272697 187426
2127 187426 203748 236512 200859 81112 15447 69760 180209 178522 37696 -10445 110357
2116 110357 236145 266623 139768 164515 278487 225994 245561 277359 178284 13828 93196
2105 93196 102676 184400 156761 127096 131299 56629 149087 373482 264992 149469 69762 -4694
2093 -4694 80379 42276 -23722 41784 143494 148089 188024 125919 24765 91819 121069 224022
2081 224022 85453 151292 135732 54996 -5428 -61568 -23511 -14881 29375 60874 -12132 -129677
2069 -129677 15924 68560 52751 11308 161506 275402 243036 129006 56571 115107 153678
2058 153678 178497 211044 154196 204697 300116 251155 258426 350790 332319 255736 255558 228948
2046 228948 203023 269857 153229 211360 244077 264883 225074 143952 243221 89799 69934
2035 69934 32857 82144 -8607 -40278 82278 175288 135800 -18477 109724 118311 83727
2024 83727 187714 52966 -20449 -62888 9840 -987 -47485 -42701 11886 91349 155958 223344
2012 223344 155885 144690 106095 185584 12494 -26079 81645 101759 87203 -41787 -67462
2001 -67462 -100014 -45575 -53671 -125872 -22404 14114 104355 143889 -4431 -13035 25929 126799
1989 126799 306295 173725 50350 47362 -23856 58503 50381 94743 88113 109581 49893 85520
1977 85520 13016 -44474 91886 42370 13844 -93510 -108564 -122549 -8256 92422 21708
1966 21708 20283 8332 64075 38095 -48061 -172597 -57326 98491 112592 76674 12838
1955 12838 -25441 -130948 -45974 -31273 -147336 -216443 -134667 970 48285 50985 133576
1944 133576 160222 -19961 -122285 -144620 -187311 -110772 -92600 -80108 -64991 102241 235008
1933 235008 104695 -52551 32813 98990 12995 -23902 53142 119354 140623 181289 54459
1922 54459 -20922 71702 -2066 -9678 -13591 -48133 -94371 31641 132134 83194 -27867 -31255
1910 -31255 25012 -79087 -69568 133794 219224 116942 5929 -125481 49595 1509 -31972
1899 -31972 53465 -120164 -62931 -499 -39300 -20579 2616 85290 76730 38397 -69638 -76341
1887 -76341 -92874 -60184 80642 26309 -31892 -46566 -19507 -57315 -46438 13787 69801 -55835
1875 -55835 -80375 -86644 36178 -8273 -74670 -106308 39456 5804 -38618 -91798 -179099 -101215
1863 -101215 -156569 -118667 -116147 -94433 27467 29689 -28256 40727 44842 137397 152480 182248
1851 182248 146985 146151 136113 176538 45012 -38040 -759 36421 -13034 104821 184024 78534
1839 78534 143963 71501 69284 52297 16574 -42184 58705 82084 66166 204675 104966 187985
1827 187985 48119 -141709 -242132 -112376 -42139 -30220 -18248 -89937 -159919 -11737 47408
1816 47408 -1956 -87031 -26817 -64057 -3749 28852 44596 89676 -17688 -64854 -6097 63909
1804 63909 82795 25447 -38521 -88890 -98713 -15704 -145297 -49663 -164611 -165182 -58971 23885
1792 23885 9623 -28925 -48440 118180 114824 -94500 -4763 -75308 6355 90924 -5769 56737
1780 56737 -84093 -61434 2271 -69349 32352 135408 123824 -2490 61859 -34570 15186
1769 15186 137981 -31953 -28396 -47776 -111970 -96188 -130287 -192599 -57327 -131444 -48755
1758 -48755 -32068 -9699 50742 170542 159703 117967 140275 100955 82181 102859 130641 22631
1746 22631 -57833 -124236 -28136 26363 26865 -46236 -22340 31643 75597 38823 -1990 74328
1734 74328 198587 100572 61474 -22916 11339 74127 54078 -3340 25886 38500 79786 104326
1722 104326 4748 -27977 -47631 -38246 493 65610 -26942 106984 173647 186216 180894 40587
1710 40587 -16593 52325 35659 117889 -6042 -188982 -122896 -90900 -18467 32668 -34475
1699 -34475 -117296 -164877 -126592 -87926 -89503 101870 131377 81473 169709 156896 130739 68161
1687 68161 101034 166865 83300 124257 40002 21048 54782 -45091 31527 65406 67865 -26591
1675 -26591 -6209 63968 5220 126982 106152 -66647 41149 74940 55744 51435 64567
1664 64567 63870 -17222 -77114 -124339 -32595 -17728 -25071 -111097 -156711 -53027 -140474 -120631
1652 -120631 -54433 32087 56212 -73614 41539 329 -4626 150798 47058 18078 -2518
1641 -2518 65433 83856 45842 26296 -9412 -29216 -117051 19188 68358 -84094 -128758 15453
1629 15453 79782 -76022 -4195 127472 -54706 -107933 -53108 -67248 -43089 -37533 26076
1618 26076 193269 152349 102813 118781 24698 -71469 -72770 -43483 -2534 51291 49822 79898
1606 79898 14327 -5045 -37208 -132185 -118543 44999 18019 130898 53331 -39515 24781
1595 24781 -54263 6506 2251 7950 42383 -52723 -73021 99117 -3728 13902 29569 63749
1583 63749 121846 154296 62972 -21455 -28837 -120192 -136666 -87784 -21916 -1944 -134792 -146404
1571 -146404 -83376 -79175 -27374 48392 30706 3124 -36845 4016 -2625 68860 17183 -54572
1559 -54572 -94351 21988 -16251 47827 52285 5868 -169945 -263014 -153169 -51395 58803
1548 58803 -61866 63927 32033 50980 15681 -39341 -88285 72480 76316 6265 -131212
1537 -131212 -86448 24230 37574 -22227 -61080 -94464 -121226 -33253 -26051 -383 74775 -61546
1525 -61546 -7844 -34108 -166904 -78711 -71732 -147691 -238299 -120215 -71362 -125502 -69945 66231
1513 66231 51977 45308 68363 46859 -10376 -178056 -72104 -82764 -98039 -14990 -48938 -28257
1501 -28257 -199471 -77065 14810 -16935 -57733 -103868 -63112 -7170 13825 91146 56977
1490 56977 121144 54191 82161 210412 119248 15276 -60358 -51741 6568 42522 -12157 109949
1478 109949 11243 -38554 -33096 57299 59642 66521 65903 28866 -97699 -94869 4231 -86207 -135987
1465 -135987 -171090 -161308 -34428 42131 25710 -40517 40598 -124106 -130000 -15611 -109779
1454 -109779 -35340 -104541 28937 52576 47625 -67960 3629 70502 -51633 -1074 -22253
1443 -22253 -9429 -176637 -155472 -92159 -123579 -71648 -64005 -117860 -104875 -80674 -13904 -41501
1431 -41501 -45532 96906 98241 13587 -30162 21222 -67128 -135987 -87131 -17784 6096 -21491
1419 -21491 -67707 -116857 -117677 -93699 -51027 8915 -63373 -1010 34567 79659 14522 -65632
1407 -65632 36980 62279 28818 -12171 -31428 30470 129111 39894 36692 131580 -34712 -60208
1395 -60208 -31529 -88135 -84548 -89632 -87134 -138136 -2692 -18086 53238 69557 -32223 32228
1383 32228 64407 42142 45580 111562 16953 -31212 26726 -162226 -135652 -114474 -46029 -11148
1371 -11148 -66149 9616 37039 32029 -57070 145030 151606 101522 143251 133655 -22692 -6749
1359 -6749 45183 51454 75350 62197 -142654 -182590 -34519 -119266 -203365 -119414 9335 15909
1347 15909 -43383 -118226 -56523 11137 -2689 21726 7345 42066 86347 124800 -65226 -100948
1335 -100948 -67301 -68758 -79284 -75131 -21098 -21073 -16844 68341 116491 -114544 -109383 -37534 137889
1322 137889 122021 101686 169639 74248 -48457 2841 -40666 -64741 4264 -14591 -11851 -79022
1310 -79022 -166091 -63770 -113192 -63546 -6642 -56880 -301 36418 48281 -30690 -21379 -68950
1298 -68950 -164172 -163211 -69916 -1271 -4809 -57618 -44463 55701 -3917 -94068 -79724 -53017
1286 -53017 -16335 29932 -11480 -40309 5044 8623 -36237 -116765 -67470 94986 204085 123542
1274 123542 -71652 -81292 55291 100800 59242 -1934 -43933 -61053 101092 119445 81068
1263 81068 18102 -148614 -153144 -29113 34163 -25347 -88899 -54297 84447 193271 206812
1252 206812 85515 45984 79077 -21163 2053 -55744 20149 69429 66418 75449 16282 -1727
1240 -1727 42068 121991 2996 18992 48439 -33507 -22906 -20106 -18675 -78250 -259181 -182686
1228 -182686 -125654 -104571 -77896 91313 -49131 -38678 42831 36943 6398 -55384 -71286
1217 -71286 -152108 -103068 -30158 -99759 -113863 -124460 -92180 71608 -55181 -17062 -37475
1206 -37475 -78548 -50792 -27314 50474 36219 12416 -101708 -155845 36284 105358 148360
1195 148360 120517 173140 78006 937 58300 -4372 -76430 1829 -24912 -49235 82634
1184 82634 109501 76955 33685 50856 116705 151960 94847 45049 97730 60547 184481 159480
1172 159480 101899 82730 510 57068 -72936 -239583 -195462 -73331 -107508 9641 -32128
1161 -32128 -90643 -115352 -75855 -173647 -157980 -5515 -59238 -175347 -155605 -126227 19476
1150 19476 97142 -53994 -110684 -13053 -72563 -86320 -55921 -90346 -74730 -70233 -121741 -135151
1138 -135151 -170992 -124824 70179 13700 -23829 36170 66122 -24466 -96866 -107349 -237566
1127 -237566 -124220 -82522 -36067 -29111 -96630 -25608 -29310 -54856 -38382 -127797 -190789 -6319
1115 -6319 29591 -26555 -31791 -77124 -90142 -61789 -52154 -60043 -161779 -129022 -129216 -52107 12986
1102 12986 -72740 -188263 39487 17645 -43932 -121416 -200080 -128517 12368 133560 49715
1091 49715 74234 169557 131279 20284 13249 99375 76664 40007 -138992 -14183 -35919
1080 -35919 -197534 -96129 -18115 -150154 -73091 88429 128730 -31355 -82034 74284 12551
1069 12551 41723 7835 45502 164226 27472 -78547 -4344 -28109 -1518 -51007 73740
1058 73740 118699 145860 54447 -107607 -65589 127123 96487 -15224 -22516 -43866 -32766
1047 -32766 -20331 -79183 -63047 -129175 -93813 -41843 2163 -33105 -9275 73421 -117413 -68658
1035 -68658 -137016 -93452 -20777 36368 11660 37504 15329 -62175 -50220 27080 120883 18647
1023 18647 -127 -7911 70785 78196 -18014 -116994 2309 3922 63403 101715 68559 21283
1011 21283 6574 25848 122153 56109 -11917 -5278 -42915 -41382 -40781 -8032 2230 -94407 47333
998 47333 48929 -4989 16751 -51759 -100880 -96120 -85770 22208 61331 82195 41094 -121919
986 -121919 -112754 -37152 -96015 -30628 51237 30343 73729 32541 41004 -15346 -168105 -265675
974 -265675 -179827 -68630 48327 -80125 31592 95180 59093 97679 55682 25741 40880
963 40880 -32832 -143781 -31386 50842 -9647 -26435 105806 194139 43169 -375 -32185
952 -32185 -44634 -56235 -104859 -160540 -148068 89708 79100 -10928 18287 -31013 -101567 -166286
940 -166286 -54576 181806 214446 65496 -60799 -97955 -103652 -67488 89359 98967 -86034
929 -86034 -133587 44058 124344 13210 -56856 -75933 -53996 -42638 45610 80602 -78359
918 -78359 -97883 -89452 -40337 -60820 31800 105884 80851 75279 96780 16155 -20566 50305
906 50305 9997 -8709 -46517 -23428 23687 -636 115651 91156 -104385 -153371 -100395 -121687
894 -121687 -65942 -87434 -167977 -103747 -25650 -53276 -98678 -129685 -187546 -169694 -48562 24757
882 24757 55282 93627 35416 -23626 40420 102614 78240 8456 -125253 42486 110721 -74185
870 -74185 -134658 60209 38014 -94574 -166952 -206480 -134185 -93858 -26494 2422 63883 61477
858 61477 -43795 -42854 -22653 -94260 -56388 6117 74391 33636 -110591 -185352 -212746 -126859
846 -126859 -110431 -48217 -49888 -47908 -42994 53582 127088 151145 62871 42263 4384 -173587
834 -173587 -149207 -119251 -66336 -49838 61760 4992 -75265 12852 117280 15649 -35048
823 -35048 -84036 -61216 -100630 -90846 -10746 2353 -83148 -112936 -59499 74358 220788 98423
811 98423 80983 -54789 108436 185613 7715 -59404 30815 57030 -13875 -42367 -60747
800 -60747 -75844 -41790 -61104 92316 35513 31652 18280 70227 144143 -20151 -64323 -50007
788 -50007 -44536 -102686 -77359 -177505 -14447 62365 33823 163209 46319 -42652 -88579
777 -88579 27536 80716 -61865 25698 90483 166028 208578 -11971 3438 40744 -43709
766 -43709 -51559 -39515 -80507 -52877 52714 121475 65242 115463 207161 96803 55989 85952
754 85952 108853 34997 -17534 -91441 -87468 -24884 -84639 -155141 -31216 -108235 17804 39764
742 39764 49904 161832 128965 93869 39954 41352 93014 20200 -114932 -8301 59966 166944
730 166944 96064 11962 -42167 29784 165217 -34655 -29182 -3906 59873 178097 152508
719 152508 143815 7765 22386 141732 100839 14495 33617 -94433 -79040 23228 35227
708 35227 105662 90270 73861 -22575 14767 49943 -16538 -97524 -87215 -72815 27813 73673
696 73673 28718 52737 -106740 -38811 101062 -432 -105720 -91889 -16 74177 -74473
685 -74473 -94154 19531 100212 -7182 962 -2049 3739 21466 -39579 13794 -15344 -33399
673 -33399 -59528 -60105 -128824 -130895 19862 108457 -93896 -96085 -24900 49774 20652 37671
661 37671 1793 36009 -28770 70471 -9100 17045 102562 -34492 139153 37313 -19516
650 -19516 -17298 106570 76028 85239 12386 -41062 -66704 -103020 -46277 8963 51673 -56808
638 -56808 -20557 6069 28572 46366 -52583 57059 131646 20406 -17203 -4207 -16992 -35711
626 -35711 -132700 -134610 -175879 -208734 -61149 -13158 21573 -6443 -86389 14616 -13596 -65311
614 -65311 12299 -8637 91107 73208 125926 86578 7131 -53417 -57113 -97742 -56928 4273
602 4273 88848 107462 -112962 -95903 -38501 -20647 -84265 -167795 -18188 42033 13313 -67433
590 -67433 -87063 -54448 -49773 27081 -61387 -142555 -100606 -72398 -61241 -34994 9253 -54266
578 -54266 -86355 -50245 -185887 -96750 17185 -96277 -197918 -131233 -220782 -87679 -97329
567 -97329 -61404 89758 34280 24407 -52984 16784 80491 -82692 -57779 9590 827 22381
555 22381 -46479 18174 6627 -147375 -65272 -44491 -69748 37022 161949 9793 -141396
544 -141396 -26404 29563 2231 -44260 29065 93191 -63086 -8595 -22302 -46443 122912
533 122912 36123 -92997 -21137 11067 35945 -140145 -120898 -65497 -58102 -71502 -1335 55254
521 55254 26929 165024 75606 152742 126958 14734 -28701 -3885 -31443 6407 -42095 -115326
509 -115326 -147834 -80352 -87475 -28515 -22520 -15524 -54736 30224 202106 72893 143179 93749
497 93749 -35006 -96002 -101859 -61308 21224 1229 91743 8017 -142899 26822 54643 -10700
485 -10700 3243 55692 199783 179376 19794 -100888 -53741 75613 7967 -18730 54198
474 54198 57465 -71796 -143243 -209083 -116286 -83602 -88776 -7869 47688 -45513 -70184 8324
462 8324 12462 35710 533 23885 -48211 -154239 -99571 84118 5804 -133396 -122079 -70752
450 -70752 -7989 -81869 79872 196292 98882 -12721 -9557 -11467 48501 42523 55278 18882
438 18882 -12620 -80455 -36176 -146034 -174136 25448 126533 18856 3791 52745 184787
427 184787 147191 114812 27464 56528 47418 71804 21080 -46169 -90961 -111835 -43233 -69044
415 -69044 30684 40726 -86565 36951 138008 -43553 -1297 -83647 -104360 -154763 -67703
404 -67703 -89304 6696 90236 133608 -98440 -205262 12111 183112 67436 -32824 -9308
393 -9308 -5470 4292 -4561 16582 21411 35988 -81155 -12734 131015 -21751 -89039 -48665
381 -48665 -15224 -57595 98089 170482 45825 177939 96710 11233 156361 10013 -57420
370 -57420 -138564 -68146 -77355 -28335 362 17960 81922 -75060 -112549 -4783 -4111 -121205
358 -121205 -210626 11447 26147 -47458 -61078 14593 75466 90695 50121 -36219 -70775 -47033
346 -47033 -95874 -40261 -74638 -28193 -105648 -88594 -26255 34934 99050 26044 7906 35489
334 35489 113991 25033 24150 -107427 -172459 -124755 -71771 36942 120929 -57385 -98878 -40504
322 -40504 -34536 -73804 -190106 -138096 38820 -96588 74240 95697 90156 572 -46065 -77825
310 -77825 22218 51564 -30448 -105363 -123196 -55285 -621 -69792 -18873 -75802 -212990 -51103
298 -51103 7243 -123555 -128637 -81172 20476 46723 -23442 2472 140603 73336 -9524 -31092
286 -31092 10186 141237 97186 -58687 -58724 -93885 -60650 -155155 -95163 -57217 -136113 -74305
274 -74305 69438 94817 -7278 91640 -792 -59398 -42306 -16953 -108283 -90133 41669
263 41669 39821 33120 97154 99263 38026 -132351 -21421 72879 -16399 -97269 -23697 28141
251 28141 90768 76463 -40894 -85725 -126156 -74351 -15796 76045 130634 96926 83062 88375
239 88375 131791 72586 89512 33314 -87748 -26658 -93948 -60027 -7746 -95205 -71498 53171
227 53171 55759 -129862 -226088 -149590 -113593 -47716 -157327 -216786 -215435 -149534 -34471 -19145
215 -19145 -91786 -123650 62672 38365 37055 -19907 58696 33844 -30773 -57834 -35927 -41434
203 -41434 -27562 -74005 8269 23074 15762 -5483 -70900 -102561 -41092 77702 81155 33888
191 33888 94026 -11357 -81358 -95317 12808 29837 -6285 -64210 -64403 1957 35646 71051
179 71051 64616 37858 6627 3726 -60848 2836 -14920 -58592 -49365 -38763 -30686 20182 -60088
166 -60088 -55953 -130906 -133665 -174111 -97734 -35087 -95423 -148770 -181508 -183571 -167829 -57193
154 -57193 42138 86189 23207 -27313 -68534 -83822 -14831 7308 -57805 -11079 -32979 -7610
142 -7610 -32869 -185154 -153127 -95805 23069 -21790 17415 -48967 -76283 -47468 51589 -19958
130 -19958 -5325 9396 -55512 37241 17823 14245 -35135 -73468 -31698 32932 -68161 -117542
118 -117542 -94776 -55190 26989 -34336 -117345 -113430 41121 91338 57790 13768 42405 31502
106 31502 78544 57495 38255 -40631 -67655 -102960 -66912 33964 40191 -47287 -42834 -69154
94 -69154 -101480 -96708 -51684 -2613 -4387 88451 25573 -5293 -23432 66975 -41923 -12657
82 -12657 -19196 -20948 93375 -46112 -91152 -41188 -48891 -11035 -9231 9802 61253 -7514 -136369
69 -136369 -132251 -139266 -123585 -129325 -84015 -60230 -71915 -15777 -24599 -107697 -137950 -146430 -7847
56 -7847 22914 1675 -68038 -159543 -123837 -50669 8763 -89614 -119448 -58291 -83391 -62715
44 -62715 -13474 6693 -69451 -77345 81366 65246 6565 -73701 -53925 -8341 -55941 -22912
32 -22912 -26947 -21619 -10776 98122 14548 -53826 -40412 -20360 -9898 -18400 -81374 -146575 -138037
19 -138037 -112673 -57885 -49577 -63666 -26714 35573 41356 -19849 -44308 25322 30137 45747 5502
6 5502 -43774 -64761 -108236 -111554 -61992 -110807
0 -110807
$$ Imaginary data points
##PAGE= N=2
##DATA TABLE= (X++(I..I)), XYDATA
16383 -2551192 -2508145 -2538484 -2511273 -2392779 -2344030 -2326109 -2227391 -2139506 -2142989 -2086712 -1994327
16372 -1994327 -2005836 -1897786 -1864325 -1761227 -1719951 -1706423 -1646102 -1722665 -1737293 -1691487 -1510301
16361 -1510301 -1404110 -1451589 -1461330 -1433847 -1278837 -1247375 -1250615 -1196309 -1081215 -1037814 -1035792
16350 -1035792 -1031886 -851641 -758302 -768218 -775031 -700101 -639453 -673483 -660702 -615092 -529229 -517155
16338 -517155 -422076 -391328 -337373 -372757 -238113 -144109 -218675 -153620 -85058 -84147 44709
16327 44709 79000 118813 87456 86594 244489 260483 270305 308398 413565 517548 474568 406734
16315 406734 614272 609134 581853 762590 806286 825861 903320 810408 879693 965418 953658
16304 953658 1079663 1096818 1143538 1131756 1139382 1155510 1215979 1378046 1270819 1247956 1429556
16293 1429556 1531474 1528146 1571572 1636261 1636014 1714007 1820498 1787059 1736393 1678614 1750121
16282 1750121 1786648 1649088 1671037 1801058 1885916 1981106 2083938 2121945 2168674 2093820 2101410
16271 2101410 2217599 2198860 2298720 2302416 2347605 2355347 2377498 2440004 2411801 2457858 2436926
16260 2436926 2498411 2627153 2625561 2576763 2669106 2685681 2729167 2679149 2718893 2651290 2733183
16249 2733183 2891377 2827456 2803673 2883857 2943298 3055828 3055759 3046609 3075566 3096530 3118348 3313471
16237 3313471 3263576 3302065 3282240 3306172 3414093 3315040 3330593 3400686 3350617 3418788 3465833
16226 3465833 3444167 3446268 3473566 3543432 3493134 3546375 3571022 3558000 3692850 3712733 3627632
16215 3627632 3621940 3585033 3824193 3771991 3763757 3757543 3772277 3810015 3990171 4057339 3955642
16204 3955642 3857046 3858838 3886810 3982703 4139616 4036113 4105028 4113839 3909994 3970308 4048745
16193 4048745 4080957 4075448 4058975 4127157 4092225 4104584 4230879 4253204 4196290 4222622 4171920
16182 4171920 4164711 4221580 4172632 4385849 4424282 4429118 4352682 4432288 4501212 4469918 4474727 4394395
16170 4394395 4485569 4442043 4421576 4414987 4438446 4608712 4627226 4535613 4561683 4475296 4470708
16159 4470708 4546722 4646944 4651487 4721552 4655981 4673421 4703819 4695021 4590553 4592943 4639413
16148 4639413 4700027 4718218 4754351 4694100 4639630 4642182 4629387 4664765 4789046 4795284 4729469
16137 4729469 4926838 4997490 4970324 4891564 4807349 4844583 4795702 4835807 4867666 4792233 4758533
16126 4758533 4769819 4768713 4724300 4719078 4710120 4758620 4798223 4807028 4816085 4921625 4803550 4935183
16114 4935183 5047688 4895640 4884378 5001544 4899832 4952042 4880306 4935974 5068730 5034462
16104 5034462 4962043 5009464 5096990 5011645 4949632 5101761 4992343 5012148 4987243 4860411 5015596
16093 5015596 4867640 4779735 4877785 4830075 4902297 4904223 5062827 4932633 4899402 5042806 4953380
16082 4953380 4997141 5207948 5169033 5024551 5051258 4848262 4890121 5047370 5134618 5042899
16072 5042899 4964054 4934801 4985932 5085127 5065142 5010338 5060292 5041933 5053554 5044806 5088611
16061 5088611 5118018 5148157 5052199 5033905 5011218 5066858 5095317 5039134 5135813 5111966 5101265
16050 5101265 5162362 5034382 4977519 5066856 5137565 5171214 5206816 5123827 5147969 5266144 5198128
16039 5198128 4980479 5063382 5095053 5086826 4990006 4961816 5008787 5109993 5255634 5186250 5200469
16028 5200469 5115001 5113286 5063034 5001723 5046984 5042334 4998240 4912402 5007477 4960915 4866725 4914949
16016 4914949 4986508 4952750 4965365 4968177 5130477 5093404 5080923 5064101 5129137 5120852 5036989
16005 5036989 5106580 5216774 5112462 5137527 5116441 5013157 4961983 4928881 5029850 5057542
15995 5057542 5225563 5191145 5088721 5153792 5177711 5108017 5131524 5132065 5163909 5109964 5017713
15984 5017713 5042547 5073098 5170978 5202862 5094128 5223683 5113295 5158225 5205543 5217304 5200940
15973 5200940 5243122 5174777 5073729 5168863 5315194 5098566 5033305 5042986 5021018 5106684 5137437
15962 5137437 5199045 5245881 5286300 5210400 5258444 5167980 5072714 5148017 5147907 5203630 5158457 5140816
15950 5140816 5136623 5196966 5211715 5254806 5200216 5098975 5059211 5187701 5141688 5139728 5189474
15939 5189474 5116420 5091588 5225608 5204849 5064219 5005829 5095757 5103238 5156834 5185241 5148516
15928 5148516 5141661 5058280 5118273 5093786 5125884 5276884 5205513 5214297 5348658 5185872 5244135
15917 5244135 5304137 5235621 5087583 5087266 5185970 5273268 5344692 5318664 5158520 5166024 5286989
15906 5286989 5125174 5073824 5050632 5021765 5124979 5194186 5195801 5071849 5153367 5202583 5292172
15895 5292172 5209663 5271072 5226998 5083416 5091886 5162132 5152084 5232576 5237805 5137506 5002882
15884 5002882 5243293 5286089 5184836 5226587 5182002 5121015 5030685 5125855 5102162 5096222 5094501
15873 5094501 5084246 5128899 5263507 5377081 5351850 5281487 5227186 5330832 5319317 5220023 5149360
15862 5149360 5161221 5231416 5158127 5211065 5200384 5192707 5179029 5102147 5164964 5266662 5179675
15851 5179675 5082492 5129660 5268765 5317375 5257481 5261353 5284824 5244090 5274858 5186019 5133900
15840 5133900 5087609 5158043 5235913 5188087 5099462 5032194 5120204 5224094 5237635 5228659 5216081
15829 5216081 5105846 5168512 5180913 5199645 5335823 5369731 5398982 5403741 5312321 5126282 5202838
15818 5202838 5261785 5288321 5243472 5076400 5070673 5155889 5085824 5077797 5195615 5245233 5244163
15807 5244163 5283128 5202062 5250371 5364223 5321345 5359083 5330150 5221347 5164735 5167638 5296204
15796 5296204 5242897 5161725 5259674 5250718 5240814 5251096 5232121 5272924 5207269 5332703 5357872
15785 5357872 5192415 5248749 5197468 5146135 5184772 5218925 5246438 5318774 5246779 5194317 5090431
15774 5090431 5108358 5176013 5264373 5210092 5183587 5204104 5234172 5249709 5292136 5278756 5239662
15763 5239662 5374524 5411296 5246723 5275984 5288848 5304943 5257892 5364980 5354905 5297029 5302730
15752 5302730 5292319 5160033 5079654 5188747 5320550 5232347 5264982 5364727 5319724 5306744 5344327
15741 5344327 5340547 5324351 5380710 5258048 5267102 5227703 5361535 5368889 5418573 5352232 5266590
15730 5266590 5331285 5401849 5239677 5224414 5250165 5353962 5502401 5292570 5142162 5232432
15720 5232432 5402385 5338624 5183145 5242468 5181600 5135644 5148456 5223371 5328590 5311755 5253920
15709 5253920 5264137 5223554 5291481 5272376 5160864 5249567 5257846 5207254 5150821 5237472 5233529
15698 5233529 5211829 5236811 5171383 5166681 5199081 5260121 5217701 5263692 5254666 5327721 5260281 5254340
15686 5254340 5174492 5252778 5299771 5285316 5291556 5318898 5343857 5230571 5122693 5169155 5281500
15675 5281500 5456862 5439686 5375201 5342213 5173108 5205453 5221809 5203216 5275831 5401327 5203028
15664 5203028 5377613 5356855 5379181 5403906 5388441 5230601 5147757 5201254 5194631 5209015 5267581
15653 5267581 5295421 5313287 5231169 5309136 5373989 5293841 5310090 5230304 5356467 5330325 5302416
15642 5302416 5363239 5380949 5420383 5439979 5416624 5383264 5335247 5346705 5377881 5385331 5317810
15631 5317810 5383968 5324652 5345410 5438423 5402034 5356469 5279247 5224701 5307666 5314650 5333025
15620 5333025 5350424 5371275 5432043 5264621 5343850 5450594 5343585 5397301 5437985 5427974 5276565
15609 5276565 5234449 5390006 5265861 5241126 5436989 5483329 5406261 5453658 5434688 5268990
15599 5268990 5350096 5432278 5466432 5381748 5351646 5366044 5245249 5332790 5488837 5449518 5232502
15588 5232502 5239585 5283460 5467833 5417200 5418534 5379177 5267584 5422334 5415326 5355803 5250021
15577 5250021 5254961 5244553 5246728 5430092 5407298 5373875 5394803 5463026 5424479 5411053 5347781
15566 5347781 5375961 5364891 5386940 5445640 5400532 5332752 5378879 5259571 5273634 5334451 5308620
15555 5308620 5247998 5305944 5339896 5292002 5329376 5356364 5334908 5254888 5187597 5323387 5364814
$$ [...]
##END NTUPLES=NMR SPECTRUM
##END=
