##TITLE=1H_EC-3361(II-22)
 200.13MHz, CDCl3,
 8 sc
 
 11.9.2025
##JCAMPDX= 6.0         $$ Bruker NMR JCAMP-DX V2.0
##DATA TYPE= NMR SPECTRUM
##DATA CLASS= NTUPLES
##ORIGIN= UXNMR, Bruker Analytische Messtechnik GmbH
##OWNER= pz
$$ XWIN-NMR		Version 3.5
$$ Thu Sep 11 13:52:11 2025 Russian Standard Time (UT+4h)  she@DPX200
##.OBSERVE FREQUENCY= 200.1313
##.OBSERVE NUCLEUS= ^1H
##.ACQUISITION MODE= SIMULTANEOUS
##.ACQUISITION SCHEME= undefined
##.AVERAGES= 8
##.DIGITISER RES= 18
##SPECTROMETER/DATA SYSTEM= spect
##.PULSE SEQUENCE= zg30
##.SOLVENT NAME= CDCl3
##.SHIFT REFERENCE= (INTERNAL, CDCl3, 0, 15.4913)
##AUDIT TRAIL= $$ (NUMBER, WHEN, WHO, WHERE, WHAT)
$$ ##TITLE= Audit trail, XWIN-NMR		Version 3.5
$$ ##JCAMPDX= 5.01
$$ ##ORIGIN= Bruker BioSpin GmbH
$$ ##OWNER= she
$$ F:/spectra/data/she/nmr/H-C/1/pdata/1/auditp.txt
$$ ##AUDIT TRAIL=  $$ (NUMBER, WHEN, WHO, WHERE, WHAT)
(   1,<2025-09-11 13:50:48.93 +0400>,<she>,<DPX200>,
      <created by zg, POWCHK disabled, PULCHK disabled
       configuration hash MD5:
       00 E9 B6 7A A2 85 ED C7 34 08 36 98 17 FE 4E 26
       data hash MD5: 16K
       C4 54 1F 7D 4F 9A AD C9 11 F9 37 6C 75 B6 F2 0E>)
(   2,<2025-09-11 13:50:52.70 +0400>,<she>,<DPX200>,
      <Start of raw data processing
       efp BC_mod = 2 LB = 0.25 FT_mod = 6 PKNL = 1 PHC0 = -1558.854 PHC1 = 11.99228 SI = 16K 
       data hash MD5: 16K
       CA CC 7A 85 A1 1D 0F E4 28 C9 8C DD 9A 7E EC 00>)
(   3,<2025-09-11 13:51:15.62 +0400>,<she>,<DPX200>,
      <pk PHC0 = 2.627707 PHC1 = -5.8 
       data hash MD5: 16K
       D7 92 D5 77 A8 E0 3C 3F C9 F8 D6 0A 26 3A 6A 50>)
(   4,<2025-09-11 13:51:21.31 +0400>,<she>,<DPX200>,
      <abs ABSG = 5 
       data hash MD5: 16K
       90 95 8E 05 28 58 2A AB 41 A2 1A 1B 1E 79 C8 38>)
(   5,<2025-09-11 13:51:44.14 +0400>,<she>,<DPX200>,
      <abs ABSG = 5 
       data hash MD5: 16K
       0C EA 17 A6 AF 21 59 3E 6D 69 D0 6D F5 98 5E BA>)
$$ ##END=
$$ 
$$ hash MD5
$$ 7C 38 DE 0E 89 5D 0B 3F 14 1A A1 C6 BC 79 1F 53
##$RELAX= 
##$RELAX= 
##$RELAX= 
##$RELAX= 
##$RELAX= 
##$RELAX= 
$$ Bruker specific parameters
$$ --------------------------
##$DU= <F:/spectra>
##$EXPNO= 1
##$NAME= <H-C>
##$PROCNO= 1
##$TYPE= <nmr>
##$USER= <she>
##$AMP= (0..31)
100 100 100 100 100 100 100 100 100 100 100 100 100 100 100 100 100 100 
100 100 100 100 100 100 100 100 100 100 100 100 100 100 
##$AQSEQ= 0
##$AQ_mod= 1
##$AUNM= <au_zg>
##$AUTOPOS= <>
##$BF1= 200.13
##$BF2= 200.13
##$BF3= 200.13
##$BF4= 200.13
##$BF5= 200.13
##$BF6= 200.13
##$BF7= 200.13
##$BF8= 200.13
##$BYTORDA= 1
##$CFDGTYP= 0
##$CFRGTYP= 5
##$CHEMSTR= <none>
##$CNST= (0..31)
1 1 145 1 1 1 1 1 1 1 1 1 1 1 1 1 1 1 1 1 1 1 1 1 1 1 1 1 1 1 1 1 
##$CPDPRG= <>
##$CPDPRG1= <>
##$CPDPRG2= <>
##$CPDPRG3= <>
##$CPDPRG4= <mlev>
##$CPDPRG5= <mlev>
##$CPDPRG6= <mlev>
##$CPDPRG7= <mlev>
##$CPDPRG8= <mlev>
##$CPDPRGB= <>
##$CPDPRGT= <>
##$D= (0..31)
0 0.7 0 0 0 0 0 0 0 0 0 0.03 0 0 0 0 0 0 0 0 0 0 0 0 0 0 0 0 0 0 0 0 
##$DATE= 1757584248
##$DBL= (0..7)
$$ [...]
##$SUBNAM3= <"">
##$SUBNAM4= <"">
##$SUBNAM5= <"">
##$SUBNAM6= <"">
##$SUBNAM7= <"">
##$SUBNAM8= <"">
##$SUBNAM9= <"">
##$SW= 18.0517328524113
##$SWIBOX= (0..15)
0 0 2 0 0 0 0 0 0 0 0 0 0 0 0 0 
##$SW_h= 3612.71676300578
##$TD= 16384
##$TD0= 1
##$TE= 0
##$TE2= 300
##$TE3= 300
##$TEG= 300
##$TL= (0..7)
0 120 120 120 120 120 120 120 
##$TP= (0..7)
150 150 150 150 150 150 150 150 
##$TP07= 0
##$TPNAME0= <>
##$TPNAME1= <>
##$TPNAME2= <>
##$TPNAME3= <>
##$TPNAME4= <>
##$TPNAME5= <>
##$TPNAME6= <>
##$TPNAME7= <>
##$TPOAL= (0..7)
0.5 0.5 0.5 0.5 0.5 0.5 0.5 0.5 
##$TPOFFS= (0..7)
0 0 0 0 0 0 0 0 
##$TUNHIN= 0
##$TUNHOUT= 0
##$TUNXOUT= 0
##$USERA1= <user>
##$USERA2= <user>
##$USERA3= <user>
##$USERA4= <user>
##$USERA5= <user>
##$V9= 5
##$VALIST= <valist>
##$VCLIST= <CCCCCCCCCCCCCCC>
##$VD= 0
##$VDLIST= <DDDDDDDDDDDDDDD>
##$VPLIST= <PPPPPPPPPPPPPPP>
##$VTLIST= <TTTTTTTTTTTTTTT>
##$WBST= 1024
##$WBSW= 4
##$XGAIN= (0..3)
0 0 0 0 
##$XL= 0
##$YL= 0
##$YMAX_a= 181239
##$YMIN_a= -311368
##$ZGOPTNS= <>
##$ZL1= 120
##$ZL2= 120
##$ZL3= 120
##$ZL4= 120
##$ABSF1= 15.49127
##$ABSF2= -2.560579
##$ABSG= 5
##$ABSL= 3
##$ALPHA= 0
##$AQORDER= 0
##$ASSFAC= 0
##$ASSFACI= 0
##$ASSFACX= 0
##$ASSWID= 0
##$AUNMP= <proc_1d>
##$AZFE= 0.1
##$AZFW= 0.1
##$BCFW= 0
##$BC_mod= 2
##$BYTORDP= 0
##$COROFFS= 0
##$CY= -3
##$DATMOD= 1
##$DC= 0
##$DFILT= <>
##$DTYPP= 0
##$F1P= 0
##$F2P= 0
##$FCOR= 1
##$FTSIZE= 16384
##$FT_mod= 6
##$GAMMA= 0
##$GB= 0
##$INTBC= 1
##$INTSCL= 3.241238e-09
##$ISEN= 128
##$LB= 0.25
##$LEV0= 0
##$LPBIN= 0
##$MAXI= 10000
##$MC2= 0
##$MEAN= 0
##$ME_mod= 0
##$MI= 1.114404
##$NCOEF= 0
##$NC_proc= -7
##$NLEV= 6
##$NOISF1= 3.799351
##$NOISF2= 2.8
##$NSP= 0
##$NTH_PI= 0
##$NZP= 0
##$OFFSET= 15.49127
##$PC= 1
##$PHC0= -1556.226
##$PHC1= 6.19228
##$PH_mod= 1
##$PKNL= yes
##$PPARMOD= 0
##$PSCAL= 0
##$PSIGN= 0
##$REVERSE= no
##$SF= 200.13000609042
##$SI= 16384
##$SIGF1= 3
##$SIGF2= 2
##$SINO= 0.751879
##$SIOLD= 32768
##$SREGLST= <19F.Aceton>
##$SSB= 0
##$STSI= 16384
##$STSR= 0
##$SW_p= 3612.71676300578
##$SYMM= 0
##$S_DEV= 0
##$TDeff= 16384
##$TDoff= 0
##$TI= <>
##$TILT= no
##$TM1= 0
##$TM2= 0
##$TOPLEV= 0
##$USERP1= <user>
##$USERP2= <user>
##$USERP3= <user>
##$USERP4= <user>
##$USERP5= <user>
##$WDW= 1
##$XDIM= 16384
##$YMAX_p= 288152504
##$YMIN_p= -804589
$$ End of Bruker specific parameters
$$ ---------------------------------
##NTUPLES= NMR SPECTRUM
##VAR_NAME=  FREQUENCY,     SPECTRUM/REAL,   SPECTRUM/IMAG
##SYMBOL=    X,             R,               I
##VAR_TYPE=  INDEPENDENT,   DEPENDENT,       DEPENDENT
##VAR_FORM=  AFFN,          ASDF,            ASDF
##VAR_DIM=   16384,         16384,           16384
##UNITS=     HZ,            ARBITRARY UNITS, ARBITRARY UNITS
##FACTOR=    0.220516191357247, 1,           1
##FIRST=     3100.26797251835, 0,            0
##LAST=      -512.448790487425, 0,           0
##MIN=       -512.448790487425, -804589,     0
##MAX=       3100.26797251835, 288152504,    0
$$ Real data points
##PAGE= N=1
##DATA TABLE= (X++(R..R)), XYDATA
$$ [...]
9757 44465 -120494 -35499 -15800 83266 171811 177281 296297 468920 132959 -26728 160536
9746 160536 39129 145700 22036 221584 384680 198501 253729 116492 81513 224481
9736 224481 194158 233403 134076 -7328 88326 162395 397175 389149 241426 245514 188934
9725 188934 265683 282710 -75667 -5315 106802 185722 -55571 -103623 202116 156838 77987
9714 77987 -32740 287190 386142 261598 171959 61462 155313 236870 252471 428229 452468
9703 452468 373327 351747 336128 303167 325790 276201 152358 -55681 -123734 164734 478022
9692 478022 182349 533357 551901 297785 317848 271668 329691 87935 -22204 328529
9682 328529 465928 368964 334362 216462 388332 435034 297413 276288 411120 367117 346982
9671 346982 10504 39753 311950 74516 434744 405682 279500 353776 395880 268388
9661 268388 269408 601496 597264 300957 357064 389612 426170 790801 1005967 1273116 914657
9650 914657 898551 714141 747745 933807 997582 658165 712411 560019 439519 416859 526149
9639 526149 669962 665935 594090 600513 298808 424847 534596 660322 739357 714545 528098
9628 528098 686981 773092 751932 783779 518840 544170 296932 307900 443617 302687 199540
9617 199540 481010 588511 529243 488525 415919 364319 598014 807520 664423 895927
9607 895927 1061479 932607 647655 720942 778532 426390 518589 740813 777025 983945
9597 983945 794836 435877 574747 551139 735525 794589 608961 404758 726673 726863 605110
9586 605110 321555 115194 427038 336687 204675 162518 360588 294397 -19371 89089
9576 89089 87446 273545 257284 334474 478610 282718 194987 -2064 -53784 238335 268833
9565 268833 180420 38345 -188752 43910 210212 383069 277827 373566 424845 321433
9555 321433 476311 334345 74365 173403 279118 158863 277274 371636 443671 409855
9545 409855 242848 108488 228612 304035 325269 302428 440243 645616 554091 596132 654477
9534 654477 510558 508503 637028 611583 153659 260928 311736 113393 372605 696496
9524 696496 429772 389746 410298 520403 638559 682095 386980 382088 369899 803985 810883
9513 810883 529934 557392 643123 362380 487533 408926 442998 618487 573426 422595 275536
9502 275536 367310 375022 314637 274483 362454 364844 396561 362782 129803 11801 68995 111795
9490 111795 -670 11979 7185 -304884 -231143 -75802 271576 91807 -59012 -320365
9480 -320365 -24645 125498 277046 66898 152633 970 -26742 -11136 8261 223927
9470 223927 -36231 153572 445034 381666 28852 -33694 165637 181173 55605 62305 17872
9459 17872 174487 261759 116853 138199 -18221 85397 227032 279032 194716 -56698 -116049
9448 -116049 -6993 251636 529329 455285 422798 -20785 69616 322203 296192 235540 403087
9437 403087 489786 500611 183820 137247 184709 394060 505382 241074 56452 58051 222816
9426 222816 155769 189432 162874 102461 107684 167563 166758 369392 335271 44036 180411 478262
9414 478262 455111 431411 141388 78904 294582 566671 847601 836743 728145 1004594
9404 1004594 1006312 771191 703514 1045137 1008735 1169241 1455485 1497292 1646284 1435055
9394 1435055 1411937 1222025 1225602 1303638 1274980 1298203 1377441 1137266 918063 727197 598898
9383 598898 736498 664993 545674 379198 337348 288536 518813 462156 422958 490188 397193
9372 397193 184852 193045 121823 27832 215058 392889 455592 210386 273124 252748 207547
9361 207547 270284 345507 502702 345809 279178 310085 332405 237273 261244 59890 202665
9350 202665 59528 313206 333798 45981 83785 257170 261936 -10048 186356 235457 243178
9339 243178 106736 -20271 152543 73161 101412 59900 102160 246687 144254 252477
9329 252477 151153 10649 154360 42242 -35476 -11232 -94241 38168 72750 160037 216418
9318 216418 104303 166060 239405 321897 248818 152958 241756 314728 191847 173449 91181
9307 91181 110621 32329 -176689 3224 -18842 168586 98896 -85286 115365 363811 15644
9296 15644 145338 302872 25071 -1636 100667 142350 291045 353251 304320 7158 75889
9285 75889 233045 203307 80516 317361 5607 15047 312544 56673 41837 -57249 31128
9274 31128 158645 327116 282947 314753 358588 333050 109551 131449 339238 215121 344032
9263 344032 479084 414408 305461 424326 380459 135625 145763 249226 444885 365588
9253 365588 348782 391691 371520 45221 170078 102793 226560 344407 447238 599181
9243 599181 406861 146959 90612 89303 346559 439822 271036 363435 241440 81367 393492
9232 393492 509868 317900 442587 464779 277994 260242 363400 408304 478693 531458 713595
9221 713595 898962 690443 516787 451456 195496 356617 288728 129468 180685 300988
9211 300988 199876 298185 692302 600088 496990 268482 258111 362366 353140 181157 246823
9200 246823 315682 80335 52303 356501 648075 570350 572175 453884 470633 399771 516561
9189 516561 518175 541110 538082 624547 707255 748177 627830 595070 644969 628981 744438 700916
9177 700916 735430 816160 611675 743883 525290 567986 487997 500268 468377 686459 547070
9166 547070 419717 646681 609320 446905 473495 588404 552576 555137 586286 578833 532898
9155 532898 649697 582127 745764 767369 638955 545288 464880 340277 635691 490430
9145 490430 541810 593380 497344 729126 664733 662780 918793 909787 1037635 1138935 1227096
9134 1227096 820099 627894 530650 586473 658464 772030 510301 510060 451169 464893 667754
9123 667754 662730 808352 695493 715886 1033716 997508 832036 765751 867986 1028417 1022568
9112 1022568 1133208 1389632 1362930 1112830 1210241 1228000 1215827 1394639 1494546 1211186
9102 1211186 1103831 1184868 994952 968187 1174244 1083499 1221312 1328163 1403588 1245340
9092 1245340 1229624 1228150 1329254 1675061 1637228 1613844 1736930 1527077 1565755 1737546 1684890
9081 1684890 1523007 1786066 2005447 1892449 2072959 2091473 2189720 2172113 1977616 1878260
9071 1878260 1905859 1949946 2102525 2082789 2128115 2045473 1925690 1961182 2149796 2417598 2508444
9060 2508444 2490369 2506675 2553274 2639429 2511223 2299537 2452651 2648925 2534217 2602070
9050 2602070 2517115 2351322 2369203 2293632 2173291 2183062 2644207 2703926 2634596 2564418 2684065
9039 2684065 2837661 2814337 2788995 2773059 2824266 2804769 2759205 2916613 2881240 2742128 2925301
9028 2925301 2915172 3030644 2931271 2874024 3038291 3124390 2852065 2795214 2890548 2972801 2993909
9017 2993909 2950818 2887085 2990082 2898851 2758150 2860718 2852521 2743939 2808477 3148259 2966332
9006 2966332 2923925 2631035 2679697 3051479 3037335 3170905 3192353 3174976 3408582 3148855
8996 3148855 3230228 3105167 3343271 3657169 3727939 3587787 3576995 3905210 4074089 4016691
8986 4016691 4011569 4225276 4574034 4781436 4732739 4823648 4978839 4753728 5038540 5131125
8976 5131125 4982667 5396018 5593777 5905923 6495422 6453727 6473046 6543761 6662114 7220100
8966 7220100 7781854 7833620 8078981 8471702 8696642 8819202 9159021 9689193 10073335 10466568
8956 10466568 10944926 11592784 12102464 12474074 12943358 13919531 14704764 15454677 16287049
8947 16287049 17381150 18688498 19902153 21145540 23087425 25123893 27216350 29684802
8939 29684802 32713988 36183189 40222137 44382003 49057320 54391000 61322428 69800700
8931 69800700 80559321 93507800 108685541 126905810 145090546 161102816 171614146
8924 171614146 177399830 176310966 158334965 138038412 124110598 113716480 105723286
8917 105723286 99278133 95064119 91058999 87598007 83985467 80037465 75908245 72888602
8909 72888602 69955313 67369155 64671929 62202461 59613670 56272925 53285110 50747199
8901 50747199 49397946 48835859 48182263 48062865 48638168 49395285 50209827 50699405 51036633
8892 51036633 51037581 50638208 50628484 51030695 51490832 52590162 54677429 56878180 59428129 62210174
8882 62210174 64724616 66315401 67140140 66763465 64796314 62502796 60384353 58426627
8874 58426627 57118739 56758044 57286956 58720018 60497323 62182185 63870187 64723295 64387666
8865 64387666 62330598 60372662 59154059 58727605 58403331 58162488 57544866 56544477 55476741
8856 55476741 54240588 52846440 51291116 49022558 46368765 44531666 43270203 42456495
8848 42456495 42400366 42564610 43108299 44132735 45529806 46923973 48447741 50183403 50895123
8839 50895123 50912672 50295887 49010782 47627168 46409209 45622751 45240374 45519468 46237526
8830 46237526 47153105 48021783 48714156 49410773 49442920 49217041 49443035 50226734 50986019 51686241
8820 51686241 51824382 51310104 50132820 48338441 46338139 44136079 41519449 39050525
8812 39050525 36685151 34485498 32506501 30900011 29871676 28707775 27811635 26895353
8804 26895353 25985965 25402387 24794560 24259044 23537957 22996828 22722019 21950895 21446530
8795 21446530 21178248 21004907 20815888 20522824 20426100 19901826 19432330 19495781 19320480 18988994
8785 18988994 19012236 19121995 19099332 18851565 18720649 18595480 18762018 18943010 18853037 18819511
8775 18819511 18989902 19242271 19264079 19366072 19596271 19521836 19418632 19558990 19824791 20049265
8765 20049265 20241932 20625094 20788546 21304437 21845030 22332482 23130604 24339667 25726452
8756 25726452 27192523 29210706 31432689 33570803 35219146 36341618 36939748 36801569
8748 36801569 36118734 35421879 34963843 35187508 35898310 36975353 37993816 38955771 39609467
8739 39609467 39254809 37883874 36135287 34202581 32201251 30650794 29616213 28367604
8731 28367604 27561366 27121155 26702785 26375618 25943073 25566827 25408070 24956070 24953617 25139125
8721 25139125 24900430 24895134 25724966 26368157 27285440 28375287 29603314 31092658 32561605
8712 32561605 34467060 36204587 37588609 38628496 38754341 38496284 38195330 37340970 36506155
8703 36506155 36345643 36761338 37757773 38479011 39094927 39382109 39345227 38711713 37215725
8694 37215725 35253812 32766726 30545182 28620251 27056896 25675044 24846009 23955839
8686 23955839 23344855 22700880 22496579 21983121 21649015 21049315 20758717 20425072 20251913
8677 20251913 20131016 20175793 20248006 20269615 20470124 20307181 20437777 20250868 19949448 19790958
8667 19790958 19402223 19117986 19041805 19185666 18937848 18657797 18691398 18624425 18492452 18604497
8657 18604497 18501492 18325807 18334945 18538982 18807088 19012565 19389750 19785565 20473737 21176685
8647 21176685 22131287 23518555 24610444 25225515 26014103 26391308 25993198 25068067 24314385
8638 24314385 23463842 23450713 23720474 24362242 24749676 25123872 25398125 25318059 24634619 23450272
8628 23450272 22493798 21396823 20608673 20118418 19581768 19134385 19041704 19272980 19400266
8619 19400266 19262606 19496583 19269818 19383501 19489789 19940310 20660591 21089271 21698902
8610 21698902 22430471 23804531 25361079 26904288 28897221 31261349 33188624 34520080
8602 34520080 35580788 35654730 35408832 34155259 32668548 31965815 31564909 31558127 31912585
8593 31912585 32616982 32804226 32750633 32315932 31145979 29368907 27516886 25849894 24126976
8584 24126976 22907670 21812632 20921686 20231044 19459275 18896159 18495600 18393017 18081550
8575 18081550 17858198 17924718 17716091 17411775 17302285 17534912 17818194 18321288 18892311 19702536
8565 19702536 20792116 21904207 22793899 23276644 23509878 23474902 23632688 23345628 22886331
8556 22886331 22306982 22130628 21954755 22096523 22370997 22420611 22198758 21819333 21099966 20214669
8546 20214669 19412640 18445751 17586384 16903763 16269568 15736350 14974117 14517565 14257867
8537 14257867 14016079 13913084 13540618 13331788 13192663 13028070 12809688 12889765 13018575 12945394
8527 12945394 13022183 13208047 13483432 13810502 14275123 14425954 14818027 15085016 15388428 15839995
8517 15839995 16256713 16442288 16793459 17219514 17648284 18040479 18473275 19054233 19730546
8508 19730546 20721822 21688465 23230692 24523173 26284831 28149529 29843546 31245414
8500 31245414 32401886 32756061 31857435 30989258 30052763 28750817 27132189 25877775 25377152
8491 25377152 25156122 25350552 25522835 26487140 27898343 29381154 30915188 32207203 33231937
8482 33231937 33256469 32380592 31012468 29711328 27866873 25833587 24649486 23669726 22808274
8473 22808274 22086353 21615586 21112285 20819335 21111187 21464616 21989487 22730155 23950863
8464 23950863 25258196 26348172 27546917 28367436 28280694 27563419 26833730 25851341 24393853
8455 24393853 22872503 21904665 20941405 20608040 20478801 20754568 21395002 22249173 23197099
8446 23197099 24040741 24706921 25594485 25824414 24956518 23958641 22773587 21266419 19204157
8437 19204157 17331048 16009311 14788564 13656128 12736507 11989393 11462862 10918949 10094168
8428 10094168 9710864 9278787 8698030 8491494 8287871 8176695 7656523 7142375 6837661
8419 6837661 6871787 6800606 6804756 6524583 6181455 6090231 5914788 5459495 5426570 5179588 4970532
8408 4970532 4941774 4869090 4890781 4869673 4852287 4656415 4649185 4447030 4360992 4494311 4442784
8397 4442784 4177366 3935683 3867066 4057574 4136460 3982683 3888849 3719519 3623271 3595564
8387 3595564 3546870 3724950 3711766 3725984 3691707 3557697 3616242 3445329 3207865 3467622
8377 3467622 3541763 3443408 3350762 3319900 3368278 3370955 3314595 3175149 2966426 3009853 3040754
8366 3040754 3014978 2996060 2883169 3008838 3006860 3192748 2951829 2839733 2700743 2693056 2799158
8355 2799158 2891192 2804730 2678946 2814170 2881238 2620036 2387134 2193760 2334509 2459116
8345 2459116 2436182 2626984 2450875 2335605 2333639 2175721 2151358 2065818 2090084 2166953 1927822
8334 1927822 2147349 2291878 2329551 2358094 2063201 1883160 1799820 1916418 2203141 2121209
8324 2121209 2312002 2204282 2048827 2132297 2007129 1875914 1919600 1908934 1970822 2074578
8314 2074578 1956986 2271857 2241802 2105096 2031903 1959043 1975193 1933575 2069211 2356469
8304 2356469 2256138 2161128 2079845 1985385 1949669 1960151 1803526 1585087 1385681 1440358 1612353
8293 1612353 1766076 1901407 1716100 1704206 1720813 1883895 1853608 2224395 2329722 2129248
8283 2129248 2270974 2268527 2011044 2073435 2133080 2411666 2661398 2839478 2746170 2953310
8273 2953310 3065052 2858802 2777667 3008228 3185234 3199330 3259233 3030216 3168231 3420531
8263 3420531 3695227 3285955 3292827 3546440 3442008 3538085 3560386 3743439 3748048 3808432 3751683
8252 3751683 3635321 3720321 3594541 3469079 3104190 3075570 3070350 3181638 2998365 2844719
8242 2844719 2880172 2974337 3087747 3588236 3905324 3928085 4066062 4131383 4133310 4224258 4641008
8231 4641008 4533415 4487085 4500328 4598954 4559277 4366498 4247152 4166125 3849438 3657849
8221 3657849 3277072 3005946 2935199 2820407 2688578 2540141 2243822 2271860 2124182 2186424
8211 2186424 1992973 1769318 1892181 1548314 1663779 1729381 1767155 1668908 1683113 1672185
8201 1672185 1709600 1498328 1396959 1338103 1389234 1232547 1477115 1680247 2218988 2815611
8191 2815611 1362043 1083350 1242559 1239232 1268955 1008607 1043165 1250830 1388129 1346193
8181 1346193 1248739 1138055 1350165 1297392 1206229 1109182 1100701 941110 964361 844634 858485
8170 858485 1044506 1178252 1357371 1180830 1214554 997769 1044554 1220501 1131423 1015909
8160 1015909 972931 950308 914970 749792 698204 858639 860994 914709 1186072 1153211 1044030
8149 1044030 953754 830239 687395 591605 499124 477238 656106 568057 583986 574978 683398
8138 683398 677666 675700 513882 562686 818374 609339 626393 611209 705601 612949 661222
8127 661222 783658 801075 838637 478170 563171 582381 577401 707214 495638 334158 505488
8116 505488 533310 424560 654837 577569 444602 498066 381447 547022 569824 659797 723540
8105 723540 813983 635609 570863 487032 520033 690194 730169 615621 548441 457709 309065
8094 309065 520111 427595 539937 501067 466036 830167 770032 334293 102580 323722
8084 323722 450132 499127 587686 523186 339617 419313 453115 527927 456349 454751 485980
8073 485980 571453 656499 528598 354087 250960 301890 159311 76859 192047 197608 200326
8062 200326 243491 141254 35931 71049 71521 104855 303954 470574 455263 379950 494582
8051 494582 597293 669054 517980 659962 671145 484400 345767 158708 374005 518884
8041 518884 345420 239910 243248 355290 58507 53488 166370 356619 589257 249763
8031 249763 342981 369653 177441 307863 409628 382833 -42135 -284866 7057 20231
8021 20231 -5340 163819 98424 271079 392606 242809 297420 335947 169886 70919 -83628
8010 -83628 -153087 63692 186995 176647 156701 -15931 105841 213878 22004 129190
8000 129190 43263 69718 96460 94174 310001 165113 186085 273502 201652 62483 146619
7989 146619 -204635 -35059 170407 -17830 -79308 -161578 -27152 326528 296719 266250
7979 266250 194043 237638 282543 227016 158506 183917 -181584 -206794 96737 308838 262395
7968 262395 323244 538463 494762 255890 109625 196623 231959 306355 308921 407516 349959
7957 349959 244731 169913 114508 83637 18719 80808 281492 123714 197433 123070 103322
7946 103322 206975 401320 108401 -113308 -250932 -139166 -57896 -137311 -21876 -94045
7936 -94045 14591 132149 230436 253646 -56140 -24254 -88282 -77989 -173554 -60107 316938
7925 316938 231871 308830 124248 170508 166423 -105696 49224 -130796 58549 286314 262117
7914 262117 100414 6297 122520 258385 42484 163381 -165909 -205575 -75752 -5936
7904 -5936 60914 34449 -58659 90689 184567 86338 101051 2207 -74145 -98313 -310705 -186097
7892 -186097 192896 131909 -4145 202114 86481 26426 190212 186371 220719 15279 -111403
7881 -111403 3003 -7528 -85551 59487 193775 211507 188544 239145 111641 108251 198812
7870 198812 51737 101902 324723 368794 502571 181172 29143 -60550 234210 88503
7860 88503 228359 310301 167653 -28569 -216691 85525 277442 184592 241568 123135
7850 123135 270103 221604 235127 -32710 -6485 99868 -96995 -146911 144376 195076 133279
7839 133279 169440 14584 150017 91470 114608 203725 171590 -62140 -95968 113681 322986
7828 322986 552894 324796 367616 324052 54025 35624 110682 218404 207570 55562 3532
7817 3532 185046 443637 374156 50931 127481 245602 449851 468059 137922 -157333 92865
7806 92865 -5311 -12128 279358 384061 722893 513668 532288 378184 143798 408428 275181
7795 275181 133734 352223 303827 303767 575680 413497 377125 303700 411808 393171 490389
7784 490389 352562 265093 95987 141880 357582 629464 743033 520690 512799 553117 441382
7773 441382 574429 328388 501660 596363 373583 437735 441850 603935 510796 684182 610203
7762 610203 316591 724712 826048 677977 846239 829971 1009850 993643 864491 823600
7752 823600 878989 1048108 1151746 1159927 1146152 1081842 982079 1085765 1112941 1031740 953841
7741 953841 1274256 1458015 1173651 1161714 1257302 1119062 981027 984656 837733 1156783
7731 1156783 1236050 1252023 1221011 1099417 1011120 920404 929099 1035746 1049427 904084 1047244
7720 1047244 1097343 1044647 1032104 1256829 1162937 1018288 1004452 934444 1056154 1046531 823557
7709 823557 670790 754026 720665 958196 1022803 959998 965350 878822 882596 838080 914076 727372
7697 727372 800266 764366 738688 849457 825888 630323 429313 424008 361669 618485 679955
7686 679955 443990 244796 281908 472006 589750 501751 552622 501748 369998 424280 482528
7675 482528 456152 271673 278776 137588 165364 365695 452057 456822 390854 276354 172264
7664 172264 302862 439513 416520 268742 124885 161581 221265 117958 243789 375631
7654 375631 308913 346105 141269 164177 121916 174111 277015 203996 230023 135249 67819
7643 67819 -183117 114122 270825 248271 296851 267077 449854 284510 332271 305931 112304
7632 112304 259984 294561 348511 309199 230507 317142 569875 621452 550913 439461 422422
7621 422422 524185 456216 416248 333585 400989 526274 483486 473432 719030 846737 878049
7610 878049 867163 710955 1055163 1080673 1033939 1134428 1036764 816312 743401 1010147 924222
7599 924222 710031 801081 875156 782957 993115 970130 816203 659384 432503 630073
7589 630073 735365 828530 694129 951540 1325921 1250376 1514940 1222072 1163165 1431944
7579 1431944 1274410 1214589 1572574 1641841 1534797 1586951 1476182 1618665 1700847 1578977
7569 1578977 1279861 1148076 1294189 1325744 1234339 945091 1035978 1244571 1122847 1044680
7559 1044680 1143934 1160718 967961 877727 938794 858999 735711 626367 738106 939026
7549 939026 693864 515967 824881 959108 966922 1039349 1088415 1192731 967626 839374
7539 839374 764381 763106 913152 987098 977184 1035200 987328 814434 758018 594427 597970 661148
7527 661148 657425 567906 700031 827566 778082 617325 624539 444644 330462 489578 368410
7516 368410 250190 284050 364260 593609 796089 517654 249884 270270 328199 251337 286359
7505 286359 318242 288773 432251 476556 308452 216675 386946 369149 292322 216663 -124207
7494 -124207 172851 316065 153790 263852 500556 430873 262336 258505 369236 304538
7484 304538 290893 244611 84096 142736 365643 260459 235952 434447 471767 397770 485762
7473 485762 492595 540515 413134 476668 319209 93044 247501 241857 187634 265677 355732
7462 355732 472656 655067 495099 376771 138714 71419 116219 216024 449141 507535
7452 507535 427115 528866 367593 281058 124953 244940 251914 268204 10551 90558 81417
7441 81417 204983 422449 316008 325565 364594 308379 -59736 79658 365353 348121 324539
7430 324539 475163 290334 226445 341082 386484 522709 464028 241306 101898 438309
7420 438309 737937 576406 513351 507339 496221 661725 518340 357702 395063 421758 595920
7409 595920 694883 571174 475182 743158 872786 786262 985266 1276184 1405716 1396580 1527144
7398 1527144 1675250 1905751 1746567 1650349 1716787 1619819 1449506 1404683 1547374 1497119
7388 1497119 997974 798770 1044351 911008 877676 1018535 813949 755105 853907 810044
7378 810044 837539 836776 710187 439906 680878 686067 464921 545931 548171 235676 245642 382906
7366 382906 541721 416235 467965 437147 347860 353457 504776 756980 738619 689146 512304
7355 512304 378159 646245 665275 511197 317394 336133 348993 558685 653542 221353
7345 221353 230383 426809 664492 776836 633865 783506 718643 608228 713913 563206
7335 563206 606779 654770 596597 811746 760873 808089 668678 647371 668222 511478 579082
7324 579082 760873 841105 777511 791176 818121 748846 704201 815684 605947 426216 388977
7313 388977 479219 691833 654042 782022 857112 469682 295120 536923 751572 621292
7303 621292 507206 465872 725019 654099 556315 567930 726343 934561 832347 705116
7293 705116 875988 787295 883987 839807 892056 936020 912250 906660 836358 845471 1038422 1130905
7281 1130905 1198736 1109016 1187588 1096343 884135 900953 1179941 1255950 1458738 1192623 1075424
7270 1075424 1054604 936090 1329092 1510476 1705069 1593821 1427903 1259428 1293502 1430237
7260 1430237 1658973 1647475 1528444 1604945 1983478 2121174 1935211 2013407 2015184 2249266
7250 2249266 2655140 2658473 2804908 2932434 2994266 3218892 3202971 3145122 3399555 3310067 3353840
7239 3353840 3493156 3743228 3750781 3808795 3786635 4007177 4075205 4162157 4258637 4543271 4735447
7228 4735447 4803973 5060357 5287186 5412721 5826372 6020805 6125516 6586120 6862051 6923382
7218 6923382 6938442 7171127 7462825 7826601 8285913 8912641 9633798 10281770 10608442 10885174
7208 10885174 11373831 12271471 13087085 13849780 14878967 15831453 16468278 17151871 18266195
7199 18266195 19407041 20445112 21337480 22649015 23854937 24879445 25817560 26569762 27577187
7190 27577187 28710681 29506821 29842464 30397711 30543302 30537944 30557152 30323160 29968108 29502875
7180 29502875 28790097 28071701 27395137 26529098 25503628 24680604 23406223 22215836 21588376
7171 21588376 20974277 19946076 18730791 17774631 17139170 16474757 15797492 15168890 14284413
7162 14284413 13365383 12858567 12316011 12004851 11282192 10544451 10223081 10035962 9608153
7153 9608153 9361745 8739847 8164187 8082433 7703380 7445666 7113625 6924350 6604548 6414044
7143 6414044 6356760 5951701 5798970 5695736 5918989 5814155 5465041 5504193 5064931 4995445
7133 4995445 4987546 4868439 4829685 4806403 4509124 4358386 4344690 4226395 4422946 4039972
7123 4039972 3865231 3901508 3806517 4005030 3850505 3914503 3622312 3470052 3540290 3704633
7113 3704633 3603043 3632101 3683408 3896525 3853970 3888054 3880078 3843942 3914084 3764636 3715369
7102 3715369 3792818 3977467 3755995 3631552 3535145 3565588 3419888 3131941 3006719 2743135
7092 2743135 2535957 2613705 2505106 2490567 2400362 2055637 2166894 2172056 2182763 2321628 2120993
7081 2120993 1926247 1780792 1649187 1520597 1887264 1869117 1835632 1972116 1684354 1257584
7071 1257584 1180209 1325158 1659553 1732172 1488518 1726058 1845332 1877536 1788565 1808063
7061 1808063 1709450 1562955 1604712 1369128 1368927 1316883 1336426 1328638 1300891 1383385 1108308
7050 1108308 1160180 1077063 943480 1025854 1214878 1347557 1113107 1020555 985171 981827 915994
7039 915994 750331 855276 1027940 1142832 1014708 635540 938720 1034955 894611 1175212
7029 1175212 1171819 1059581 1147317 1093940 1053247 1032899 925546 885404 1092352 1073776 1008284
7018 1008284 964448 767045 620323 1007306 1009748 817772 852874 776326 804199 788506 1185966
7007 1185966 993455 731572 576229 743440 805717 753558 585948 721131 714239 518123
6997 518123 514931 467320 694886 893418 989808 820133 803496 1133432 1078846 895702 1056745
6986 1056745 1052341 803693 775517 841639 741922 651745 778240 812427 1167850 1290442 1297867
6975 1297867 1383969 1274230 1205430 785399 716547 889327 1139289 1269707 943336 925611
6965 925611 761098 642693 846603 842861 721361 533338 762825 857619 943605 877134 853342
6954 853342 733428 773823 684388 752784 613650 669191 610671 468829 582481 912789 815090
6943 815090 663033 711349 879803 1090410 991026 694340 681721 845671 599889 599234 611766
6932 611766 502858 432368 714613 890795 899221 892721 904634 739595 666074 677324 632779
6921 632779 712318 890868 819072 795151 679905 637998 854548 780114 709922 870041 741587
6910 741587 591377 591190 442423 438502 514900 802286 846798 631536 861426 761207 538580
6899 538580 669874 911076 813574 1133601 1422089 1431188 1166556 928058 883347 825473 892061
6888 892061 938063 714864 599015 495133 525031 692252 624379 642055 750931 730847 591886
6877 591886 430015 418690 664361 582837 606530 462584 481670 490520 487848 741480 700891
6866 700891 517423 719657 634419 812501 754498 545680 486882 233596 366441 652863
6856 652863 589970 562587 571464 432420 577160 552896 690510 745371 562093 687612 1004998
6845 1004998 899687 826775 842460 1046710 1030087 797154 707717 809277 1064585 1068709 952199
6834 952199 894415 871093 748768 648755 697408 786730 853177 792545 756059 664963 843874
6823 843874 819025 777047 772879 764357 621242 596012 663140 664628 588272 580076 811343 936919
6811 936919 632723 698670 444764 462950 470675 342491 388853 564506 496292 290141 221406
6800 221406 330614 505373 413251 527593 365803 449459 440321 455996 509584 517108 279794
6789 279794 260671 34295 287267 686260 783337 637515 695512 738409 611879 447266
6779 447266 631409 695256 546271 490255 569479 718819 874522 589351 417229 346300
6769 346300 344712 367390 438750 267317 375292 137376 131904 433696 299514 35543 -1661
6758 -1661 263698 116156 287820 208726 254410 452695 336108 593703 520514 487454 526686
6747 526686 528003 575568 442009 311869 373758 700827 998092 1021817 933955 1112958 1223989
6736 1223989 1102647 932170 830723 841560 1124406 1049553 788354 665525 1045183 860922
6726 860922 706562 918516 1274739 1134768 1196645 1114042 881918 804915 747760 582217
6716 582217 959864 1114276 1179120 1142982 1217523 1128542 1145758 1405277 1061757 1138487 1222542
6705 1222542 1257434 1099455 1235200 1223984 1170680 1057802 1020011 918477 907031 1142310
6695 1142310 1038938 902118 908708 918864 1055818 1065727 843773 473824 622584 891792
6685 891792 1061771 1058196 961136 740467 787312 1037720 1009835 870979 1168085 1385221 1270367
6674 1270367 1192652 1118366 856260 846017 1277302 1283591 1349174 1064644 1045765 1404917 1299636
6663 1299636 1360528 1384290 1291392 1187700 1239117 1280828 1006775 1076936 858833 915450 709885
6652 709885 850936 1083126 940623 672822 687445 858629 811117 742252 815718 806967 657061
6641 657061 836440 876731 622302 611564 739936 999392 1043318 811667 922800 1254184
6631 1254184 1203697 1083217 1116639 1033594 1079994 1046064 1256425 1427228 1440211 1111298 1153809
6620 1153809 1176738 1309575 1155050 1103445 1106098 1063723 1081702 1140550 1128253 1178548 1020750
6609 1020750 991707 822593 891045 1080938 1135879 1111114 1162407 1209073 1075039 1230628 1543365
6598 1543365 1714959 1608302 1792583 1762734 1445185 1249587 1442323 1618862 1762739 1502990
6588 1502990 1535864 1401205 1584141 1916757 2002927 1826179 2007160 2030734 1787995 1752691
6578 1752691 1771977 1862068 1685172 1901523 1857360 1720802 1847936 1926801 2164376 2664036
6568 2664036 2746353 2649094 2830218 2858716 2988319 3514947 3735765 4194704 4686244 4979880
6558 4979880 5451468 5668328 5947820 6145237 6377256 6281863 6062012 5895076 5588404 5082146
6548 5082146 4605560 4540353 4539972 4296424 4020925 3952851 3822261 3999222 4007597 3972923 3991912
6537 3991912 4249498 4020370 3738544 3723132 3467805 3256829 3170582 3026234 2860277 2810181
6527 2810181 2833658 2827259 2636313 2544420 2538045 2309214 2331513 2427151 2236451 2305177 2199588
6516 2199588 2241459 2204813 2019770 2097913 2089889 2155584 2307913 2030303 1819347 1871912 1574182
6505 1574182 1740171 1884704 1552951 1468189 1585188 1926521 2065890 1834334 1590170 1671719
6495 1671719 1732415 1911399 1772318 1799950 1956514 2002023 2027886 1832260 1592925 1591213 1626204
6484 1626204 1753545 1898871 1846329 1964281 2073413 1961985 1881062 1885059 1922110 1816775
6474 1816775 1856734 1930067 2074763 2206930 2304031 2057267 2030688 2046571 2116567 2414103 2491069
6463 2491069 2570583 2424221 2521974 2459044 2819063 2802284 2866394 2919531 3053452 3036753 2752145
6452 2752145 2885315 3031969 3149283 3358850 3395099 3012883 2979909 3160695 3013587 3072888
6442 3072888 3218790 3253407 3226920 3117112 3129856 3336180 3458479 3584738 3487596 3280700
6432 3280700 3382954 3498061 3742570 3862284 3889948 3784271 3734040 3775763 4026105 4266052
6422 4266052 4190485 4488894 4618229 4841368 4846006 4841256 4729283 4631910 5048245 5058205 5162238
6411 5162238 5372228 5616682 5438840 5245469 5299530 5714772 6009344 6320893 6556371 6837201
6401 6837201 7248198 7721697 8086874 8336286 8528934 9281806 10346020 10909537 11561310
6392 11561310 12616407 13661781 15260637 17480334 19664920 22640215 25886255 28394739
6384 28394739 30435803 31824020 32541887 31175490 27752583 25228539 23727588 22538154
6376 22538154 21775334 21362418 21302511 21809623 22440981 22713081 22933985 23057730 23211681 23282229
6366 23282229 23065701 23579570 23929791 24278659 25107085 26331062 27171536 27740805 28663803
6357 28663803 29180147 29583821 30004844 30904588 31432605 32064345 32914528 33690419 34605577
6348 34605577 35079760 35706806 36696498 38030829 39540418 41821117 44681188 48430037 52472063
6339 52472063 56926078 61085245 64429129 66838723 67337132 65963072 63600568 60427242
6331 60427242 57091505 54817992 53056717 52258308 52321470 53050396 54515421 56703002 59204035
6322 59204035 62508441 66213284 70068485 73785040 76816223 79264915 80000478 79042473
6314 79042473 77150018 74558344 70801212 66405525 62474396 59012486 56055879 53941857
6306 53941857 51905385 50546615 49488248 48955698 48889580 49457524 50695555 51848544 54265157
6297 54265157 57011686 59900108 63697338 67749457 71538415 74735265 76892057 77908850
6289 77908850 77139106 75445174 72802195 69928556 66582396 62914490 59644800 57361739
6281 57361739 55555550 54263753 53870171 54109594 55195247 56722089 58969993 61366706
6273 61366706 63922004 66134113 67681282 67547294 66025002 63263379 59424709 55306441
6265 55306441 51459809 48065520 45449813 43540969 41895781 40585479 39468433 38608117
6257 38608117 37784968 37067367 36404186 35515389 34391850 33591816 32806615 32225313 31449123
6248 31449123 30805082 30034973 29169685 27906714 26807972 25957478 25035407 24567735 23880782
6239 23880782 23140554 22615338 22020344 21182313 20386097 19548328 18261535 17007890 16322189
6230 16322189 15489838 14430757 13729940 13456966 12939698 12682486 11926336 11422142 10910302
6221 10910302 10609191 10523965 10320809 10031912 9539255 9254024 9280294 9109355 8987912 8898813
6211 8898813 8566916 8273112 8028969 8064129 7802914 7880248 8098816 7846777 7615113 7856178
6201 7856178 7646341 7400181 7386310 7543742 7586098 7497670 7490076 7291142 7193653 7244433 7005172
6190 7005172 6960692 7124160 7132249 7148653 6812003 6919515 6999679 6771469 6542152 6712631
6180 6712631 6515533 6340186 6387997 6282964 6248616 6352001 6326988 6230468 6265342 6329169 6365798
6169 6365798 6256911 6071894 5998690 5988999 6014482 5926013 5973298 5776685 5704213 5799297 5690166
6158 5690166 5902631 5731113 5665657 5462092 5620722 5699838 5528306 5183466 5300442 5103751
6148 5103751 5197640 5022513 5028212 5017522 4734458 4603709 4722481 4781629 4516100 4356751
6138 4356751 4257421 4207213 4158280 4144369 3700187 3664278 3605521 3581223 3419989 3375263 3487191
6127 3487191 3309071 3294522 3132285 3226999 3263890 2960139 2925788 2814411 3092273 3298640
6117 3298640 2997874 2905384 2782888 2639818 2669888 2675866 2768900 2709090 2714200 2694715 2550417
6106 2550417 2622734 2589482 2657104 2602409 2828619 3078925 2766534 2681055 2737816 2819326 2765080
6095 2765080 2814302 2822016 2557107 2602348 2626296 2519150 2714979 2671387 2662566 2722752 3156091
6084 3156091 3001374 3152955 2925933 2529673 2436991 2639447 2510519 2533082 2291372 2279339
6074 2279339 2678317 2809433 2903607 3040781 2984258 2869964 2939511 2971738 3037196 3096958 3122157
6063 3122157 3051321 3260970 3296452 3465873 3286312 3263972 3125285 3130542 3041722 3013222 3132624
6052 3132624 3303814 3335372 3148011 3071352 3369035 3322639 3032436 2910748 2843287 2849871 3041963
6041 3041963 3169013 3183136 3122686 3199215 3174541 3208967 3344203 3475373 3401416 3593090 3624185
6030 3624185 3511134 3463196 3353479 3377392 3198651 3291996 3282253 3217938 3715912 3427352 3578865
6019 3578865 3749409 3597576 3484118 3233109 3449293 3624251 3672137 3635199 3598772 3579079
6009 3579079 3696685 3519579 3617978 3748060 3884864 3719028 3741057 3687098 3630768 3658928
5999 3658928 3716354 3698385 3756500 3755764 3763287 3812392 3814967 3678385 3732131 4188748 4320879 4252588
5987 4252588 4370671 4491895 4312721 4527445 4662156 4672266 4758801 4603599 5117859 5215061
5977 5215061 5199667 5629570 5743320 5739101 6271335 6548106 6802452 7021616 7257745 7423264
5967 7423264 7331591 7426024 7330991 7280759 6965153 6686748 6413405 5823884 5600116 5508635
5957 5508635 5384967 5433723 5248442 4861000 4775930 4993502 4738899 4821490 5000352 4830800
5947 4830800 4656130 4556652 4509447 4475942 4489101 4428956 4529342 4594991 4302894 4147748 4146089
5936 4146089 4172159 4117363 4439160 4518041 4483861 4720344 4659716 4656312 4661011 4818460 4960990
5925 4960990 4911443 4928927 4717539 4476846 4737425 4844325 4850740 5166709 5027586 5071983
5915 5071983 5065285 5136671 5161600 5239675 5387593 5388628 5592906 5705427 5558974 5793111 5763891
5904 5763891 6001615 5959960 6146188 6141547 6280229 6499048 6589224 6561164 6560251 6700755 6768915
5893 6768915 6631363 6325028 6312530 5974745 6049461 5913420 5794901 5700622 5519323 5642508
5883 5642508 5941185 6248522 6059423 5786318 5611889 5479390 5610724 5423903 5321039 5183697
5873 5183697 5475376 5371283 5152645 5393274 5370961 5214727 5384884 5310395 5205883 4992011
5863 4992011 4856014 4916136 5163235 4954893 5076046 5194270 5305013 5413442 5265423 5137679
5853 5137679 4930658 4815852 4843725 4953162 5132896 5032546 4916987 4863601 4795367 4905700
5843 4905700 5172601 5176827 5000248 5116164 5310044 5437934 5631066 5667900 6018978 6264744
5833 6264744 6511604 6701508 6652861 6854544 7186025 7121149 7350292 7582434 7523263 7811500
5823 7811500 7794715 7763147 7875924 7726485 7341881 7283608 7454236 7138399 6754835 6770326
5813 6770326 6839193 6538890 6319135 6016771 5878227 5820775 5746771 5958094 5742823 5242213
5803 5242213 5039029 5334478 5113506 5087511 5094653 4911541 4967681 5098237 5054039 5218623
5793 5218623 5141365 5171054 5166295 4981078 5129080 5228463 5013169 5314203 5254419 5136733 5025683
5782 5025683 5089754 5142534 5061313 5012799 5109469 4731762 4719822 4460168 4516892 4779554 4885783
5771 4885783 4808531 4816716 5165081 5248840 5502454 5351045 5257049 5437349 5125246 4885227
5761 4885227 4907863 4456829 4514377 4375409 4229349 4078860 3949265 3801923 4172428 4155573
5751 4155573 3750720 3664017 3679438 3756692 3806902 3885847 3859708 3690288 3719429 3704341 3839393
5740 3839393 3898756 3822214 3893726 4036641 4493971 4397486 4312895 4439305 4400491 4495493 4249412
5729 4249412 4437636 4876419 4932420 5050776 4970848 4891049 4879669 4906514 4978629 5302846 5274975
5718 5274975 4958817 5191022 5228764 5355962 5484589 5492644 5590083 5802263 6041627 5921211
5708 5921211 6214951 6492564 6610045 6616550 6829328 7042515 7112015 7208289 7614678 8063425
5698 8063425 7935946 8295870 8750708 9155621 9186834 9292448 9154649 9066434 9190062 8924837
5688 8924837 9035063 8903846 9104268 9279784 9097861 9058938 9188093 9013683 9205064 9495667
5678 9495667 9332956 9452105 9513504 9580193 9825104 9598615 9728998 9833375 10023991 10215052
5668 10215052 10387064 10753857 10749599 11027917 11203264 11694678 11966506 12066860 11875697 11858022
5658 11858022 11858820 11974565 11780895 11700509 11754678 11814823 11868968 11912088 12094827 12243029 12305467
5647 12305467 12240747 12459891 12876605 13219282 13481270 13684483 14018045 14248739 14764119 14930540
5637 14930540 15111635 15415964 15979929 16514027 16741529 17331232 17989518 18519555 18798430
5628 18798430 19367249 19625967 20249138 21187377 21952011 22788975 23700596 25052332 26413401
5619 26413401 27608233 29081014 30761592 32250964 33581448 35457661 37821431 40180163
5611 40180163 42656399 45402027 48767920 52070197 56012663 60633903 65185252 70735059
5603 70735059 76847552 83466752 90254108 97573249 104973913 112341205 118868613 124534299
5595 124534299 129047920 131571993 132025272 130848897 128153046 123956738 118886926 113377248
5587 113377248 107495695 101609790 95525079 89373597 83164698 77032284 71126686 65841665
5579 65841665 61204540 56707685 52829777 49513418 46316397 43552329 40857656 38332008
5571 38332008 36515159 34738793 33030588 31435930 30029158 28874967 27780446 26571715
5563 26571715 25781509 25334492 24440109 23477022 22828926 21993937 21110360 20387685 19869982
5554 19869982 19169798 18626745 18258626 17698354 17037080 16346568 15931632 15606922 15419433
5545 15419433 14793117 14182679 13820876 13454495 13284513 12924248 12490302 12232811 11879627
5536 11879627 11671804 11689082 11394550 11062482 10733675 10574009 10449106 10447354 10034162 9596469
5526 9596469 9584154 9278732 8974689 8836556 8668708 8513722 8193270 8415812 8441342 8247748
5516 8247748 8115081 7936263 7788089 7859673 8022988 8008612 7779305 7707001 7737500 8058948
5506 8058948 8077560 7778230 7853499 7970877 8034360 8067975 8012271 7854424 7891058 7895311 8005093
5495 8005093 8069624 8219059 7842204 7650158 7506687 7421594 7286944 7233024 6858872 6624375
5485 6624375 6739462 6505594 6413729 6312656 6074561 6078978 5997647 6019586 6121717 6149424 6233033
5474 6233033 5876076 5750043 5662258 5586529 5656073 5667931 5915285 5818985 5937085 5929632 5820569
5463 5820569 5898852 5963728 6147899 6329006 6581663 7108868 7622772 7705417 7935293 8037239
5453 8037239 7939904 7728211 7655046 7330739 6761333 6485084 6492799 6098058 6094845 6265538 6229015
5442 6229015 5844278 5942947 6027291 5720397 5617221 5278231 5153148 5209806 5374826 5427551
5432 5427551 5488672 5390482 5208379 5206780 5352557 5420721 5305823 5077171 5065254 5260575 5313615
5421 5313615 5197208 5207531 5199996 4940562 5111822 5197953 5169559 5227759 5181357 5188816 5216420
5410 5216420 5023531 4901388 4708503 4862973 4860050 4675508 4639434 4521207 4442219 4502699
5400 4502699 4303836 4140180 4356941 4140979 3974628 4024655 3862905 3647252 3705695 3849769
5390 3849769 4001977 3774304 3441076 3419968 3875663 3840870 3553954 3509387 3861944 3924729
5380 3924729 3679661 3839238 3604292 3540121 3630503 3666654 3443636 3378650 3088199 3091222 3215485
5369 3215485 3110329 3117293 2905367 3095009 3251514 3278406 2972072 2847037 3009068 3095886
5359 3095886 2918928 2754650 2838874 2973188 2835842 2918624 2996332 2920285 2813168 2612551
5349 2612551 2773921 2824589 2674934 2789836 2851150 2721449 2811626 2840481 2694639 2642478
5339 2642478 2467113 2489407 2457099 2368385 2602376 2652844 2702561 2560683 2615129 2687961 2354018
5328 2354018 2439773 2442361 2594176 2547703 2683789 2851155 2680717 2810007 2924382 2811595
5318 2811595 2895851 2782199 2849108 2876111 2756838 2769544 2636247 2580709 2583427 2886100 2789418
5307 2789418 2628488 2693103 2674067 2967777 3157968 3006037 3146337 3085313 2803380 2922251
5297 2922251 3067265 2965062 2984476 2968968 3105561 3362908 3736205 3602354 3491987 3509351
5287 3509351 3562348 3326336 3479883 3717498 3733611 3852200 3772791 4049962 3995050 3726540
5277 3726540 3650224 3923064 4235475 4342770 4208549 4197354 4315192 4696580 5069148 5543288
5267 5543288 5687470 6030512 6237490 6603578 7141030 7581556 7730514 7707168 7675665 7274166
5257 7274166 7089450 6670560 6264884 5915268 5781120 5812472 5746348 5483997 5510807 5529933
5247 5529933 5481830 5180128 5176170 5380246 5397811 5413353 5679601 5816170 5977650 6090085
5237 6090085 6068020 6233851 6162116 6247297 6488398 6557070 6733870 7169464 7740356 8213296
5227 8213296 8699138 9081437 9687706 10297697 11069739 11807810 12325501 13125135 14136343
5218 14136343 14815409 15576595 15764787 15787217 15920376 15943157 16055920 16123090 16524565 16587015
5208 16587015 17190773 17797537 18425727 18786386 19309587 19586522 19467159 19219576 18704594
5199 18704594 18200506 17540667 16774863 15909848 15587100 15382375 15292763 14974688 14888292 15169950
5189 15169950 15731886 16183055 16292372 16963576 17700667 18263733 19031123 19953901 20906377
5180 20906377 22043242 22773947 23629884 24282373 24929217 25596905 26134688 26903518 27973167
5171 27973167 28886088 30025325 31388810 32598638 34020832 34896472 35175258 35334482 35038226
5162 35038226 34001488 32981167 31828307 30738968 29368727 28090152 27091059 26354477
5154 26354477 26210016 25736508 25422171 25439174 25857345 26477193 27244103 28245771 29281665
5145 29281665 30750899 32442694 34337839 36294409 38464812 40326888 42161618 44203674
5137 44203674 46279792 48700317 51202514 54285569 57259414 59311851 60415134 60216655
5129 60216655 58445566 53320845 47009042 42366257 38872478 36037697 33515296 31554461
5121 31554461 30023988 28798729 27530607 26278865 24919362 23488358 22663959 21725820
5113 21725820 20706433 19991960 19453325 19038933 18147863 17939251 17598988 17125250 16910525
5104 16910525 16751978 16644530 16464298 16446324 16087339 15732021 15213728 14985221 14839440 14410932
5094 14410932 13959626 13746536 13248355 12655164 12441258 12318462 12259255 12237396 12047520 11924794
5084 11924794 11715114 11638855 11712849 11509799 11094973 10917463 11039766 10847300 10850522 10948971
5074 10948971 10864624 11109830 11116478 11055375 11052942 10840487 10900537 10807286 10908928 10876553 10514826
5063 10514826 10416068 10550082 10717644 10485056 10682084 10944549 10887153 10756679 10692130 10682808
5053 10682808 10617112 10587564 10495241 10297440 10304516 10213109 10057386 10270009 10180029 10442101 10456959
5042 10456959 10255639 10702073 10957745 10934264 11024570 11176980 11236793 11413328 11941901 12024121
5032 12024121 12015549 12260240 12300647 12005659 11966996 12102475 12246574 12101582 12038971 11544258
5022 11544258 11552038 11915115 11868875 11958229 12113006 12260370 12542051 12642365 12678748 12859791
5012 12859791 13330172 13700115 14258692 14543548 14646678 15130975 15516486 15766397 15991110
5003 15991110 16198539 16337046 16705070 16672071 16780870 16983201 17016883 17304744 17635078 17659094
4993 17659094 17826531 17930975 17912012 18176798 18701253 18979330 19375864 19748560 20115989 20497519
4983 20497519 21084116 21265075 21393872 21680951 22075473 22417364 22755919 23283636 23821029
4974 23821029 24450402 25148169 25591312 26169061 26623243 27256412 27681161 28196612 28548925
4965 28548925 28791704 29157261 29810085 30432436 30987899 31528573 32066442 32784926 33691146
4956 33691146 34356500 35051009 36291875 37362124 38370699 39784665 41421576 43208043
4948 43208043 45099673 47068612 49148357 51585155 54455418 57104696 60129853 63344800
4940 63344800 66758738 70595947 74972985 79328575 83952057 88919529 94871166 101241946
4932 101241946 107713177 114642311 122540398 130856462 139298561 148359229 157491844 166795277
4924 166795277 176342451 185236756 193183943 199591023 203912362 205512505 204919823 202522489
4916 202522489 198642718 193389736 187628280 181975942 176766660 171936610 166852698 161158593
4908 161158593 155404762 149372850 142980808 136953070 131333780 126151917 120830576 115858656
4900 115858656 110821430 106204524 101714706 97450221 93319623 89455243 85990092 82843822
4892 82843822 80120038 77872226 75962360 74196205 72677283 71098840 69335531 67673868
4884 67673868 65966419 64067135 62080347 60520290 58838666 57207006 55822198 54513711
4876 54513711 53569590 52807257 52259293 52489161 52776589 53084912 53811320 54763413 55924965
4867 55924965 57111263 58482638 59881935 61312856 62593114 64120299 65168611 65709830
4859 65709830 65442457 64768469 63603024 61382742 59179014 56683115 53835043 51217222
4851 51217222 48443325 46005480 43677276 41696156 39888147 38482945 37107570 35822590
4843 35822590 34627885 33542439 32457843 31739937 30625425 29741688 29240174 28310540 27976823
4834 27976823 27352884 26735324 26129758 25824034 25297193 24765861 24292097 23956221 23554947
4825 23554947 22973257 22731295 22369374 21995086 21599134 21606255 21657446 21228450 20995491 20772157
4815 20772157 20588681 20589043 20449808 20414108 20308299 20079580 19898581 19994372 20233740 20257243
4805 20257243 20137360 20194097 19905194 19559161 19531728 19586237 19772748 19927557 19775248 19652854
4795 19652854 19517708 19593641 19931790 20183560 20485206 20674889 20978421 21079789 21309649 21402531
4785 21402531 21538828 21968155 21664247 21356613 21236764 20871867 20514344 20282077 19966167
4776 19966167 20082006 19792973 19430906 19558152 19369039 19678496 19936968 20236119 20373713
4767 20373713 20667307 20761322 20905269 21408564 21680339 22083331 22484748 22686971 22788597 23217704
4757 23217704 23403040 23291857 23607467 24053029 24085024 23866049 23680844 23993405 24436592 24829360
4747 24829360 25579421 26073242 26738246 27243358 27905613 28576557 29436908 30204095 31195935
4738 31195935 32194724 33350746 34799468 36528615 38484174 40638377 43172605 45945334
4730 45945334 49130473 52996865 57352141 62465357 67983685 74242691 80896895 89244299
4722 89244299 99511882 112155362 128678322 148266908 171703056 197812366 221605077
4715 221605077 240069524 250272457 252838387 237712850 207329196 180401530 159321126
4708 159321126 142956478 129299952 118770680 110232783 102856295 96782514 91284753 85457884
4700 85457884 80557562 76546816 72942614 69762924 67054799 64655856 62844942 61652098
4692 61652098 60793932 60096137 59696874 59544017 59805522 60311189 61330662 62687033 64437888
4683 64437888 66716047 69143178 71266988 73316632 74989097 76278974 76764769 76762334 77003312
4674 77003312 77745844 78836535 80784466 83616166 87202439 91370195 96006508 100374446
4666 100374446 104120579 106981112 108496804 109302761 109424621 108946190 108938768 110158320 112301559
4657 112301559 115255817 119316788 124497060 130896342 138929410 148616037 160303355 174472032
4649 174472032 191260435 210029518 229722060 248626883 263996297 273433378 275795691
4642 275795691 268732298 253284205 235327693 218599515 203512127 189983632 177359141
4635 177359141 166286886 157277316 149907220 143350857 137656461 132826104 128937860 125537896
4627 125537896 123092754 121160109 119557485 118134169 116768798 114949393 112401034 109378641
4619 109378641 105629838 101563605 98144900 95191163 92675624 90555474 88829944 87392648
4611 87392648 85745947 84092362 82324739 80078666 77541754 75304284 72865434 70495429
4603 70495429 67985135 65888749 64180769 62715527 61328102 60181972 59025610 58025571
4595 58025571 57077616 56396891 56011018 55438166 54941645 54891435 55014456 55376582 55735474 56267522
4585 56267522 56939647 57279977 57444453 57608516 57810252 57869442 57778739 57696359 58224664 58403650
4575 58403650 58874138 59266920 59924618 60849095 61581751 62518821 63837698 65125338 65854037
4566 65854037 66232085 66225721 65626642 64358094 62485758 59961346 56846707 54317051 52377604
4557 52377604 50803045 49686412 49011149 48058824 47633524 47241318 46993162 46688648 46627110
4548 46627110 47037385 47369727 47942987 48700479 49797006 50972002 52239792 53876077 55757444
4539 55757444 57648270 59993145 62168692 64346990 66942340 69283323 71106053 72969916
4531 72969916 74504458 75912907 77481754 79427161 81457141 83837818 86364403 88873072
4523 88873072 91517921 94367526 98208591 102184375 106390337 111435391 117476618 124844855
4515 124844855 133667099 144664743 157801413 173213662 191818007 212581475 234195446
4508 234195446 255407609 273079903 284626325 288152504 282244075 264711116 238802610
4501 238802610 212760494 190153269 170877196 154772021 141591281 130728151 121340983
4494 121340983 112711214 104554247 96964748 90079317 83960711 78591902 73748558 69066092
4486 69066092 65147433 61936066 58949986 56184109 54291266 52379610 50479383 48876748
4478 48876748 47537537 46552363 45863276 45363814 44999955 45032005 45405586 45973482 46724813
4469 46724813 47696488 48757618 49313718 49117864 48581558 47637222 46380987 44578623 42745589
4460 42745589 41523404 40317176 39589169 39107823 38704728 38744640 39088727 39359824 39137854
4451 39137854 38566940 37862598 36675436 34893057 33270396 31827323 30407204 28868908
4443 28868908 27832013 27086515 26063588 25214516 24599134 24222152 23844551 23423696 22905925
4434 22905925 22519211 22459439 22690781 22725885 23078963 23617684 24186958 24688808 24910809 25210751
4424 25210751 24964366 24763809 23926144 23269491 22820391 22459874 22307294 22241698 22018930 21924755
4414 21924755 22044012 22218648 22662842 22643213 22472337 21914004 21299968 20565478 19650559 19001481
4404 19001481 18248193 17616709 16957616 16503045 16270935 15967655 15801603 15317381 14929727
4395 14929727 14440345 14093875 13694483 13367232 13328548 13009111 12969947 12689034 12266974 12084308
4385 12084308 12185973 12242812 12207004 12116402 12092219 12059406 11939796 11795482 11735478 11635855 11673087
4374 11673087 11719390 11542193 11648890 11450146 11342504 11251955 11267872 11342442 11023676 10732585
4364 10732585 10532426 10090731 9908375 9621834 9228605 8869832 8968528 9147756 8893442 8640707
4354 8640707 8201079 8164775 8199211 8215099 7874281 7769962 7916188 7718043 7777036 7823867
4344 7823867 7878860 8010661 8120258 8139404 7984148 7821623 7671451 7715569 7643521 7663472
4334 7663472 7279284 6929653 6734426 6562752 6526816 6313110 6167988 6116001 6229171 5893125
4324 5893125 5760123 5690387 5497436 5550002 5428684 5475536 5478812 5426328 5574222 5740767 5396759
4313 5396759 5098183 5151367 5266283 5109309 4722778 4843053 5026270 5088508 5209881 5050452
4303 5050452 4914134 5022042 5204455 5087479 5110053 5216678 5189146 5047374 4853130 4726834
4293 4726834 4667561 4604617 4617280 4568913 4599501 4640684 4488795 4741927 4752820 4461194 4626756
4282 4626756 4663335 4507203 4450240 4384732 4451983 4500020 4282045 4141424 4091260 3933302 4263499
4271 4263499 4345280 4460470 4373583 4371967 4528668 4527622 4641137 4378843 4303744 4334980 4603198
4260 4603198 4679253 4579925 4629587 4636468 4469429 4425669 4433075 4371633 4314229 4191421 4342596
4249 4342596 4300500 4145147 4132423 4373820 4446623 4383880 4515037 4737970 4909346 5039336
4239 5039336 5213696 5438739 5531915 5810131 6185655 6522619 6793933 7075114 7578356 8018577
4229 8018577 8343266 8651804 8607518 8662489 8749186 8882022 8598249 8284905 7737295 7362727
4219 7362727 7222043 7068136 7008192 6893374 6831846 6696911 6682743 6511367 6573409 6627444
4209 6627444 6461384 6724657 6889036 7136778 7282053 7429746 7481084 7753143 8401545 8717610
4199 8717610 8906928 9193554 9292219 9730753 10253126 10777328 11272163 11934147 12770825 12880887
4189 12880887 13086045 13194580 13117273 13187194 13338645 13028266 13121926 12814524 12715538 12964605
4179 12964605 12980943 13338549 13903050 14362079 15232103 16239393 17158629 18494405 19907642
4170 19907642 21017412 22080271 23120054 23813794 24196756 24104367 23753543 23127195 22004671
4161 22004671 20859876 19779441 18799805 17601099 16674536 16076785 15515885 15221861 15112565
4152 15112565 14974861 15249086 15321901 15387305 15685778 16120058 16622111 17006426 17140894 17166499
4142 17166499 17269219 16942801 16950131 16912183 17015540 17346006 17570094 17838817 18069023 18494434
4132 18494434 18939437 19111303 18971361 18653654 18537995 18311926 17626829 17251841 16729991
4123 16729991 16044728 15349959 14606487 14317087 13857015 13356480 13118269 13199341 13155690 13093587
4113 13093587 13233047 13301550 13584831 13665856 14159664 14468998 14426313 14006169 13604706 13502676
4103 13502676 13079818 12258792 11683891 11206021 10504660 10235222 9932777 9752290 9496592
4094 9496592 9228890 8921158 8731929 8699373 8662903 8934621 9260281 8917771 8688763 8729073
4084 8729073 8928928 8853004 8928152 9186315 9526113 9702274 9741782 9738467 10242508 10148830 10110645
4073 10110645 10336033 10047562 9766157 9311912 9111671 8781016 8148282 7395084 7195539
4064 7195539 6679415 6205499 5773774 5576950 5662196 5229842 4913223 4840726 4710114 4484703
4054 4484703 4296420 4083118 4059300 4285569 4114399 3851657 4005716 3690684 3697861 3804249
4044 3804249 3694421 3620261 3458926 3302861 3218535 3732257 3465625 3534722 3489185 3184325
4034 3184325 3198484 3088104 2955684 3060156 3079033 3120151 3227900 3064996 2880224 2996543
4024 2996543 3093367 2862220 2858956 2652511 2420105 2519058 2641194 2472697 2540968 2729977
4014 2729977 2556633 2423822 2546578 2702571 2773977 2655829 2828399 2634270 2498417 2396034
4004 2396034 2311271 2390916 2522000 2690285 2704239 2520780 2283412 2190559 2163748 2206783 2307297
3993 2307297 2272036 2252717 2203788 2047815 2143450 1981629 2048893 1979551 1813454 1893214 2255755
3982 2255755 2163834 2180635 2385886 2090596 1904336 2048462 2108801 2083779 2178716 2070849
3972 2070849 2187308 2196797 2027555 1983251 2179662 1999225 2046554 1994346 1861376 2048048
3962 2048048 2132168 1852033 2024019 2159673 2116063 2001222 1929910 2014172 2117350 2039938
3952 2039938 1948979 2104590 1814632 1840954 1772927 2066126 2023559 1878385 2034520 2036161 2235718
3941 2235718 2387738 2300107 1944047 2013014 2196861 2110998 2221401 2330946 2272531 2246844
3931 2246844 2118427 1941041 1998306 2055222 2180412 2386593 2532911 2554757 2695020 2679604
3921 2679604 2654647 2643467 2509939 2425335 2415162 2523365 2478249 2681978 2636833 2327467 2209130
3910 2209130 2184700 2445164 2486644 2646003 2604214 2769120 2892613 2891044 2759309 2492425
3900 2492425 2558142 2704516 2692079 2914076 2824789 2796100 2785013 2812997 3114977 2878568 2602840
3889 2602840 2750945 3132780 3076622 3183826 3065069 2982747 3154534 3139139 2866580 2724838
3879 2724838 2959144 3019323 3040133 3258899 3401282 3221940 3123730 3166071 3044785 2954922
3869 2954922 2858083 2989847 3103550 3016887 3012606 2835043 3116857 3294483 3215783 3242681 3063318
3858 3063318 3097818 2820752 2996067 3169635 3265174 3233723 3084213 2934024 2836507 2953930
3848 2953930 2880505 3020300 3314005 3175053 3165601 3272948 3098897 3032456 2876761 3005476
3838 3005476 3173654 3037074 2917551 2850010 3144109 3103464 2913394 2813932 2726292 2712320
3828 2712320 2805925 2747032 2698731 2904572 2858181 2750570 2739729 2903584 3023028 3145300
3818 3145300 2811040 2931210 2851991 2770671 2666672 2515756 2605816 2733994 2510105 2566770
3808 2566770 2729083 2682696 2721626 2480930 2657795 2915039 2837388 2683403 2680429 2696339 2698749
3797 2698749 2649169 2580978 2509032 2565199 2730645 2758905 2632747 2834862 2784928 2394061 2452149
3786 2452149 2525170 2711869 2609290 2700116 2916618 2732983 2592632 2536041 2524514 2425156
3776 2425156 2429161 2649316 2860266 2796285 2796944 2962468 3188579 3199435 3039439 3043127 3292292
3765 3292292 3091434 3283832 2930690 3067867 3227726 3241634 3238997 3105291 3244960 3236599
3755 3236599 3229728 3169691 3132034 3057250 2777689 2907739 3238254 3117812 2968280 3163685
3745 3163685 3319486 3112350 2909838 2971828 3054536 2932663 3101763 3209989 3234727 2734926
3735 2734926 2706086 2943981 3197525 3006169 2783325 2841440 2887247 2942422 2924543 2721349
3725 2721349 2819296 3042740 2924425 2834479 2762188 2929202 3059349 2981843 2938191 2991276 3056596
3714 3056596 3112726 3069601 3179479 3043922 3006217 2868939 2866427 3056562 3068010 2803603 2732063
3703 2732063 2672057 2770887 2838969 2703324 2810157 2764408 2544419 2418761 2325788 2394230 2754841
3692 2754841 2549482 2568543 2586537 2651405 2381760 2244347 2440594 2557065 2647348 2552762
3682 2552762 2615393 2747496 2811852 2856755 2676178 2772502 2743032 2562712 2660817 2756875 2591823
3671 2591823 2338038 2329216 2268924 2410524 2476918 2584541 2410673 2366085 2600914 2658120 2726368
3660 2726368 2715523 2501663 2559093 2715537 2643817 2372511 1810525 2224442 2633302 2651535
3650 2651535 2330759 2189736 2295757 2232114 2380450 2427820 2274046 2295416 2208657 2519143
3640 2519143 2591504 2534328 2489675 2210977 2245013 2377380 2534424 2744624 2778787 2862498 2787363
3629 2787363 2481979 2570552 2665350 3027528 2754762 2745066 2983310 3146875 3147430 2965847 3016154
3618 3016154 2984355 2839286 2756097 2690461 2664733 2726125 2778465 2628627 2587226 2818287 3164033
3607 3164033 3037645 2943978 3029925 2994347 3210381 3178570 3089165 3340652 3298306 3472260 3497805
3596 3497805 3558508 3420267 3584191 3771506 3344558 3466370 3447984 3549205 3508732 3556548
3586 3556548 3688873 3639384 3608376 3473822 3404822 3549605 3440831 3479429 3741329 3962297
3576 3962297 4093859 4177586 4066387 3837567 3821715 4086142 4316057 4222305 4286400 4357161
3566 4357161 4274048 4319050 4146886 4175200 4420030 4233513 4286024 4232264 4354026 4527404
3556 4527404 4426539 4420640 4407135 4566450 4612182 4603247 4796334 5027520 5459715 5378783 5223169
3545 5223169 5353312 5211778 5348884 5673736 5698059 5823166 5880269 5947992 5981781 6452977
3535 6452977 6403555 6298416 6487388 6552406 6576902 6583959 6887507 7083036 6998878 7341928 7637863
3524 7637863 7588395 7835217 7736417 7922231 8167168 8436748 8606731 8933214 9140010 9042782
3514 9042782 9088195 9312944 9360915 9652860 10057226 10098889 10225158 10530824 10803433 10715875
3504 10715875 11057647 11445332 11576661 11972195 12351945 12702070 12706240 13028466 13771694 14027840
3494 14027840 14367373 14866557 15040669 15426806 15851144 16500688 17105640 17795724 18457712
3485 18457712 18995300 19768159 20730047 21743178 22567110 23636614 25081458 26501929 27977000
3476 27977000 29410013 30869870 32931530 34917227 36805507 38644345 40044453 41495786
3468 41495786 42546559 43266589 43726927 43609656 42904193 42020135 41014898 39800732 38711454
3459 38711454 37260722 36076006 34741840 33553170 32208774 31197916 30707292 29875450
3451 29875450 29103987 28264407 27591467 27004023 26526610 26070652 25774067 25869253 25759130 25693692
3441 25693692 25763030 25962323 26002422 26069316 25902803 24983134 24028311 22958181 22363223 21656973
3431 21656973 20945812 20412292 19759211 19287233 18988439 18386331 17760271 17195160 17110529 16893586
3421 16893586 16504094 16128365 15986083 15553258 15313959 14894323 14797782 14734995 14357239 14370639
3411 14370639 14501254 14414490 14480048 14575779 14649327 14440442 13975538 13643288 13184081 12747378
3401 12747378 12222569 11922399 11785989 11736496 11319050 11002287 10709342 10569688 10496279 10387807
3391 10387807 10148079 9990091 9609468 9588405 9434641 9130964 9091448 9044206 8852330 8764109
3381 8764109 8812058 8718554 8556288 8233917 8221805 8346019 8238197 8320515 8048413 7647326
3371 7647326 7616066 7812467 7649935 7592937 7637729 7629829 7520777 7674350 7443256 7412509 7360292
3360 7360292 7321442 7135274 6966901 6591283 6555181 6383172 6426164 6605176 6546631 6450086
3350 6450086 6383101 6567813 6292169 6237284 6275112 6161434 5868027 5824767 5968707 5964496 5961234
3339 5961234 5846996 5801569 5638063 5561990 5803613 5761454 5666852 5603390 5396442 5189372
3329 5189372 5387234 5405266 5312504 5341065 5465945 5292188 5109583 5074678 5206144 5320865
3319 5320865 5189517 5220695 5447696 4939027 5031617 5201215 5301390 5149930 5005435 5083254
3309 5083254 4739852 4766495 4919208 4905542 4964625 4760644 4998648 5055929 4727836 4705791
3299 4705791 4715175 4616693 4615826 4525375 4542947 4507407 4572522 4549775 4594979 4702196 4483257 4517202
3287 4517202 4392076 4085626 4068814 3927485 3883207 4034179 4053687 3920647 3812489 3693309
3277 3693309 4169314 4461677 4181759 4097962 4020739 4068409 3947093 3886609 3911489 3707570
3267 3707570 3748541 3692902 3663526 3782219 3745951 3671735 3692830 3728288 3633006 3448815 3273905
3256 3273905 3379022 3435768 3592319 3360918 2993148 2945301 3084203 3051268 3125274 2781060
3246 2781060 2800564 2907262 2937258 2839584 2982066 3010372 3114579 2941322 2825607 2859635
3236 2859635 3041528 3105244 3056549 3109173 2983812 2912736 2929126 3050383 3057901 3048875 2922338
3225 2922338 3142576 2915761 2942699 2839407 2778603 3022002 2993232 2986402 3127305 3231483
3215 3231483 3208894 2909278 2813840 2979832 3053819 2932879 3014597 2958190 3113881 3243121
3205 3243121 3038671 2968325 3058553 3148430 3163348 3206134 3294231 3166183 3398095 3322518 3470140
3194 3470140 3528866 3388457 3575005 3503029 3366989 3474976 3670973 3866530 3887173 3916819
3184 3916819 4192611 4064818 3807773 3875184 4051136 4195924 4215046 4153917 4575475 4584327
3174 4584327 4632753 4702084 4732660 4595636 4764656 4715987 5114673 5299684 5511655 5818522
3164 5818522 5484471 5538638 5986063 6122235 6340461 6636240 6808386 7004284 7122893 7371924
3154 7371924 7404515 7553771 7813060 7987238 8076204 8161617 8208731 8284237 8425705 8564171
3144 8564171 8700428 9017665 9292705 9608257 9631479 9752672 9986423 10282150 10611595 11321772
3134 11321772 11902439 12079823 12769150 13129978 13539162 14072826 14835552 15386222 15577181
3125 15577181 15815135 15926590 16066119 16032065 15791765 15490148 15278882 14924476 14705925 14393622
3115 14393622 14435151 14208899 14171042 14486131 14478381 14940662 14963325 15001827 15264028 15474359
3105 15474359 15835533 16023600 16336668 16504644 16785879 17381660 17635595 17735055 17987587 18079052
3095 18079052 17794042 17544210 16858203 16457181 16262195 16105074 15807342 15088103 14811718
3086 14811718 14707719 14236930 13793970 13797549 13598043 13617347 13467495 13252157 13217955 13266170
3076 13266170 13021263 13028808 13042870 12796463 12647775 12365294 11934474 11380260 11226938 11105673
3066 11105673 10696250 10096177 9662317 9275459 9000042 8790544 8553688 8182869 7892827
3057 7892827 7624520 7323173 7246607 7006406 6555319 6385305 6103150 6060757 5769099 5497858
3047 5497858 5563447 5444294 5582212 5195949 5251071 5166816 4849207 4634093 4492996 4660224
3037 4660224 4622699 4309055 4032989 4021403 3612113 3572609 3475696 3438405 3613888 3532754 3457251
3026 3457251 3290710 3049190 2886319 2951500 2964755 3016543 2682810 2800707 2786643 2692443
3016 2692443 2594889 2524405 2621325 2899740 2862200 2790032 2830628 2710387 2834444 2560765 2544781
3005 2544781 2434153 2258565 2227648 2019111 1980021 1899244 1516972 1583482 1871516 1878138 1970958
2994 1970958 1758455 1475090 1581165 1597950 1512093 1551793 2039770 1881070 1870013 2044938
2984 2044938 1927930 1912089 1835607 1983282 1729508 1597997 1515723 1512778 1405786 1470872 1404807
2973 1404807 1492189 1410628 1280982 1292851 1278332 1127882 1228425 1404803 1003131 1095303
2963 1095303 1006862 963765 993849 1042955 1027627 923572 1042137 1146091 827939 618931
2953 618931 875441 1207701 1201869 1125488 933560 848368 837139 846134 693813 850402 744513
2942 744513 651226 915888 1072866 827793 862531 877754 732865 434261 551986 572458
2932 572458 619237 833116 626372 538211 445329 727804 571722 610361 825973 698373
2922 698373 458923 532122 554747 595743 721970 729742 755654 627935 312929 237901 516131
2911 516131 645764 644121 910237 675404 572387 434203 580122 806403 698002 613348
2901 613348 569095 642762 662004 618378 521025 515698 545974 726344 691801 679105 325034
2890 325034 314988 531444 472082 423609 580708 387081 263591 390960 284624 301521
2880 301521 298214 244809 245510 173074 394491 529564 469528 610949 504189 442862 537149
2869 537149 549770 237645 316235 427603 192224 245865 321385 297871 424251 451666 321280
2858 321280 223216 285933 88767 -50641 180865 132378 383208 341227 288721 433510 324086
2847 324086 327318 136763 74065 185456 422389 428132 543149 474870 267063 92609 105295
2836 105295 165252 341594 372325 288229 185237 374342 390812 313023 373120 355721 288123
2825 288123 107439 328136 270962 302663 358066 163568 265739 491549 526286 556176 479798
2814 479798 371158 498385 269627 156736 307221 259790 61080 52488 181283 188069 361576
2803 361576 274759 -44838 -21659 229602 344593 292925 322505 159801 83700 400194 241971
2792 241971 197175 152783 59684 278466 486339 265510 -53449 236443 229771 107325 240082
2781 240082 70656 88257 135080 -9789 209010 -99527 -226608 32226 140422 257537
2771 257537 146930 -46958 -137216 25454 118079 362816 302836 -44552 39260 97808 112436
2760 112436 71056 164599 337693 231123 108325 250702 338853 295746 192806 131620 194558
2749 194558 165751 398679 305848 409988 349528 276712 47968 200589 230643 118931 152701
2738 152701 195787 214999 -43635 -157244 -120355 -89524 147121 -69739 -279095 67931
2728 67931 363359 252201 141149 184043 131166 289747 8008 71339 -1700 -138169 -33663
2717 -33663 322069 335702 142937 256761 40749 124376 284318 96525 203235 -44735
2707 -44735 -123450 -59094 55963 136692 137415 159951 174675 84121 202972 197096 -116017 93840
2695 93840 90718 -224000 -266691 -223351 -242255 -176847 80189 215472 161603 97088 98580 5073
2683 5073 22791 210334 -2581 -115557 -130628 120930 31402 -39372 -318830 -106584 -59557
2672 -59557 -16211 61118 102555 103209 83573 54889 112511 324384 94555 101941 -146933 -240389
2660 -240389 78227 -40361 -93639 25392 -250508 -283739 -44278 8564 -231663 19802
2650 19802 -67841 64755 -64567 -242196 -194603 -130863 -9433 100836 218886 59997
2640 59997 130110 88735 -18467 160815 47521 -28738 206744 11148 -133606 94156
2630 94156 -164302 -152708 97140 -189141 -393232 92131 368011 280380 -1813 1273 32159
2619 32159 -106967 -21474 -79890 195761 298598 215071 296358 179128 -25283 138292 167801
2608 167801 16711 5461 35671 -88501 -22981 329948 281870 184424 301513 113029 36898
2597 36898 -142476 -134648 205630 122067 241185 444555 503398 272266 195503 183457 32572
2586 32572 321671 228266 86262 -40535 54578 87640 325628 177611 -14562 161579
2576 161579 143069 411867 145797 -5088 -286925 -109431 194337 113442 -103075 -452812
2566 -452812 -441404 -144176 31482 -173630 -213701 58508 53482 -36081 34875 144986 -95039
2555 -95039 -118512 -168938 -99127 43412 165796 22679 -25617 29547 -4797 184450 183526
2544 183526 -74833 -14347 204595 112434 155740 -113166 -7755 140652 140125 149119 178100
2533 178100 106313 -75217 75375 255832 17907 -10731 21704 51630 335878 288706 84607
2522 84607 65953 -22198 -170567 -12670 5550 -10914 99168 -41145 157432 28206 57822
2511 57822 -44544 16430 24417 -160277 -230775 129138 15883 135093 288392 -4600 57676
2500 57676 72040 145106 54683 -106200 77139 78171 103095 174215 56007 -54486 49241
2489 49241 100808 136845 321945 288980 145967 9645 132779 142225 86814 236700 363785
2478 363785 162136 42915 46296 22896 33396 24328 26957 -22567 37738 87547 175860 223592
2466 223592 65411 222810 97438 -49940 214668 96486 -159977 -125673 -98546 38600
2456 38600 -162651 -243180 -308879 108630 101075 -122028 47999 -131644 14188 190953 124400
2445 124400 69158 47015 124106 173428 267566 287974 479055 331733 201104 134907 139246
2434 139246 -29370 -30035 79486 119961 98779 139732 352083 251146 281524 391915 497542
2423 497542 532278 498652 126809 -17445 197270 249252 289139 214155 -62445 86240 68915
2412 68915 99893 133014 126515 205847 333830 392567 454894 612409 505639 612175 286962
2401 286962 245993 445582 402237 473106 529038 415881 479345 497569 451762 344080 709634
2390 709634 612400 543971 490851 413177 695080 672724 819576 1111935 1087342 1071881 1027876
2379 1027876 902102 1176938 1471971 1199983 1093760 998872 979509 1121289 1260183 1551859
2369 1551859 1509005 1636121 1801067 1811078 1876975 2031316 2022441 2488476 2321829 2303382 2516275
2358 2516275 2759280 2996911 3068324 3350896 3606960 3825712 3962817 4224686 4489834 5143903
2348 5143903 5641098 5859553 6370002 7063750 7860159 8723604 9547506 10656020 11837834
2339 11837834 13087713 14247732 15594530 17268747 18826958 21479360 24457273 27741382
2331 27741382 32500890 38411253 45330857 52642575 58819300 62993962 64826916 64583641
2323 64583641 57067638 47464037 40794735 35484232 31128663 27644635 25102103 22819903
2315 22819903 21012113 19332480 17862735 16516166 15434776 14238503 13171536 12085297
2307 12085297 11009793 10000860 9290707 8602379 7794519 7237953 6583671 6477561 5933705
2298 5933705 5663449 5626512 5130749 4826975 4730565 4573974 4217252 4267634 4131446 3796303
2288 3796303 3499390 3503085 3307957 3034953 2803867 2677247 2489519 2636123 2599676 2524827
2278 2524827 2277939 2020181 1773127 1679639 1759628 1685955 1664400 1507710 1413247 1620892
2268 1620892 1607323 1736007 1553317 1609413 1488067 1526013 1617343 1277329 1007445 1071986
2258 1071986 1414185 1581716 1437894 1191854 1212362 1306987 1347382 1170438 984637 832014
2248 832014 718688 807185 773761 939570 808124 964314 999041 830948 874510 824375 837350
2237 837350 928803 784242 926919 806428 683830 776545 799508 714364 416809 552606
2227 552606 700377 554251 683839 715728 492245 819148 792755 841838 738812 733598 646044
2216 646044 621675 502308 466151 399092 523915 500172 490782 585039 429677 318201 472722
2205 472722 522657 477927 614987 453957 174221 320305 279629 266969 407870 568132
2195 568132 426196 499981 432915 181215 27818 23658 211528 202005 347052 194914 144786
2184 144786 -112023 -84347 78073 85730 -49254 -4531 16097 -15960 -106872 -75457 242969
2173 242969 20094 23907 163475 225197 387933 400454 147118 261425 551633 127140
2163 127140 -36793 119088 -20651 12459 10728 -56826 48965 286664 142160 -15602
2153 -15602 53939 -9885 -220276 -282506 -24148 -220743 -207325 -79873 -44975 -41925 229118
2142 229118 119242 91610 -74718 219627 162173 -216989 -142278 -32492 -31924 -449154 -127460
2131 -127460 -16611 71913 37248 162309 335875 313757 268752 151862 -91611 -87050 -38259
2120 -38259 -8502 146785 75246 -132677 -401995 -222165 -207669 -190302 -57611 -356160 -399589
2109 -399589 -237751 -220930 -124446 17864 3730 -9419 23957 156808 166179 104918 -73779
2098 -73779 104367 163877 199019 146869 294415 241964 152936 352273 192720 265416 232121
2087 232121 -45334 -209715 -140902 143735 35229 -142752 -113466 238830 467858 395172
2077 395172 262227 246646 172963 223994 251540 -43381 31727 49936 142339 331815 404168
2066 404168 422029 318370 139576 172744 157063 217396 121247 370082 248062 255901 485466
2055 485466 416177 409815 270856 351839 330872 72852 50844 -44704 111931 -118368 -92519
2044 -92519 171697 305484 331850 222210 141028 254682 396652 242587 304209 184926
2034 184926 196397 163621 284533 179430 -191332 -57029 5146 -10666 -151313 -42190
2024 -42190 47729 123128 152351 -10658 -150569 -55955 -191331 -113304 319881 99628 120396
2013 120396 51059 44871 -15778 -10366 95716 208836 -22607 -18780 -153276 -213362 -136020
2002 -136020 -23781 -231871 -224106 -42828 -244267 -66925 -8878 -37998 45578 176050 275913
1991 275913 258407 -41053 -280669 -356708 -427685 -139852 101745 -40137 41723 -18078 -238395
1980 -238395 -289285 -78477 -126670 -181994 -82894 -145144 -242543 -5345 41909 109185 194727
1969 194727 -73563 41180 156782 55184 81338 101937 37837 -30696 -266346 -379368
1959 -379368 -120609 -72927 -189567 -224393 -119739 -29399 40770 154385 181864 138129 -151252
1948 -151252 -124960 -65510 -97807 33603 -23949 -290609 -493698 -361349 -40486 -13037 24118
1937 24118 -45387 -307939 -267069 -345504 -309272 -134206 -42501 -200564 -314255 -89921 5700
1926 5700 -313460 66814 232537 303787 155879 -57415 48569 -12785 -53215 -68660 128130
1915 128130 122037 33732 83526 264345 66068 -47621 59124 91756 -111922 26075 -74114
1904 -74114 -201586 -100726 -14008 -157618 -20482 52245 23387 27090 -246856 -160938 -100262
1893 -100262 -185890 -336149 -220445 31276 -204028 -234525 -448140 -325466 36087 -249994
1883 -249994 -176773 -91295 100019 78741 -198550 -272097 -20463 -15943 -181780 -252346 -172877
1872 -172877 14947 -81585 -178818 -231500 4389 35165 -125199 -29443 -56724 -223544 -183252
1861 -183252 -129998 -72555 14594 -141956 -101923 -256859 -251953 72220 222651 173332 55816
1850 55816 -192132 -243787 -86676 163188 81134 22998 -60100 -143287 -126662 17946 -29821
1839 -29821 -147949 -105086 130539 76790 -208554 -236679 -219974 -309312 -169585 -36285 40164
1828 40164 72419 -47981 -70705 -245752 -54648 -151422 -125183 -159964 170881 44043 118357
1817 118357 168137 68537 24565 191573 106986 -334679 -215456 -15820 110331 58156 79391
1806 79391 -48260 -159575 -215041 -408217 -270968 -92089 346248 81640 -191719 -231110
1796 -231110 -291382 -246177 -166640 99636 11149 118948 5072 -168473 -202551 -136827 -136815
1785 -136815 -99975 -111699 102605 -15652 -366566 -454698 -500107 -375941 -136520 -166466 -112715
1774 -112715 93410 -181581 -256166 -89984 -62745 -242049 -202442 -40239 91874 148771
1764 148771 11286 17817 -12143 199874 -7429 -97855 -178198 -295562 -161954 168226 228437
1753 228437 -49272 -208767 -293545 -6487 32020 -7854 40110 144095 -31399 -75262 163241
1742 163241 146055 142763 97142 114981 113736 27826 -40470 25227 -62897 156138 -41966 -328489
1730 -328489 -305885 12179 97710 225391 -17223 -32032 -40304 -34635 94962 12938 -10003
1719 -10003 43161 33884 -295381 -450977 -594514 -464139 -338861 -281625 -253606 -162355 -329585
1708 -329585 -285210 -376762 -181573 -87137 -71214 164051 -270516 -225827 -203676 -306042 -245066
1697 -245066 -245592 -141018 -146263 -49493 -55411 -176512 -260107 -108593 -51293 -8912 -128448 -115044
1685 -115044 168353 202173 29023 105408 47063 59498 14760 -69810 80974 89673 92407
1674 92407 7983 -201803 -127724 44526 103221 73034 -353 -35549 54340 10347 158091
1663 158091 -41045 -278545 -236718 -305947 -166237 -22869 193661 -66021 69966 -13429
1653 -13429 -351092 -332000 -214106 -77745 195304 218566 -62185 -74900 -93062 -291080 -81555
1642 -81555 247000 47045 60228 -64389 -85500 -14399 -232462 -185370 34063 174998 155618
1631 155618 150115 206546 91514 220136 -57684 -90826 -71752 -122575 -2628 65048 32544
1620 32544 301379 285228 -22277 -176187 -47866 -30879 -252643 -273186 -79462 -154786 -215901
1609 -215901 -194341 -150556 -34051 -248968 -191081 -17449 -207666 -180772 46869 150699
1599 150699 39224 -55395 -38011 -182113 -19688 -268588 -397991 -292232 -149537 -82580
1589 -82580 -25131 -199291 -262050 129820 169875 -32050 -130175 -8345 159554 207585 319537
1578 319537 250704 253526 139043 -24077 98990 55758 -72208 -18380 47505 -73094 -253465
1567 -253465 101191 258110 61102 70122 39433 77784 -57993 -154708 150451 169201 50659
1556 50659 2008 -14305 57491 -3812 -66341 -31175 -273781 -396462 -261811 -144314 -3698
1545 -3698 -29826 -29700 1305 -36570 92738 -20287 12232 7774 -241636 -291973 -246946 -175038
1533 -175038 -11761 -23935 -18638 -11884 -80771 -99538 -132442 77482 338480 427392 -66850
1522 -66850 -164788 -72330 -182989 -162520 -190038 -35021 125846 198322 132447 106016 137637
1511 137637 58439 94113 -34485 -81318 -35137 -272127 -14627 -22700 -54473 -130736 2372
1500 2372 196975 -47940 79922 86897 88544 -81906 -172326 -29217 -20908 -89590 72725
1489 72725 -148735 -308407 -250811 -337023 -268416 -167957 166255 134443 -97872 -243632 -225481
1478 -225481 -76070 -68061 -37825 -49194 -181537 -101592 15189 -44128 -265627 -302091 -237283
1467 -237283 -71769 -34994 -81103 -53663 147830 -229559 -216322 -143346 -104476 -171184 -350578
1456 -350578 -143636 -287261 -154215 -154723 -171378 2566 124353 215541 209744 212551 302582
1445 302582 -43364 -97182 -106424 54079 326506 74645 -34318 -88020 -171553 -115535 -164206
1434 -164206 19134 98560 216768 90787 159350 7707 -64319 -176223 -187055 -250264 -165288
1423 -165288 12258 -107299 -267268 -92194 -105028 -216966 -152414 -361727 -246406 33353
1413 33353 -14606 -35470 -16607 38168 -61578 -94240 -176308 -134986 -65659 -41984 -154790 -84296
1401 -84296 15436 -273503 -237968 -266129 -25858 -174338 -327327 -287550 -133169 -63529 -121679
1390 -121679 -7719 49913 -45175 206261 -94785 -109493 161064 193602 53555 45547 168577
1379 168577 61630 1961 -28198 -36733 -93683 -964 56127 -13947 -95513 -91181 -78491 -115007
1367 -115007 -177557 -229852 -75522 29910 -14896 -50858 75432 166876 212286 -48871 73152
1356 73152 106882 -316380 -126698 -34706 -95677 -112865 -16902 -38823 -189768 -91531 -45522
1345 -45522 -61742 -107617 -268263 -158229 104798 4767 -183852 -29902 -8424 -147063
1335 -147063 -235862 10945 -176499 -186134 71101 69792 -3869 6611 -29571 -269377 -192610
1324 -192610 -31343 -103880 12272 232125 10081 84970 100389 3392 -133025 -327167
1314 -327167 -323665 -325871 -109304 -87831 -34257 -209348 -211136 -66009 139860 26411 93027
1303 93027 62948 -25626 -87757 -167529 -128869 -226921 -28273 -37080 -44357 6267 44352 -66968
1291 -66968 -280886 -100118 1718 -234741 -137580 -157483 45349 50489 140764 174298 285693
1280 285693 144593 -20660 -281960 -67596 100526 395827 228134 13068 109505 40789
1270 40789 -53824 -113076 -25333 36965 -35345 28619 31355 -25532 -148766 -126431 -20352 96671
1258 96671 135236 87645 -128185 8253 -120889 -322333 -193465 -211662 -156802 -218697 134518
1247 134518 219043 131722 -38952 -153850 -169756 87341 83073 147711 345216 234306 38730
1236 38730 -31510 -104376 -39170 -92221 -143488 -111707 54833 274336 194876 -5255 248898
1225 248898 57499 -133773 -58382 -83710 -62759 150867 98290 -101569 -72775 -313374 -313188
1214 -313188 -129141 -176534 -17394 118591 107825 -51507 -20915 68244 77744 -140561 -140083
1203 -140083 -95665 -89612 -178659 -23630 -115837 -36363 -69968 142515 -27496 -15185 148231
1192 148231 -29468 -221281 -247449 -18004 180831 179941 25065 179275 -74130 -278969
1182 -278969 -68317 12145 -53778 -2110 -246004 -272370 -181263 16932 297865 146986 84227
1171 84227 38197 99003 135914 -86627 -189803 -93403 -66762 -205148 -190460 -19905 -83151
1160 -83151 -208358 -100230 -126903 -166689 -111588 -7041 -212885 -43885 17463 -135097 -120425
1149 -120425 -185373 -190984 -288740 -103092 -72176 -208746 104156 57876 50470 45558 67355 -4961
1137 -4961 -125053 -194839 -237554 -178367 58517 115854 84166 -19173 80992 -21914 -164445
1126 -164445 -150531 63835 146735 258814 234881 115611 33452 -150066 -100603 -168369 -201349
1115 -201349 -341245 -315645 70658 -27779 -38054 -27108 -259441 -81883 223901 124802 -7453
1104 -7453 -24060 142077 177678 80990 -76773 -149191 -139115 25930 -85845 -283760 103931
1093 103931 209081 150564 37732 -14219 66814 26242 27033 -97278 -216782 -195263 -68780
1082 -68780 -113703 -28158 87443 121877 -58322 32361 300271 -90908 93298 -214715 -239127
1071 -239127 104440 -2089 -210319 -237129 19274 -60964 -33555 -56929 26839 -192495 -214875
1060 -214875 -130629 49207 42632 -323664 -128029 -187313 -135622 -97779 -61208 -259836 -298111
1049 -298111 -192987 -116716 -225823 -176923 28035 157636 -23038 -7757 93010 116976
1039 116976 322796 386877 296439 -57104 -43454 -59849 -38643 -200444 -103267 220069 252663
1028 252663 150758 -240713 -72964 -120210 1089 79556 -482963 -202276 -44609 -101184
1018 -101184 -87360 27117 -81780 -143579 -144590 -123624 -153537 -168468 -74027 5570 134050
1007 134050 87128 -61654 137241 -49626 -74844 57567 -181484 -276681 -154126 57878
997 57878 157166 346056 248637 238882 237946 47859 -75910 -182075 -134085 -196002 -39297 65924
985 65924 -184717 -92187 55084 199853 149202 354512 124914 181835 261485 232660 241431
974 241431 142008 -48894 255498 246058 82822 237762 286095 151691 -14275 -108047 -283144
963 -283144 -76725 87733 -62768 -21791 -7425 -47577 38711 155418 -129725 -70266 32728
952 32728 -138821 -279942 -401313 -64189 -26966 187669 120395 -200318 -224768 -348371 -147596
941 -147596 173636 90073 -63318 -209912 -159019 -76987 -229474 -279139 -137390 -44961 86395
930 86395 360090 129684 159830 81246 108059 15791 -4950 16634 -151116 114018 33636
919 33636 -32800 -59857 224287 27450 -358424 -254788 102785 83753 -211436 -31854 227978
908 227978 101466 -216930 -263986 -94732 -65213 113604 -44177 8452 79673 12903 -71021
897 -71021 -36575 -57437 -117891 -54866 -102918 -162673 -178695 -156338 -186341 -145439 159318 277417
885 277417 264010 197706 19998 -73650 101401 317343 116126 25791 -80326 -54639 188391
874 188391 191906 -12132 97395 90913 -262271 -228799 -225763 -286143 -149143 167876 -85066
863 -85066 -182322 -16260 153553 84177 25420 8260 -138477 107121 242296 116647 310566
852 310566 383542 139503 -201298 -289408 -207502 -56367 -194793 -216271 -31769 -105138 -36357
841 -36357 118963 -34513 50138 151694 183903 72651 53384 20019 -105341 -40679 8077
830 8077 67090 -108101 -115370 -160350 48663 -75585 -58379 87872 -26239 293410 152204
819 152204 107630 59538 26522 12093 -54520 73353 207454 271868 427965 88707 -187331
808 -187331 -50528 -94324 69996 199835 218077 -178809 -163373 -286785 -62385 267324
798 267324 342609 134994 -3831 -123912 -133327 -113016 -45361 123866 76299 -25612 -30785
787 -30785 172501 63944 103242 74735 -69008 -398537 -432944 -121656 -25781 43376 -179548
776 -179548 102759 181561 22350 -64247 -32065 78924 202165 78573 213732 160103 116336
765 116336 -67549 -154539 -5360 -59391 -57205 -174583 54811 221442 -50939 -275096 -16935
754 -16935 189667 -127149 25498 16036 -127839 -215163 -69286 19145 -147209 -46821 130746
743 130746 -11986 59645 73694 -122005 -226232 -132579 -169884 -190186 28862 -11368 -200529
732 -200529 -273824 -912 10593 -98475 -100031 -43774 61318 -116650 56539 -24952 135148
721 135148 145622 -155594 20743 -146125 -21755 174289 85771 78544 237793 309497 212088
710 212088 207121 428873 292453 396911 168019 -33416 -51543 11449 127806 67469 -116805
699 -116805 -27546 147067 143028 169169 82449 -43545 -129514 549 -26807 -104192 -272736
688 -272736 -25669 -76217 -209983 54252 -88246 -174885 239503 116818 -276666 -37664
678 -37664 62490 106392 -2005 283215 128903 80639 128568 252405 286586 137437 89709
667 89709 -72724 -142566 -37937 -9975 36573 51560 -25163 61788 229037 5362 86326
656 86326 -159833 -6170 -53775 -152194 -74976 -66768 -151098 -233053 -323126 -113819 -1904
645 -1904 98771 21881 263449 85381 -7355 -184283 -46984 -121561 -165069 282149 150686
634 150686 31384 80636 41335 3963 167170 225631 25481 -129283 -219253 -346740 -163833
623 -163833 -61206 116037 112735 202753 92860 83517 7744 180924 120629 -101560 -218842
612 -218842 100743 -22604 22862 126539 248851 72585 -91231 -220443 67305 -21822
602 -21822 -34623 6968 209908 184662 172956 275865 118192 -59593 66493 185554 315843
591 315843 326986 -1604 -36129 8718 -8297 130874 118991 10299 194763 278845 195815
580 195815 231727 -80406 -210380 -221061 -250730 -212130 -154845 -49111 -214571 -30959 -4688
569 -4688 193746 275652 199369 293262 327510 219174 97965 395215 382631 88027 76703
558 76703 179669 9657 -223737 -222997 -62696 386 81908 8956 -92969 -178411 -239998
547 -239998 -193333 -92126 -159002 61243 6958 -39690 214552 236750 75924 20414 -154887
536 -154887 -107777 76767 15083 5857 302852 339257 287931 68092 -27091 -165208 103683
525 103683 31031 -197641 -35565 -305375 -446241 -303064 -151699 -151876 110719 220101 190208
514 190208 43896 17541 -124351 -143511 -168929 108657 -100797 -52052 -294155 -78312 -76855
503 -76855 84958 147459 299133 299934 112949 77390 430703 368597 271127 73453 -226311
492 -226311 115260 81518 142400 335825 99906 300647 355974 360283 301905 25195 -114526
481 -114526 -21820 78977 64207 15369 -28275 252452 209838 159752 -134778 58762 -4894
470 -4894 93658 59181 18856 61551 -222838 -88510 3409 88888 190523 83707 -81490
459 -81490 62350 60960 79351 98076 130542 181070 80593 266903 -23178 -263526 -225650
448 -225650 -62103 -369016 -442847 -389238 55225 331112 250553 235910 215312 322266 277930
437 277930 42155 -4161 167891 129382 171015 211834 148165 130133 129866 10368 -98130
426 -98130 -125446 51061 34177 70088 51134 29905 26254 40243 209247 91547 85534 343412
414 343412 73266 180565 278328 38361 -29722 -125178 -6271 81429 -46049 70805 -113483
403 -113483 -192570 -205543 104990 209406 -3495 -76008 91736 -31676 -77575 108927 238229
392 238229 429964 42625 -454305 -551340 -385953 -217687 -78706 201564 234201 -36958
382 -36958 -37257 121169 -22597 54807 30252 -271296 -324055 -23850 179251 -78740 551
371 551 125506 226356 172212 156224 75590 304275 124391 -57264 89668 102641 3519
360 3519 184042 6491 119000 255882 296632 165331 10205 -32482 -37240 -92315 27145
349 27145 112582 61702 -76169 -172853 -106818 -17404 -55036 79352 -57300 -184171 112765
338 112765 60 -165836 -30174 84807 81426 206799 343634 265403 79198 -57408
328 -57408 -102208 -25049 76349 -145661 -168512 55268 226393 -57411 -138749 -120493 -415884
317 -415884 -497606 -174876 -39371 -115706 -67096 3755 -110134 -479987 -389896 -62674 -21045
306 -21045 -237020 55750 164198 -79517 104303 116399 3350 56645 280480 281233 -60280
295 -60280 93496 83963 -40964 205330 422897 351111 432455 298473 169617 -236557 -404096
284 -404096 -385856 -77596 -124014 -175363 -194384 2351 -94535 91149 87970 -15089 -43038
273 -43038 86458 79937 82245 11935 192499 39549 51463 159202 -167479 -155319 -169568
262 -169568 9016 -293034 -104922 -79899 -96029 133964 160550 187979 138285 -115734 438
251 438 93011 226378 168236 146163 167887 368877 483977 441012 187571 -419 141035
240 141035 -98447 45670 -96615 -430200 -556303 -372958 -86827 16419 -59107 -297780
230 -297780 -205686 99147 146951 -17644 163993 214004 210893 85350 230120 267054 128843
219 128843 154595 54576 -80190 -114093 75097 256226 105372 1392 118642 185770
209 185770 13305 103526 104966 -140087 -234359 -91104 -11101 13833 65658 193841 71767
198 71767 -101913 -98673 27844 87092 -92706 34118 27013 16906 71472 158128 138564 104401
186 104401 122914 187544 57951 2559 149970 240232 -47588 -24297 110433 173002 388602
175 388602 12183 -227634 -97501 181235 186529 178573 309621 289118 117831 -38319 -175272
164 -175272 -171914 -197018 -230418 -120379 24849 -40420 123768 83675 6627 -91604 -5609
153 -5609 127001 177885 209514 177072 337178 170888 72774 58450 94746 -95710 -75119
142 -75119 -80974 34110 51143 2946 20061 -166517 58164 304590 276157 362541 383068
131 383068 208561 97151 53032 -131684 -175520 -136315 -73702 70978 86591 -105613 -16835
120 -16835 233424 295616 86874 -32771 -64213 -308994 -175099 -157194 -256083 -247101 -231423
109 -231423 -61921 98232 -20415 -80603 53744 74438 -58650 -203281 74839 79040 -62105
98 -62105 -11781 -95047 69171 -9627 1971 71235 106974 194578 222508 196340 63706 149028
86 149028 155171 179114 24416 45064 134432 123299 105142 159641 71571 -79648 80433 246804
74 246804 119058 125293 280042 66221 155563 100531 22240 -104774 -51697 26207 -88544
63 -88544 11314 159764 178162 169276 181114 119452 -10502 121719 110015 -34678 -73070 133261
51 133261 318009 197054 190766 250925 155531 167656 176789 -93936 -2988 61457 137800 296979
39 296979 183867 -49556 -112749 177839 77336 -17320 80953 -38326 53927 117923 -12009
28 -12009 34887 130759 -48987 -162654 -191661 -62778 102647 163602 230197 157 -99456
17 -99456 -28992 88318 182686 63859 200318 256248 113411 -17697 1257 49439 62854
6 62854 47370 141315 49069 -8173 52390 171370
0 171370
$$ Imaginary data points
##PAGE= N=2
##DATA TABLE= (X++(I..I)), XYDATA
16383 -1722476 -1773032 -1618056 -1357485 -1361640 -1395042 -1259736 -1226018 -1230429 -1158436 -1024603 -1083028
16372 -1083028 -1118787 -1080978 -1121642 -1019361 -977566 -914039 -915949 -1009367 -920236 -821562 -814346
16361 -814346 -812579 -734170 -721263 -797824 -697250 -591093 -411719 -317022 -371757 -475268 -481104
16350 -481104 -378630 -305453 -225588 -377176 -418792 -514501 -274259 -12573 -254243 -283301
16340 -283301 -226605 -152941 -26764 1648 51224 149905 205586 242336 95749 124101 116151
16329 116151 88905 7716 152596 259739 366131 439704 188683 220050 293361 226643 253249
16318 253249 349984 434950 544937 677477 647350 557099 754832 703211 805450 855075 655065
16307 655065 688315 584441 731088 851511 865339 849399 806910 831378 986277 1148236
16297 1148236 1048025 760561 907371 963380 980824 1006344 1005931 1217301 1332362 1162253
16287 1162253 1120752 1201378 1138503 1203176 1327777 1204467 1189295 1226423 1246293 1282553 1392056
16276 1392056 1333536 1218940 1250213 1348532 1475533 1544463 1409643 1297901 1448793 1565168
16266 1565168 1645770 1683133 1680945 1742826 1777568 1588623 1739372 1699189 1764069 1858855 1868989
16255 1868989 2139790 2198007 2095293 1936612 1950153 1998499 1872019 2041440 1990833 1909793
16245 1909793 1908455 1945245 2260581 2261718 2199718 2217738 1929621 2026056 2259581 2160700 2161245
16234 2161245 1940820 2232471 2359598 2228752 2122351 2070388 2016191 1982286 2157656 2239023
16224 2239023 2304018 2520439 2722564 2607440 2644845 2483909 2643121 2726422 2600381 2535589
16214 2535589 2516888 2469628 2530199 2417646 2427944 2443927 2496228 2739785 2704178 2583182 2563321
16203 2563321 2404475 2661641 2553495 2427823 2577165 2630209 2628631 2622337 2661793 2669887 2791203
16192 2791203 2975964 2807275 2873968 2840003 2741154 2807598 2774229 2799933 2727673 2643244 2930729
16181 2930729 2943223 2798709 2654317 2811695 2890721 2842870 2913308 2942662 2941492 2925985 2983825
16170 2983825 2987535 3223151 3182510 3050665 2976105 3057457 2973978 2888981 2976440 3288370 3116102
16159 3116102 3106796 2877369 2779766 2976756 3051155 3185410 3269251 3097709 3173610 3289516
16149 3289516 2932266 3058887 3120446 3269549 3212576 3318376 3446450 3236578 3185135 2990949
16139 2990949 3114192 3196916 3231372 2860336 2995833 3210065 3399693 3494002 3498880 3168235
16129 3168235 3214709 3323849 3439656 3239388 3154702 3080832 3206609 3345848 3259324 3246956
16119 3246956 3062626 3172106 3178204 3187245 3056966 3083887 3272188 3130868 2960773 2876475
16109 2876475 3054924 3101330 3258720 3248675 3102327 3203510 3210731 3245326 3433542 3399999
16099 3399999 3387163 3353582 3307636 3327492 3249155 3300045 3119183 3412590 3371975 3078989 3110138
16088 3110138 3167901 2866844 3064687 3087367 3156509 3251614 3527141 3472357 3562706 3616974 3580661
16077 3580661 3586844 3435895 3502891 3577032 3547324 3417696 3179996 3173997 3251031 3201196 3148033
16066 3148033 3176219 3288523 3446739 3466353 3242561 3311953 3167303 2991402 3402644 3403606
16056 3403606 3448631 3458104 3472148 3538363 3383568 3552839 3613649 3492082 3689315 3772806 3650173
16045 3650173 3569005 3494175 3245441 3292793 3359380 3220321 3506971 3583867 3644496 3373192
16035 3373192 3125207 3242912 3423425 3508381 3153872 3174951 3581575 3550183 3384130 3399152
16025 3399152 3452575 3327036 3279530 3332057 3239884 3126795 3569547 3750685 3516085 3502644
16015 3502644 3513963 3349284 3322341 3604888 3694556 3727797 3770784 3761355 3594214 3642861 3633707
16004 3633707 3597954 3508299 3087350 3124233 2969105 3110643 3120461 3190962 3121710 3189213 3449765
15993 3449765 3274150 3328023 3320046 3182789 3330855 3667920 3667639 3333063 3307035 3251499 3186164
15982 3186164 3326043 3342469 3255833 3385947 3301367 3366308 3244538 3223483 3337579 3331579 3297575
15971 3297575 3442144 3586565 3777748 3807732 3447001 3067331 3291949 3461393 3451326 3527867
15961 3527867 3387941 3304411 3489496 3591061 3431533 3399582 3166423 3251561 3270832 3519834
15951 3519834 3603185 3657266 3217344 3132258 3105943 3043295 3163742 3354685 3346736 3447375 3681341
15940 3681341 3670009 3252190 3305954 3624607 3473007 3532907 3527376 3585198 3172180 3164170 3364433
15929 3364433 3558569 3544984 3390732 3445078 3417060 3501599 3333220 3358788 3172947 3089119
15919 3089119 3284730 3227153 3349168 3504703 3449452 3307578 3301966 3480589 3599041 3522534
15909 3522534 3334953 3358552 3441575 3581292 3645656 3722767 3475752 3882145 3975600 4042716
15899 4042716 3884100 3717827 3780348 3685187 3706490 3670384 3331769 3164780 3184060 3198411
15889 3198411 3508323 3548030 3688148 3601180 3461024 3319820 3161874 3136316 3430419 3591564
15879 3591564 3358919 3423519 3632769 3697214 3634405 3222751 3419487 3429912 3351559 3306453
15869 3306453 3434281 3630277 3603359 3497696 3535133 3502914 3221530 3222476 3248294 3221288 3440957
15858 3440957 3526088 3689068 3428841 3283632 3593796 3518676 3443499 3463655 3489657 3439123
15848 3439123 3281443 3157064 3286931 3444567 3286719 3285003 3326144 3427825 3600911 3550733
15838 3550733 3473262 3363648 3487094 3764794 3509882 3755637 3640868 3392652 3170422 3324331
15828 3324331 3386333 3464759 3344854 3447644 3642029 3622535 3645251 3472857 3522886 3338516
15818 3338516 3524512 3458594 3529749 3370049 3399086 3516835 3404611 3394479 3301851 3554022
15808 3554022 3593853 3547992 3252430 3298781 3450256 3322421 3440370 3248677 3397011 3332478
15798 3332478 3418891 3312090 3502779 3497420 3366005 3378809 3368349 3534324 3478172 3516178 3532346
15787 3532346 3598383 3562439 3660536 3755181 3687320 3612434 3447877 3548332 3581034 3482240 3492501
15776 3492501 3446562 3290163 3262547 3483517 3478242 3537589 3563918 3523015 3608915 3803512 3712533
15765 3712533 3649791 3424377 3568661 3619690 3278628 3331955 3355466 3406472 3458231 3441285 3213521
15754 3213521 3044355 3280767 3453979 3501567 3384037 3285859 3234838 3381232 3495189 3335902
15744 3335902 3433340 3400332 3590871 3558393 3487996 3601638 3531842 3533556 3527154 3392406 3523984
15733 3523984 3575079 3745953 3636813 3477540 3352259 3376955 3516657 3481578 3385140 3432999
15723 3432999 3417526 3492428 3358293 3511505 3798728 3631482 3389089 3321001 3513667 3482066
$$ [...]
##END NTUPLES=NMR SPECTRUM
##END=
