##TITLE=1H_EC-3361(II-2)
 200.13MHz, CDCl3,
 8 sc
 
 10.9.2025
##JCAMPDX= 6.0         $$ Bruker NMR JCAMP-DX V2.0
##DATA TYPE= NMR SPECTRUM
##DATA CLASS= NTUPLES
##ORIGIN= UXNMR, Bruker Analytische Messtechnik GmbH
##OWNER= pz
$$ XWIN-NMR		Version 3.5
$$ Wed Sep 10 15:49:00 2025 Russian Standard Time (UT+4h)  she@DPX200
##.OBSERVE FREQUENCY= 200.1313
##.OBSERVE NUCLEUS= ^1H
##.ACQUISITION MODE= SIMULTANEOUS
##.ACQUISITION SCHEME= undefined
##.AVERAGES= 8
##.DIGITISER RES= 18
##SPECTROMETER/DATA SYSTEM= spect
##.PULSE SEQUENCE= zg30
##.SOLVENT NAME= CDCl3
##.SHIFT REFERENCE= (INTERNAL, CDCl3, 0, 15.4869)
##AUDIT TRAIL= $$ (NUMBER, WHEN, WHO, WHERE, WHAT)
$$ ##TITLE= Audit trail, XWIN-NMR		Version 3.5
$$ ##JCAMPDX= 5.01
$$ ##ORIGIN= Bruker BioSpin GmbH
$$ ##OWNER= she
$$ F:/spectra/data/she/nmr/H-C/1/pdata/1/auditp.txt
$$ ##AUDIT TRAIL=  $$ (NUMBER, WHEN, WHO, WHERE, WHAT)
(   1,<2025-09-10 15:47:27.70 +0400>,<she>,<DPX200>,
      <created by zg, POWCHK disabled, PULCHK disabled
       configuration hash MD5:
       00 E9 B6 7A A2 85 ED C7 34 08 36 98 17 FE 4E 26
       data hash MD5: 16K
       12 9F 0C 97 76 A5 E7 1A F1 C5 57 81 21 E1 BE A8>)
(   2,<2025-09-10 15:47:31.39 +0400>,<she>,<DPX200>,
      <Start of raw data processing
       efp BC_mod = 2 LB = 0.25 FT_mod = 6 PKNL = 1 PHC0 = -1721.842 PHC1 = 15.19228 SI = 16K 
       data hash MD5: 16K
       77 4A 9F DA 71 DE 0F B7 B4 E0 35 BE 99 26 A2 72>)
(   3,<2025-09-10 15:47:53.62 +0400>,<she>,<DPX200>,
      <pk PHC0 = 10.29251 PHC1 = -11.8 
       data hash MD5: 16K
       C6 0F 90 BF E5 78 31 55 B9 D0 3E 70 F8 5B 76 94>)
(   4,<2025-09-10 15:47:58.67 +0400>,<she>,<DPX200>,
      <abs ABSG = 5 
       data hash MD5: 16K
       70 53 E9 BB 24 2B E2 7C 8A C9 61 82 C6 F7 81 A4>)
$$ ##END=
$$ 
$$ hash MD5
$$ 9B BF 6E 87 79 5C 9B 5F 58 EA 4B 95 8D 3E A1 26
##$RELAX= 
##$RELAX= 
##$RELAX= 
##$RELAX= 
##$RELAX= 
##$RELAX= 
$$ Bruker specific parameters
$$ --------------------------
##$DU= <F:/spectra>
##$EXPNO= 1
##$NAME= <H-C>
##$PROCNO= 1
##$TYPE= <nmr>
##$USER= <she>
##$AMP= (0..31)
100 100 100 100 100 100 100 100 100 100 100 100 100 100 100 100 100 100 
100 100 100 100 100 100 100 100 100 100 100 100 100 100 
##$AQSEQ= 0
##$AQ_mod= 1
##$AUNM= <au_zg>
##$AUTOPOS= <>
##$BF1= 200.13
##$BF2= 200.13
##$BF3= 200.13
##$BF4= 200.13
##$BF5= 200.13
##$BF6= 200.13
##$BF7= 200.13
##$BF8= 200.13
##$BYTORDA= 1
##$CFDGTYP= 0
##$CFRGTYP= 5
##$CHEMSTR= <none>
##$CNST= (0..31)
1 1 145 1 1 1 1 1 1 1 1 1 1 1 1 1 1 1 1 1 1 1 1 1 1 1 1 1 1 1 1 1 
##$CPDPRG= <>
##$CPDPRG1= <>
##$CPDPRG2= <>
##$CPDPRG3= <>
##$CPDPRG4= <mlev>
##$CPDPRG5= <mlev>
##$CPDPRG6= <mlev>
##$CPDPRG7= <mlev>
##$CPDPRG8= <mlev>
##$CPDPRGB= <>
##$CPDPRGT= <>
##$D= (0..31)
0 0.7 0 0 0 0 0 0 0 0 0 0.03 0 0 0 0 0 0 0 0 0 0 0 0 0 0 0 0 0 0 0 0 
##$DATE= 1757504846
##$DBL= (0..7)
120 120 120 120 120 120 120 120 
##$DBP= (0..7)
150 150 150 150 150 150 150 150 
##$DBP07= 0
##$DBPNAM0= <>
##$DBPNAM1= <>
##$DBPNAM2= <>
##$DBPNAM3= <>
##$DBPNAM4= <>
$$ [...]
##$SUBNAM3= <"">
##$SUBNAM4= <"">
##$SUBNAM5= <"">
##$SUBNAM6= <"">
##$SUBNAM7= <"">
##$SUBNAM8= <"">
##$SUBNAM9= <"">
##$SW= 18.0517328524113
##$SWIBOX= (0..15)
0 0 2 0 0 0 0 0 0 0 0 0 0 0 0 0 
##$SW_h= 3612.71676300578
##$TD= 16384
##$TD0= 1
##$TE= 0
##$TE2= 300
##$TE3= 300
##$TEG= 300
##$TL= (0..7)
0 120 120 120 120 120 120 120 
##$TP= (0..7)
150 150 150 150 150 150 150 150 
##$TP07= 0
##$TPNAME0= <>
##$TPNAME1= <>
##$TPNAME2= <>
##$TPNAME3= <>
##$TPNAME4= <>
##$TPNAME5= <>
##$TPNAME6= <>
##$TPNAME7= <>
##$TPOAL= (0..7)
0.5 0.5 0.5 0.5 0.5 0.5 0.5 0.5 
##$TPOFFS= (0..7)
0 0 0 0 0 0 0 0 
##$TUNHIN= 0
##$TUNHOUT= 0
##$TUNXOUT= 0
##$USERA1= <user>
##$USERA2= <user>
##$USERA3= <user>
##$USERA4= <user>
##$USERA5= <user>
##$V9= 5
##$VALIST= <valist>
##$VCLIST= <CCCCCCCCCCCCCCC>
##$VD= 0
##$VDLIST= <DDDDDDDDDDDDDDD>
##$VPLIST= <PPPPPPPPPPPPPPP>
##$VTLIST= <TTTTTTTTTTTTTTT>
##$WBST= 1024
##$WBSW= 4
##$XGAIN= (0..3)
0 0 0 0 
##$XL= 0
##$YL= 0
##$YMAX_a= 147331
##$YMIN_a= -92785
##$ZGOPTNS= <>
##$ZL1= 120
##$ZL2= 120
##$ZL3= 120
##$ZL4= 120
##$ABSF1= 15.46042
##$ABSF2= -2.59143
##$ABSG= 5
##$ABSL= 3
##$ALPHA= 0
##$AQORDER= 0
##$ASSFAC= 0
##$ASSFACI= 0
##$ASSFACX= 0
##$ASSWID= 0
##$AUNMP= <proc_1d>
##$AZFE= 0.1
##$AZFW= 0.1
##$BCFW= 0
##$BC_mod= 2
##$BYTORDP= 0
##$COROFFS= 0
##$CY= -3
##$DATMOD= 1
##$DC= 0
##$DFILT= <>
##$DTYPP= 0
##$F1P= 0
##$F2P= 0
##$FCOR= 1
##$FTSIZE= 16384
##$FT_mod= 6
##$GAMMA= 0
##$GB= 0
##$INTBC= 1
##$INTSCL= 3.241238e-09
##$ISEN= 128
##$LB= 0.25
##$LEV0= 0
##$LPBIN= 0
##$MAXI= 10000
##$MC2= 0
##$MEAN= 0
##$ME_mod= 0
##$MI= 1.114404
##$NCOEF= 0
##$NC_proc= -8
##$NLEV= 6
##$NOISF1= 3.799351
##$NOISF2= 2.8
##$NSP= 0
##$NTH_PI= 0
##$NZP= 0
##$OFFSET= 15.48687
##$PC= 1
##$PHC0= -1711.55
##$PHC1= 3.39228
##$PH_mod= 1
##$PKNL= yes
##$PPARMOD= 0
##$PSCAL= 0
##$PSIGN= 0
##$REVERSE= no
##$SF= 200.130006970951
##$SI= 16384
##$SIGF1= 3
##$SIGF2= 2
##$SINO= 0.751879
##$SIOLD= 32768
##$SREGLST= <19F.Aceton>
##$SSB= 0
##$STSI= 16384
##$STSR= 0
##$SW_p= 3612.71676300578
##$SYMM= 0
##$S_DEV= 0
##$TDeff= 16384
##$TDoff= 0
##$TI= <>
##$TILT= no
##$TM1= 0
##$TM2= 0
##$TOPLEV= 0
##$USERP1= <user>
##$USERP2= <user>
##$USERP3= <user>
##$USERP4= <user>
##$USERP5= <user>
##$WDW= 1
##$XDIM= 16384
##$YMAX_p= 274201964
##$YMIN_p= -852361
$$ End of Bruker specific parameters
$$ ---------------------------------
##NTUPLES= NMR SPECTRUM
##VAR_NAME=  FREQUENCY,     SPECTRUM/REAL,   SPECTRUM/IMAG
##SYMBOL=    X,             R,               I
##VAR_TYPE=  INDEPENDENT,   DEPENDENT,       DEPENDENT
##VAR_FORM=  AFFN,          ASDF,            ASDF
##VAR_DIM=   16384,         16384,           16384
##UNITS=     HZ,            ARBITRARY UNITS, ARBITRARY UNITS
##FACTOR=    0.220516191357247, 1,           1
##FIRST=     3099.38736343612, 0,            0
##LAST=      -513.329399569664, 0,           0
##MIN=       -513.329399569664, -852361,     0
##MAX=       3099.38736343612, 274201964,    0
$$ Real data points
##PAGE= N=1
##DATA TABLE= (X++(R..R)), XYDATA
$$ [...]
$$ plain form
7453 -140547 -204172 -125244 -85778 100177 -132894 -93215 -305766 -294504 50729 80914 -146957
7442 -146957 -135014 -40827 -13531 41101 -5658 -103821 -93676 162777 25043 68460 190723
7431 190723 -72345 -136796 -145292 -284697 159502 407581 393580 403304 326144 428112 551843
7420 551843 388529 188027 157274 145304 153976 339121 220985 386254 426732 440510 518225
7409 518225 593811 524158 512527 557951 607170 742909 683941 595229 746156 777089 1071205
7398 1071205 1123493 869832 983662 1112749 1329766 1414735 1122490 938099 819025 1008091
7388 1008091 650235 528150 756045 440576 604370 424464 263946 56244 34962 127340
7378 127340 137917 242684 407731 398193 511152 346158 478034 547706 454331 636335 605338
$$ packed form
7453a40547o3625P8928L9466J85955k33071L9679k12551J1262L45233L0185k27871
7442a46957J1943R4187K7296N4632m6759r8163J0145K56453j37734M3417J22263
7431A90723k63068o4451q496j39405M44199K48079j4001R724p7160J01968J23731
7420E51843j63314k00502l0753j1970Q672J85145j18136J65269M0478J3778P7715
7409E18225P5586o9653j1631M5424M9219J35739n8968q8712J50927L0933K94116
7398A071205N2288k53661J13830J29087K17017Q4969k92245j84391j19074J89066
7388A008091l57856j22085K27895l15469J63794j79906j60518k07702k1282R2378
7378A27340J0577J04767J65047r538J12959j64994J31876O9672r3375J82004l0997
$$ plain form
7367 605338 315783 357976 290823 113249 217798 170150 306717 248445 1391 49112 59985
7356 59985 196054 266017 236940 362854 69745 -13140 -192098 -51822 107346 147648 114041
7345 114041 537031 497571 250032 279493 293090 384182 398448 400935 406373 504580 554928 367922
7333 367922 337649 361340 282743 224539 468236 443259 283721 557701 625616 571063 425894
7322 425894 429974 492008 418309 396853 574783 330091 507268 538279 387240 385161 417342
7311 417342 527587 430377 258141 242496 295051 213009 448523 497004 620714 505080 509837
7300 509837 725396 703850 439313 282930 255070 153419 359845 377031 403803 644629
7290 644629 379211 278986 550148 630268 647265 340356 454284 503053 358647 522245
$$ packed form
7367F05338k89555M2193o7153j77574J04549m7648J36567n8272k47054M7721J0873
7356E9985J36069O9963k9077J25914k93109q2885j78958J40276J59168M0302l3607
7345A14041M22990l9460k47539K9461J3597R1092J4266K487N438R8207N0348j87006
7333C67922l0273K3691p8597n8204K43697k4977j59538K73980O7915n4553j45169
7322D25894M080O2034p3699k1456J77930k44692J77177L1011j51039k079L2181
7311D17342J10245r7210j72236j5645N2555q2042K35514M8481J23710j15634M757
7300E09837K15559k1546k64537j56383k7860j01651K06426J7186K6772K40826
7290F44629k65418j00225K71162Q0120J6997l06909J13928M8769j44406J63598
$$ plain form
7280 522245 751065 585996 572641 704383 603933 489959 718281 979022 773894 883691
7270 883691 896483 800183 730736 787807 826638 718046 628584 565068 817422 402843 565603
7259 565603 807316 746831 715752 738075 697749 725956 717159 632260 653604 576035 826464
7248 826464 907898 1020766 1017056 1293173 1400036 1375222 1340532 1523172 1563123 1666857 1614927
7237 1614927 1695817 1690834 1810931 1824462 1733389 1668039 1650070 1925518 1917105 1978128 2088499
7226 2088499 2104456 2133243 2144736 2039391 2254188 2447179 2432935 2396168 2485255 2637660 2921547
7215 2921547 2865506 2963487 2950308 3163984 3493469 3434993 3615081 4131786 4126445 4186857 4192128
7204 4192128 4224010 4367007 4573222 4714404 5043255 5183052 5445631 5900713 6137997 6423568
$$ packed form
7280E22245K28820j65069j3355J31742j00450j13974K28322K60741k05128J09797
7270H83691J2792r6300o9447N7071L8831j08592q9462o3516K52354m14579J62760
7259E65603K41713o0485l1079K2323m0326K8207q797q4899K1344p7569K50429
7248H26464Q1434J12868l710K76117J06863k4814l4690J82640L9951J03734n1930
7237A614927Q0890m983J20097J3531r1073o5350j7969K75448q413O1023J10371
7226B088499J5957K8787J1493j05345K14797J92991j4244l6767Q9087J52405K83887
7215B921547n6041R7981j3179K13676L29485n8476J80088N16705n341O0412N271
7204D192128L1882J42997K06215J41182L28851J39797K62579M55082K37284K85571
$$ plain form
7194 6423568 6702023 7176895 7432622 7643662 8296399 8673669 9226288 10001657 10538081 10919193
7184 10919193 11614415 12208984 12626718 13509273 14435682 15117585 15864823 16653226 17210027
7175 17210027 18048956 18674843 19352418 20304092 20723625 21104942 21561797 21687221 22058229
7166 22058229 22283035 22269392 22080451 22132460 21878016 21923750 21534808 21096767 20663985 20164198
7156 20164198 19621792 18899321 18145879 17739300 17055188 16338912 15488693 14918209 14549523
7147 14549523 13865083 13028365 12356778 11869651 11417029 10894828 10469953 10248181 9764117
7138 9764117 8906464 8521286 8365577 7727169 7232375 7102921 6873011 6688379 6508096 6153840
7128 6153840 5917553 5721464 5717845 5398049 5230822 4989872 4884113 4950277 4961657 4442542
$$ packed form
7194F423568K78455M74872K55727K11040O52737L77270N52619P75369N36424L81112
7184A0919193O95222N94569M17734Q82555R26409O81903P47238P88403N56801
7175A7210027Q38929O25887O77575R51674M19533L81317M56855J25424L71008
7166B2058229K24806j3643j88941N2009k54444M5734l88942m38041m32782m99787
7156B0164198n42406p22471p53442m06579o84112p16276q50219n70484l68686
7147A4549523o84440q36718o71587m87127m52622n22201m24875k21772m84064
7138I764117q57653l85178j55709o38408m94794j29454k29910j84632j80283l54256
7128F153840k36287j96089l619l19796j67227k40950j05759O6164J1380n19115
$$ plain form
7118 4442542 4181882 4307060 4111464 4039919 4154910 4170681 4039765 3724621 3900753 3969206
7108 3969206 3840380 3781674 4016466 4074016 4062815 4120167 3869700 3768110 3553717 3655048
7098 3655048 3417685 3222469 3365186 3270270 3003102 2629930 2660221 2662350 2536452 2407338
7088 2407338 2491379 2485973 2281943 2281529 2272165 2156730 1992697 1930287 1804395 1662881 1704257
7077 1704257 1569669 1463009 1633712 1629043 1590464 1633916 1387019 1420366 1622985 1818795
7067 1818795 1680906 1762948 1441467 1217775 1273315 1239713 1379592 1410237 1221314 1514261
7057 1514261 1423066 1358309 1490682 1643923 1679981 1332984 1222841 1098200 898496 899190 1160391
7046 1160391 1084841 1101263 895911 1036678 1120198 793447 650006 960704 1233800 1130748
$$ packed form
7118D442542k60660J25178j95596p1545J14991J5771j30916l15144J76132O8453
7108C969206j28826n8706K34792N7550j1201N7352k50467j01590k14393J01331
7098C655048k37363j95216J42717r4916k67168l73172L0291K129j25898j29114
7088B407338Q4041n406k04030m14r364j15435j64033o2410j25892j41514M1376
7077A704257j34588j06660J70703m669l8579M3452k46897L3347K02619J95810
7067A818795j37889Q2042l21481k23692N5540l3602J39879L0645j88923K92947
7057A514261r1195o4757J32373J53241L6058l46997j10143j24641j99704O94K61201
7046A160391p5550J6422k05352J40767Q3520l26751j43441L10698K73096j03052
$$ plain form
7036 1130748 1065347 1054522 890718 967737 989681 694039 624942 871110 860914 692964 715650
7025 715650 840063 776433 882611 855797 787217 789146 674570 764124 1077899 966057 795157
7014 795157 799686 1095050 1022513 1078334 894418 831767 776859 813628 858053 1125780 1154841
7003 1154841 1067770 1239749 1272756 1506451 1358998 1465924 1576728 1606217 1672098 1987702
6993 1987702 2333481 2574154 2670741 2921281 2804868 2684367 2765395 3031799 3111893 3111178 2782256
6982 2782256 2837642 2898157 3072136 3393062 3602026 3607429 3419936 3413261 3240430 3021798 3028967
6971 3028967 3129901 2877251 2357149 2075396 1743704 1686336 1891620 1857414 1784777 1591282
6961 1591282 1436391 1416520 1684681 1548441 1393365 1590450 1278265 1124229 1319299 1174588
$$ packed form
7036A130748o5401j0825j63804P7019K1944k95642o9097K46168j0196j67950K2686
7025G15650J24413o3630J06178k6814o8580J929j14576Q9554L13775j11842j70900
7014G95157M529K95364p2537N5821j83916o2651n4908L6769M4425K67727K9061
7003A154841q7071J71979L3007K33695j47453J06926J10804K9489O5881L15604
6993A987702L45779K40673R6587K50540j16413j20501Q1028K66404Q0094p15l28922
6982B782256N5386O0515J73979L20926K08964N403j87493o675j72831k18632P169
6971C028967J00934k52650n20102k81753l31692n7368K05284l4206p2637j93495
6961A591282j54891j9871K68161j36240j55076J97085l12185j54036J95070j44711
$$ plain form
6951 1174588 1030263 645914 739655 860173 1013022 1327593 1226144 1092354 1041832 1005035
6941 1005035 1183090 1192104 1059268 1257927 1281283 1314491 1549163 1711372 1790785 2015863
6931 2015863 2175832 2368411 2623224 2735502 2748116 2758131 2939623 2960733 2857796 2861238
6921 2861238 3038545 2951871 2869609 2856049 3316250 3582324 3054078 2646886 2493541 2354536
6911 2354536 2581003 2488370 2322559 2206767 1987209 1799704 1441705 1448569 1679191 1541739
6901 1541739 1572949 1500980 1237228 1387447 1550763 1460435 1401731 1552269 1678884 1601193
6891 1601193 1528249 1498832 1525487 1597107 1369463 1449969 1229959 990193 1085947 989746 933590
6880 933590 1016852 980077 915533 783121 1004282 989697 1049521 1082572 767517 732128 951472
$$ packed form
6951A174588j44325l84349R3741J20518J52849L14571j01449j33790n0522l6797
6941A005035J78055R014j32836J98659K3356L3208K34672J62209P9413K25078
6931B015863J59969J92579K54813J12278J2614J0015J81492K1110j02937L442
6921B861238J77307q6674q2262j3560M60201K66074n28246m07192j53345j39005
6911B354536K26467r2633j65811j15792k19558j87505l57999O864K30622j37452
6901A541739L1210p1969k63752J50219J63316r0328n8704J50538J26615p7691
6891A601193p2944k9417K6655P1620k27644Q0506k20010k39766R5754r6201n6156
6880I33590Q3262l6775o4544j32412K21161j4585N9824L3051l15055l5389K19344
$$ plain form
6869 951472 965629 829739 912770 871172 1135439 1244911 1061393 1014314 789578 783968 801660
6858 801660 866242 807596 611629 667400 729832 736242 783698 878617 1065881 1143602 1051261
6847 1051261 1120984 1017458 678274 875478 990289 929931 1025353 1146817 1487263 1475772
6837 1475772 1335594 1212568 1162354 1240934 1358176 1416432 1550393 1421896 929120 868203
6827 868203 829804 869216 963181 903255 955017 849641 1219819 1352127 932865 789151 984110
6816 984110 1032706 894321 841464 653942 603091 815344 883960 738520 778626 869039 1035008
6805 1035008 888770 599916 701979 831761 827036 894149 688250 870493 1075117 1254333
6795 1254333 986509 826709 959120 988686 896552 821519 819859 1149601 1199286 1007879 845186
$$ packed form
6869I51472J4157j35890Q3031m1598K64267J09472j83518m7079k24736n610J7692
6858H01660O4582n8646j95967N5771O2432O410M7456R4919J87264P7721r2341
6847A051261O9723j03526l39184J97204J14811o0358R5422J21464L40446j1491
6837A475772j40178j23026n0214P8580J17242N8256J33961j28497m92776o0917
6827H68203l8399L9412R3965n9926N1762j05376L70178J32308m19262j43714J94959
6816I84110M8596j38385n2857j87522n0851K12253O8616j45440M0106R0413J65969
6805A035008j46238k88854J02063J29782m725O7113k05899J82243K04624J79216
6795A254333k67824j59800J32411K9566r2134p5033j660L29742M9685j91407j62693
$$ plain form
6784 845186 926137 996446 824505 786559 964219 1397743 1541610 1346438 802169 502008
6774 502008 359784 740167 841383 610001 822310 860966 283941 620045 918341 970049
6764 970049 949774 964311 860500 847840 794186 921880 1004605 1004166 960388 866298 760684
6753 760684 1055850 821410 794607 841967 920796 995452 1441326 1677110 1563976 1927013
6743 1927013 2024802 2050915 2336223 2822770 3165754 3429729 3250794 3164473 2901936 3239964
6733 3239964 3500514 3419614 3338546 3509661 3543966 3682652 3913465 4013491 3777016 3835954
6723 3835954 3814180 3566575 3585816 3545565 3294106 3392602 3216227 3142011 3379697 3579627
6713 3579627 3984115 4111685 4210563 4343320 4254023 3938979 4007246 4239037 4176292 4032166
$$ packed form
6784H45186Q0951P0309j71941l7946J77660M33524J43867j95172n44269l00161
6774E02008j42224L80383J01216k31382K12309L8656n77025L36104K98296N1708
6764I70049k0275J4537j03811j2660n3654J27694Q2725m39m3778r4090j05614
6753G60684K95166k34440k6803M7360P8829P4656M45874K35784j13134L63037
6743A927013R7789K6113K85308M86547L42984K63975j78935q6321k62537L38028
6733C239964K60550q0900q1068J71115L4305J38686K30813J00026k36475N8938
6723C835954k1774k47605J9241m0251k51459R8496j76375p4216K37686J99930
6713C579627M04488J27570R8878J32757q9297l15044O8267K31791o2745j44126
$$ plain form
6703 4032166 3753810 3851179 3971489 4172422 4052960 3541158 3483638 3423566 3361454 3299293
6693 3299293 3015845 2775391 2668404 2509422 2335743 2194027 1997835 2137655 2206602 1973223
6683 1973223 1805589 1664883 1547502 1403958 1668138 1715371 1667320 1530687 1529974 1288491
6673 1288491 1291818 1414051 1311413 1254012 1176829 1372978 1407001 1455776 1386107 1494789 1566681
6662 1566681 1557928 1334887 1364727 1467797 1370157 1555930 1415228 1441090 1374416 1332114 1143023
6651 1143023 1107835 1024798 1006790 1321393 1207366 1255093 1481220 1456743 1250906 1305108 1391145
6640 1391145 1483009 1527526 1557827 1538169 1351390 1170131 1012225 1274933 1417111 1052820
6630 1052820 1113703 1139318 1242559 1445830 1627675 1702133 1566252 1530390 1332824 1136957
$$ packed form
6703D032166k78356R7369J20310K00933j19462n11802n7520o0072o2112o2161
6693C299293k83448k40454j06987j58982j73679j41716j96192J39820O8947k33379
6683A973223j67634j40706j17381j43544K64180M7233m8051j36633p13k41483
6673A288491L327J22233j02638n7401p7183J96149L4023M8775o9669J08682P1892
6662A566681q753k23041K9840J03070r7640J85773j40702K5862o6674m2302j89091
6651A143023l5188q3037j8008L14603j14027M7727K26127k4477k05837N4202Q6037
6640A391145R1864M4517L0301j9658j86779j81259j57906K62708J42178l64291
6630A052820O0883K5615J03241K03271J81845P4458j35881l5862j97566j95867
$$ plain form
6620 1136957 1295993 1606666 1480285 1481253 1731150 1658684 1560668 1426760 1651910 1579752 1645374
6609 1645374 1518081 1537920 1727324 1558955 1868489 1631805 1627306 1650506 1636574 1782716
6599 1782716 1768890 1832996 1825076 1713492 1678486 1769655 2046559 2152191 1917317 2086073 2254000
6588 2254000 2113728 2209307 2169820 1946834 2208514 2351695 2636012 2600791 2424096 2615260
6578 2615260 2553321 2670222 2849506 2992777 2811763 2643211 2920535 2974209 2874381 3015535
6568 3015535 3122841 3451065 3667858 3845270 4352166 4448222 4432501 4553095 4989502 5566592
6558 5566592 5976459 6276625 6710059 6890241 7015017 7225814 6961603 6814530 6779195 6688612
6548 6688612 6318362 5823713 5196007 5102243 4898044 4874814 4788144 4427606 4408564 4558003
$$ packed form
6620A136957J59036L10673j26381R68K49897p2466r8016j33908K25150p2158O5622
6609A645374j27293J9839J89404j68369L09534k36684m499K3200j3932J46142
6599A782716j3826O4106p920j11584l5006R1169K76904J05632k34874J68756J67927
6588B254000j40272R5579l9487k22986K61680J43181K84317l5221j76695J91164
6578B615260o1939J16901J79284J43271j81014j68552K77324N3674r9828J41154
6568C015535J07306L28224K16793J77412N06896R6056j5721J20594M36407N77090
6558E566592M09867L00166M33434J80182J24776K10797k64211j47073l5335r0583
6548F688612l70250m94649o27706r3764k04199k3230q6670l60538j9042J49439
$$ plain form
6538 4558003 4358476 4158876 3894871 3590659 3911855 3713730 3641811 3431559 3387561 3464287
6528 3464287 3338799 3009171 2950154 3045995 2805015 2537513 2483697 2374858 2389916 2317401
6518 2317401 2397623 2578476 2335705 2448195 2125593 2101970 2114847 2061388 2130410 2374444
6508 2374444 2346788 2468120 2153653 1710780 1720991 1894390 2035125 2124329 1918255 1700729
6498 1700729 1934453 2083274 1925450 1788745 2012061 2014559 1729318 1591433 1847349 1690820
6488 1690820 1754841 1898380 1951947 1819009 1847832 1829231 1888423 2050347 2042380 1984736 1810108
6477 1810108 1804941 1953153 2088837 2444583 2534467 2399265 2456589 2559516 2486246 2590026
6467 2590026 2876952 2901992 2927912 2694075 2622310 2793550 3146096 3193444 3020830 3045139
$$ packed form
6538D558003j99527j99600k64005l04212L21196j98125p1919k10252m3998P6726
6528C464287j25488l29628n9017R5841k40980k67502n3816j08839J5058p2515
6518B317401Q0222J80853k42771J12490l22602k3623J2877n3459O9022K44034
6508B374444k7656J21332l14467m42873J0211J73399J40735Q9204k06074k17526
6498A700729K33724J48821j57824j36705K23316K498k85241j37885K55916j56529
6488A690820O4021J43539N3567j32938K8823j8601N9192J61924p967n7644j74628
6477A810108n167J48212J35684L55746Q9884j35202N7324J02927p3270J03780
6467B590026K86926K5040K5920k33837p1765J71240L52546M7348j72614K4309
$$ plain form
6457 3045139 3090519 3287058 3341158 3479968 3692313 3623662 3742180 3707058 3933407 4008259
6447 4008259 3934910 4096059 4196252 4347675 4282457 4310432 4327741 4374911 4514338 4896011
6437 4896011 5073820 5308533 5402403 5325392 5426914 5314932 5346272 5521810 5646293 5770131
6427 5770131 5981715 6105000 6180797 6238547 6378966 6841372 7015024 7027183 7280704 7696734
6417 7696734 7936068 8523654 8593973 8967523 9432342 9917846 10449553 10559531 11020593 11554042
6407 11554042 11956802 12477655 13477883 14282012 15094573 16211527 17165963 18116432 19207810
6398 19207810 20582439 21937329 22951943 24296977 26006844 28082273 30164594 32911649
6390 32911649 36269745 40619336 45761234 52710203 60972778 71156090 83695802 97515060
$$ packed form
6457C045139M5380J96539N4100J38810K12345o8651J18518l5122K26349P4852
6447D008259p3349J61149J00193J51423o5218K7975J7309M7170J39427L81673
6437D896011J77809K34713R3870p7011J01522j11982L1340J75538J24483J23838
6427E770131K11584J23285P5797N7750J40419M62406J73652J2159K53521M16030
6417G696734K39334N87586P0319L73550M64819M85504N31707J09978M61062N33449
6407A1554042M02760N20853J000228Q04129Q12561J116954R54436R50469J091378
6398A9207810J374629J354890J014614J345034J709867K075429K082321K747055
6390C2911649L358096M349591N141898O948969Q262575J0183312J2539712J3819258
$$ plain form
6382 97515060 107287886 106352181 101577053 99370865 98117305 96482850 92642261 83474670
6374 83474670 73844071 66828236 61450086 57183415 53317322 49947313 47362606 45239017
6366 45239017 43493365 41889620 39960907 38382895 37208823 36395815 35721671 35187079 34936466
6357 34936466 34673360 34580514 34835951 34672694 34432747 34064644 34263066 34677414 35056102 35200824
6347 35200824 35045217 35007774 34926798 35123540 35554959 36259908 36977720 37808905 38918266 40675344
6337 40675344 43208496 45735725 48818567 51810304 54305961 55716259 56335239 56122810
6329 56122810 55529326 54901773 54328859 52810047 51120145 49761684 48731670 48513384 48745446
6320 48745446 49455432 50897474 52824738 55242256 58006881 60172355 62092890 63750733
$$ packed form
6382I7515060R772826r35705m775128k206188j253560j634455l840589r167591
6374H3474670r630599p015835n378150m266671l866093l370009k584707k123589
6366D5239017j745652j603745j928713j578012j174072q13008o74144n34592k50613
6357C4936466k63106r2846K55437j63257k39947l68103J98422M14348L78688J44722
6347C5200824j55607l7443q0976J96742M31419P04949P17812Q31185J109361J757078
6337D0675344K533152K527229L082842K991737K495657J410298O18980k12429
6329E6122810n93484o27553n72914j518812j689902j358461j030014k18286K32062
6320D8745446P09986J442042J927264K417518K764625K165474J920535J657843
$$ plain form
6312 63750733 65187878 65514402 65049614 63741012 62123950 60027480 58075644 56335926
6304 56335926 53981431 51850567 49733565 48249731 47083923 46225033 45617621 45617537 46014039
6295 46014039 46798264 48300500 50149000 52480474 54958280 57476595 59479409 61346480
6287 61346480 62613559 63141174 63059320 62116311 60759666 58842881 56867149 54986680 53075262
6278 53075262 50968485 49302147 47879214 47093861 47025777 47356116 48601139 50245018 51699898
6269 51699898 53039342 54062026 53748371 53104289 51829099 50499540 48952355 46810447
6261 46810447 44535255 42227596 39963070 38207073 36567222 34965533 33762306 32763987
6253 32763987 31871732 31357446 30288570 29287512 28603652 28000934 27450603 26990595 26344040
$$ packed form
6312F3750733J437145L26524m64788j308602j617062k096470j951836j739718
6304E6335926k354495k130864k117002j483834j165808q58890o07412q4L96502
6295D6014039P84225J502236J848500K331474K477806K518315K002814J867071
6287F1346480J267079N27615q1854r43009j356645j916785j975732j880469j911418
6278E3075262k106777j666338j422933p85353o8084L30339J245023J643879J454880
6269E1699898J339444J022684l13655o44082j275190j329559j547185k141908
6261D6810447k275192k307659k264526j755997j639851j601689j203227r98319
6253C2763987q92255n14286j068876j001058o83860o02718n50331m60008o46555
$$ plain form
6244 26344040 25613538 24784892 23802498 23092862 22494578 21557303 20947139 20372458 19686025
6235 19686025 19326938 18866216 18137006 17314454 16600587 15873760 15586604 14985849 14172358
6226 14172358 13319011 12683425 12123632 11531751 11182561 10622142 10517978 10492259 10169625 9749364
6216 9749364 9434937 9247740 9003795 9009641 8559475 8192151 8077314 8072873 7829286 7780200
6206 7780200 7763895 7773394 7723762 7751918 7546806 7417968 7566121 7448187 7552030 7719494
6196 7719494 7755694 7510877 7541237 7663900 7337973 7501852 7451385 7329994 7131768 7126208
6186 7126208 7520747 7708690 7296099 7398194 7214032 7289254 7175201 6803624 6865000 6822328
6176 6822328 6973702 6925080 6840656 6821139 6796650 6654830 6507715 6290703 6264107 6270360 6388411
$$ packed form
6244B6344040p30502q28646r82394p09636n98284r37275o10164n74681o86433
6235A9686025l59087m60722p29210q22552p13867p26827k87156o00755q13491
6226A4172358q53347o35586n59793n91881l49190n60419j04164k5719l22634m20261
6216I749364l14427j87197k43945N846m50166l67324j14837m441k43587m9086
6206G780200j6305R499m9632K8156k05112j28838J48153j17934J03843J67464
6196G719494L6200k44817L0360J22663l25927J63879n0467j21391j98226n560
6186G126208L94539J87943m12591J02095j84162P5222j14053l71577O1376m2672
6176F822328J51374m8622q4424j9517k4489j41820j47115k17012k6596O253J18051
$$ plain form
6165 6388411 6173268 6156760 6159587 6137412 5876668 5804504 5903606 5953906 5963290 5945956 6047438
6154 6047438 5861061 5776146 5633240 5661251 5546434 5278537 5282346 5261319 4870701 4800707 4822118
6143 4822118 4736546 4598592 4465999 4372964 4402719 4181543 3759266 3925503 3842251 3940866
6133 3940866 3894649 3886711 3871467 3777245 3869235 3870735 3577063 3679597 3568675 3543025 3462137
6122 3462137 3297040 3321978 3407330 3421266 3452553 3301415 3148331 3221563 3345199 3165558
6112 3165558 3092856 2952428 2763235 2920180 3013106 2999407 2876218 3148969 3098145 2771429
6102 2771429 2848768 2899051 3058570 3177804 2918187 2992267 2979864 3022124 3410053 3181858
6092 3181858 3045933 2963622 2961261 3263170 3023442 3006223 2969194 2678872 2806886 2926406
$$ packed form
6165F388411k15143j6508K827k2175k60744p2164R9102N0300R384j7334J01482
6154F047438j86377q4915j42906K8011j14817k67897L809k1027l90618o9994K1411
6143D822118q5572j37954j32593r3035K9755k21176m22277J66237q3252R8615
6133C940866m6217p938j5244r4222R1990J500k93672J02534j10922k5650q0888
6122C462137j65097K4938Q5352J3936L1287j51138j53084P3232J23636j79641
6112C165558p2702j40428j89193J56945R2926j3699j23189K72751n0824l26716
6102B771429P7339N0283J59519J19234k59617P4080j2403M2260L87929k28195
6092C181858j35925q2311k361L01909k39728j7219l7029k90322J28014J19520
$$ plain form
6082 2926406 2812123 2952170 2860521 3099972 3374860 3043310 2760798 3229121 3330406 3269259
6072 3269259 3180800 3216985 3409920 3713266 3422536 3250823 3090445 3287642 3457806 3524272
6062 3524272 3436473 3281578 3509915 3784063 3952716 3704454 3707245 3731317 3805842 3605364
6052 3605364 3977478 3727682 3614607 3429822 3568531 3748772 3867202 3935924 3700379 3598817
6042 3598817 3529570 3392177 3571479 3664857 3428545 3482302 3696854 3851471 3567515 3451377
6032 3451377 3835706 3969784 3673477 3564106 3783215 3858680 3934824 4218046 4322770 3880912
6022 3880912 3753779 4218016 4314907 4145388 3991432 4245383 4498976 4500400 4403989 4509366
6012 4509366 4405418 4123742 4189049 4158147 3940819 4407414 4291709 4133125 4164538 4296118
$$ packed form
6082B926406j14283J40047r1649K39451K74888l31550k82512M68323J01285o1147
6072C269259q8459L6185J92935L03346k90730j71713j60378J97197J70164O6466
6062C524272q7799j54895K28337K74148J68653k48262K791K4072P4525k00478
6052C605364L72114k49796j13075j84785J38709J80241J18430O8722k35545j01562
6042C598817o9247j37393J79302R3378k36312N3757K14552J54617k83956j16138
6032C451377L84329J34078k96307j09371K19109P5465P6144K83222J04724m41858
6022C880912j27133M64237R6891j69519j53956K53951K53593J424r6411J05377
6012D509366j03948k81676O5307l0902k17328M66595j15705j58584L1413J31580
$$ plain form
6002 4296118 4303480 4418058 4133590 3986619 4045249 4159255 3993870 4042789 4338471 4367548
5992 4367548 4494160 4345796 4593157 4906123 5131404 5182204 4981473 5045190 5259002 5534433
5982 5534433 5526486 5596352 5834590 5802859 6110792 6329202 6530675 7016219 7378909 7422050
5972 7422050 7709300 8189914 8882051 9255342 9491611 9477533 9256883 9151838 8967035 8965732
5962 8965732 9179912 8657755 8308064 8157178 7938942 7721127 7771654 7580206 7394547 7075038
5952 7075038 6811403 6679538 6844839 6714021 6500196 6354581 6083338 5974577 5944147 6038539
5942 6038539 6045096 5924910 5713207 5970009 5718245 5670769 5704077 5632745 5728591 5763931 5668887
5931 5668887 5754884 5753222 5565522 5580390 5661932 5502607 5638694 5448384 5642879 5765933
$$ packed form
6002D296118P362J14578k84468j46971N8630J14006j65385M8919K95682K9077
5992D367548J26612j48364K47361L12966K25281N0800k00731O3717K13812K75431
5982E534433p947O9866K38238l1731L07933K18410K01473M85544L62690M3141
5972G422050K87250M80614O92137L73291K36269j4078k20650j05045j84803j303
5962H965732K14180n22157l49691j50886k18236k17815N0527j91448j85659l19509
5952G075038k63635j31865J65301j30818k13825j45615k71243j08761l0430R4392
5942F038539O557j20186k11703K56802k51764m7476L3308p1332R5846L5340r5044
5931E668887Q5997j662j87700J4868Q1542j59325J36087j90310J94495J23054
$$ plain form
5921 5765933 5676802 5873012 5962162 6206883 6028091 5858733 6044025 6066746 6124338 5941506
5911 5941506 5956861 5962842 5742442 5913111 5823537 6154301 6257317 6061315 5971782 5931521 6236381
5900 6236381 6333287 6263148 6502624 6532463 6666903 7066231 6890780 6720862 7006015 7000639
5890 7000639 7263609 7471816 7396997 7351693 7529673 7492297 7502284 7716976 7545792 7460701 7353516
5879 7353516 7079618 6928039 6812040 6626827 6350051 6045398 6313335 6308997 6008461 5874271
5869 5874271 5969689 5964899 5991355 6008860 5971954 5733977 5598794 5692137 5749366 5855976 5800439
5858 5800439 5734736 5587652 5367927 5115996 4979178 5152364 4893725 4907934 5261996 4972518
5848 4972518 5196777 5249772 5207487 5189107 5352953 5168391 5195450 5289732 5242065 5099479 5006421
$$ packed form
5921E765933q9131J96210Q9150K44721j78792j69358J85292K2721N7592j82832
5911E941506J5355N981k20400J70669q9574L30764J03016j96002q9533m0261L04860
5900F236381R6906p0139K39476K9839J34440L99328j75451j69918K85153n376
5890G000639K62970K08207p4819m5304J77980l7376R987K14692j71184q5091j07185
5879G353516k73898j51579j15999j85213k76776l04653K67937m338l00536j34190
5869E874271R5418m790K6456J7505l6906k37977j35183R3343N7229J06610n5537
5858E800439o5703j47084k19725k51931j36818J73186k58639J4209L54062k89478
5848D972518K24259N2995m2285j8380J63846j84562K7059R4282m7667j42586r3058
$$ plain form
5837 5006421 4978092 5022106 5340786 5549401 5631698 5452100 5368642 5390053 5383149 5528054 5781839
5826 5781839 6048848 6297205 5992199 5695294 6094637 6148532 6080684 6074973 5972513 6027205
5816 6027205 5906978 5981873 6383649 6689174 6557169 6626055 6693230 6681152 6514980 6389407
5806 6389407 6889019 6828986 6304894 6335049 6027718 5938299 5807046 5838708 5925668 5799254
5796 5799254 5491656 5532521 5680240 5429739 5125259 5039101 5182863 5418686 5316767 5221065
5786 5221065 5297436 5441209 5194156 5157901 5197547 4989099 4989407 4918139 5076921 5171203 4886704
5775 4886704 5173817 5365502 5512383 5289305 5238989 5568758 5743438 5664422 5629830 5566802
5765 5566802 5655463 5704205 5663745 5445738 5366403 5082503 5052826 5409870 5426650 5366025 5062040
$$ packed form
5837E006421k8329M4014L18680K08615Q2297j79598q3458K1411o904J44905K53785
5826E781839K67009K48357l05006k96905L99343N3895o7848n711j02460N4692
5816F027205j20227P4895M01776L05525j32005O8886O7175j2078j66172j25573
5806F389407M99612o0033n24092L0155l07331q9419j31253L1662Q6960j26414
5796E799254l07598M0865J47719k50501l04480q6158J43762K35823j01919r5702
5786E221065P6371J43773k47053l6255L9646k08448L08p1268J58782R4282k84499
5775D886704K87113J91685J46881k23078n0316L29769J74680p9016l4592o3028
5765E566802Q8661M8742m0460k18007p9335k83900k9677L57044J6780o0625l03985
$$ plain form
5754 5062040 4870717 4934532 5155678 5093646 5185558 4777763 4710554 4942288 4889450 4588312
5744 4588312 4391782 4450569 4699046 4817170 4717707 4574988 4323867 4379040 4683259 4742809
5734 4742809 4958219 4988708 5021416 4763279 4872902 4996672 5038012 5349997 5473418 5451971
5724 5451971 5506429 5466289 5357072 5427434 5701432 5554951 5375967 5650616 5761130 5498260
5714 5498260 5715430 5698801 5635545 5949427 6234066 6080863 5841763 6115517 6277974 6606561
5704 6606561 6662599 6494482 6816974 7034055 7539199 7824373 8048869 8058649 8319000 8504869
5694 8504869 8608294 8908237 9119679 9181241 9168283 9170949 9117031 9081006 9312471 9740804 9860283
5683 9860283 9836003 9909968 9644932 9387511 9648424 9724156 10002820 10041007 10004261 9980866 9875786
$$ packed form
5754E062040j91323O3815K21146o2032R1912m07795o7209K31734n2838l01138
5744D588312j96530N8787K48477J18124r9463j42719k51121N5173L04219N9550
5734D742809K15410L0489L2708k58137J09623J23770M1340L11985J23421k1447
5724E451971N4458m0140j09217P0362K73998j46481j78984K74649J10514k62870
5714E498260K17170j6629o3256L13882K84639j53203k39100K73754J62457L28587
5704F606561N6038j68117L22492K17081N05144K85174K24496R780K60351J85869
5694H504869J03425K99943K11442O1562j2958K666n3918l6025K31465M28333J19479
5683I860283k4280P3965k65036k57421K60913P5732K78664L8187l6746k3395j05080
$$ plain form
5672 9875786 9693723 9736859 9670861 9669080 9980556 10034691 9868931 9803818 10185332 10904700 11244427
5661 11244427 11172573 11180400 11389677 11220302 11560836 12065750 12103919 12338220 12263377 12413979
5651 12413979 12722290 12681475 12733223 13191130 13473956 13793090 13871547 13776564 13979456 14484216
5641 14484216 14881756 15274745 15737759 16226770 16591746 16911830 17601223 18072873 18639602
5632 18639602 19573650 20205919 20958451 21729710 22429858 23497476 24537086 25949807 27356650
5623 27356650 28564745 29653783 31128057 32560184 34333340 36371261 38557358 40458858
5615 40458858 42952197 45681623 48753755 51875998 55281086 59207661 63590545 68769803
5607 68769803 74310814 80535540 87124652 94258720 101686932 109432208 117228734 124480195
$$ packed form
5672I875786j82063M3136o5998j781L11476N4135j65760o5113L81514P19368L39727
5661A1244427p1854P827K09277j69375L40534N04914L8169K34301p4843J50602
5651A2413979L08311m0815N1748M57907K82826L19134P8457r4983K02892N04760
5641A4484216L97540L92989M63014M89011L64976L20084O89393M71650N66729
5632A8639602R34048O32269P52532P71259P00148J067618J039610J412721J406843
5623B7356650J208095J089038J474274J432127J773156K037921K186097J901500
5615D0458858K493339K729426L072132L122243L405088L926575M382884N179258
5607F8769803N541011O224726O589112P134068P428212P745276P796526P251461
$$ plain form
5599 124480195 131219694 137155865 141349417 144202289 145689475 144900079 143156170 140625242
5591 140625242 136584807 131393537 125883333 119217822 112326578 105654441 98908224 92267971
5583 92267971 86007689 80420374 75112319 70092134 65738897 61597610 58059456 54646773
5575 54646773 51552364 48815296 46196980 43787705 41920938 39857789 37736892 36310469
5567 36310469 34719091 33027513 31619382 30335960 29147658 28365894 27344150 26088422
5559 26088422 25227183 24270288 23392189 22738121 21901619 21399476 20853232 20273952 19508861
5550 19508861 18785030 18229170 17754685 17255271 16691038 16457035 15788613 15073832 14877002
5541 14877002 14464245 14133438 13719464 13754748 13644605 13287953 12809062 12337415 12003919 11797864
$$ packed form
5599A24480195O739499N936171M193552K852872J487186p89396j743909k530928
5591A40625242m040435n191270n510204o665511o891244o672137o746217o640253
5583I2267971o260282n587315n308055n020185m353237m141287l538154l412683
5575E4646773l094409k737068k618316k409275j866767k063149k120897j426423
5567C6310469j591378j691578j408131j283422j188302p81764j021744j255728
5559B6088422q61239r56895q78099o54068q36502n02143n46244n79280p65091
5550A9508861p23831n55860m74485m99414n64233k34003o68422p14781j96830
5541A4877002m12757l30807m13974L5284j10143l56652m78891m71647l33496k06055
$$ plain form
5531 11797864 11594394 11305689 10864638 10709829 10735855 10732649 10484979 10157544 9827860 9849233
5521 9849233 9817156 9853502 9513787 9457624 9261980 9292377 9243098 9009132 9126355 9078240 8633146
5510 8633146 8778836 8737361 8629162 8488048 8753884 8807332 8593568 8819894 8860667 8664094
5500 8664094 8407678 8294254 8269517 8274223 8070908 8420763 8228449 8015139 7816396 7760269
5490 7760269 7692692 7406378 7353418 7138113 7091820 7108573 7063053 7042400 6958693 6910621 6895241
5479 6895241 6788966 6641189 6569048 6507846 6367161 6431160 6733902 6673376 6537630 6543693 6381035
5468 6381035 6470455 6578200 6793558 6814890 6520124 6757658 7243430 7043207 7083109 7198558
5458 7198558 7472744 7909618 8515849 9147007 9606096 10285749 11482301 12239531 12219518 12183282
$$ packed form
5531A1797864k03470k88705m41051j54809K6026l206k47670l27435l29684K1373
5521I849233l2077L6346l39715n6163j95644L0397m9279k33966J17223m8115m45094
5510H633146J45690m1475j08199j41114K65836N3448k13764K26326M0773j96573
5500H664094k56416j13424k4737M706k03315L49855j92314k13310j98743n6127
5490G760269o7577k86314n2960k15305m6293J6753m5520k0653q3707m8072j5380
5479F895241j06275j47777p2141o1202j40685O3999L02742o0526j35746O063j62658
5468F381035Q9420J07745K15358K1332k94766K37534M85772k00223L9902J15449
5458G198558K74186M36874O06231O31158M59089O79653J196552P57230k0013l6236
$$ plain form
5448 12183282 12144410 12409846 12578739 12268417 11395057 10815094 10289953 10184806 9504253 9178424
5438 9178424 8976838 8501289 8686862 8685937 8434206 8181938 7913660 7672980 7200606 7192391
5428 7192391 7231760 7165851 6993305 7197451 7005250 7076998 7150571 7156300 7701837 8002999 7973416
5417 7973416 7775837 7614403 7990199 8004685 8441039 8442483 8343888 8471963 8422579 8133230
5407 8133230 7812784 7354805 7321227 7519796 6954926 6998708 6735370 6590785 6653758 6517610
5397 6517610 6308806 5875166 5617085 5661405 5554350 5554745 5717245 5489709 5343051 5345149 5473741
5386 5473741 5418381 5367925 5423988 5402416 5264304 5026542 5159917 5322115 5146915 4656455
5376 4656455 4569054 4767636 4904831 4618796 4544538 4667257 4626811 4600000 4227698 4027355
$$ packed form
5448A2183282l8872K65436J68893l10322q73360n79963n25141j05147o80553l25829
5438I178424k01586m75549J85573r25k51731k52268k68278k40680m72374q215
5428G192391L9369o5909j72546K04146j92201P1748P3573N729N45537L01162k9583
5417G973416j97579j61434L75796J4486M36354J444r8595J28075m9384k89349
5407H133230l20446m57979l3578J98569n64870M3782k63338j44585O2973j36148
5397F517610k08804m33640k58081M4320j07055L95J62500k27536j46658K098J28592
5386E473741n5360n0456N6063k1572j38112k37762J33375J62198j75200m90460
5376D656455q7401J98582J37195k86035p4258J22719m0446k6811l72302k00343
$$ plain form
5366 4027355 3901487 4272217 4154085 3899406 4046293 4070862 4137788 4121738 4157819 4120097
5356 4120097 4104087 3979547 4003854 3848938 3731297 4100076 4179103 3860493 4113318 4161902
5346 4161902 4039854 4019694 4046090 3870606 3671849 3896897 4170450 4003648 3983868 3842409
5336 3842409 4088155 4093260 4135129 4142566 4243111 4081956 4077884 3965211 3868867 4064352 4199831
5325 4199831 4024061 4038300 4088566 3758358 3872658 3709467 3782760 3633996 3664055 3612396
5315 3612396 3891266 4069952 3709559 3542914 3501058 3613000 3666547 3853864 3598780 3529444
5305 3529444 3684936 3839584 3957465 4109786 4007952 4083550 3972137 4175858 4262370 4035739
5295 4035739 4345039 4347151 4203760 4580542 4856708 4719612 5063827 4951192 4886729 4908536
$$ packed form
5366D027355j25868L70730j18132k54679J46887K4569O6926j6050L6081l7722
5356D120097j6010j24540K4307j54916j17641L68779P9027l18610K52825M8584
5346D161902j22048k0160K6396j75484j98757K25048K73553j66802j9780j41459
5336C842409K45746N105M1869P437J00545j61155m072j12673r6344J95485J35479
5325D199831j75770J4239N0266l30208J14300j63191P3293j48764L0059n1659
5315C612396K78870J78686l60393j66645m1856J11942N3547J87317k55084o9336
5305C529444J55492J54648J17881J52321j01834P5598j11413K03721Q6512k26631
5295D035739L09300K112j43391L76782K76166j37096L44215j12635o4463K1807
$$ plain form
5285 4908536 4907732 5024115 5187517 5197179 5257132 5355442 5259545 5285737 5557986 5709333 5931531
5274 5931531 5942726 5811916 5689172 5807989 6104971 5846402 5857940 5913169 6112993 5995948
5264 5995948 6399971 6540601 6482352 6882542 7289420 7256851 7502216 7911080 8127873 8305116
5254 8305116 8328983 8148735 7750353 7672796 7594548 7467688 7229358 7276162 7125092 6996601
5244 6996601 6929683 6960317 6581089 6638580 6806135 6665766 6731364 6716213 6638255 6744264 7368270
5233 7368270 7338878 7246359 7466792 7601949 7795374 8034759 8311342 8619218 9110832 8956975
5223 8956975 9390695 10002667 10485071 11053344 11745431 12616883 13041243 13348716 13675097 14074390
5213 14074390 14488386 14741565 14762299 14895510 15128410 15123863 15702462 16046370 16141453 16774142
$$ packed form
5285D908536q04J16383J63402R662N9953R8310r5897K6192K72249J51347K22198
5274E931531J1195j30810j22744J18817K96982k58569J1538N5229J99824j17045
5264E995948M04023J40630n8249M00190M06878l2569K45365M08864K16793J77243
5254H305116K3867j80248l98382p7557p8248j26860k38330M6804j51070j28491
5244F996601o6918L0634l79228N7491J67555j40369O5598j5151p7958J06009O24006
5233G368270k9392r2519K20433J35157J93425K39385K76583L07876M91614j53857
5223H956975M33720O11972M82404N68273O92087Q71452M24360L07473L26381L99293
5213A4074390M13996K53179K0734J33211K32900m547N78599L43908R5083O32689
$$ plain form
5203 16774142 17323053 17453690 17558352 17739443 17988293 17832120 17527362 17284933 17041671
5194 17041671 16788255 16220083 15947617 15815145 15848948 15837537 15912160 16223211 16547716 16867406
5184 16867406 17269450 17882759 18074890 18935606 19824394 20502277 21452354 22161896 22897678
5175 22897678 23630452 24331186 25190276 25850521 26918593 27681162 28724263 29827955 31088667
5166 31088667 32381087 33118916 33936627 34442212 34951718 35429574 35523854 35637349 35707941 35332477
5156 35332477 35540276 35934601 35800337 36300344 37134179 38227773 39493937 41210784 43082112
5147 43082112 44769624 46815003 49170263 51528467 54415533 57876549 61296265 65770819
5139 65770819 71211271 77177298 84196885 92534994 103722195 116817588 132342488 150752355
$$ packed form
5203A6774142N48911J30637J04662J81091K48850j56173l04758k42429k43262
5194A7041671k53416n68172k72466j32472L3803j1411P4623L11051L24505L19690
5184A6867406M02044O13309J92131Q60716Q88788O77883R50077P09542P35782
5175B2897678P32774P00734Q59090O60245J068072P62569J043101J103692J260712
5166C1088667J292420P37829Q17711N05585N09506M77856R4280J13495P0592l75464
5156C5332477K07799L94325j34264N00007Q33835J093594J266164J716847J871328
5147D3082112J687512K045379K355260K358204K887066L461016L419716M474554
5139F5770819N440452N966027P019587Q338109J1187201J3095393J5524900J8409867
$$ plain form
5131 150752355 171344033 183595005 179594367 172237271 168259309 166318862 163641764 158834840
5123 158834840 145984646 133198841 125054597 118615661 111031432 102388922 95035361 88808055
5115 88808055 83705681 78906971 73401818 67434751 62587753 57980674 54394171 50818941
5107 50818941 47972017 45290079 43270645 41423039 39722279 37785324 35880980 34418274
5099 34418274 33008207 31793414 30645340 29555787 28514121 27610533 26755958 25899498 24754550
5090 24754550 23664125 23200650 22606011 21857684 21129832 20669788 20194739 19499055 19007793
5081 19007793 18709483 18607636 18371911 18111655 17615737 16898594 16942134 16674542 16263742 16025603
5071 16025603 16154300 15621938 15041855 14979953 14962406 15116551 14933057 14863958 14622282 14585856
$$ packed form
5131A50752355K0591678J2250972m000638p357096l977962j940447k677098m806924
5123A58834840j2850194j2785805q144244o438936p584229q642510p353561o227306
5115H8808055n102374m798710n505153n967067m846998m607079l586503l575230
5107E0818941k846924k681938k019434j847606j700760j936955j904344j462706
5099C4418274j410067j214793j148074j089553j041666r03588q54575q56460j144948
5090B4754550j090425m63475n94639p48327p27852m60044m75049o95684m91262
5081A9007793k98310j01847k35725k60256m95918p17143M3540k67592m10800k38139
5071A6025603J28697n32362n80083o1902j7547J54145j83494o9099k41676l6426
$$ plain form
5061 14585856 14585022 14727043 14685657 14591927 14526673 14261762 13997703 14185721 14132118 13969113 13876563
5050 13876563 13941155 13892251 13532900 13533566 13437872 13595442 13439370 13443589 13551784 13426675 13679926
5039 13679926 13918292 13836649 13641505 13602950 13576412 13475913 13616772 13976638 13894057 13814785
5029 13814785 13903963 13906979 14038349 13931413 13955756 13794200 14251585 14351007 14218731 14535162
5019 14535162 14595637 14667583 14665741 14879884 15041772 15412373 15374033 15649290 15972469 16109248
5009 16109248 16584977 17242317 17598598 18216012 18988799 19328754 19468444 19867399 20412052
5000 20412052 21129140 21729808 22143444 22609080 23316379 23300958 23308888 23337878 22908173 22850283
4990 22850283 22843401 22757106 22245114 22260482 22505015 22601327 22706066 22849194 22947495 23288430
$$ packed form
5061A4585856q34J42021m1386r3730o5254k64911k64059J88018n3603j63005r2550
5050A3876563O4592m8904l59351O66r5694J57570j56072M219J08195j25109K53251
5039A3679926K38366q1643j95144l8555k6538j00499J40859L59866q2581p9272
5029A3814785Q9178L016J31370j06936K4343j61556M57385R9422j32276L16431
5019A4535162O0475P1946j842K14143J61888L70601l8340K75257L23179J36779
5009A6109248M75729O57340L56281O17414P72787L39955J39690L98955N44653
5000B0412052P17088O00668M13636M65636P07299j5421P930K8990m29705n7890
4990B2850283o882q6295n11992J5368K44533R6312J04739J43128R8301L40935
$$ plain form
4980 23288430 23462517 23925382 24216813 24565296 24846313 24974307 25073485 25372773 25806856 26276758
4970 26276758 26869693 27439764 27851294 28298927 28801346 29330142 29784966 29982430 30334321
4961 30334321 30841872 31440765 32141790 33013814 33416063 34220786 35156487 35892434 36611915
4952 36611915 37738493 38897841 40063328 41768501 43527237 45268710 46803449 48487909
4944 48487909 50316700 52931950 55448067 57958549 61029723 64182380 67317343 70625481
4936 70625481 74460908 78552414 82932510 87487541 92803953 98796471 105223346 112275616
4928 112275616 119461894 126852309 135011095 143789135 152453516 160433002 167460355 173063005
4920 173063005 177172512 179784066 181568502 181722451 180348972 178209159 174883516 170789181
$$ packed form
4980B3288430J74087M62865K91431L48483K81017J27994R9178K99288M34083M69902
4970B6276758N92935N70071M11530M47633N02419N28796M54824J97464L51891
4961C0334321N07551N98893P01025Q72024M02249Q04723R35701P35947P19481
4952C6611915J126578J159348J165487J705173J758736J741473J534739J684460
4944D8487909J828791K615250K516117K510482L071174L152657L134963L308138
4936G0625481L835427M091506M380096M555031N316412N992518O426875P052270
4928A12275616P186278P390415Q158786Q778040Q664381P979486P027353N602650
4920A73063005M109507K611554J784436J53949j373479k139813l325643m094335
$$ plain form
4912 170789181 165403544 159738882 153573998 148004585 142661439 137593575 132814257 128356894
4904 128356894 124566978 120889725 117960785 115386834 112762573 110641709 108834551 106772306
4896 106772306 104980261 103780342 102662309 101505990 101028679 100991776 101034839 101623381 102489890
4887 102489890 103466804 105114004 107312901 110135622 112658419 115899542 118506818 120629620
4879 120629620 122544644 123615230 123723588 122796748 121104210 118847370 116365299 113411079
4871 113411079 110339208 107178488 104187058 101024771 97874431 95013455 92776198 90843804
4863 90843804 88782936 86668998 84539620 82439616 80728723 78679714 76406233 74153287
4855 74153287 71908307 69421106 66798446 64207613 61238842 58583244 55954189 53374733
$$ packed form
4912A70789181n385637n664662o164884n569413n343146n067864m779318m457363
4904A28356894l789916l677253k928940k573951k624261k120864j807158k062245
4896A06772306j792045j199919j118033j156319m77311l6903M3063N88542Q66509
4887A02489890R76914J647200K198897K822721K522797L241123K607276K122802
4879A20629620J915024J070586J08358r26840j692538k256840k482071k954220
4871A13411079l071871l160720k991430l162287l150340k860976k237257j932394
4863I0843804k060868k113938k129378k100004j710893k049009k273481k252946
4855G4153287k244980k487201k622660k590833k968771k655598k629055k579456
$$ plain form
4847 53374733 50862121 48534296 46641156 45053372 43190401 41612783 40056611 38745467
4839 38745467 37309694 35958654 34939763 33709647 32669512 31783207 30815697 29940729 29374481
4830 29374481 28814400 28047733 26990231 26244030 25558322 25038230 24373550 24066601 23892582
4821 23892582 23127178 22923593 22510834 22367006 22362800 21778415 21537430 21501606 21174577 21280365
4811 21280365 21267496 21285345 21089550 20996581 21076841 21195919 20907194 20459730 20485758 20143826
4801 20143826 19927750 20166289 20079486 20019328 20079084 20018037 20097446 19987459 19888715 19646607
4791 19646607 19779782 20171451 20124946 20220537 20358867 20223698 20236452 20572328 20933346 20755201
4781 20755201 20945120 20910000 20740669 21051401 20812027 20567422 20495876 20392436 20600891 20647825
$$ packed form
4847E3374733k512612k327825j893140j587784j862971j577618j556172j311144
4839C8745467j435773j351040j018891j230116j040135q86305r67510q74968n66248
4830B9374481n60081p66667j057502p46201o85708n20092o64680l06949j74019
4821B3892582p65404k03585m12759j43828m206n84385k40985l5824l27029J05788
4811B1280365j2869J7849j95795r2969Q0260J19078k88725m47464K6028l41932
4801B0143826k16076K38539q6803o0158N9756o1047P9409j09987r8744k42108
4791A9646607J33175L91669m6505R5591J38330j35169J2754L35876L61018j78145
4781B0755201J89919l5120j69331L10732k39374k44605p1546j03440K08455M6934
$$ plain form
4771 20647825 20646646 20352038 20071722 20365026 20705058 20745113 20465215 20548964 20688579 21114772
4761 21114772 21282978 21378839 21470993 21721235 21733900 21792741 22340602 22603440 22551181 22704377
4751 22704377 22617842 22713921 23423560 23443517 23685932 23971500 24157645 24655617 24946154 25375979
4741 25375979 26035222 26584943 27480670 28403805 29126916 29980742 31213845 32593223 34500850
4732 34500850 36288025 38117124 40056834 42281353 44391069 46171823 48412298 51121744
4724 51121744 54145749 57845490 61857759 67173303 73478013 81587322 91461193 104097503
4716 104097503 119466013 138357492 159775757 178562265 182638107 176082825 170867351
4709 170867351 168326185 165931781 161592061 151360952 136039604 123127953 112799157
$$ packed form
4771B0647825j179k94608k80316K93304L40032M0055k79898Q3749J39615M26193
4761B1114772J68206R5861R2154K50242J2665N8841N47861K62838n2259J53196
4751B2704377q6535R6079P09639J9957K42415K85568J86145M97972K90537M29825
4741B5375979O59243N49721Q95727R23135P23111Q53826J233103J379378J907627
4732C4500850J787175J829099J939710K224519K109716J780754K240475K709446
4724E1121744L024005L699741M012269N315544O304710Q109309R873871J2636310
4716A04097503J5368510J8891479K1418265J8786508M075842o555282n215474
4709A70867351k541166k394404m339720j0231109j5321348j2911651j0328796
$$ plain form
4702 112799157 104866568 97905124 91529231 85669430 81093793 77393896 74033726 70984534
4694 70984534 68431002 66524443 64387051 62675516 61699392 61116671 60703721 60644153 61033804
4685 61033804 61517859 61937359 62103136 62851214 63757345 64946218 66075301 67452075 69208985
4676 69208985 70876832 72081706 73158461 75194931 77854089 80860451 84499675 88327983
4668 88327983 91931584 94995864 98091232 100904560 103175728 105187629 107269371 109407506
4660 109407506 111496770 113561559 116182814 119619543 124291821 130325595 137452526 146460174
4652 146460174 157982616 172116796 188696179 207114732 226114651 242333779 252641389
4645 252641389 258655515 264133181 270328224 274201964 271537860 261930632 248733053 236084390
$$ packed form
4702A12799157p932589o961444o375893n859801m575637l699897l360170l049192
4694G0984534k553532j906559k137392j711535r76124n82721m12950n9568L89651
4685F1033804M84055M19500J65777P48078R06131J188873J129083J376774J756910
4676F9208985J667847J204874J076755K036470K659158L006362L639224L828308
4668H8327983L603601L064280L095368K813328K271168K011901K081742K138135
4660A09407506K089264K064789K621255L436729M672278O033774P126931R007648
4652A46460174J1522442J4134180J6579383J8418553J8999919J6219128J0307610
4645B52641389O014126N477666O195043L873740k664104r607228j3197579j2648663
$$ plain form
4637 236084390 224690931 213604273 201586555 188621537 176812652 167326525 158603093
4630 158603093 151322257 144378627 138743993 134009849 130201155 126419709 122246457 117853297
4622 117853297 113655285 109462534 105220333 101154761 97186157 93347280 89988587 86780470
4614 86780470 83754680 81506961 79495311 77682997 75638434 73905174 71982154 69954511
4606 69954511 67798021 66107280 64425531 62416320 60545541 58646719 57041988 55529904
4598 55529904 53927238 52663881 51683223 50589856 49837312 49014033 47936853 47185854 46542375
4589 46542375 46462364 46171761 46088030 46385320 46611739 46949940 47309415 47971463 48432349 48822589
4579 48822589 49687361 49846673 50451181 50556224 50827381 51247545 51898310 52426449 53184963
$$ packed form
4637B36084390j1393459j1086658j2017718j2965018j1808885r486127q723432
4630A58603093p280836o943630n634634m734144l808694l781446m173252m393160
4622A17853297m198012m192751m242201m065572l968604l838877l358693l208117
4614H6780470l025790k247719k011650j812314k044563j733260j923020k027643
4606F9954511k156490j690741j681749k009211j870779j898822j604731j512084
4598E5529904j602666j263357r80658j093367p52544q23279j077180p50999o43479
4589D6542375q0011k90603q3731K97290K26419L38201L59475O62048M60886L90240
4579D8822589Q64772J59312O04508J05043K71157M20164O50765N28139P58514
$$ plain form
4570 53184963 53916189 54096732 53971314 53604371 53462207 53673012 53626296 53554095 53744216 53730926
4560 53730926 53413745 52341749 51262722 50758307 50305196 49673376 49261632 48139843 47153781
4551 47153781 46579311 46242959 46217792 46170505 46096266 46464830 47112810 47964381 49089959 50092913
4541 50092913 51089911 52482824 54357660 56114038 58130369 59803735 61578134 63199408
4533 63199408 64999268 66547643 68422962 70200704 71973213 73863303 75682531 77376781
4525 77376781 78965745 80854959 82670107 84453420 85927417 87251333 89202122 91506035
4517 91506035 94302226 98439282 103299262 109522280 117583115 127393385 139106875 152619953
4509 152619953 167692029 183876643 199344672 208606751 209055650 204065841 198017708 192343351
$$ packed form
4570E3184963P31226J80543j25418l66943j42164K10805m6716p2201J90121j3290
4560E3730926l17181j071996j079027n04415m53111o31820m11744j121789r86062
4551D7153781n74470l36352k5167m7287p4239L68564O47980Q51571J125578J002954
4541E0092913R96998J392913J874836J756378K016331J673366J774399J621274
4533F3199408J799860J548375J875319J777742J772509J890090J819228J694250
4525G7376781J588964J889214J815148J783313J473997J323916J950789K303913
4517I1506035K796191M137056M859980O223018Q060835R810270J1713490J3513078
4509A52619953J5072076J6184614J5468029R262079M48899m989809o048133n674357
$$ plain form
4501 192343351 185618554 176565681 163682557 149307579 136004470 124425961 114877551
4494 114877551 106161509 98081186 91062032 85093958 79688105 74683334 70279617 66234117
4486 66234117 62576227 59659600 56729228 53966332 51493245 49408588 47704995 46065956
4478 46065956 44263793 42606444 41533262 40485081 39979044 39503479 39142699 38968467 39222354
4469 39222354 39372118 40000362 40241322 40050534 39793201 39049954 38280232 37733776 37110558
4460 37110558 36273480 35404871 34657023 34347003 33867867 33956731 33881360 34041600 34127195 33850475
4450 33850475 33363267 32506401 31936522 30872615 30039004 28997626 28072122 26816001 25841938
4441 25841938 25167385 24662842 23901317 22993312 22635664 22174151 21943669 22065957 21962612
$$ packed form
4501A92343351o724797r052873j2883124j4374978j3303109j1578509r548410
4494A14877551q716042q080323p019154n968074n405853n004771m403717m045500
4486F6234117l657890k916627k930372k762896k473087k084657j703593j639039
4478D6065956j802163j657349j073182j048181n06037m75565l60780j74232K53887
4469C9222354J49764O28244K40960j90788k57333p43247p69722n46456o23218
4460C7110558q37078q68609p47848l10020m79136Q8864p5371J60240Q5595k76720
4450C3850475m87208q56866n69879j063907q33611j041378r25504j256121r74063
4441B5841938o74553n04543p61525r08005l57648m61513k30482J22288j03345
$$ plain form
4432 21962612 22085725 22066278 22316503 22305307 22564910 22750680 22875123 22866706 22620993 22749061
4422 22749061 22435637 21888275 21448056 21249544 20761081 20279111 20101397 20020318 19806903 20024571
4412 20024571 20080960 20117538 20126008 19812395 19069815 18690422 18277119 17507200 17145682 16649679
4402 16649679 16083140 15544024 15097967 14632672 14311793 14086442 13885691 13965635 13630749 13359028
4392 13359028 13005176 12668872 12687835 12750895 12511464 12240128 12026107 11908046 11789100 11758021
4382 11758021 11927882 12037628 11788907 11702372 11503199 11259005 11320669 11397774 11202712 10793448
4372 10793448 10887016 10982182 10861884 10749207 10704593 10602489 10840339 10900651 10546590 10562687
4362 10562687 10758153 10772546 10499251 10397784 10739869 10284755 9870254 9422145 9226886 9062756
$$ packed form
4432B1962612J23113j9447K50225j1196K59603J85770J24443q417k45713J28068
4422B2749061l13424n47362m40219j98512m88463m81970j77714q1079k13415K17668
4412B0024571N6389L6578Q470l13613p42580l79393m13303p69919l61518m96003
4402A6649679n66539n39116m46057m65295l20879k25351k00751P9944l34886k71721
4392A3359028l53852l36304J8963O3060k39431k71336k14021j18061j18946l1079
4382A1758021J69861J09746k48721q6535j99173k44194O1664P7105j95062m09264
4372A0793448R3568R5166j20298j12677m4614j02104K37850O0312l54061J6097
4362A0562687J95466J4393k73295j01467L42085m55114m14501m48109j95259j64130
$$ plain form
4352 9062756 9120725 9128569 8744467 8656003 8878456 8776212 8576904 8634870 8641206 8524315 8546684
4341 8546684 8642088 8418055 8283034 8209521 8177676 7989496 8183888 8090507 7791674 7569482
4331 7569482 7402340 7110459 7281185 7343831 7287653 6990245 7215009 7174935 6861124 6693965
4321 6693965 6960698 6767189 6516394 6371590 6283070 6394738 6509442 6457210 6086219 6303866
4311 6303866 6123557 5775953 5602481 5612606 5719819 5691173 5997996 5871243 5414384 5206432
4301 5206432 5043863 5218465 5396131 5592279 5640389 5601620 5482434 5215241 5248074 5452779
4291 5452779 5339817 5341047 5289060 5083057 5176110 5189672 5093067 5297442 5483832 5359155 5287707
4280 5287707 5198064 5303674 5366619 5345125 5245893 5088531 5160957 5018645 4773895 4655929
$$ packed form
4352I062756N7969P844l84102q8464K22453j02244j99308N7966O336j16891K2369
4341H546684R5404k24033j35021p3513l1845j88180J94392r3381k98833k22192
4331G569482j67142k91881J70726O2646n6178k97408K24764m0074l13811j67159
4321F693965K66733j93509k50795j44804q8520J11668J14704n2232l70991K17647
4311F303866j80309l47604j73472J0125J07213k8646L06823j26753m56859k07952
4301E206432j62569J74602J77666J96148M8110l8769j19186k67193L2833K04705
4291E452779j12962J230n1987k06003R3053J3562r6605K04375J86390j24677p1448
4280E287707q9643J05610O2945k1494r9232j57362P2426j42312k44750j17966
$$ plain form
4270 4655929 4740843 4906416 5372507 5274930 5087587 4998291 4880621 4926446 4923843 5019002 4937775
4259 4937775 4956815 4935357 5115233 5038597 4926038 5274030 5441201 5310767 5338066 5463122
4249 5463122 5230679 5150639 5454943 5827892 5754310 5591735 5622454 5626920 5871115 5864483 5935497
4238 5935497 6181587 6177475 6240293 6233636 6397847 6448059 6573618 6796829 6973427 7268946 7729298
4227 7729298 7973851 8090085 8250623 8207589 8093738 8040843 7998224 7792670 7569454 7316274
4217 7316274 7140396 7248431 7150158 6998898 6785517 6634108 6490728 6629072 6762223 6790847
4207 6790847 6660415 6837995 7225546 7059659 7045507 7376441 7535690 7811706 7831707 7958650
4197 7958650 8470210 8446705 8539071 9157648 9655431 10152556 10693333 10923246 11058306 11533500
$$ packed form
4270D655929Q4914J65573M66091r7577j87343q9296j17670M5825k603R5159q1227
4259D937775J9040k1458J79876p6636j12559L47992J67171j30434K7299J25056
4249E463122k32443q0040L04304L72949p3582j62575L0719M466K44195o632P1014
4238E935497K46090m112O2818o657J64211N0212J25559K23211J76598K95519M60352
4227G729298K44553J16234J60538m3034j13851n2895m2619k05554k23216k53180
4217G316274j75878J08035r8273j51260k13381j51409j43380J38344J33151K8624
4207F790847j30432J77580L87551j65887j4152L30934J59249K76016K0001J26943
4197G958650N11560k3505R2366O18577M97783M97125N40777K29913J35060M75194
$$ plain form
4187 11533500 11543830 11598667 11542383 11772859 11871269 11623015 11432229 11246572 11666423 11706310
4177 11706310 11440879 11666019 12236596 12657892 13109741 13766610 14501613 15135454 16097280
4168 16097280 17029078 18034828 18776769 19101595 19187105 19073950 19084320 18594571 18412440 17967075
4158 17967075 16997752 16246201 15388949 14727367 14284877 13670341 13426280 13311499 12993962
4149 12993962 13089055 13548521 13800527 13798487 14006429 13857337 13896854 14090082 14024484 14146253
4139 14146253 14261444 14256396 14147417 14316730 14357604 14702149 14964705 14933551 15213011 15406652
4129 15406652 15670435 15512084 15386745 15353550 14905902 14735841 14592475 14148378 13891286 13525761
4119 13525761 13313529 12829238 12477720 12046076 11740659 11500932 11455041 11588114 11688185 11625860
$$ packed form
4187A1533500J0330N4837n6284K30476R8410k48254j90786j85657M19851L9887
4177A1706310k65431K25140N70577M21296M51849O56869P35003O33841R61826
4168A6097280R31798J005750P41941L24826Q5510j13155J0370m89749j82131m45365
4158A7967075r69323p51551q57252o61582m42490o14536k44061j14781l17537
4149A2993962R5093M59466K52006k040K07942j49092L9517J93228o5598J21769
4139A4146253J15191n048j08979J69313M0874L44545K62556l1154K79460J93641
4129A5406652K63783j58351j25339l3195m47648j70061j43366m44097k57092l65525
4119A3525761k12232m84291l51518m31644l05417k39727m5891J33073J00071o2325
$$ plain form
4109 11625860 11547345 11482644 11758120 11965449 12114029 11839535 11822986 11614659 11332095 10968355
4099 10968355 10433925 10158933 9772390 9349270 8938044 8817793 8516827 8197643 8266981 8151514
4089 8151514 8313033 8670385 8401681 8311756 8232414 7803086 7734814 8095401 8083375 7972007
4079 7972007 8097844 8447929 8693696 8886490 8927021 8937829 9061453 9163199 9076955 8842233
4069 8842233 8887296 8567571 8194969 8020855 7502617 7217030 6857855 6550710 6318853 6049610
4059 6049610 5976101 5877745 5724070 5788834 5804538 5442570 4998590 4995984 5060583 5311844 5033962
4048 5033962 4610841 4819089 4759295 4771975 4633087 4437384 4245236 4212639 4313297 4332430
4038 4332430 4245956 4026999 4062408 4107843 4445733 4345029 4429900 4279817 4130989 4012279
$$ packed form
4109A1625860p8515o4701K75476K07329J48580k74494j6549k08327k82564l63740
4099A0968355n34430k74992l86543m23120m11226j20251l00966l19184O9338j15467
4089H151514J61519L57352k68704q9925p9342m29328o8272L60587j2026j11368
4079G972007J25837L50085K45767J92794M0531J0808J23624J01746q6244k34722
4069H842233M5063l19725l72602j74114n18238k85587l59175l07145k31857k69243
4059F049610p3509r8356j53675O4764J5704l61968m43980k606O4599K51261k77882
4048E033962m23121K08248n9794J2680j38888j95703j92148l2597J00658J9133
4038D332430q6474k18957L5409M5435L37890j00704Q4871j50083j48828j18710
$$ plain form
4028 4012279 3752763 3431061 3806367 4104656 4252786 4035534 3902903 4049919 3958839 3685706
4018 3685706 3538063 3501428 3264788 3438691 3544488 3424139 3434672 3680128 3860619 3824249
4008 3824249 3523015 3647932 3676921 3459367 3398292 3601993 3546478 3604133 3525473 3605738 3798340
3997 3798340 3598323 3421363 3524517 3514536 3425811 3676275 3483832 3404118 3341765 3195329
3987 3195329 3322621 3184472 3274620 3519789 3618184 3673316 3448290 3312323 3390524 3437456
3977 3437456 3428281 3399192 3367835 3376152 3664376 3514488 3501512 3368779 3331544 3455254 3777322
3966 3777322 3639513 3398508 3320260 3091798 3054846 3351932 3319373 3435370 3515789 3485950
3956 3485950 3675486 3701786 3477957 3568451 3767691 3602310 3634126 3635140 3725729 3489997 3699915
$$ packed form
4028D012279k59516l21702L75306K98289J48130k17252j32631J47016r1080k73133
4018C685706j47643l6635k36640J73903J05797j20349J0533K45456J80491l6370
4008C824249l01234J24917K8989k17554o1075K03701n5515N7655p8660Q0265J92602
3997C798340k00017j76960J03154r981q8725K50464j92443p9714o2353j46436
3987C195329J27292j38149R0148K45169R8395N5132k25026j35967P8201M6932
3977C437456r175k9089l1357Q317K88224j49888j2976j32733l7235J23710L22068
3966C777322j37809k41005p8248k28462l6952K97086l2559J15997Q0419k9839
3956C485950J89536K6300k23829R0494J99240j65381L1816J014R0589k35732K09918
$$ plain form
3945 3699915 3969040 4022171 4044193 3973693 4165051 4207286 3849106 3973121 4076576 4127691
3935 4127691 4494875 4434907 4320550 4231692 4340389 4657082 4650898 4394071 4572762 4893444
3925 4893444 4802469 5010451 5138614 5210205 5188450 5175021 5370083 5660426 5924394 5926541 5924377
3914 5924377 6037233 6031317 6322097 6290039 6667675 6655372 6762081 7148776 7161865 7035939
3904 7035939 7218938 7167576 7174120 6997064 6807181 6753548 6685825 6761395 6577883 6545115 6508515
3893 6508515 6626845 6791253 6913125 6936362 6911439 6887721 7017301 7115279 7256794 7377716
3883 7377716 7368127 7425191 7461630 7459819 7558339 7707355 7824135 8004070 7898420 7996722 7868456
3872 7868456 7633188 7515000 7414290 7328914 7225643 7234458 6921330 7088508 6900448 6991136
$$ packed form
3945C699915K69125N3131K2022p0500J91358M2235l58180J24015J03455N1115
3935D127691L67184n9968j14357q8858J08697L16693o184k56827J78691L20682
3925D893444r0975K07982J28163P1591k1755j3429J95062K90343K63968K147k164
3914E924377J12856n916K90780l2058L77636j2303J06709L86695J3089j25926
3904G035939J82999n1362O544j77056j89883n3633o7723P5570j83512l2768l6600
3893F508515J18330J64408J21872K3237k4923k3718J29580R7978J41515J20922
3883G377716r589N7064L6439j811R8520J49016J16780J79935j05650R8302j28266
3872G868456k35268j18188j00710q5376j03271Q815l13128J67178j88060R0688
$$ plain form
3862 6991136 6805267 6654322 6864302 6887408 6862280 6828387 6475543 6395811 6366733 6538582
3852 6538582 6424085 6232560 6119899 6069420 6090473 6435377 6524081 6302674 6383724 6439472
3842 6439472 6320470 6315562 6474230 6442030 6401327 6614970 6583282 6551756 6235521 6206262 6288551
3831 6288551 6159882 5981113 6008420 5848729 5796639 5842537 5884482 5906789 5885774 5899328 5979321
3820 5979321 6079936 6109932 5929330 5794158 5970887 6028660 6232820 6045732 5796335 5782728
3810 5782728 5661511 5461311 5594662 5898104 5979530 5697481 5702127 5477757 5359996 5308415
3800 5308415 5417898 5520385 5251025 5047985 5475893 5744772 5622118 5474877 5572251 5777466
3790 5777466 5587658 5499899 5502309 5419182 5449738 5293106 5538978 5470997 5410517 5561991 5384656
$$ packed form
3862F991136j85869j50945K09980K3106k5128l3893l52844p9732k9078J71849
3852F538582j14497j91525j12661n0479K1053L44904Q8704k21407Q1050N5748
3842F439472j19002m908J58668l2200m0703K13643l1688l1526l16235k9259Q2289
3831F288551j28669j78769K7307j59691n2090M5898M1945K2307k1015J3554P9993
3820E979321J00615K9996j80602j35172J76729N7773K04160j87088k49397j3607
3810E782728j21217k00200J33351L03442Q1426k82049M646k24370j17761n1581
3800E308415J09483J02487k69360k03040M27908K68879j22654j47241R7374K05215
3790E777466j89808q7759K410q3127L0556j56632K45872o7981o0480J51474j77335
$$ plain form
3779 5384656 5198274 5239740 5216160 5426513 5427645 5680079 5495366 5398018 5739902 5784949 5788663
3768 5788663 5965299 5860027 5580249 5810889 5766291 5627719 5931688 6020258 6074535 5775088
3758 5775088 5865823 5912981 5867693 6106812 5887718 5723481 5346487 5719873 5987225 6204140
3748 6204140 6322053 6335262 6199826 6106489 6354319 6386756 6331337 6159566 6261643 6192941
3738 6192941 6322493 6324728 6402079 6506285 6453789 6191796 6095189 6411206 6416799 6317428 6231929
3727 6231929 6182530 6056690 5951344 5867365 5988559 6176685 6370128 6491694 6566919 6480906
3717 6480906 6292177 6457833 6124869 6239416 6615445 6560284 6653227 6771902 6727502 6690797
3707 6690797 6749875 6771501 6764852 6450683 6426509 6431446 6649143 6682930 6762977 6572435 6317832
$$ packed form
3779E384656j86382M1466k3580K10353J132K52434j84713r7348L41884M5047L714
3768E788663J76636j05272k79778K30640m4598j38572L03969Q8570N4277k99447
3758E775088R0735M7158m5288K39119k19094j64237l76994L73386K67352K16915
3748F204140J17913J3209j35436r3337K47830L2437n5419j71771J02077o8702
3738F192941J29552K235P7351J04206n2496k61993r6607L16017N593r9371q5499
3727F231929m9399j25840j05346q3979J21194J88126J93443J21566P5225q6013
3717F480906j88729J65656l32964J14547L76029n5161R2943J18675m4400l6705
3707F690797N9078K1626o649l14169k4174M937K17697L3787Q0047j90542k54603
$$ plain form
3696 6317832 6104385 6081157 5800302 5605674 5697977 5873989 6100942 6140498 5992317 6122860
3686 6122860 6120094 6119448 6276115 6455274 6560424 6550218 6595289 6170895 6262262 6385953 5948821
3675 5948821 5916862 6128966 6275551 6364637 6037783 5748301 5808510 5771043 6065061 6491058
3665 6491058 6313561 6230198 6223951 6158136 6089122 5844314 5903474 6269223 6142812 6073920 6093901
3654 6093901 6138084 6045080 6096111 5972749 5851382 6080253 6400439 6480148 6497796 6409607 6255913
3643 6255913 6169709 6038841 6124081 6220092 6241205 6289699 6486309 6526834 6501015 6398413 6471586
3632 6471586 6732285 6659587 6597581 6578361 6651948 6713391 6683137 6908050 7069946 6915021 6707484
3621 6707484 7188869 7195628 7169626 7052103 7190054 7013869 6724332 7002482 7299514 7305218
$$ packed form
3696F317832k13447k3228k80855j94628R2303J76012K26953L9556j48181J30543
3686F122860k766o46J56667J79159J05150j0206M5071m24394R1367J23691m37132
3675E948821l1959K12104J46585Q9086l26854k89482O0209l7467K94018M25997
3665F491058j77497q3363o247o5815o9014k44808N9160L65749j26411o8892J9981
3654F093901M4183r3004N1031j23362j21367K28871L20186P9709J7648q8189j53694
3643F255913q6204j30868Q5240R6011K1113M8494J96610M0525k5819j02602P3173
3632F471586K60699p2698o2006j9220P3587O1443l0254K24913J61896j54925k07537
3621F707484M81385O759k6002j17523J37951j76185k89537K78150K97032N704
$$ plain form
3611 7305218 7250758 7367674 7462465 7535156 7704854 7708676 7617724 7779928 7770162 7820779 7938842
3600 7938842 7908621 7959956 8215503 8272752 8172216 8186982 8225509 8330194 8241263 8254789 8609028
3589 8609028 8744821 8666288 8648790 9180652 9255110 8883006 9131223 9272386 9206399 9372872
3579 9372872 9414066 9568457 9667085 9624840 9955075 9811435 9944694 10240139 10299149 10346611
3569 10346611 10190505 10465343 10549381 10786186 10855266 11004783 11294775 11229716 11389159 11447523
3559 11447523 11500635 11721380 11936050 12064943 11885667 11936825 11958126 12192810 12409457 12606823
3549 12606823 12657047 12848406 13265128 13587185 13692250 13604670 13952122 14506788 14545958 14934524
3539 14934524 15401335 15566860 15645550 15911782 16162457 16440289 16725740 16922067 17096541 17654497
$$ packed form
3611G305218n4460J16916R4791P2691J69698L822r0952J62204r766N0617J18063
3600G938842l0221N1335K55547N7249j00536J4766L8527J04685q8931J3526L54239
3589H609028J35793p8533j7498N31862P4458l72104K48217J41163o5987J66473
3579I372872M1194J54391R8628m2245L30235j43640J33259K95445N9010M7462
3569A0346611j56106K74838Q4038K36805O9080J49517K89992o5059J59443N8364
3559A1447523N3112K20745K14670J28893j79276N1158K1301K34684K16647J97366
3549A2606823N0224J91359M16722L22057J05065q7580L47452N54666L9170L88566
3539A4934524M66811J65525P8690K66232K50675K77832K85451J96327J74474N57956
$$ plain form
3529 17654497 17951223 18381794 18847651 18989845 19104712 19656573 19945109 20382545 20890819
3520 20890819 20976655 21314561 22041947 22663986 22826510 23314567 23824435 24398299 24927837 25230085
3510 25230085 25878905 26248861 26460690 27098480 27741314 28755839 29352015 29697020 30280382
3501 30280382 31275525 32045104 32793937 33388834 34093396 34730749 35591268 36712119 37867189
3492 37867189 38946556 40175159 41412862 42493800 43988953 45615047 47163805 48996806
3484 48996806 50724788 52595343 54830402 57251393 59772467 62738371 65450046 68303499
3476 68303499 71773771 75481790 79321982 82960543 86973260 91216138 94757646 97896410
3468 97896410 100307572 102224291 103107422 103164045 102901441 101630150 99626733 97461555 95038412
$$ packed form
3529A7654497K96726M30571M65857J42194J14867N51861K88536M37436N08274
3520B0890819Q5836L37906P27386O22039J62524M88057N09868N73864N29538L02248
3510B5230085O48820L69956K11829O37790O42834J014525N96176L45005N83362
3501C0280382R95143P69579P48833N94897P04562O37353Q60519J120851J155070
3492C7867189J079367J228603J237703J080938J495153J626094J548758J833001
3484D8996806J727982J870555K235059K420991K521074K965904K711675K853453
3476F8303499L470272L708019L840192L638561M012717M242878L541508L138764
3468I7896410K411162J916719Q83131N6623k62604j271291k003417k165178k423143
$$ plain form
3459 95038412 92247262 89570153 87043663 84391895 81510708 78903047 76463480 74490132
3451 74490132 72204366 69836086 68182765 66422081 64540013 63262669 61947619 60463881
3443 60463881 59285266 58571193 57611939 56862715 56234163 55880088 55328985 54391059 53390507
3434 53390507 52181599 51148010 49994571 49012785 48021269 46687671 45803442 44745997 43388001
3425 43388001 42477328 41443650 40561409 39848686 39013816 37784645 36938523 36041671 35144247
3416 35144247 34541839 33707232 33020251 32365731 31853978 31559336 31231624 30653145 30239296
3407 30239296 29966688 29736159 29462113 29041923 28468260 27871983 27675465 27281609 26866526
3398 26866526 26250165 25692885 25035099 24781831 24558811 23850105 23519989 23116324 22794261
$$ packed form
3459I5038412k791150k677109k526490k651768k881187k607661k439567j973348
3451G4490132k285766k368280j653321j760684j882068j277344j315050j483738
3443F0463881j178615p14073r59254p49224o28552l54075n51103r37926j000552
3434E3390507j208908j033589j153439r81786r91516j333598q84229j057445j357996
3425D3388001r10673j033678q82241p12723q34870j229171q46122q96852q97424
3416C5144247o02408q34607o86981o54520n11753k94642l27712n78479m13849
3407C0239296k72608k30529k74046m20190n73663n96277j96518l93856m15083
3398B6866526o16361n57280o57786k53268k23020p08706l30116m03665l22063
$$ plain form
3389 22794261 22650590 22296016 21895777 21482723 21371640 21142664 20779607 20615045 20431835
3380 20431835 20214815 19906815 19808164 19636032 19265659 19148186 18817088 18608413 18409321 18201090
3370 18201090 18061699 17549480 17685665 17788959 17597548 17312406 17004831 16881265 16720272
3361 16720272 16669956 16395100 16069457 15806208 15636610 15857742 15937439 15740123 15494503 15021223
3351 15021223 14978843 15015443 14640455 14724016 14580812 14410400 14090011 13977478 13802128 13901212
3341 13901212 14155296 14061564 13976630 13862250 13553479 13326874 13249442 13136252 13197511 12888821
3331 12888821 12758607 12959770 12867635 12947582 12673769 12731494 12362522 12208779 12278531 12373759
3321 12373759 12047090 11817853 11929808 12141732 12255824 12109001 11914765 11987705 12062773 11657248
$$ packed form
3389B2794261j43671l54574m00239m13054j11083k28976l63057j64562j83210
3380B0431835k17020l08000r8651j72132l70373j17473l31098k08675j99092k08231
3370A8201090j39391n12219J36185J03294j91411k85142l07575j23566j60993
3361A6720272n0316k74856l25643k63249j69598K21132P9697j97316k45620m73280
3351A5021223m2380L6600l74988Q3561j43204j70412l20389j12533j75350R9084
3341A3901212K54084r3732q4934j14380l08771k26605p7432j13190O1259l08690
3331A2888821j30214K01163r2135P9947k73813N7725l68972j53743O9752R5228
3321A2373759l26669k29237J11955K11924J14092j46823j94236P2940P5068m05525
$$ plain form
3311 11657248 11619538 11599769 11739937 11567118 11697059 11359161 11164340 11081991 11235041 11127167
3301 11127167 11315660 11341047 11100513 10949254 11174739 11048428 10906282 10798844 10523842 10570788
3291 10570788 10436880 10312324 10397310 10532380 10233772 10294579 10141884 10015324 10095134 10325279
3281 10325279 10206736 10000640 9885750 9854488 9750502 9521954 9776178 9612205 9579934 9773769
3271 9773769 9853910 9721898 9414275 9101771 9149097 8962054 8979859 8857056 8656233 8697967
3261 8697967 8858275 8930912 8582980 8433642 8556137 8501385 8256506 8363438 8512967 8411230
3251 8411230 8288933 8116751 8093323 7849414 7662602 8037475 7748558 7808399 7538861 7247911
3241 7247911 7322405 7177300 7441215 7675824 7435756 7291673 7419253 7361855 7155949 7160499
$$ packed form
3311A1657248l7710j9769J40168j72819J29941l37898j94821q2349J53050j07874
3301A1127167J88493K5387k40534j51259K25485j26311j42146j07438k75002M6946
3291A0570788j33908j24556Q4986J35070k98608O0807j52695j26560P9810K30145
3281A0325279j18543k06096j14890l1262j03986k28548K54224j63973l2271J93835
3271I773769Q0141j32012l07623l12504M7326j87043J7805j22803k00823M1734
3261H697967J60308P2637l47932j49338J22495n4752k44879J06932J49529j01737
3251H411230j22297j72182k3428k43909j86812L74873k88917N9841k69538k90950
3241G247911P4494j45105K63915K34609k40068j44083J27580n7398k05906M550
$$ plain form
3231 7160499 7458888 7616848 7415776 7579818 7669573 7241178 7223339 7550680 7605093 7400078
3221 7400078 7313657 7485053 7519306 7727558 7712180 7640068 7545279 7602367 7608419 7467857 7685755
3210 7685755 7676832 7991900 7961977 7883389 8206507 8215045 8579461 8772157 8716581 8597470 8606189
3199 8606189 8760985 8820819 9025644 8883470 9027015 9134156 9226549 9369460 9491958 9760101
3189 9760101 9707397 9771903 9834816 9663428 9843854 10065004 10289399 10591792 10448880 10618615
3179 10618615 10696609 10824138 11297792 11702527 11817144 11721092 11897509 12423732 12741886 13173268
3169 13173268 13459201 13472543 13656576 14077404 14475100 14822231 15251159 15703055 16450151 16930006
3159 16930006 17530092 18163579 18517692 19155181 19422339 19806603 20043580 20490800 21032166
$$ packed form
3231G160499K98389J57960k01072J64042Q9755m28395j7839L27341N4413k05015
3221G400078q6421J71396L4253K08252j5378p2112r4789N7088O052j40562K17898
3210G685755q923L15068k9923p8588L23118Q538L64416J92696n5576j19111Q719
3199H606189J54796N9834K04825j42174J43545J07141R2393J42911J22498K68143
3189I760101n2704O4506O2913j71388J80426K21150K24395L02393j42912J69735
3179A0618615P7994J27529M73654M04735J14617r6052J76417N26223L18154M31382
3169A3173268K85933J3342J84033M20828L97696L47131M28928M51896P47096M79855
3159A6930006O00086O33487L54113O37489K67158L84264K36977M47220N41366
$$ plain form
3150 21032166 21245819 21658165 22177141 22974881 23131527 23440517 23857452 24355284 24730926
3141 24730926 25237391 25667727 26064890 26998054 27681162 28723922 29780652 30612710 31655141
3132 31655141 33007222 34271346 35646693 37013729 37977396 39244160 40026426 40597995 40972541
3123 40972541 40835091 40853873 40804277 40154658 39593320 39360018 39065330 38573958 38278175 38221642
3113 38221642 38130076 38033179 38531347 38719579 39250953 39707411 40388267 40801970 41362499 42220534
3103 42220534 42969267 43822147 44477648 45062323 45362918 45870494 45881339 45768106 45291376 44812182
3093 44812182 44058759 43246105 42113989 40882478 39705364 39042845 38433931 36972037 36358681
3084 36358681 35942685 35307070 34830419 34621856 34584490 34373284 34130678 33894042 33801399 33444880
$$ packed form
3150B1032166K13653M12346N18976P97740J56646L08990M16935M97832L75642
3141B4730926N06465M30336L97163R33164O83108J042760J056730Q32058J042431
3132C1655141J352081J264124J375347J367036R63667J266764P82266N71569L74546
3123D0972541j37450J8782m9596o49619n61338k33302k94688m91372k95783n6533
3113C8221642r1566r6897M98168J88232N31374M56458O80856M13703N60529Q58035
3103D2220534P48733Q52880O55501N84675L00595N07576J0845j13233m76730m79194
3093D4812182p53423q12654j132116j231511j177114o62519o08914j461894o13356
3084C6358681m15996o35615m76651k08563l7366k11206k42606k36636r2643l56519
$$ plain form
3074 33444880 32998196 32711080 32271511 31592861 30826084 29707626 28535377 27759453 26956584
3065 26956584 25832583 24889479 24136815 23313864 22270127 21415458 20633237 19699328 19154795
3056 19154795 18442414 17787719 17469401 17232508 16923982 16268095 16049033 15540964 14773063
3047 14773063 14425516 14015550 13585308 13397858 13102869 12776453 12339413 11790997 11598325
3038 11598325 11377347 10944750 10624030 10517446 10178579 9573360 9314812 9207150 9063555
3029 9063555 8531369 8242892 8060344 7926864 7911246 7721048 7321252 7174395 7165020 7290197
3019 7290197 6851937 6577668 6427372 6332090 6234490 6058743 6031890 5957375 6022515 5886474
3009 5886474 5704816 5859169 5888338 5915164 5583945 4952047 5049521 5405370 5333876 5048698
$$ packed form
3074C3444880m46684k87116m39569o78650p66777j118458j172249p75924q02869
3065B6956584j124001r43104p52664q22951j043737q54669p82221r33909n44533
3056A9154795p12381o54695l18318k36893l08526o55887k19062n08069p67901
3047A4773063l47547m09966m30242j87450k94989l26416m37040n48416j92672
3038A1598325k20978m32597l20720j06584l38867o05219k58548j07662j43595
3029I063555n32186k88477j82548j33480j5618j90198l99796j46857r375J25177
3019G290197m38260k74269j50296r5282r7600j75747k6853p4515O5140j36041
3009E886474j81658J54353K9169K6826l31219o31898R7474L55849p1494k85178
$$ plain form
2999 5048698 4952760 5015990 4773050 4155895 4168064 4241261 4424760 4279638 4522024 4352406
2989 4352406 4274330 4188298 4107413 4263311 4271285 4147796 3593148 3372963 3455152 3539521 3692331
2978 3692331 3459010 3355012 3300324 3294762 3335870 3180173 3468616 3272389 3244226 3265057 3294989
2967 3294989 3279945 3217964 2952322 2899011 3049987 2958602 2938625 2620902 2591933 2388182 2188565
2956 2188565 2199984 2296573 2403623 2592476 2360448 2461191 2495653 2274110 2271008 2437227
2946 2437227 2487935 2362516 2152539 2043672 2189630 2187293 1870567 1934872 1946120 1784792
2936 1784792 1728522 1629668 1717692 1738261 1914858 1814885 1724615 1710263 1575300 1744554 1901237
2925 1901237 1410730 1210576 1287960 1665509 1701957 1531147 1746331 1610473 1657111 1685881
$$ packed form
2999E048698r5938O3230k42940o17155J2169P3197J83499j45122K42386j69618
2989D352406p8076q6032q0885J55898P974j23489n54648k20185Q2189Q4369J52810
2978C692331k33321j03998n4688n562M1108j55697K88443j96227k8163K0831K9932
2967C294989j5044o1981k65642n3311J50976r1385j9977l17723k8969k03751j99617
2956B188565J1419R6589J07050J88853k32028J00743L4462k21543l102J66219
2946B437227N0708j25419k09977j08867J45958k337l16726O4305J1248j61328
2936A784792n6270r8854Q8024K0569J76597r9973r0270j4352j34963J69254J56683
2925A901237m90507k00154P7384L77549L6448j70810K15184j35858M6638K8770
$$ plain form
2915 1685881 1905114 1855998 1785974 2018876 1676008 1304917 1539557 1592948 1657390 1648365 1496550
2904 1496550 1544221 1592661 1751622 1723066 1513796 1303992 1466462 1415191 1353147 1558206
2894 1558206 1445297 1282481 1188236 1191210 1209989 1147893 1076075 963598 1194929 904035 922004
2883 922004 1152687 1313075 1378632 1461958 1525719 1257689 1076013 1132042 1267961 998093
2873 998093 1070442 1267800 1051199 1065948 1280135 1184165 1011941 1064268 1209475 1286588 1273619
2862 1273619 1231805 1250384 951322 921048 923880 904077 925165 872112 1140304 1134129 1079980
2851 1079980 1040602 1046096 1158332 1271337 1227638 1344668 1182398 1043769 887876 950078
2841 950078 1050067 1009473 1254401 1455122 1306929 1052841 1322748 1203571 912328 767670
$$ packed form
2915A685881K19233m9116p0024K32902l42868l71091K34640N3391O4442r025j51815
2904A496550M7671M8440J58961k8556k09270k09804J62470n1271o2044K05059
2894A558206j12909j62816r4245K974J8779o2096p1818j12477K31331k90894J7969
2883I22004K30683J60388O5557Q3326O3761k68030j81676N6029J35919k69868
2873I98093P2349J97358k16601J4749K14187r5970j72224N2327J45207P7113j2969
2862A273619m1814J8579k99062l0274K832j9803K1088n3053K68192o175n4149
2851A079980l9378N494J12236J13005m3699J17030j62270j38629j55893O2202
2841I50078R9989m0594K44928K00721j48193k54088K69907j19177k91243j44658
$$ plain form
2831 767670 906725 920960 1075295 1033328 903178 850602 1023915 814698 786402 1005959
2821 1005959 961223 985780 710395 620041 662975 1017725 1122699 1232247 1234114 1058696 932392
2810 932392 1007088 840528 805619 846098 1000952 1095283 1075056 969531 851606 766903 871700
2799 871700 820626 654666 959298 1101335 1051459 881046 1011453 1076444 987934 946190 483607
2788 483607 475906 496759 631111 649212 633170 628151 804922 774617 524198 697805 522985
2777 522985 654570 812577 984559 926064 800322 508458 508654 610717 627007 726982 765419
2766 765419 627216 724975 655107 550585 548688 631666 434814 466088 661369 618033 837264
2755 837264 740467 733425 671575 545806 669146 559968 596876 798441 559634 707089 658716
$$ packed form
2831G67670J39055J4235J54335m1967j30150n2576J73313k09217k8296K19557
2821A005959m4736K4557k75385r0354M2934L54750J04974J09548J867j75418j26304
2810I32392P4696j66560l4909M0479J54854R4331k0227j05525j17925q4703J04797
2799H71700n1074j65960L04632J42037m9876j70413J30407O4991q8510m1744m62583
2788D83607p701K0853J34352J8101j6042n019J76771l0305k50419J73607j74820
2777E22985J31585J58007J71982n8495j25742k91864J96J02063J6290R9975L8437
2766G65419j38203R7759o9868j04522j897Q2978j96852L1274J95281m3336K19231
2755H37264r6797p042o1850j25769J23340j09178L6908K01565k38807J47455m8373
$$ plain form
2744 658716 632662 687589 592423 512471 503350 421040 349013 421171 436543 562935 544121 400262
2732 400262 533904 391087 418545 377898 246126 439927 223953 372894 441732 770084
2722 770084 625930 449614 470757 567852 444427 483068 617149 371665 308171 432805
2712 432805 481854 316026 459850 534158 546338 647052 519540 472455 270603 216591 313786
2701 313786 350016 233833 495294 614131 586643 439583 584619 852734 770497 812380
2691 812380 763968 613685 677454 747689 736280 537842 469896 563366 599430 410488 398370
2680 398370 468741 37190 155848 238113 112572 40123 234134 156875 182155 120865 147484
2669 147484 94322 242478 232942 136180 88695 321841 213187 356527 314300 184533 103809
$$ packed form
2744F58716k6054N4927r5166p9952r121q2310p2027P2158J5372J26392j8814j43859
2732D00262J33642j42817K7458m0647j31772J93801k15974J48941O8838L28352
2722G70084j44154j76316K1143R7095j23425L8641J34081k45484o3494J24634
2712D32805M9049j65828J43824P4308J2180J00714j27512m7085k01852n4012R7195
2701C13786L6230j16183K61461J18837k7488j47060J45036K68115q2237M1883
2691H12380m8412j50283O3769P0235j1409j98438o7946R3470L6064j88942j2118
2680C98370P0371m31551J18658Q2265j25541p2449J94011p7259K5280o1290K6619
2669A47484n3162J48156r536r6762m7485K33146j08654J43340m2227j29767q0724
$$ plain form
2658 103809 191152 440545 415767 313409 222729 272211 223307 324951 355650 376321 289578
2647 289578 186806 219047 297947 122408 74024 278090 287888 70611 76591 330445 224468
2636 224468 173337 55923 48296 -97183 68936 486732 629965 463496 484613 526552 178557
2625 178557 27884 81120 249008 333487 388596 398914 218582 103730 221920 93757
2615 93757 147490 132833 214950 162469 -154746 20280 386390 417032 504174 354269 497115
2604 497115 448579 142300 86466 311528 68297 -17217 245519 203543 104757 321598 398937
2593 398937 320453 190544 235517 380168 290682 163839 111704 414218 369706 221291 250341
2582 250341 377199 260495 233494 415021 627948 424849 329008 334801 104683 140075 303062
$$ packed form
2658A03809Q7343K49393k4778j02358r0680M9482m8904J01644L0699K0671q6743
2647B89578j02772L2241P8900j75539m8384K04066R798k17277N980K53854j05977
2636B24468n1131j17414p627j45479J66119M17796J43233j66469K1117M1939l47995
2625A78557j50673N3236J67888Q4479N5109J0318j80332j14852J18190j28163
2615I3757N3733j4657Q2117n2481l17215J75026L66110L0642Q7142j49905J42846
2604D97115m8536l06279n5834K25062k43231q5514K62736m1976r8786K16841P7339
2593C98937p8484j29909M4973J44651q9486j26843n2135L02514m4512j48415K9050
2582B50341J26858j16704k7001J81527K12927k03099r5841N793k30118L5392J62987
$$ plain form
2571 303062 198490 -19272 90719 97498 -78040 -43651 56909 -14860 -29751 -240007 -167233
2560 -167233 163897 -31666 -35787 139637 167361 243464 35597 -16504 92428 -125240 -59811
2549 -59811 335037 156505 248581 53008 136754 16689 -266232 -120354 158764 155882 -52754
2538 -52754 108420 354033 239342 -6288 -26268 -3421 142241 7432 -162316 41222
2528 41222 -5347 118382 266676 172426 21108 36107 172939 23000 -93508 -349560
2518 -349560 -428465 -227707 -42584 90111 158965 2137 164795 142391 86091 83862 121367
2507 121367 -32007 210082 398424 317719 427195 216926 149779 -12116 -133123 -117093
2497 -117093 40685 166301 289739 385125 395924 68907 -79061 -4640 -275516 -38238
$$ packed form
2571C03062j04572k17762J09991O779j75538L4389J00560p1769j4891k10256P2774
2560a67233L31130j95563m121J75424K7724P6103k07867n2101J08932k17668O5429
2549e9811L94848j78532R2076j95573Q3746j20065k82921J45878K79118k882k08636
2538e2754J61174K45613j14691k45630j9980K2847J45662j34809j69748K03538
2528D1222m6569J23729J48294r4250j51318J4999J36832j49939j16508k56052
2518c49560p8905K00758J85123J32695O8854j56828J62658k2404n6300k229L7505
2507A21367j53374K42089J88342q0705J09476k10269o7147j61895j21007J6030
2497a17093J57778J25616J23438R5386J0799l27017j47968P4421k70876K37278
$$ plain form
2487 -38238 -28793 213245 78083 -63409 299515 371073 175780 345179 347986 348123 469562
2476 469562 366484 8770 127429 176329 379322 321481 99285 110079 -18808 3708
2466 3708 103528 35419 187987 337559 358101 -49951 258584 261694 256847 323075 148891
2455 148891 444817 395731 370639 292103 198319 230254 305534 283952 151769 277612 421964
2444 421964 86750 262629 211736 309272 213697 383774 334612 128814 161122 251665 280408
2433 280408 406108 295178 455636 371732 540068 402961 182895 -17426 222711 397794
2423 397794 604433 489754 426296 273280 723287 802567 484974 515211 282368 223447
2413 223447 32957 6609 287692 706483 565400 401869 405631 638249 536977 687982
$$ packed form
2487c8238R445K42038j35162j41492L62924P1558j95293J69399K807J37J21439
2476D69562j03078l57714J18659M8900K02993n7841k22196J0794j28887K2516
2466C708R9820o8109J52568J49572K0542m08052L08535L110m847O6228j74184
2455A48891K95926m9086k5092p8536r3784L1935P5280k1582j32183J25843J44352
2444D21964l35214J75879n0893R7536r5575J70077m9162k05798L2308R0543K8743
2433B80408J25700j10930J60458q3904J68336j37107k20066k00321K40137J75083
2423C97794K06639j14679o3458j53016M50007P9280l17593L0237k32843n8921
2413B23447j90490k6348K81083M18791j41083j63531L762K32618j01272J51005
$$ plain form
2403 687982 803624 722693 1110598 1006538 979060 906820 779871 1048829 850195 882249
2393 882249 692523 920202 756366 650093 851078 812741 1148653 1364911 1184135 1057437
2383 1057437 1430518 1662568 1343688 1345001 1570721 1591600 1527831 1539405 1529740 1745950 1934274
2372 1934274 1826156 1713958 1893262 1987740 1994865 2267982 2212953 2082650 2156701 2246313 2661428
2361 2661428 2831473 3224485 3645418 3755202 3757992 4002544 4329319 4703712 5044192 5130642
2351 5130642 5440661 6035089 6547527 7206506 7878912 8831250 10171597 11030338 11924335
2342 11924335 12491956 13248155 13892293 14955647 16364168 17518941 19146369 21205122 23960371
2333 23960371 27548786 32113867 37899604 44763101 52600962 60653857 61109633 57245404
$$ packed form
2403F87982J15642q0931L87905j04060k7478p2240j26949K68958j98634L2054
2393H82249j89726K27679j63836j06273K00985l8337L35912K16258j80776j26698
2383A057437L73081K32050l18880J313K25720K0879o3769J1574r665K16210J88324
2372A934274j08118j12198J79304R4478P125K73117n5029j30303P4051Q9612M15115
2361B661428J70045L93012M20933J09784K790K44552L26775L74393L40480Q6450
2351E130642L10019N94428N12438O58979O72406R52338J340347Q58741Q93997
2342A1924335N67621P56199O44138J063354J408521J154773J627428K058753K755249
2333B3960371L588415M565081N785737O863497P837861Q052895M55776l864229
$$ plain form
2325 57245404 55258542 54238002 53254724 52156178 48767614 42178069 36799334 32959432
2317 32959432 29756553 27159006 24796925 22489860 20502756 18999953 17587911 15711219
2309 15711219 14314700 13720353 12756356 11723925 10896004 10025541 9232578 8307663 7904892
2300 7904892 7335728 7053028 6572642 5951261 5607316 5124836 4915657 4617229 4424118 4202228
2290 4202228 4039254 3384238 3076578 3239610 2899505 2763208 2675022 2541768 2267300 2180586
2280 2180586 2156050 2110935 1678108 1776487 1788850 1388900 1211035 1363963 1614682 1491462
2270 1491462 1356289 1366199 1163214 1147490 1181466 1050479 1252163 1161849 1046545 1210577
2260 1210577 1445996 1249543 966485 828562 1052790 1111842 782131 935162 787273 554012
$$ packed form
2325E7245404j986862j020540r83278j098546l388564o589545n378735l839902
2317C2959432l202879k597547k362081k307065j987104j502803j412042j876692
2309A5711219j396519n94347r63997j032431q27921q70463p92963r24915m02771
2300G904892n69164k82700m80386o21381l43945m82480k09179k98428j93111k21890
2290D202228j62974o55016l07660J63032l40105j36297q8186j33254k74468q6714
2280B180586k4536m5115m32827R8379J2363l99950j77865J52928K50719j23220
2270A491462j35173R910k02985j5724L3976j30987K01684r0314j15304J64032
2260A210577K35419j96453k83058j37923K24228N9052l29711J53031j47889k33261
$$ plain form
2250 554012 502183 812221 902778 928556 579019 333543 375059 296584 456030 525325 732856
2239 732856 546749 470058 446027 552612 993240 934735 765173 335275 390922 403003 310016
2228 310016 283510 422068 454066 474466 230447 137943 78420 160975 271132 447185 276510
2217 276510 193233 342060 348124 613522 681398 564451 386563 285924 308141 273560 316005
2206 316005 607152 453359 418753 98037 68764 219622 475074 185845 92093 238012
2196 238012 452047 386513 465922 443814 401134 500240 281365 116124 240264 -52338 238208
2185 238208 10052 -99479 -240543 47593 186450 125038 290452 403722 202676 58015
2175 58015 183116 71518 278573 282930 255648 191700 311014 97341 103200 245674 407676
$$ packed form
2250E54012n1829L10038R0557K5778l49537k45476M1516p8475J59446O9295K07531
2239G32856j86107p6691k4031J06585M40628n8505j69562m29898N5647J2081r2987
2228C10016k6506J38558L1998K0400k44019r2504n9523Q2555J10157J76053j70675
2217B76510q3277J48827O064K65398O7876j16947j77888j00639K2217l4581M2445
2206C16005K91147j53793l4606l20716k9273J50858K55452k89229r3752J45919
2196B38012K14035o5534P9409k2108m2680R9106k18875j65241J24140k92602K90546
2185B38208k28156j09531j41064K88136J38857o1412J65414J13270k01046j44661
2175E8015J25101j11598K07055M357k7282o3948J19314k13673N859J42474J62002
$$ plain form
2164 407676 372724 375515 323678 15832 95957 -57262 242730 378742 -413 69742 160915
2153 160915 139674 170017 114413 124390 255872 13668 162057 309578 394677 62001 80735
2142 80735 227257 232059 313823 312594 342008 216383 225503 239702 14333 152476 168434 24564
2130 24564 100890 335233 317676 196502 53875 -6454 106966 61734 284433 215344 -3850
2119 -3850 80826 141989 121335 -198516 -165567 -20888 29146 -25077 192799 201354 408270
2108 408270 467406 254691 211678 119546 207131 150984 -47499 29480 27237 6412 102266
2097 102266 230887 108137 10963 -156516 -34092 -106751 -441634 -254774 -15484 -253879
2087 -253879 -253991 -40750 27320 74055 319484 113466 -269998 -258004 -81815 94268 393283
$$ packed form
2164D07676l4952K791n1837l07846Q0125j53219K99992J36012l79155P0155R1173
2153A60915k1241L0343n5604R977J31482k42204J48389J47521Q5099l32676J8734
2142H0735J46522M802Q1764j229K9414j25625R120J4199k25369J38143J5958j43870
2130B4564P6326K34343j7557j21174j42627o0329J13420m5232K22699o9089k19194
2119c850Q4676O1163k0654l19851L2949J44679N0034n4223K17876Q555K06916
2108D08270N9136k12715m3013r2132Q7585n6147j98483P6979k243k0825R5854
2097A02266J28621j22750r7174j67479J22424p2659l34883J86860K39290k38395
2087b53879j12K13241O8070M6735K45429k06018l83464J1994J76189J76083K99015
$$ plain form
2076 393283 206019 38497 55590 -114942 269055 124432 -93618 -156763 -129660 -105763
2066 -105763 50611 173343 199582 194701 -97551 -119546 358985 479460 442326 455090 369495
2055 369495 244100 235661 -58750 15751 93510 134402 90853 39272 260530 115775 -64011
2044 -64011 173887 -107982 -134156 74330 202426 -227308 -260732 -19401 12504 360845
2034 360845 307317 280395 248966 103785 -125552 -328424 -252584 27788 68518 21053 76357
2023 76357 19594 -18068 -163101 -205814 -11498 78037 -112170 -301155 29857 99772 123582
2012 123582 227768 71802 92842 12969 -203149 -123769 176195 -36771 -14185 -110306 111249
2001 111249 326607 637634 204984 -8656 27423 -93563 -38751 165658 -1596 -288209
$$ packed form
2076C93283j87264j67522J7093j70532L83997j44623k18050o3145K7103K3897
2066a05763J56374J22732K6239m881k92252k1995M78531J20475l7134J2764q5595
2055C69495j25395q439k94411P4501P7759M0892m3549n1581K21258j44755j79786
2044f4011K37898k81869k6174K08486J28096m29734l3424K41331L1905L48341
2034C60845n3528k6922l1429j45181k29337k02872P5840K80372M0730m7465N5304
2023G6357n6763l7662j45033m2713J94316Q9535j90207j88985L31012O9915K3810
2012A23582J04186j55966K1040p9873k16118P9380K99964k12966K2586r6121K21555
2001A11249K15358L11027m32650k13640L6079j20986N4812K04409j67254k86613
$$ plain form
1991 -288209 -291578 -133626 -34546 46694 154630 -19009 -77848 -264854 -110665 220537 364908
1980 364908 170679 -4515 -51082 -128330 -201283 34591 -5104 147253 220651 248320 333778
1969 333778 176187 -89617 -115610 -256509 -40513 51962 247901 9846 -317545 -157772
1959 -157772 41646 -149728 -117765 -62035 105571 20066 18135 330480 137171 -119626 233117
1948 233117 36982 -258199 -419845 -183489 -68384 103268 33381 -205018 -208227 -16474
1938 -16474 27668 -126786 -179490 -326114 -342313 -121907 -3143 -66120 -182721 -290019 -364290
1927 -364290 -157207 -136817 -2747 25767 317369 244585 -163023 59182 27828 9414 25776
1916 25776 229701 -76614 -96735 -8409 -16115 -258721 -232252 -97615 4813 -33354 -194387
$$ packed form
1991b88209l369J57952R9080Q1240J07936j73639n8839j87006J54189L31202J44371
1980C64908j94229j75194m6567p7248p2953K35874l9695J52357P3398K7669Q5458
1969C33778j57591k65804k5993j40899K15996R2475J95939k38055l27391J59773
1959a57772J99418j91374L1963N5730J67606q5505j931L12345j93309k56797L52743
1948B33117j96135k95181j61646K36356J15105J71652o9887k38399l209J91753
1938a6474M4142j54454n2704j46624j6199K20406J18764o2977j16601j07298p4271
1927c64290K07083K0390J34070K8514K91602p2784m07608K22205l1354j8414J6362
1916B5776K03925l06315k0121Q8326p706k42606K6469J34637J02428l8167j61033
$$ plain form
1905 -194387 -2278 -138056 -260029 -323430 -121678 78648 -332782 -310427 -19615 110643
1895 110643 -116643 -136653 105879 233108 -112255 -139131 -257741 -219989 -275226 -207327 -277797
1884 -277797 -375781 -217842 -277338 -233904 -70369 -268179 -388316 -505435 -361279 -407973
1874 -407973 -106294 -377655 -748808 -585580 -476824 -312993 -74433 138636 -49422 -50068
1864 -50068 -21014 -123282 -228400 -189361 -180759 -28490 -24044 -319284 -466258 -391439 -145578
1853 -145578 -382194 -264702 -98990 -159835 108003 75179 -90013 27231 207416 149967
1843 149967 132448 -194299 119357 123721 -102030 308 -200408 -334652 -436040 -163375
1833 -163375 71275 -76632 -199658 -298233 -419415 -306745 -94123 -16934 -53084 -191362
$$ packed form
1905a94387J92109j35778j21973o3401K01752K00326m11430K2355K90812J30258
1895A10643k27286k0010K42532J27229l45363k6876j18610L7752n5237O7899p0470
1884b77797r7984J57939n9496M3434J63535j97810j20137j17119J44156m6694
1874d07973L01679k71361l71153J63228J08756J63831K38560K13069j88058o46
1864e0068K9054j02268j05118L9039Q602J52269M446k95240j46974P4819K45861
1853a45578k36616J17492J65712o0845K67838l2824j65192J17244J80185n7449
1843A49967j7519l26747L13656M364k25751J02338k00716j34244j01388K72665
1833a63375K34650j47907j23026r8575j21182J12670K12622P7189l6150j38278
$$ plain form
1823 -191362 5667 -187527 -134002 141544 -26076 -235945 -77941 -121274 -206716 -238572
1813 -238572 -331808 -237951 -235341 -260392 -57830 -28087 -202195 -209131 -62077 -3409 -134049
1802 -134049 -1990 2717 -55821 -32814 193124 -125849 -414840 -335086 -172921 -34811 -245702
1791 -245702 -324121 -105963 10943 -91644 -301569 -320293 3311 -43541 -130959 -79537 105931
1780 105931 50930 43726 -67 46275 9258 50728 -116538 16953 37842 -53433 -140230
1769 -140230 -358035 -245554 -210655 -243110 -313074 -540757 -440864 -240676 -196467 77589 107817
1758 107817 -40236 88391 61142 19186 -39955 -6655 -72411 -25417 -213243 -148503 -255559
1747 -255559 -270910 -135685 73228 301823 123048 -216539 -450095 -232987 -59768 170355
$$ packed form
1823a91362J97029j93194N3525K75546j67620k09869J58004m3333q5442l1856
1813b38572r3236R3857K610k5051K02562K9743j74108o936J47054N8668j30640
1802a34049J32059M707n8538K3007K25938l18973k88991P9754J62165J38110k10891
1791b45702p8419K18158J16906j02587k09925j8724L23604m6852q7418N1422J85468
1780A05931n5001p204m3793M6342l7017M1470j67266J33491K0889r1275q6797
1769a40230k17805J12481L4899l2455o9964k27683R9893K00188M4209K74056L0228
1758A07817j48053J28627k7249m1956n9141L3300o5756M6994j87826O4740j07056
1747b55559j5351J35225K08913K28595j78775l39587k33556K17108J73219K30123
$$ [...]
##END NTUPLES=NMR SPECTRUM
##END=
