##TITLE=1H_EC-3361(34)
 200.13MHz, CDCl3,
 8 sc
 
 4.9.2025
##JCAMPDX= 6.0         $$ Bruker NMR JCAMP-DX V2.0
##DATA TYPE= NMR SPECTRUM
##DATA CLASS= NTUPLES
##ORIGIN= UXNMR, Bruker Analytische Messtechnik GmbH
##OWNER= pz
$$ XWIN-NMR		Version 3.5
$$ Thu Sep  4 13:53:13 2025 Russian Standard Time (UT+4h)  she@DPX200
##.OBSERVE FREQUENCY= 200.1313
##.OBSERVE NUCLEUS= ^1H
##.ACQUISITION MODE= SIMULTANEOUS
##.ACQUISITION SCHEME= undefined
##.AVERAGES= 8
##.DIGITISER RES= 18
##SPECTROMETER/DATA SYSTEM= spect
##.PULSE SEQUENCE= zg30
##.SOLVENT NAME= CDCl3
##.SHIFT REFERENCE= (INTERNAL, CDCl3, 0, 15.4659)
##AUDIT TRAIL= $$ (NUMBER, WHEN, WHO, WHERE, WHAT)
$$ ##TITLE= Audit trail, XWIN-NMR		Version 3.5
$$ ##JCAMPDX= 5.01
$$ ##ORIGIN= Bruker BioSpin GmbH
$$ ##OWNER= she
$$ F:/spectra/data/she/nmr/H-C/1/pdata/1/auditp.txt
$$ ##AUDIT TRAIL=  $$ (NUMBER, WHEN, WHO, WHERE, WHAT)
(   1,<2025-09-04 13:51:36.81 +0400>,<she>,<DPX200>,
      <created by zg, POWCHK disabled, PULCHK disabled
       configuration hash MD5:
       00 E9 B6 7A A2 85 ED C7 34 08 36 98 17 FE 4E 26
       data hash MD5: 16K
       8F F1 D1 1C DC 57 10 12 3B 9F EC FD 3A 84 31 CE>)
(   2,<2025-09-04 13:51:41.85 +0400>,<she>,<DPX200>,
      <Start of raw data processing
       efp BC_mod = 2 LB = 0.25 FT_mod = 6 PKNL = 1 PHC0 = -1555.263 PHC1 = 5.192279 SI = 16K 
       data hash MD5: 16K
       94 26 43 C6 F6 B5 29 8E 6D 41 97 E1 8D 05 6A 5D>)
(   3,<2025-09-04 13:51:59.40 +0400>,<she>,<DPX200>,
      <pk PHC0 = -1.813988 PHC1 = 2.6 
       data hash MD5: 16K
       B4 EB 3A E8 A1 8D 3C 9F E1 F5 12 BC 05 2E 55 2F>)
(   4,<2025-09-04 13:52:02.90 +0400>,<she>,<DPX200>,
      <abs ABSG = 5 
       data hash MD5: 16K
       3F B2 A0 C2 93 75 0D 6E A0 34 4C 84 1F A4 7E F7>)
$$ ##END=
$$ 
$$ hash MD5
$$ D8 9C 93 B5 0C 72 92 C4 9C C1 B4 84 CB 62 74 84
##$RELAX= 
##$RELAX= 
##$RELAX= 
##$RELAX= 
##$RELAX= 
##$RELAX= 
$$ Bruker specific parameters
$$ --------------------------
##$DU= <F:/spectra>
##$EXPNO= 1
##$NAME= <H-C>
##$PROCNO= 1
##$TYPE= <nmr>
##$USER= <she>
##$AMP= (0..31)
100 100 100 100 100 100 100 100 100 100 100 100 100 100 100 100 100 100 
100 100 100 100 100 100 100 100 100 100 100 100 100 100 
##$AQSEQ= 0
##$AQ_mod= 1
##$AUNM= <au_zg>
##$AUTOPOS= <>
##$BF1= 200.13
##$BF2= 200.13
##$BF3= 200.13
##$BF4= 200.13
##$BF5= 200.13
##$BF6= 200.13
##$BF7= 200.13
##$BF8= 200.13
##$BYTORDA= 1
##$CFDGTYP= 0
##$CFRGTYP= 5
##$CHEMSTR= <none>
##$CNST= (0..31)
1 1 145 1 1 1 1 1 1 1 1 1 1 1 1 1 1 1 1 1 1 1 1 1 1 1 1 1 1 1 1 1 
##$CPDPRG= <>
##$CPDPRG1= <>
##$CPDPRG2= <>
##$CPDPRG3= <>
##$CPDPRG4= <mlev>
##$CPDPRG5= <mlev>
##$CPDPRG6= <mlev>
##$CPDPRG7= <mlev>
##$CPDPRG8= <mlev>
##$CPDPRGB= <>
##$CPDPRGT= <>
##$D= (0..31)
0 0.7 0 0 0 0 0 0 0 0 0 0.03 0 0 0 0 0 0 0 0 0 0 0 0 0 0 0 0 0 0 0 0 
##$DATE= 1756979496
##$DBL= (0..7)
120 120 120 120 120 120 120 120 
##$DBP= (0..7)
150 150 150 150 150 150 150 150 
##$DBP07= 0
##$DBPNAM0= <>
##$DBPNAM1= <>
##$DBPNAM2= <>
##$DBPNAM3= <>
##$DBPNAM4= <>
$$ [...]
##$SUBNAM3= <"">
##$SUBNAM4= <"">
##$SUBNAM5= <"">
##$SUBNAM6= <"">
##$SUBNAM7= <"">
##$SUBNAM8= <"">
##$SUBNAM9= <"">
##$SW= 18.0517328524113
##$SWIBOX= (0..15)
0 0 2 0 0 0 0 0 0 0 0 0 0 0 0 0 
##$SW_h= 3612.71676300578
##$TD= 16384
##$TD0= 1
##$TE= 0
##$TE2= 300
##$TE3= 300
##$TEG= 300
##$TL= (0..7)
0 120 120 120 120 120 120 120 
##$TP= (0..7)
150 150 150 150 150 150 150 150 
##$TP07= 0
##$TPNAME0= <>
##$TPNAME1= <>
##$TPNAME2= <>
##$TPNAME3= <>
##$TPNAME4= <>
##$TPNAME5= <>
##$TPNAME6= <>
##$TPNAME7= <>
##$TPOAL= (0..7)
0.5 0.5 0.5 0.5 0.5 0.5 0.5 0.5 
##$TPOFFS= (0..7)
0 0 0 0 0 0 0 0 
##$TUNHIN= 0
##$TUNHOUT= 0
##$TUNXOUT= 0
##$USERA1= <user>
##$USERA2= <user>
##$USERA3= <user>
##$USERA4= <user>
##$USERA5= <user>
##$V9= 5
##$VALIST= <valist>
##$VCLIST= <CCCCCCCCCCCCCCC>
##$VD= 0
##$VDLIST= <DDDDDDDDDDDDDDD>
##$VPLIST= <PPPPPPPPPPPPPPP>
##$VTLIST= <TTTTTTTTTTTTTTT>
##$WBST= 1024
##$WBSW= 4
##$XGAIN= (0..3)
0 0 0 0 
##$XL= 0
##$YL= 0
##$YMAX_a= 512662
##$YMIN_a= -766087
##$ZGOPTNS= <>
##$ZL1= 120
##$ZL2= 120
##$ZL3= 120
##$ZL4= 120
##$ABSF1= 15.50559
##$ABSF2= -2.546259
##$ABSG= 5
##$ABSL= 3
##$ALPHA= 0
##$AQORDER= 0
##$ASSFAC= 0
##$ASSFACI= 0
##$ASSFACX= 0
##$ASSWID= 0
##$AUNMP= <proc_1d>
##$AZFE= 0.1
##$AZFW= 0.1
##$BCFW= 0
##$BC_mod= 2
##$BYTORDP= 0
##$COROFFS= 0
##$CY= -3
##$DATMOD= 1
##$DC= 0
##$DFILT= <>
##$DTYPP= 0
##$F1P= 0
##$F2P= 0
##$FCOR= 1
##$FTSIZE= 16384
##$FT_mod= 6
##$GAMMA= 0
##$GB= 0
##$INTBC= 1
##$INTSCL= 3.241238e-09
##$ISEN= 128
##$LB= 0.25
##$LEV0= 0
##$LPBIN= 0
##$MAXI= 10000
##$MC2= 0
##$MEAN= 0
##$ME_mod= 0
##$MI= 1.114404
##$NCOEF= 0
##$NC_proc= -5
##$NLEV= 6
##$NOISF1= 3.799351
##$NOISF2= 2.8
##$NSP= 0
##$NTH_PI= 0
##$NZP= 0
##$OFFSET= 15.46593
##$PC= 1
##$PHC0= -1557.077
##$PHC1= 7.792279
##$PH_mod= 1
##$PKNL= yes
##$PPARMOD= 0
##$PSCAL= 0
##$PSIGN= 0
##$REVERSE= no
##$SF= 200.130011161119
##$SI= 16384
##$SIGF1= 3
##$SIGF2= 2
##$SINO= 0.751879
##$SIOLD= 32768
##$SREGLST= <19F.Aceton>
##$SSB= 0
##$STSI= 16384
##$STSR= 0
##$SW_p= 3612.71676300578
##$SYMM= 0
##$S_DEV= 0
##$TDeff= 16384
##$TDoff= 0
##$TI= <>
##$TILT= no
##$TM1= 0
##$TM2= 0
##$TOPLEV= 0
##$USERP1= <user>
##$USERP2= <user>
##$USERP3= <user>
##$USERP4= <user>
##$USERP5= <user>
##$WDW= 1
##$XDIM= 16384
##$YMAX_p= 339490553
##$YMIN_p= -214907
$$ End of Bruker specific parameters
$$ ---------------------------------
##NTUPLES= NMR SPECTRUM
##VAR_NAME=  FREQUENCY,     SPECTRUM/REAL,   SPECTRUM/IMAG
##SYMBOL=    X,             R,               I
##VAR_TYPE=  INDEPENDENT,   DEPENDENT,       DEPENDENT
##VAR_FORM=  AFFN,          ASDF,            ASDF
##VAR_DIM=   16384,         16384,           16384
##UNITS=     HZ,            ARBITRARY UNITS, ARBITRARY UNITS
##FACTOR=    0.220516191357247, 1,           1
##FIRST=     3095.19674052442, 0,            0
##LAST=      -517.520022481362, 0,           0
##MIN=       -517.520022481362, -214907,     0
##MAX=       3095.19674052442, 339490553,    0
$$ Real data points
##PAGE= N=1
##DATA TABLE= (X++(R..R)), XYDATA
$$ [...]
$$ plain form
7745 201702 198973 187308 216853 214510 189306 260840 278322 251657 191046 183567 175293 247869
7733 247869 253279 241313 265287 319240 357595 412744 416265 441731 419825 448185 509982 551442
7721 551442 592131 632614 627576 572632 576438 627124 662128 649323 655389 735423 770552 744437
7709 744437 796233 814808 784436 812579 826353 826592 804902 840652 875657 831023 873620 904813
7697 904813 914938 916148 907117 900176 897380 887233 873455 844053 855707 844383 824652 819787 800106
7684 800106 805295 752246 686138 667178 695804 716910 712016 733729 708503 728772 749346 741565
7672 741565 726306 740336 738734 702646 640688 655587 676586 623598 608186 609259 587994 577527
7660 577527 524250 487639 486394 504001 511945 531320 486401 492586 518415 460208 504644 520621
$$ packed form
7745B01702k729j1665K9545k343k5204P1534J7482k6665o0611p479q274P2576
7733B47869N410j1966K3974N3953L8355N5149L521K5466k1906K8360O1797M1460
7721E51442M0689M0483n038n4944L806N0686L5004j2805O066Q0034L5129k6115
7709G44437N1796J8575l0372K8143J3774K39k1690L5750L5005m4634M2597L1193
7697I04813J0125J210r031o941k796j0147j3778k9402J1654j1324j9731m865j9681
7684H00106N189n3049o6108j8960K8626K1106m894K1713k5226K0269K0574p781
7672G41565j5259J4030j602l6088o1958J4899K0999n2988j5412J073k1265j0467
7660E77527n3277l6611j245J7607P944J9375m4919O185K5829n8207M4436J5977
$$ plain form
7648 520621 539005 535601 533808 512181 468948 514830 561697 568508 535243 532952 519024 537816
7636 537816 549060 532698 514049 558169 577782 530150 580107 641894 624641 663354 709474 695545
7624 695545 695800 675141 673433 666864 616079 586171 605332 549309 541064 551724 521279 478190 426508
7611 426508 401612 395419 368185 351319 387624 407562 346789 343470 311852 352395 357801 316084
7599 316084 256328 281369 292510 269095 279207 289200 318824 286847 258431 251515 242046 250533
7587 250533 237673 221921 231232 251577 273602 252104 288896 276863 315514 390381 358494 369021
7575 369021 385113 380239 430079 481849 513067 490047 522256 545343 577541 558905 536733 521237
7563 521237 596528 586826 613332 607904 549196 514694 497405 491157 526208 542138 519497 582441
$$ packed form
7648E20621J8384l404j793k1627m3233M5882M6867O811l3265k291j3928J8792
7636E37816J1244j6362j8649M4120J9613m7632M9957O1787j7253L8713M6120j3929
7624F95545K55k0659j708o569n0785k9908J9161n6023q245J0660l0445m3089n1682
7611D26508k4896o193k7234j6866L6305J9938o0773l319l1618M0543N406m1717
7599C16084n9756K5041J1141k3415J0112R993K9624l1977k8416o916r469Q487
7587B50533j2860j5752R311K0345K2025k1498L6792j2033L8651P4867l1887J0527
7575C69021J6092m874M9840N1770L1218k3020L2209K3087L2198j8636k2172j5496
7563E21237P5291r702K6506n428n8708l4502j7289o248L5051J5930k2641O2944
$$ plain form
7551 582441 599031 601530 595730 590819 634562 651751 653458 680647 731968 768772 763118 745205 842308
7538 842308 888414 877126 867478 886278 899795 885317 941985 920656 906038 849889 799078 832588
7526 832588 828599 795526 778072 716390 727051 673186 662826 650199 682785 691904 596425 580271
7514 580271 549175 582987 613696 597919 593044 617951 625616 580893 594243 612903 608937 637344
7502 637344 614663 589858 568123 562149 560071 565462 589995 523694 501389 496696 471612 446172
7490 446172 455916 405099 387759 402461 324586 373220 385560 390525 395273 373806 424558 449387
7478 449387 382546 385552 394601 383329 418110 389746 418570 418679 401050 438735 463093 465263 468414
7465 468414 477555 524535 460697 468397 471253 483726 530517 557898 560908 534710 536988 519811 480061
$$ packed form
7551E82441J6590K499n800m911M3743J7189J707K7189N1321L6804n654j7913R7103
7538H42308M6106j1288r648J8800J3517j4478N6668k1329j4618n6149n0811L3510
7526H32588l989l3073j7454o1682J0661n3865j0360j2627L2586R119r5479j6154
7514E80271l1096L3812L0709j5777m875K4907P665m4723J3350J8660l966K8407
7502F37344k2681k4805k1735n974k078N391K4533o6301k2305m693k5084k5440
7490D46172R744n0817j7340J4702p7875M8634J2340M965M748k1467N0752K4829
7478D49387o6841L006R049j1272L4781k8364K8824J09j7629L7685K4358K170L151
7465D68414R141M6980o3838P700K856J2473M6791K7381L010k6198K278j7177l9750
$$ plain form
7452 480061 490804 485167 516856 514636 525172 568508 535743 515989 544406 570755 562402 589358
7440 589358 612759 555261 563672 633955 656518 663735 619557 675422 692886 678445 681522 689463
7428 689463 706760 720047 750419 738900 759270 708329 698827 702596 699067 715376 712746 744313
7416 744313 699755 738381 753360 712381 764663 786813 760904 797180 785997 818441 858837 834636
7404 834636 808139 825642 810232 835917 896488 914730 937675 968097 1013307 1011278 1059548 1100701
7392 1100701 1140364 1167357 1166300 1198453 1233694 1237760 1238591 1305637 1343708 1311574 1269428 1363672
7380 1363672 1398310 1422569 1517531 1561392 1640022 1768038 1869418 1926829 1991902 2117384 2224509
7369 2224509 2353729 2532371 2654030 2769139 2945125 3158131 3409765 3620674 3829975 4062600
$$ packed form
7452D80061J0743n637L1689k220J0536M3336l2765j9754K8417K6349q353K6956
7440E89358K3401n7498Q411P0283K2563P217m4178N5865J7464j4441L077P941
7428F89463J7297J3287L0372j1519K0370n0941r502L769l529J6309k630L1567
7416G44313m4558L8626J4979m0979N2282K2150k5909L6276j1183L2444M0396k4201
7404H34636k6497J7503j5410K5685O0571J8242K2945L0422M5210k029M8270M1153
7392A100701L9663K6993j057L2153L5241M066Q31O7046L8071l2134m2146R4244
7380A363672L4638K4259R4962M3861P8630J28016J01380N7411O5073J25482J07125
7369B224509J29220J78642J21659J15109J75986K13006K51634K10909K09301K32625
$$ plain form
7359 4062600 4332539 4669400 4967956 5202908 5488437 5829337 6093234 6367088 6666563 6847070
7349 6847070 7071093 7224489 7295260 7329319 7302785 7219495 7166340 7067258 6865179 6687355 6472313
7338 6472313 6280080 6100222 5937492 5765399 5572290 5449764 5304542 5232444 5167489 5063742
7328 5063742 4976076 4848108 4750610 4607954 4424030 4142689 3925951 3727810 3448299 3221513
7318 3221513 3013705 2866882 2744381 2580607 2477543 2337697 2208855 2144009 2065741 1981537
7308 1981537 1900938 1796632 1656782 1479977 1452431 1425326 1381296 1334450 1282126 1227139 1170168
7297 1170168 1181086 1168327 1095320 1008981 974192 927278 838082 845751 830983 809382 773745 727516
7285 727516 706260 689265 685775 670768 649949 619457 589073 597238 581791 578802 582141 541436
$$ packed form
7359D062600K69939L36861K98556K34952K85529L40900K63897K73854K99475J80507
7349F847070K24023J53396P0771L4059k6534q3290n3155r9082k02079j77824k15042
7338F472313j92233j79858j62730j72093j93109j22526j45222p2098o4955j03747
7328E063742q7666j27968r7498j42656j83924k81341k16738j98141k79511k26786
7318C221513k07808j46823j22501j63774j03064j39846j28842o4846p8268q4204
7308A981537q0599j04306j39850j76805k7546k7105m4030m6846n2324n4987n6971
7297A170168J0918j2759p3007q6339l4789m6914q9196P669j4768k1601l5637m6229
7285G27516k1256j6995l490j5007k0819l0492l0384Q165j5447k989L339m0705
$$ plain form
7273 541436 600030 531090 502192 478777 514054 534021 433605 448303 452828 423163 410253 404285
7261 404285 410751 375728 342127 351745 343757 366697 339270 328057 325782 302636 256867 226916
7249 226916 249393 322098 409800 386407 374305 377459 377593 350028 345982 301182 300305 346011 362544
7236 362544 353777 356227 346506 337683 323916 303802 268054 232905 205678 183019 240550 224298
7224 224298 275097 264729 282194 224837 271389 251683 183609 223166 267726 231969 210337 186665
7212 186665 164311 171629 147209 128127 99568 112848 118931 120340 158873 156404 105945 142949
7200 142949 132373 159250 198807 194263 167589 150083 126315 170708 134319 143073 147804 141012
7188 141012 107898 109668 120586 102939 104852 136283 81114 101303 133287 116680 127980 137458
$$ packed form
7273E41436N8594o8940k8898k3415L5277J9967j00416J4698M525k9665j2910n968
7261D04285O466l5023l3601R618p988K2940k7427j1213k275k3146m5769k9951
7249B26916K2477P2705Q7702k3393j2102L154J34k7565m046m4800q77M5706J6533
7236C62544q767K450r721q823j3767k0114l5748l5149k7227k2659N7531j6252
7224B24298N0799j0368J7465n7357M6552j9706o8074L9557M4560l5757k1632k3672
7212A86665k2354P318k4420j9082k8559J3280O083J409L8533k469n0459L7004
7200A42949j0576K6877L9557m544k6674j7506k3768M4393l6389Q754M731o792
7188A41012l3114J770J0918j7647J913L1431n5169K0189L1984j6607J1300R478
$$ plain form
7176 137458 129653 141715 118916 82432 71229 49175 91190 128617 141418 195097 198340 105538
7164 105538 73769 106546 117141 113636 88465 89060 105909 125351 177675 201657 181374 203573
7152 203573 157516 124605 169607 166693 170697 232578 257440 222054 233945 219949 231421 244368
7140 244368 273237 290091 292095 262006 324289 327656 414347 436492 376676 366387 434980 496847
7128 496847 554764 623141 713637 763175 812021 889872 979609 1050231 1077256 1120384 1132777 1133205
7116 1133205 1121114 1117237 1011919 889408 879756 900345 815955 757017 716764 658268 615625
7105 615625 595554 534887 488684 476810 415435 370645 418811 406315 409105 390234 398340 418975
7093 418975 386454 360777 372451 353956 334211 363200 356084 344898 313685 298370 295852 317889
$$ packed form
7176A37458p805J2062k2799l6484j1203k2054M2015L7427J2801N3679L243r2802
7164A05538l1769L2777J0595l505k5171N95J6849J9442N2324K3982k0283K2199
7152B03573m6057l2911M5002k914M004O1881K4862l5386J1891j3996J1472J2947
7140B44368K8869J6854K004l0089O2283L367Q6691K2145n9816j0289O8593O1867
7128D96847N7917O8377R0496M9538M8846P7851Q9737P0622K7025M3128J2393M28
7116A133205j2091l877j05318j22511r652K0589q4390n8938m0253n8496m2643
7105F15625k0071o0667m6203j1874o1375m4790M8166j2496K790j8871Q106K0635
7093D18975l2521k5677J1674j8495j9745K8989p116j1186l1213j5315k518K2037
$$ plain form
7081 317889 300339 329495 358609 338083 333677 372871 400377 395071 416029 448666 454700 428665
7069 428665 387111 469999 458598 416986 417616 429466 534988 575263 582401 543818 565647 584415
7057 584415 597860 540909 556833 644448 698430 700025 718999 781394 844656 835777 855493 844603
7045 844603 846784 905449 923913 870416 823811 801306 756499 781561 761757 715547 684738 672501
7033 672501 639181 636796 628884 534530 488943 488082 475445 454372 431574 401489 361383 386966
7021 386966 394659 452960 408492 394524 393748 364058 358340 408821 402169 428639 453790 426293 402597
7008 402597 394609 408575 411061 421140 419583 417140 365512 331316 281654 265028 294367 289957 255616
6995 255616 262313 271607 310210 300842 268452 280762 304933 313203 286307 227103 277498 294564
$$ packed form
7081C17889j7550K9156K9114k0526m406L9194K7506n306K0958L2637O034k6035
7069D28665m1554Q2888j1401m1612O30J1850J05522M0275P138l8583K1829J8768
7057E84415J3445n6951J5924Q7615N3982J595J8974O2395O3262q879J9716j0890
7045H44603K181N8665J8464n3497m6605k2505m4807K5062j9804m6210l0809j2237
7033F72501l3320k385p912r4354m5587q61j2637k1073k2798l0085m0106K5583
7021C86966P693N8301m4468j3968p76k9690n718N0481o652K6470K5151k7497k3696
7008D02597p988J3966K486J0079j557k443n1628l4196m9662j6626K9339m410l4341
6995B55616O697R294L8603r368l2390J2310K4171Q270k6896n9204N0395J7066
$$ plain form
6983 294564 293360 282694 226720 254600 236920 184410 183199 149405 157976 179191 191367 241317
6971 241317 260349 242388 234145 238709 219036 208357 266338 237957 185113 219183 251078 278927
6959 278927 249177 235575 241285 232434 277831 297004 256433 240794 288168 333176 341106 293206
6947 293206 222620 197285 258140 270142 262734 266272 248803 271676 275369 317296 321558 322147 268527
6934 268527 270482 245907 203971 197702 194349 182735 168201 178307 166062 148889 120688 66216
6922 66216 94829 109358 107352 72190 98545 165847 168139 146113 154025 128867 112360 120595 49946
6909 49946 71960 111848 162052 181135 149328 111671 108555 129083 151665 121152 179869 181358
6897 181358 163699 132227 117727 128393 94274 134928 154577 143038 116185 101339 115169 128875
$$ packed form
6983B94564j204j0666n5974K7880j7680n2510j211l3794Q571K1215J2176M9950
6971B41317J9032j7961q243M564j9673j0679N7981k8381n2844L4070L1895K7849
6959B78927k9750j3602N710q851M5397J9173m0571j5639M7374M5008P930m7900
6947B93206p0586k5335O0855J2002p408L538j7469K2873L693M1927M262N89n3620
6934B68527J955k4575m1936o269l353j1614j4534J0106j2245j7173k8201n4472
6922F6216K8613J4529k006l5162K6355O7302K292k2026P912k5158j6507Q235p0649
6909D9946K2014L9888N0204J9083l1807l7657l116K0528K2582l0513N8717J489
6897A81358j7659l1472j4500J0666l4119M0654J9649j1539k6853j4846J3830J3706
$$ plain form
6885 128875 125532 134942 114005 168280 220396 193820 224863 230052 228638 216507 184180 185043 218447
6872 218447 273675 289772 317156 313575 310457 312640 303513 314280 294803 299237 305344 282938 287433
6859 287433 307556 304445 279029 235355 240620 235213 211017 207809 244101 276415 251564 190487
6847 190487 116873 94532 130838 143044 147516 176704 200748 197188 175533 176990 165538 142250
6835 142250 137668 143776 158531 120921 95450 109957 111001 131070 139615 132158 120546 82079 104888
6822 104888 185940 163937 183038 189328 149498 161672 154092 192407 154400 128867 126179 107579
6810 107579 58906 82374 156425 161200 136715 155698 100842 87281 100307 92805 89537 68689
6798 68689 47938 72046 128461 97421 86618 107730 95352 54014 90172 117358 150274 94505
$$ packed form
6885A28875l343R410k0937N4275N2116k6576L1043N189j414j2131l2327Q63L3404
6872B18447N5228J6097K7384l581l118K183r127J0767j9477M434O107k2406M495
6859B87433K0123l111k5416m3674N265n407k4196l208L6292L2314k4851o1077
6847A90487p3614k2341L6306J2206M472K9188K4044l560k1655J457j1452k3288
6835A42250m582O108J4755l7610k5471J4507J044K0069Q545p457j1612l8467K2809
6822A04888Q1052k2003J9101O290l9830J2174p580L8315l8007k5533k688j8600
6810A07579m8673K3468P4051M775k4485J8983n4856j3561J3026p502l268k0848
6798F8689k0751K4108N6415l1040j0803K1112j2378m1338L6158K7186L2916n5769
$$ plain form
6786 94505 74970 103375 116416 85125 77727 97380 63160 76385 112001 159785 172317 167395
6774 167395 131308 147888 139029 102257 112514 91616 102467 126545 119103 108466 152734 107994
6762 107994 60818 35701 58594 94253 169814 141311 139528 180367 178035 164564 149866 171402
6750 171402 186444 219738 240760 195318 229215 266611 234707 218810 236771 230407 275039 342244
6738 342244 414705 437347 424223 385432 359968 332193 342712 393801 305923 320689 331399 281467
6726 281467 264269 229983 213019 261058 239675 247915 256638 216863 222390 241365 189950 167460
6714 167460 144896 162942 166726 167063 155687 142180 171531 165921 170792 163966 156839 196149 169100
6701 169100 195285 153630 234344 256930 210336 254595 213178 188556 205139 209905 245816 297513
$$ packed form
6786I4505j9535K8405J3041l1291p398J9653l4220J3225L5616M7784J2532m922
6774A67395l6087J6580q859l6772J0257k0898J0851K4078p442j0637M4268m4740
6762A07994m7176k5117K2893L5659P5561k8503j783M0839k332j3471j4698K1536
6750A71402J5042L3294K1022m5442L3897L7396l1904j5897J7961o364M4632O7205
6738C42244P2461K2642j3124l8791k5464k7775J0519N1089q7878J4766J0710m9932
6726B81467j7198l4286j6964M8039k1383Q240Q723l9775N527J8975n1415k2490
6714A67460k2564J8046L784L37j1376j3507K9351n610M871o826p127L9310k7049
6701A69100K6185m1655Q0714K2586m6594M4259m1417k4622J6583M766L5911N1697
$$ plain form
6689 297513 286748 288523 291739 288927 248398 256833 244979 248956 255037 280521 262729 237772 272923
6676 272923 286514 254160 260637 255169 210161 193701 193098 227266 216786 180549 240170 288416
6664 288416 281315 288055 223491 202108 241459 249525 208381 207716 282512 331111 299371 301208 321631
6651 321631 269121 224177 244320 262176 325341 369417 387309 381302 345352 386224 394568 396037
6639 396037 449603 482915 491885 498351 497816 505340 484299 471164 472608 543469 529470 528120 532643
6626 532643 494035 530180 528250 533467 548046 524695 539700 532133 495598 496741 529737 542247
6614 542247 548109 542101 530061 563719 595041 588531 537398 576473 547935 582828 568291 562565
6602 562565 627504 602635 557693 551074 590592 579074 495962 492047 523820 526578 539234 483250
$$ packed form
6689B97513j0765J775L216k812m0529Q435j1854L977O081K5484j7792k4957L5151
6676B72923J3591l2354O477n468m5008j6460o03L4168j0480l6237N9621M8246
6664B88416p101O740o4564k1383L9351Q066m1144o65P4796M8599l1740J837K0423
6651C21631n2510m4944K0143J7856O3165M4076J7892o007l5950M0872Q344J469
6639C96037N3566L3312Q970O466n35P524k1041j3135J444P0861j3999j350M523
6626E32643l8608L6145j930N217J4579k3351J5005p567l6535J143L2996J2510
6614E42247N862o008j2040L3658L1322o510n1133L9075k8538L4893j4537n726
6602E62565O4939k4869m4942o619L9518j1518q3112l915L1773K758J2656n5984
$$ plain form
6590 483250 510394 510910 473310 469284 461928 431572 427843 440455 482842 478986 482274 480482 474274
6577 474274 539917 516638 487003 512948 499307 473059 506966 526000 515486 488855 438153 469351
6565 469351 484371 483883 511302 474175 522127 578092 548050 542148 517708 507240 502948 506124 493378
6552 493378 485730 502223 523007 554908 567442 595874 561674 579504 637974 659822 627495 595707
6540 595707 610030 651309 731335 706830 662584 681935 763143 784873 812350 833489 865966 909979
6528 909979 897767 876296 846237 778462 772581 826123 806159 802264 800991 786367 829167 844282
6516 844282 882998 872414 858837 887578 906688 914571 941474 963547 1018122 1063112 1027660 1035098
6504 1035098 1068282 1073203 1106047 1150522 1083217 1064410 1104926 1139816 1142492 1105669 1119757 1112061
$$ packed form
6590D83250K7144N16l7600m026p356l0356l729J2612M2387l856L288j792o208
6577D74274O5643k3279k9635K5945j3641k6248L3907J9034j0514k6631n0702L1198
6565D69351J5020m88K7419l7127M7952N5965l0042n902k4440j0468m292L176j2746
6552D93378p648J6493K0784L1901J2534K8432l4200J7830N8470K1848l2327l1788
6540E95707J4323M1279Q0026k4505m4246J9351Q1208K1730K7477K1139L2477M4013
6528I09979j2212k1471l0059o7775n881N3542j9964l895j273j4624M2800J5115
6516H44282L8716j0584j3577K8741J9110P883K6903K2073N4575M4990l5452P438
6504A035098L3184M921L2844M4475o7305j8807M0516L4890K676l6823J4088p696
$$ plain form
6492 1112061 1078360 1073303 1052965 1048948 1045717 1070533 1104588 1069769 1053133 1046902 1080236 1072605
6480 1072605 1080561 1090573 1094365 1115434 1131647 1085645 1055962 1076946 1084123 1079560 1005717 1000688
6468 1000688 1016577 1025439 975931 950058 927710 954012 958525 950438 933146 959832 965208 873994
6456 873994 900604 929203 921211 876222 828154 823732 819710 859033 886304 863435 812606 813254 846527
6443 846527 834615 804481 810986 804109 884789 858290 895250 855860 863381 908915 831907 833137
6431 833137 799486 774648 757150 803243 799608 799408 792968 775558 805385 818768 837368 803644
6419 803644 822804 791814 758235 763522 783030 777362 756036 789387 784246 802278 795781 742572
6407 742572 782305 841538 826390 855177 883638 882925 833504 827449 879176 879023 853871 861956 900499
$$ packed form
6492A112061l3701n057k0338m017l231K4816L4055l4819j6636o231L3334p631
6480A072605P956J0012L792K1069J6213m6002k9683K0984P177m563p3843n029
6468A000688J5889Q862m9508k5873k2348K6302M513q087j7292K6686N376r1214
6456H73994K6610K8599p992m4989m8068m422m022L9323K7271k2869n0829O48L3273
6443H46527j1912l0134O505o877Q0680k6499L6960l9390P521M5534p7008J230
6431H33137l3651k4838j7498M6093l635k00o440j7410K9827J3383J8600l3724
6419H03644J9160l0990l3579N287J9508n668k1326L3351n141J8032o497n3209
6407G42572L9733N9233j5148K8787K8461p13m9421o055N1727j53k5152Q085L8543
$$ plain form
6394 900499 897617 922834 903988 888571 923748 959627 956523 941176 999001 1014101 1018547 1052477
6382 1052477 1044652 1067906 1069490 1083965 1096466 1121244 1172492 1137050 1164233 1180170 1249594 1260440
6370 1260440 1272762 1270390 1255442 1212903 1226752 1240821 1312559 1360855 1334176 1321719 1395288 1395094
6358 1395094 1356858 1363886 1399098 1415644 1455764 1489552 1519523 1511024 1473367 1438414 1431296 1490995
6346 1490995 1572792 1646187 1590547 1629885 1657814 1681197 1729449 1776286 1791628 1812574 1868265
6335 1868265 1852397 1874970 1895547 1905802 1907426 1943498 1969031 1968433 1983061 2052266 2080158 2079370
6323 2079370 2122463 2183475 2275372 2281678 2356587 2422386 2486382 2569146 2580404 2619083 2666733 2740082
6311 2740082 2839627 2974279 3036738 3121467 3276661 3411402 3609871 3764435 3891289 4108812
$$ packed form
6394I00499k882K5217j8846j5417L5177L5879l104j5347N7825J5100M446L3930
6382A052477p825K3254J584J4475J2501K4778N1248l5442K7183J5937O9424J0846
6370A260440J2322k372j4948m2539J3849J4069P1738M8296k6679j2457P3569j94
6358A395094l8236P028L5212J6546M0120L3788K9971q499l7657l4953p118N9699
6346A490995Q1797P3395n5640L9338K7929K3383M8252M6837J5342K0946N5691
6335A868265j5868K2573K0577J0255J624L6072K5533n98J4628O9205K7892p88
6323B079370M3093O1012R1897O306P4909O5799O3996Q2764J1258L8679M7650P3349
6311B740082R9545J34652O2459Q4729J55194J34741J98469J54564J26854K17523
$$ plain form
6301 4108812 4412166 4720067 4973600 5265187 5641779 5969057 6274216 6495049 6726392 6900640
6291 6900640 7086267 7336240 7557499 7820085 7992384 8181837 8352656 8452910 8571326 8692072
6281 8692072 8905742 9168969 9452375 9781016 10200056 10599843 11024117 11483570 11956507 12476369
6271 12476369 13055004 13717277 14515350 15374262 16307038 17215631 17962001 18537037 18799657
6262 18799657 18633013 18159042 17465498 16714323 15922152 15361546 14999949 14741781 14639944
6253 14639944 14693446 14858177 15190144 15623565 16182703 16894612 17612127 18375525 19002911 19472385
6243 19472385 19678218 19579895 19229031 18571588 17823442 16958694 15988139 15080522 14195503 13416122
6233 13416122 12796575 12265787 11774374 11344165 11076806 10791908 10481824 10250553 10085167
$$ packed form
6301D108812L03354L07901K53533K91587L76592L27278L05159K20833K31343J74248
6291F900640J85627K49973K21259K62586J72299J89453J70819J00254J18416J20746
6281H692072K13670K63227K83406L28641M19040L99787M24274M59453M72937N19862
6271A2476369N78635O62273P98073Q58912R32776R08593P46370N75036K62620
6262A8799657j66644m73971o93544p51175p92171n60606l61597k58168j01837
6253A4639944N3502J64731L31967M33421N59138P11909P17515P63398O27386M69474
6243A9472385K05833r8323l50864o57443p48146q64748r70555r07617q85019p79381
6233A3416122o19547n30788m91413m30209k67359k84898l10084k31271j65386
$$ plain form
6224 10085167 9947745 9837633 9789357 9820822 9944183 10093840 10404977 10785452 11191577 11591491
6214 11591491 12241383 12954111 13771323 14756228 15720622 16651453 17535746 18341155 18902236
6205 18902236 19177578 19225723 19066128 18715861 18207208 17571371 16917366 16303269 15793275 15443639
6195 15443639 15140535 15021648 15061848 15224480 15523188 15890348 16486337 17117891 17756858 18309964
6185 18309964 18649459 18873045 18768557 18340068 17703457 16998867 16207540 15505834 14913715
6176 14913715 14376247 13882827 13484626 13108452 12707141 12244783 11823760 11389591 10976239
6167 10976239 10648111 10360983 10163275 9992538 9879240 9665167 9524014 9325204 9078737
6158 9078737 8884908 8671767 8483437 8275811 8050748 7848502 7630934 7380029 7111498 6761980
$$ packed form
6224A0085167j37422j10112m8276L1465J23361J49657L11137L80475M06125L99914
6214A1591491O49892P12728Q17212R84905R64394R30831Q84293Q05409N61081
6205A8902236K75342M8145j59595l50267n08653o35837o54005o14097n09994l49636
6195A5443639l03104j18887M0200J62632K98708L67160N95989O31554O38967N53106
6185A8309964L39495K23586j04488m28489o36611p04590p91327p01706n92119
6176A4913715n37468m93420l98201l76174m01311m62358m21023m34169m13352
6167A0976239l28128k87128j97708j70737j13298k14073j41153j98810k46467
6158I078737j93829k13141j88330k07626k25063k02246k17568k50905k68531l49518
$$ plain form
6148 6761980 6415349 6148833 5861852 5617921 5369217 5118390 4932474 4719326 4567638 4388992
6138 4388992 4257861 4138538 4022153 3898655 3768419 3655253 3558466 3458521 3386703 3411016
6128 3411016 3336269 3198537 3124853 3108551 3081336 2978140 2916776 2911285 2904744 2918175 2834613
6117 2834613 2775879 2808879 2793954 2812325 2740602 2647834 2653457 2632222 2596050 2538773 2539315 2529510
6105 2529510 2499856 2505850 2428495 2445984 2442613 2381115 2336793 2254701 2241898 2216641 2182614 2106515
6093 2106515 2112812 2083774 2114481 2072162 2070516 2055194 2012296 1977845 1990920 2002331 1978223 1960828
6081 1960828 1910107 1867349 1855854 1803413 1783815 1761857 1789462 1798930 1746927 1703825 1740211 1765166
6069 1765166 1709087 1707092 1707498 1742857 1727032 1714286 1722115 1765153 1760026 1768865 1735859 1712455 1639936
$$ packed form
6148F761980l46631k66516k86981k43931k48704k50827j85916k13148j51688j78646
6138D388992j31131j19323j16385j23498j30236j13166r6787r9945p1818K4313
6128C411016p4747j37732p3684j6302k7215j03196o1364n491o541J3431q3562
6117B834613n8734L3000j4925J8371p1723r2768N623k1235l6172n7277N42r805
6105B529510k9654N994p7355J7489l371o1498m4322q2092j2803k5257l4027p6099
6093B106515O297k9038L0707m2319j646j5322m2898l4451J3075J1411k4108j7395
6081A960828n0721m2758j1495n2441j9598k1958K7605R468n2003m3102L6386K4955
6069A765166n6079j995M06L5359j5825j2746P829M3038n127Q839l3006k3404p2519
$$ plain form
6056 1639936 1630280 1682466 1681804 1683640 1734280 1761153 1712788 1676626 1740891 1748054 1712199 1727528
6044 1727528 1712428 1770626 1829230 1827923 1806557 1757455 1748239 1812928 1807949 1852103 1871185 1855582
6032 1855582 1875574 1916591 1933612 1957986 1967687 1968317 1925445 1926516 1909464 1891937 1952857 1914257
6020 1914257 1958168 1960026 1950065 1977054 1943242 1960109 1960178 1942913 1971132 1996926 2020620 2010064
6008 2010064 2007629 1978742 1998944 2024960 2040880 2092597 2046338 2011002 2036167 2030764 2048123 2069054
5996 2069054 2104506 2145441 2180392 2206928 2244670 2264994 2292593 2281228 2347779 2382629 2422356
5985 2422356 2411884 2454502 2499208 2477271 2461501 2435683 2462513 2489637 2516202 2520794 2486064 2543502
5973 2543502 2571010 2567421 2552118 2531184 2576522 2620422 2623847 2608627 2608605 2610472 2589582 2581951 2604191
$$ packed form
6056A639936r656N2186o62J836N0640K6873m8365l6162O4265P163l5855J5329
6044A727528j5100N8198N8604j307k1366m9102r216O4689m979M4154J9082j5603
6032A855582J9992M1017J7021K4374R701O30m2872J071j7052j7527O0920l8600
6020A914257M3911J858r961K6989l3812J6867O9j7265K8219K5794K3694j0556
6008B010064k435k8887K0202K6016J5920N1717m6259l5336K5165n403J7359K0931
5996B069054L5452M0935L4951K6536L7742K0324K7599j1365O6551L4850L9727
5985B422356j0472M2618M4706k1937j5770k5818K6830K7124K6565M592l4730N7438
5973B543502K7508l589j5303k0934M5338M3900L425j5220k2J867k0890p631K2240
$$ plain form
5960 2604191 2641804 2614580 2629688 2643514 2653238 2693095 2689435 2789373 2825799 2826462 2821916 2904057
5948 2904057 2973654 2964000 2982180 3015012 3018125 3028875 3050677 3067951 3060203 3072813 3026921 3036933
5936 3036933 3018328 3080544 3106749 3122990 3161095 3171734 3221263 3282465 3281954 3314258 3326526 3323013
5924 3323013 3338024 3407104 3455347 3436479 3467314 3507996 3506671 3491959 3505196 3551485 3551264 3528360
5912 3528360 3509040 3463372 3465549 3495373 3501516 3446514 3473276 3401899 3386141 3441027 3438894 3339399
5900 3339399 3314971 3251256 3229584 3230397 3199919 3140688 3129314 3094689 3065694 3053125 3049719 3066727
5888 3066727 3069072 3022395 3006016 3054519 3075895 3111629 3089266 3113089 3124896 3151404 3095278 3135792
5876 3135792 3118019 3154669 3167467 3118718 3113722 3086472 3050379 3052201 3038239 2983537 2948026 2961117
$$ packed form
5960B604191L7613k7224J5108J3826R724L9857l660R9938L6426O63m546Q2141
5948B904057O9597r654J8180L2832L113J0750K1802J7274p748J2610m5892J0012
5936C036933j8605O2216K6205J6241L8105J0639M9529O1202n11L2304J2268l513
5924C323013J5011O9080M8243j8868L0835M0682j325j4712J3237M6289k21k2904
5912C528360j9320m5668K177K9824O143n5002K6762p1377j5758N4886k133r9495
5900C339399k4428o3715k1672Q13l0478n9231j1374l4625k8995j2569l406J7008
5888C066727K345m6677j6379M8503K1376L5734k2363K3823J1807K6508n6126M0514
5876C135792j7773L6650J2798m8749m996k7250l6093J822j3962n4702l5511J3091
$$ plain form
5864 2961117 2948600 2938890 2879740 2860478 2870305 2819445 2790309 2780166 2815844 2807836 2790970 2797497
5852 2797497 2753439 2744235 2764201 2776036 2752127 2744858 2811899 2785872 2736422 2741509 2735047 2738537
5840 2738537 2772555 2781215 2800560 2832196 2863313 2926936 2972203 2982830 3035067 3072434 3106302 3124236
5828 3124236 3215584 3285254 3368262 3438761 3527718 3516584 3586798 3716195 3808635 3796703 3846128
5817 3846128 3953178 3924498 3984715 4012079 4050747 4037902 4002003 4049372 4105106 4073207 4024540
5806 4024540 3991398 3904625 3870408 3789419 3737060 3712424 3699434 3646988 3640927 3625457 3583450 3582985
5794 3582985 3634065 3632418 3626988 3687525 3734741 3764472 3761650 3789342 3853394 3884689 3916510 3938243
5782 3938243 3996284 4017598 4033043 4086927 4134632 4222688 4253057 4317003 4358143 4471095 4490117
$$ packed form
5864B961117j2517r710n9150j9262R827n0860k9136j0143L5678q008j6866O527
5852B797497m4058r204J9966J1835k3909p269O7041k6027m9450N087o462L490
5840B738537L4018Q660J9345L1636L1117O3623M5267J0627N2237L7367L3868J7934
5828C124236R1348O9670Q3008P0499Q8957j1134P0214J29397R2440j1932M9425
5817C846128J07050k8680O0217K7364L8668j2845l5899M7369N5734l1899m8667
5806D024540l3142q6773l4217q0989n2359k4636j2990n2446o061j5470m2007m65
5794C582985N1080j647n430O0537M7216K9731k822K7692O4052L1295L1821K1733
5782C938243N8041K1314J5445N3884M7705Q8056L0369O3946M1140J12952J9022
$$ plain form
5771 4490117 4502727 4565746 4569321 4586142 4632806 4667208 4731335 4827970 4862265 4880268 4941315 5004477
5759 5004477 5030894 5047878 5057106 5058630 5115682 5172766 5177009 5203461 5214231 5181884 5274829 5296303
5747 5296303 5359641 5374419 5443821 5504695 5578744 5617368 5624758 5588943 5551244 5534866 5500265 5401842
5735 5401842 5349083 5355655 5249922 5236518 5208530 5192765 5217867 5210408 5139798 5156328 5143568 5094477
5723 5094477 5135459 5212816 5271345 5275352 5334232 5393164 5442007 5532666 5639178 5736630 5788448
5712 5788448 5884998 5997821 6130317 6203197 6341723 6527256 6715805 6936029 7091104 7278422
5702 7278422 7516842 7724171 7958513 8133026 8310126 8489346 8667154 8834340 8984122 9174888
5692 9174888 9356973 9564519 9769238 9971782 10138769 10230387 10387804 10554204 10783357 10945810
$$ packed form
5771D490117J2610O3019L575J6821M6664L4402O4127R6635L4295J8003O1047O3162
5759E004477K6417J6984R228J524N7052N7084M243K6452J0770l2347R2945K1474
5747E296303O3338J4778O9402O0874P4049L8624P390l5815l7699j6378l4601r8423
5735E401842n2759O572j05733j3404k7988j5765K5102p459p0610J6530j2760m9091
5723E094477M0982P7357N8529M007N8880N8932M8843R0659J06512R7452N1818
5712E788448R6550J12823J32496P2880J38526J85533J88549K20224J55075J87318
5702G278422K38420K07329K34342J74513J77100J79220J77808J67186J49782J90766
5692I174888J82085K07546K04719K02544J66987R1618J57417J66400K29153J62453
$$ plain form
5682 10945810 11072899 11271055 11449793 11592403 11773338 11880333 11962323 12041732 12084602 12177712
5672 12177712 12294854 12376050 12451857 12540822 12654545 12777932 12918439 13030523 13154692 13372501
5662 13372501 13584824 13715739 13830627 13912424 13991579 14015362 14049610 14176302 14345959 14571461
5652 14571461 14772529 14995034 15295649 15527057 15833558 16101165 16442447 16853329 17262037
5643 17262037 17729092 18169349 18711978 19250281 19876067 20575056 21325850 22177031 23261821
5634 23261821 24452686 25787788 27286914 28890132 30598869 32253618 33734949 35201636
5626 35201636 36487953 37775217 39341221 41163068 43301808 45804871 48659449 51933525
5618 51933525 55639482 59900001 64574343 69765709 75516515 81890224 88819510 96287103
$$ packed form
5682A0945810J27089J98156J78738J42610J80935J06995Q1990P9409M2870R3110
5672A2177712J17142Q1196P5807Q8965J13723J23387J40507J12084J24169K17809
5662A3372501K12323J30915J14888Q1797P9155K3783L4248J26692J69657K25502
5652A4571461K01068K22505L00615K31408L06501K67607L41282M10882M08708
5643A7262037M67055M40257N42629N38303O25786O98989P50794Q51181J084790
5634B3261821J190865J335102J499126J603218J708737J654749J481331J466687
5626C5201636J286317J287264J566004J821847K138740K503063K854578L274076
5618E1933525L705957M260519M674342N191366N750806O373709O929286P467593
$$ plain form
5610 96287103 104083820 112180903 120403737 128509534 136405224 143828383 150531119 156395352
5602 156395352 161194732 164608606 166387726 166405695 164562469 160873554 155751952 149645067
5594 149645067 142663828 135209392 127649477 119918840 112316323 104776011 97551601 90789606
5586 90789606 84434847 78562491 73175750 68237889 63843836 59792611 56122918 52778998
5578 52778998 49716853 46914735 44421339 42204981 40231440 38401068 36697219 35206194
5570 35206194 33898555 32711077 31604103 30564070 29617911 28699992 27745707 26800216 25822839
5561 25822839 24799521 23881489 23082672 22274147 21494548 20778068 20115989 19500597 18917450
5552 18917450 18393523 17861477 17359016 16847742 16364041 15959374 15617467 15305373 14941768
$$ packed form
5610I6287103P796717Q097083Q222834Q105797P895690P423159O702736N864233
5602A56395352M799380L413874J779120J7969j843226l688915n121602o106885
5594A49645067o981239p454436p559915p730637p602517p540312p224410o761995
5586I0789606o354759n872356n386741m937861m394053m051225l669693l343920
5578E2778998l062145k802118k493396k216358j973541j830372j703849j491025
5570C5206194j307639j187478j106974j040033r46159r17919r54285r45491r77377
5561B5822839j023318r18032p98817q08525p79599p16480o62079o15392n83147
5552A8917450n23927n32046n02461n11274m83701m04667l41907l12094l63605
$$ plain form
5543 14941768 14592227 14271540 13962042 13746284 13516572 13300773 13089458 12855306 12668978
5534 12668978 12484169 12282894 12080678 11947808 11780596 11610337 11452900 11370257 11270002 11167572
5524 11167572 11053397 10944764 10831153 10690395 10560404 10488612 10396153 10287824 10199485 10090835
5514 10090835 9955973 9824409 9659191 9496354 9356115 9249625 9147889 9021014 8872302
5505 8872302 8682576 8512406 8360685 8232622 8101370 7942987 7817820 7666076 7548828 7499797
5495 7499797 7415014 7303704 7236978 7153468 7086178 7027390 6902637 6849591 6808096 6751415 6686367
5484 6686367 6603019 6544458 6528184 6503030 6448465 6362122 6348901 6307402 6321572 6241740 6219021
5473 6219021 6196679 6215647 6153741 6093007 6052556 5990431 6016496 5987467 5988743 5969339 5972197 6014510
$$ packed form
5543A4941768l49541l20687l09498k15758k29712k15799k11315k34152j86328
5534A2668978j84809k01275k02216j32870j67212j70259j57437q2643j00255j02430
5524A1167572j14175j08633j13611j40758j29991p1792r2459j08329q8339j08650
5514A0090835j34862j31564j65218j62837j40239j06490j01736j26875j48712
5505H872302j89726j70170j51721j28063j31252j58383j25167j51744j17248m9031
5495G499797q4783j11310o6726q3510o7290n8788j24753n3046m1495n6681o5048
5484F686367q3348n8561j6274k5154n4565q6343j3221m1499J4170p9832k2719
5473F219021k2342J8968o1906o0734m0451o2125K6065k9029J276j9404K858M2313
$$ plain form
5461 6014510 5960159 5822696 5815076 5800053 5761359 5714832 5720655 5703893 5645862 5552852 5523405 5493462
5449 5493462 5444696 5364930 5353759 5310225 5321146 5316051 5306430 5305115 5318296 5307424 5270494 5267722
5437 5267722 5255363 5254074 5200631 5154681 5119309 5111855 5040693 5017782 5022918 4992672 4927081 4839753
5425 4839753 4769717 4735113 4715257 4720470 4673377 4641858 4598354 4578280 4566111 4589106 4617393 4585491
5413 4585491 4569272 4555816 4581774 4526159 4505258 4474740 4497070 4460965 4439025 4392759 4371867
5402 4371867 4334109 4244594 4211698 4220598 4231333 4153301 4142688 4116166 4095507 4048681 4034058 4036606
5390 4036606 4054215 4020644 4009892 4004706 4010738 4051387 4089147 4049032 4062760 4126333 4077407 4102581
5378 4102581 4188667 4216497 4290889 4340832 4408529 4460886 4592720 4757412 4858481 4983902 5233080
$$ packed form
5461F014510n4351j37463p620j5023l8694m6527N823j6762n8031r3010k9447k9943
5449E493462m8766p9766j1171m3534J0921n095r621j315J3181j0872l6930k772
5437E267722j2359j289n3443m5950l5372p454p1162k2911N136l0246o5591q7328
5425D839753p0036l4604j9856N213m7093l1519m3504k0074j2169K2995K8287l1902
5413D585491j6219j3456K5958n5615k0901l0518K2330l6105k1940m6266k0892
5402D371867l7758q9515l2896Q900J0735p8032j0613k6522k0659m6826j4623K548
5390D036606J7609l3571j0752n186O032M0649L7760m0115J3728O3573m8926K5174
5378D102581Q6086K7830P4392M9943O7697N2357J31834J64692J01069J25421K49178
$$ plain form
5367 5233080 5493247 5743049 6088331 6352064 6484378 6574448 6498875 6216383 5829537 5472570
5357 5472570 5182038 4966485 4801812 4640140 4544226 4414264 4313468 4268394 4214248 4087723
5347 4087723 3984220 3953470 3954403 3917321 3909061 3819123 3785721 3757179 3711740 3644891 3687458 3689072
5335 3689072 3595096 3557444 3627403 3651771 3616117 3564278 3553276 3591168 3587322 3601001 3635255 3635339
5323 3635339 3605477 3604853 3669464 3718492 3702986 3701626 3643375 3653289 3677538 3643088 3597333 3593251
5311 3593251 3588363 3634630 3634166 3638333 3632881 3650318 3687440 3672579 3663401 3707174 3738978 3721112 3737763
5298 3737763 3698612 3660619 3711402 3740733 3729678 3739007 3703362 3643698 3649479 3640334 3602044 3549723
5286 3549723 3473666 3412139 3404349 3336199 3332658 3338840 3343030 3284135 3198791 3199926 3212204 3143140
$$ packed form
5367E233080K60167K49802L45282K63733J32314R0070p5573k82492l86846l56967
5357E472570k90532k15553j64673j61672r5914j29962j00796m5074n4146j26525
5347D087723j03503l0750R33l7082q260q9938l3402k8542m5439o6849M2567J614
5335C689072r3976l7652O9959K4368l5654n1839j1002L7892l846J3679L4254Q4
5323C635339k9862o24O4611M9028j5506j360n8251R914K4249l4450m5755m082
5311C593251m888M6267m64M167n452J7437L7122j4861r178M3773L1804j7866J6651
5298C737763l9151l7993N0783K9331j1055R329l5645n9664N781r145l8290n2321
5286C549723p6057o1527p790o8150l541O182M190n8895q5344J135J2278o9064
$$ plain form
5274 3143140 3147869 3129631 3090226 3066203 3015106 2979797 2994532 2986913 2979699 2978241 2959225 2912830
5262 2912830 2916131 2937079 2924411 2943788 2942584 2927769 2862845 2846867 2869532 2879898 2907935 2939276
5250 2939276 2924225 2938658 2900226 2882166 2893396 2977807 2936247 2865622 2904750 2949117 2917307
5239 2917307 2927004 2922067 2917083 2910933 2971147 3023873 3057369 3081605 3189303 3206877 3227710 3337262
5227 3337262 3413829 3520273 3601690 3766276 3896439 4034085 4166866 4227568 4201512 4217879
5217 4217879 4133849 4038835 3957190 3861096 3803226 3694917 3629011 3571900 3510708 3527751 3534059
5206 3534059 3525798 3558921 3572778 3516888 3498781 3540242 3532774 3534740 3600348 3693896 3761113 3841764
5194 3841764 3907757 4053635 4207746 4350466 4511864 4635705 4776960 4913449 4991739 5073932
$$ packed form
5274C143140M729j8238l9405k4023n1097l5309J4735p619p214j458j9016m6395
5262B912830L301K0948j2668J9377j204j4815o4924j5978K2665J0366K8037L1341
5250B939276j5051J4433l8432j8060J1230Q4411m1560p0625L9128M4367l1810
5239B917307R697m937m984o150O0214N2726L3496K4236J07698J7574K0833J09552
5227C337262P6567J06444Q1417J64586J30163J37646J32781O0702k6056J6367
5217D217879q4030r5014q1645r6094n7870j08309o5906n7111o1192J7043O308
5206C534059q261L3123J3857n5890j8107M1461p468J966O5608R3548O7217Q0651
5194C841764O5993J45878J54111J42720J61398J23841J41255J36489P8290Q2193
$$ plain form
5184 5073932 5107250 5105526 5158147 5177073 5248800 5227771 5250313 5343691 5467091 5567990 5696664
5173 5696664 5739072 5783015 5842765 5869905 5787455 5709344 5713757 5611406 5627723 5654974 5678810
5162 5678810 5711497 5675603 5691848 5749912 5806821 5912693 6024967 6095264 6184189 6402743 6606457
5151 6606457 6794373 7031132 7294711 7576615 7866773 8126304 8356974 8496981 8596857 8717549
5141 8717549 8751729 8796036 8851187 8859807 8957994 9000594 9029607 9053658 9080720 9111986 9000579
5130 9000579 8794567 8610800 8437442 8227173 7956555 7708750 7515365 7387292 7271317 7178523
5120 7178523 7148769 7107569 7125534 7220998 7265619 7375156 7465441 7646334 7778842 7932398 8129107
5109 8129107 8265904 8436996 8516283 8616611 8626199 8547521 8530991 8528295 8438717 8354517 8217256
$$ packed form
5184E073932L3318j724N2621J8926P1727k1029K2542R3378J23400J00899J28674
5173E696664M2408M3943N9750K7140q2450p8111M413j02351J6317K7251K3836
5162E678810L2687l5894J6245N8064N6909J05872J12274P0297Q8925K18554K03714
5151F606457J87916K36759K63579K81904K90158K59531K30670J40007R9876J20692
5141H717549L4180M4307N5151Q620R8187M2600K9013K4051K7062L1266j11407
5130I000579k06012j83767j73358k10269k70618k47805j93385j28073j15975r2794
5120G178523k9754m1200J7965R5464M4621J09537R0285J80893J32508J53556J96709
5109H129107J36797J71092P9287J00328R588p8678j6530k696q9578q4200j37261
$$ plain form
5098 8217256 8060318 7883126 7769205 7690335 7556142 7388283 7276050 7133903 7011289 6911413
5088 6911413 6845406 6823541 6722432 6615546 6628220 6597576 6521419 6479555 6415697 6377794 6349457
5077 6349457 6241831 6219233 6215738 6132609 6051726 6032441 5982221 5929960 5876740 5866901 5899080 5877322
5065 5877322 5896007 5879933 5852888 5801173 5838040 5850876 5859757 5861822 5844762 5812580 5738749 5704957
5053 5704957 5662183 5672220 5686610 5627386 5620666 5621610 5595857 5620278 5617816 5648809 5633104 5608690
5041 5608690 5646773 5705896 5705961 5693929 5733320 5801830 5868944 5905682 5902342 5965130 6026508 6020185
5029 6020185 6035458 6115863 6138520 6127474 6174528 6231612 6248575 6286846 6340983 6377876 6413855
5018 6413855 6491108 6575478 6637142 6743009 6793088 6884501 6886438 6920416 7028383 7112069 7204723
$$ packed form
5098H217256j56938j77192j13921p8870j34193j67859j12233j42147j22614r9876
5088F911413o6007k1865j01109j06886J2674l0644p6157m1864o3858l7903k8337
5077F349457j07626k2598l495q3129q0883j9285n0220n2261n3220r839L2179k1758
5065E877322J8685j6074k7045n1715L6867J2836Q881K065j7060l2182p3831l3792
5053E704957m2774J0037J4390n9224o720R44k5753K4421k462L0993j5705k4414
5041E608690L8083N9123O5j2032L9391O8510O7114L6738l340O2788O1378o323
5029F020185J5273Q0405K2657j1046M7054N7084J6963L8271N4137L6893L5979
5018F413855P7253Q4370O1664J05867N0079R1413J937L3978J07967Q3686R2654
$$ plain form
5007 7204723 7208133 7234046 7337023 7384292 7475830 7539364 7558153 7588743 7652116 7733749 7755612
4996 7755612 7755636 7852376 7904877 7965564 8031667 8151519 8223079 8252337 8327130 8343861 8375246 8464480
4984 8464480 8546523 8566720 8605789 8596220 8595773 8634673 8672070 8731178 8766057 8812171 8834954 8824539
4972 8824539 8906891 9016821 9114102 9274824 9449001 9592490 9850645 10097796 10368511 10644247
4962 10644247 10962918 11311761 11515951 11833825 12040534 12247224 12517832 12803674 13158068
4953 13158068 13472479 13817408 14199975 14599722 15029648 15448257 15803913 16183225 16585071
4944 16585071 16985684 17378528 17779007 18176605 18647520 19019669 19403844 19855965 20262645
4935 20262645 20669858 21060293 21483587 21966441 22363776 22766280 23216557 23724507 24279148
$$ packed form
5007G204723L410K5913J02977M7269R1538O3534J8789L0590O3373Q1633K1863
4996G755612K4R6740N2501O0687O6103J19852P1560K9258P4793J6731L1385Q9234
4984H464480Q2043K0197L9069r569m47L8900L7397N9108L4879M6114K2783j0415
4972H824539Q2352J09930R7281J60722J74177J43489K58155K47151K70715K75736
4962A0644247L18671L48843K04190L17874K06709K06690K70608K85842L54394
4953A3158068L14411L44929L82567L99747M29926M18609L55656L79312M01846
4944A6585071M00613L92844M00479L97598M70915L72149L84175M52121M06680
4935B0262645M07213L90435M23294M82854L97335M02504M50277N07950N54641
$$ plain form
4926 24279148 24892629 25603030 26465634 27361321 28411953 29639477 31026876 32516834 34067625
4917 34067625 35775525 37647896 39682956 41806003 44003988 46116722 48185383 50168955
4909 50168955 52134064 54083500 56003799 57943542 59697111 61220582 62455319 63267978
4901 63267978 63605781 63363552 62617642 61360611 59984620 58348307 56627371 54948516 53300570
4892 53300570 51749081 50171372 48657876 47243065 45826877 44452904 43103573 41714671
4884 41714671 40313893 38988432 37653205 36277992 34944169 33666852 32448813 31237963
4876 31237963 30115041 29016628 28084751 27258467 26470047 25850414 25306580 24779245 24380701
4867 24380701 23975839 23650121 23382556 23198258 23040718 22976917 22957278 22931131 22980942 23134681
$$ packed form
4926B4279148O13481P10401Q62604Q95687J050632J227524J387399J489958J550791
4917C4067625J707900J872371K035060K123047K197985K112734K068661J983572
4909E0168955J965109J949436J920299J939743J753569J523471J234737Q12659
4901F3267978L37803k42229p45910j257031j375991j636313j720936j678855j647946
4892E3300570j551489j577709j513496j414811j416188j373973j349331j388902
4884D1714671j400778j325461j335227j375213j333823j277317j218039j210850
4876C1237963j122922j098413r31877q26284p88420o19633n43834n27335l98544
4867B4380701m04862l25718k67565j84298j57540o3801j9639k6147M9811J53739
$$ plain form
4857 23134681 23337201 23557183 23847352 24224055 24648344 25165792 25778024 26494842 27353623
4848 27353623 28320693 29292147 30383354 31542295 32699491 33849178 34990637 36164687
4840 36164687 37395669 38550181 39753120 41059253 42428490 43927026 45519858 47126965
4832 47126965 48530341 49722606 50674679 51326355 51582040 51467237 51124960 50663983 50184874
4823 50184874 49784685 49546455 49485496 49715855 50129127 50823987 51795691 53085209 54633127
4814 54633127 56539762 58871769 61564291 64674547 68070194 71699011 75408837 79156704
4806 79156704 82676315 85730615 88005069 89497042 89798025 88899512 86889322 84102027
4798 84102027 80823594 77415381 74061383 70999319 68398336 66127781 64222836 62652201
$$ packed form
4857B3134681K02520K19982K90169L76703M24289N17448O12232P16818Q58781
4848B7353623R67070R71454J091207J158941J157196J149687J141459J174050
4840C6164687J230982J154512J202939J306133J369237J498536J592832J607107
4832D7126965J403376J192265R52073O51676K55685j14803l42277m60977m79109
4823E0184874m00189k38230o0959K30359M13272O94860R71704J289518J547918
4814E4633127J906635K332007K692522L110256L395647L628817L709826L747867
4806G9156704L519611L054300K274454J491973L00983q98513k010190k787295
4798H4102027l278433l408213l353998l062064k600983k270555j904945j570635
$$ plain form
4790 62652201 61398515 60444219 59936210 59809953 60021753 60558329 61382326 62409721 63595986
4781 63595986 64830394 65874285 66639455 66921522 66563180 65561550 63976070 61884133 59427906
4772 59427906 56777989 54001840 51316020 48797445 46350766 44046405 41886121 39902446
4764 39902446 38051466 36353725 34800673 33365882 32120803 30943859 29892187 28985578
4756 28985578 28184474 27502939 26840699 26218598 25595965 25003422 24487164 23925191 23451187
4747 23451187 22999684 22628152 22219373 21872258 21531259 21239970 20978127 20678393 20461066
4738 20461066 20250022 20038841 19853751 19718884 19602565 19497221 19464612 19472087 19500311 19584252
4728 19584252 19692679 19922007 20163558 20442427 20777420 21120100 21351134 21501900 21613997
$$ packed form
4790F2652201j253686r54296n08009j26257K11800N36576Q23997J027395J186265
4781F3595986J234408J043891P65170K82067l58342j001630j585480k091937k456227
4772E9427906k649917k776149k685820k518575k446679k304361k160284j983675
4764C9902446j850980j697741j553052j434791j245079j176944j051672r06609
4756B8985578q01104o81535o62240o22101o22633n92543n16258n61973m74004
4747B3451187m51503l71532m08779l47115l40999k91289k61843k99734k17327
4738B0461066k11044k11181j85090j34867j16319j05344l2609P475K8224Q3941
4728A9584252J08427K29328K41551K78869L34993L42680K31034J50766J12097
$$ plain form
4719 21613997 21696375 21756485 21769415 21832749 21909097 22035990 22165452 22254434 22397984 22512587
4709 22512587 22757428 23006342 23191689 23432891 23719475 24158567 24631694 25159953 25774596
4700 25774596 26506383 27344387 28199197 29144932 30263063 31458354 32864764 34397906 35925234
4691 35925234 37556917 39240709 40974556 42643530 44159069 45558612 46980752 48426996
4683 48426996 50075840 51950823 54125775 56759816 59762085 63409968 67726931 72894436
4675 72894436 79098821 86294320 94009799 101914271 110309161 117644964 121436706 122507045
4667 122507045 120725254 115375169 109880790 106168479 103852926 102737848 102728000 103722838 105529167
4658 105529167 108116009 111363545 115375899 120341764 126371174 133519020 141761036 150987407
$$ packed form
4719B1613997Q2378O0110J2930O3334P6348J26893J29462Q8982J43550J14603
4709B2512587K44841K48914J85347K41202K86584M39092M73127N28259O14643
4700B5774596P31787Q38004Q54810R45735J118131J195291J406410J533142J527328
4691C5925234J631683J683792J733847J668974J515539J399543J422140J446244
4683D8426996J648844J874983K174952K634041L002269L647883M316963N167505
4675G2894436O204385P195499P715479P904472Q394890P335803L791742J070339
4667A22507045j781791n350085n494379l712311k315553j115078r848R94838J806329
4658A05529167K586842L247536M012354M965865O029410P147846Q242016R226371
$$ plain form
4650 150987407 161117206 171871182 182842144 193563502 203938757 214258615 225225839
4643 225225839 237745657 252410952 268913568 286705620 304773046 321430829 333899060
4636 333899060 339490553 337218313 327345057 311656703 293187341 274703464 257444544
4629 257444544 241746932 227624430 214850793 203206959 192689737 183098753 174437759
4622 174437759 166755979 160091482 154411434 149572976 145464889 142078776 139346445 137118938
4614 137118938 135267690 133807152 132545636 131338378 130101833 128693890 127032859 125086668
4606 125086668 122724396 120161920 117452037 114535715 111504063 108523826 105567471 102673728
4598 102673728 99849073 97150812 94586021 92205152 89966942 87824226 85803480 83836050
$$ packed form
4650A50987407J0129799J0753976J0970962J0721358J0375255J0319858J0967224
4643B25225839J2519818J4665295J6502616J7792052J8067426J6657783J2468231
4636C33899060N591493k272240r873256j5688354j8469362j8483877j7258920
4629B57444544j5697612j4122502j2773637j1643834j0517222r590984q660994
4622A74437759p681780o664497n680048m838458m108087l386113k732331k227507
4614A37118938j851248j460538j261516j207258j236545j407943j661031j946191
4606A25086668k362272k562476k709883k916322l031652k980237k956355k893743
4598A02673728k824655k698261k564791k380869k238210k142716k020746j967430
$$ plain form
4590 83836050 81925573 80014058 78203503 76488509 74879349 73286388 71722372 70214602
4582 70214602 68706190 67228064 65738521 64104094 62488428 60857556 59170949 57510620
4574 57510620 55878249 54212670 52621264 50979569 49421187 47949792 46481005 45012614
4566 45012614 43536115 42142955 40676142 39376161 38238592 37131811 36260278 35470127
4558 35470127 34748799 34096757 33519393 33048822 32629729 32232173 31950064 31797502 31700040 31681396
4548 31681396 31686435 31665285 31631884 31596900 31560172 31542292 31420378 31326187 31267389 31272081 31390232
4537 31390232 31465290 31573271 31709967 31747568 31629708 31425256 31111753 30737362 30325453 29953759
4527 29953759 29591272 29260075 28995336 28753989 28613882 28619410 28762370 29036721 29418718 29856876
$$ packed form
4590H3836050j910477j911515j810555j714994j609160j592961j564016j507770
4582G0214602j508412j478126j489543j634427j615666j630872j686607j660329
4574E7510620j632371j665579j591406j641695j558382j471395j468787j468391
4566D5012614j476499j393160j466813j299981j137569j106781q71533p90151
4558C5470127p21328o52042n77364m70571m19093l97556k82109j52562r7462j8644
4548C1681396N039k1150l3401l4984l6728j7880j21914r4191n8798M692J18151
4537C1390232P5058J07981J36696L7601j17860k04452l13503l74391m11909l71694
4527B9953759l62487l31197k64739k41347j40107N528J42960K74351L81997M38158
$$ plain form
4517 29856876 30364442 30843122 31065848 31015500 30761832 30258766 29772077 29525263 29481021 29618872
4507 29618872 30027188 30653648 31503360 32451685 33522377 34734181 35970907 37307451 38869244
4498 38869244 40650314 42792045 45456175 48436304 51514987 54633904 57328047 58678955
4490 58678955 58312655 56395152 52977817 48777394 44728120 41173822 38150911 35577938
4482 35577938 33373414 31344699 29539272 27842385 26243304 24801578 23465423 22265001
4474 22265001 21199204 20210195 19328123 18631648 17925806 17327009 16783648 16231505 15817167
4465 15817167 15465400 15137619 14827278 14637004 14489387 14380774 14280296 14301547 14352577 14404110
4455 14404110 14463418 14532679 14598389 14552757 14457746 14309052 14036019 13787037 13497527 13153002
$$ packed form
4517B9856876N07566M78680K22726n0348k53668n03066m86689k46814m4242J37851
4507B9618872M08316O26460Q49712R48325J070692J211804J236726J336544J561793
4498C8869244J781070K141731K664130K980129L078683L118917K694143J350908
4490E8678955l66300j917503l417335m200423m049274l554298l022911k572973
4482C5577938k204524k028715j805427j696887j599081j441726j336155j200422
4474B2265001j065797r89009q82072o96475p05842n98797n43361n52143m14338
4465A5817167l51767l27781l10341j90274j47617j08613j00478K1251N1030N1533
4455A4404110N9308O9261O5710m5632r5011j48694k73033k48982k89510l44525
$$ plain form
4445 13153002 12924590 12673702 12513158 12402414 12397412 12320481 12279193 12280747 12183447 12066573 11804709
4434 11804709 11481000 11125938 10773247 10475993 10129009 9874222 9644875 9408337 9162400
4425 9162400 8995993 8813063 8742496 8684830 8626120 8567843 8468881 8471256 8493030 8456641 8542097
4414 8542097 8657764 8710645 8740457 8823121 8892679 8801556 8743833 8621506 8553945 8394322 8330582
4403 8330582 8345347 8286705 8175927 8114885 8043571 7980011 7954640 7909125 7884830 7714684 7575437
4392 7575437 7451455 7258179 7105848 6982717 6876722 6800237 6703875 6632902 6614723 6481368
4382 6481368 6374392 6239677 6152235 6065582 5931722 5832484 5785240 5776990 5774483 5735749 5687742
4371 5687742 5622954 5560742 5492674 5482295 5431330 5385190 5381113 5406146 5428828 5416552 5422220 5507624
$$ packed form
4445A3153002k28412k50888j60544j10744n002p6931m1288J554r7300j16874k61864
4434A1804709l23709l55062l52691k97254l46984k54787k29347k36538k45937
4425I162400j66407j82930p0567n7666n8710n8277r8962K375K1774l6389Q5456
4414H542097J15667N2881K9812Q2664O9558r1123n7723j22327o7561j59623o3740
4403H330582J4765n8642j10778o1042p1314o3560k5371m5515k4295j70146j39247
4392G575437j23982j93276j52331j23131j05995p6485r6362p0973j8179j33355
4382F481368j06976j34715q7442q6653j33860r9238m7244q250k507l8734m8007
4371E687742o4788o2212o8068j0379n0965m6140m077K5033K2682j2276N668Q5404
$$ plain form
4359 5507624 5625496 5685406 5768464 5829995 5861274 5957369 5988118 6033529 6046694 5986522 5951639
4348 5951639 5911404 5891122 5841133 5765566 5743855 5737354 5673855 5679640 5592260 5567512 5589342 5617082
4336 5617082 5668471 5774937 5824085 5918035 5963367 5850318 5806346 5678921 5541689 5373156
4326 5373156 5241449 5141042 5028470 4951421 4897231 4814383 4712957 4693225 4645524 4548063 4455741
4315 4455741 4428968 4365115 4368190 4376077 4327408 4257985 4232114 4176581 4083667 4102160 4132722 4181362
4303 4181362 4175892 4153539 4195395 4289177 4323493 4276277 4273083 4347613 4345972 4257548 4181762 4036310
4291 4036310 3876973 3738758 3625954 3549668 3507017 3441941 3376848 3320567 3267293 3154460 3073821
4280 3073821 2990451 2989332 2970033 2912172 2914640 2904130 2820667 2766730 2714596 2641278 2599217 2576827
$$ packed form
4359E507624J17872N9910Q3058O1531L1279R6095L0749M5411J3165o0172l4883
4348E951639m0235k0282m9989p5567k1711o501o3499N785q7380k4748K1830K7740
4336E617082N1389J06466M9148R3950M5332j13049m3972j27425j37232j68533
4326E373156j31707j00407j12572p7049n4190q2848j01426j9732m7701r7461r2322
4315D455741k6773o3853L075P887m8669o9423k5871n5533r2914J8493L0562M8640
4303D181362n470k2353M1856R3782L4316m7216l194P4530j641q8424p5786j45452
4291D036310j59337j38215j12804p6286m2651o5076o5093n6281n3274j12833q0639
4280C073821q3370j119j9299n7861K468j0510q3463n3937n2134p3318m2061k2390
$$ plain form
4268 2576827 2585552 2521508 2475856 2442651 2507489 2479406 2426878 2439407 2444211 2408293 2352532 2321041
4256 2321041 2305937 2285010 2283391 2321859 2310332 2242182 2163887 2181275 2188721 2174585 2201885 2218771
4244 2218771 2198579 2133665 2121317 2163720 2145755 2122884 2142017 2099776 2108632 2108376 2074973 2135387
4232 2135387 2154496 2159821 2213596 2261847 2230453 2244615 2269011 2337688 2339924 2387553 2377724 2323596
4220 2323596 2327046 2334260 2358349 2360424 2414492 2457367 2451782 2469528 2509861 2528888 2559911 2517851
4208 2517851 2533840 2537345 2540141 2522638 2484225 2437671 2429853 2448580 2430142 2459897 2457644 2424413
4196 2424413 2416029 2424808 2441223 2472776 2460492 2439789 2482310 2506626 2611260 2645483 2713657 2760400
4184 2760400 2763931 2795996 2817818 2858758 2919904 3011301 3108943 3218887 3381719 3488960 3556444
$$ packed form
4268B576827Q725o4044m5652l3205O4838k8083n2528J2529M804l5918n5761l1491
4256B321041j5104k0927j619L8468j1527o8150p8295J7388P446j4136K7300J6886
4244B218771k0192o4914j2348M2403j7965k2871J9133m2241Q856k56l3403O0414
4232B135387J9109N325N3775M8251l1394J4162K4396O8677K236M7629r829n4128
4220B323596L450P214K4089K075N4068M2875n585J7746M0333J9027L1023m2060
4208B517851J5989L505K796j7503l8413m6554p818J8727j8438K9755k253l3231
4196B424413q384Q779J6415L1553j2284k0703M2521K4316J04634L4223O8174M6743
4184B760400L531L2065K1822M0940O1146R1397R7642J09944J62832J07241O7484
$$ plain form
4173 3556444 3680799 3737280 3769605 3751943 3667669 3605309 3501507 3403323 3304318 3291691 3301168
4162 3301168 3255903 3235741 3253918 3228115 3288180 3370503 3423631 3478744 3635339 3783876 3874905
4151 3874905 4132100 4386151 4610086 4853440 5090399 5305210 5493086 5616565 5679312 5601711
4141 5601711 5526221 5388332 5200397 4991342 4745623 4569420 4416024 4206706 4069222 3934416
4131 3934416 3840497 3824523 3820139 3811981 3844245 3924973 4022321 4080648 4118588 4161673 4187836 4199491
4119 4199491 4208249 4255271 4218910 4177786 4140343 4154823 4164646 4159235 4193535 4267202 4302096 4312936
4107 4312936 4272072 4235934 4168921 4066440 3965035 3950808 3901450 3876370 3911663 3861023 3844685
4096 3844685 3812502 3817777 3840134 3822193 3825502 3872387 3846378 3811910 3814715 3815182 3814390 3791548 3722361
$$ packed form
4173C556444J24355N6481L2325j7662q4274o2360j03802r8184r9005j2627R477
4162C301168m5265k0162J8177k5803O0065Q2323N3128N5113J56595J48537R1029
4151C874905K57195K54051K23935K43354K36959K14811J87876J23479O2747p7601
4141E601711p5490j37889j87935k09055k45719j76203j53396k09318j37484j34806
4131C934416r3919j5974m384q158L2264Q0728R7348N8327L7940M3085K6163J1655
4119D199491Q758M7022l6361m1124l7443J4480R823n411L4300P3667L4894J0840
4107D312936m0864l6138o7013j02481j01405j4227m9358k5080L5293n0640j6338
4096C844685l2183N275K2357j7941L309M6885k6009l4468K805M67p92k2842o9187
$$ plain form
4083 3722361 3679464 3585176 3476582 3367710 3270293 3120411 2993288 2867913 2767265 2676011
4073 2676011 2584668 2540053 2437261 2370020 2329750 2339799 2318295 2302830 2319542 2294314 2353740
4062 2353740 2346854 2374364 2394269 2459240 2473766 2553039 2675123 2719832 2797239 2904753 2990569
4051 2990569 3023672 2997137 2932239 2897491 2841717 2744479 2685636 2581305 2472624 2344448 2218736
4040 2218736 2138175 2028928 1947303 1922197 1899005 1800894 1757247 1728785 1708503 1647404 1647796 1630029
4028 1630029 1598653 1614469 1552290 1544560 1477366 1402254 1434390 1382893 1364953 1380254 1345617 1377952
4016 1377952 1349784 1310688 1290242 1244007 1260266 1321429 1279880 1249005 1264247 1233520 1234504 1210376
4004 1210376 1204596 1194530 1190898 1150885 1187205 1198152 1184566 1157292 1163681 1093522 1089290 1115817
$$ packed form
4083C722361m2897r4288j08594j08872r7417j49882j27123j25375j00648r1254
4073B676011r1343m4615j02792o7241m0270J0049k1504j5465J6712k5228N9426
4062B353740o886K7510J9905O4971J4526P9273J22084M4709P7407J07514Q5816
4051B990569L3103k6535o4898l4748n5774r7238n8843j04331j08681j28176j25712
4040B218736q0561j09247q1625k5106k3192r8111m3647k8462k0282o1099L92j7767
4028A630029l1376J5816o2179p730o7194p5112L2136n1497j7940J5301l4637L2335
4016A377952k8168l9096k0446m6235J6259O1163m1549l0875J5242l0727R84k4128
4004A210376n780j0066l632m0013L6320J0947j3586k7274O389p0159m232K6527
$$ plain form
3992 1115817 1122408 1149547 1142147 1075171 1078645 1051860 1049605 1081138 1061154 1038852 1023174 1048730
3980 1048730 1051136 1074152 1079333 1039180 1049803 1023250 995992 1029614 1043395 1035118 1054661 1051641
3968 1051641 981965 988653 992630 1007721 983173 986870 945188 915301 890085 867709 894858 900033
3956 900033 911984 942436 987384 983203 1019846 1029899 1015061 1019170 996437 906699 933437 937107
3944 937107 908046 903448 858981 872662 884304 886138 890738 899734 883181 821304 812212 844251 898540
3931 898540 867248 855671 861090 845900 833704 833980 837306 831523 844170 829189 819402 767514 786359
3918 786359 799908 790490 798407 853736 816916 806260 847246 839881 770610 799055 840102 832129
3906 832129 810007 782772 756518 773151 785547 772199 779159 783930 785297 761671 746028 800281
$$ packed form
3992A115817O591K7139p400o6976L474k6785k255L1533j9984k2302j5678K5556
3980A048730K406K3016N181m0153J0623k6553k7258L3622J3781q277J9543l020
3968A051641o9676O688L977J5091k4548L697m1682k9887k5216k2376K7149N175
3956I00033J1951L0452M4948m181L6643J0053j4838M109k2733q9738K6738L670
3944I37107k9061m598m4467J3681J1642J834M600Q996j6553o1877r092L2039N4289
3931H98540l1292j1577N419j5190j2196K76L326n783J2647j4981r787n1888J8845
3918G86359J3549r418P917N5329l6820j0656M0986p365o9271K8445M1047p973
3906H32129k2122k7235k6254J6633J2396j3348O960M771J367k3626j5643N4253
$$ plain form
3894 800281 794333 778404 778163 722436 705244 715802 710147 775631 785979 802917 796499 806028 797758
3881 797758 803727 827104 861640 809877 838412 876660 843871 846416 862162 809700 796507 823456
3869 823456 817998 859511 830247 827222 800617 841481 865772 859491 845938 891073 874567 846642
3857 846642 819046 854462 873007 885156 911555 911906 944877 962830 989317 1004680 954162 998670
3845 998670 1039225 1047532 1123665 1191929 1155088 1136313 1134467 1120871 1150463 1173856 1167061 1154433
3833 1154433 1159640 1146947 1098923 1080294 1023788 1029631 1073338 1044364 1030890 1085688 1088189 1062449
3821 1062449 1015966 1002198 1015766 1012778 1016641 1055790 1065916 993914 994651 1000750 991194 1006420 1036123
3808 1036123 1049045 1013653 999686 996407 961327 986970 951021 914023 906297 904391 940426 973826
$$ packed form
3894H00281n948j5929k41n5727j7192J0558n655O5484J0348J6938o418R529q270
3881G97758N969K3377L4536n1763K8535L8248l2789K545J5746n2462j3193K6949
3869H23456n458M1513k9264l025k6605M0864K4291o281j3553M5135j6506k7925
3857H46642k7596L5416J8545J2149K6399L51L2971J7953K6487J5363n0518M4508
3845I98670M0555Q307P6133O8264l6841j8775j846j3596K9592K3393o795j2628
3833A154433N207j2693m8024j8629n6506N843M3707k8974j3474N4798K501k5740
3821A062449m6483j3768J3568k988L863L9149J0126p2002P37O099r556J5226K9703
3808A036123J2922l5392j3967l279l5080K5643l5949l6998p726j906L6035L3400
$$ plain form
3796 973826 973535 961533 971658 966857 901649 902931 886763 859241 873774 863144 876244 893596
3784 893596 850542 848012 840850 844913 877087 809426 781323 841776 851468 819906 833490 832301 844180
3771 844180 810161 803385 805669 833606 920000 941280 941908 895596 891722 880817 855575 853572 826828
3758 826828 895894 926130 880228 864075 818040 822609 848298 859370 887749 845351 757513 750221
3746 750221 719669 728105 750494 779971 759983 739127 738770 735883 732646 769153 771323 737881 706502
3733 706502 687103 700689 644356 664856 694981 715157 712674 724228 709199 686013 676510 650924
3721 650924 659267 697672 667028 624074 604254 636999 628079 598990 601225 609578 573066 550439
3709 550439 602124 628780 597585 560334 566710 575633 602117 601218 567632 536778 523876 540529
$$ packed form
3796I73826k91j2002J0125m801o5208J282j6168k7522J4533j0630J3100J7352
3784H93596m3054k530p162M063L2174o7661k8103O0453R692l1562J3584j189J1879
3771H44180l4019o776K284K7937Q6394K1280O28m6312l874j0905k5242k003k6744
3758H26828O9066L0236m5902j6153m6035M569K5689J1072K8379m2398q7838p292
3746G50221l0552Q436K2389K9477j9988k0856l57k887l237L6507K170l3442l1379
3733G06502j9399J3586n6333K0500L0125K0176k483J1554j5029k3186r503k5586
3721F50924Q343L8405l0644m2954j9820L2745q920k9089K235Q353l6512k2627
3709E50439N1685K6656l1195l7251O376Q923K6484q99l3586l0854j2902J6653
$$ plain form
3697 540529 554667 534235 504581 505513 560300 568538 607813 599838 615282 674671 608655 625365
3685 625365 625578 625700 609858 573611 631601 663736 689923 669451 638920 595378 579809 630231
3673 630231 598772 610429 593857 587591 572145 549731 531164 540661 545599 560739 572612 519491
3661 519491 562047 546266 509088 497832 490611 552748 541842 459490 497614 571862 593880 561796
3649 561796 530464 531413 542512 520500 534684 546154 584311 561397 511615 557584 530385 506482
3637 506482 478305 456319 486657 475678 460863 437224 446441 467554 474889 438117 448599 439652
3625 439652 399276 405436 406409 436151 457729 460386 459927 433795 373355 392745 432707 437121 463224
3612 463224 434108 463056 465982 443992 386918 452822 491958 443320 407190 461462 448461 416233
$$ packed form
3697E40529J4138k0432k9654R32N4787Q238L9275p975J5444N9389o6016J6710
3685F25365K13J22j5842l6247N7990L2135K6187k0472l0531m3542j5569N0422
3673F30231l1459J1657j6572o266j5446k2414j8567R497M938J5140J1873n3121
3661E19491M2556j5781l7178j1256p221O2137j0906q2352L8124P4248K2018l2084
3649E61796l1332R49J1099k2012J4184J1470L8157k2914m9782M5969k7199k3903
3637E06482k8177k1986L0338j0979j4815k3639R217K1113P335l6772J0482q947
3625D39652m0376O160R73K9742K1578K657m59k6132o0440J9390L9962M414K6103
3612D63224k9116K8948K926k1990n7074O5904L9136m8638l6130N4272j3001l2228
$$ plain form
3600 416233 403787 415502 436392 400955 385298 348425 379532 440285 482424 417043 436708 388009
3588 388009 365041 381774 368488 305340 360941 369740 337074 402287 463897 409290 396476 425222
3576 425222 385368 325589 352794 324868 275626 331210 378646 429167 395360 377930 368075 384048
3564 384048 422546 411096 404451 368962 407765 443093 396207 410652 442462 494950 464179 436000
3552 436000 468180 498950 500396 522300 499142 447920 462612 436504 439436 560046 601687 541386
3540 541386 541030 613446 593893 520396 552275 565653 593698 554170 537210 566172 598600 632838
3528 632838 672205 643924 602120 625390 671728 611822 652757 744558 740217 773866 785164 790205
3516 790205 797207 795008 787334 820923 834157 899207 915565 923329 958407 976533 982978 1035412 1042901
$$ packed form
3600D16233j2446J1715K0890l5437j5657l6873L1107O0753M2139o5381J9665m8699
3588C88009k2968J6733j3286o3148N5601Q799l2666O5213O1610n4607j2814K8746
3576D25222l9854n9779K7205k7926m9242N5584M7436N0521l3807j7430r855J5973
3564C84048L8498j1450o645l5489L8803L5328m6886J4445L1810N2488l0771k8179
3552D36000L2180L0770J446K1904k3158n1222J4692k6108K932J20610M1641o0301
3540E41386l56P2416j9553p3497L1879J3378K8045l9528j6960K8962L2428L4238
3528F32838L9367k8281m1804K3270M6338n9906M0935R1801m341L3649J1298N041
3516G90205P002k199p674L3589J3234O5050J6358P764L5078J8126O445N2434P489
$$ plain form
3503 1042901 1041250 1105633 1184263 1236986 1301846 1374525 1412839 1406242 1451835 1559382 1633567 1708493
3491 1708493 1812241 1819250 1878573 1915336 1965133 1963413 1955329 1984515 1929601 1896484 1856992 1789261
3479 1789261 1767798 1732291 1653436 1587276 1561224 1550584 1521502 1490194 1417028 1334160 1302723
3468 1302723 1331567 1293088 1268420 1290000 1307956 1298673 1231704 1230865 1271966 1237375 1221073 1196111
3456 1196111 1166367 1195764 1258227 1288467 1312818 1281966 1296030 1346976 1337884 1390312 1394711 1389863
3444 1389863 1401667 1455367 1484936 1520915 1581600 1651089 1691027 1763049 1900412 1968559 2134331
3433 2134331 2237807 2419454 2642886 2912438 3227402 3569150 3970097 4433972 4953533 5538165
3423 5538165 5909944 6049088 6028819 5760495 5201430 4686660 4366185 4093326 3806311 3596593
$$ packed form
3503A042901j651O4383P8630N2723O4860P2679L8314o597M5593J07547P4185P4926
3491A708493J03748P009N9323L6763M9797j720q084K9186n4914l3117l9492o7731
3479A789261k1463l5507p8855o6160k6052j0640k9082l1308p3166q2868l1437
3468A302723K8844l8479k4668K1580J7956r283o6969q39M1101l4591j6302k4962
3456A196111k9744K9397O2463L0240K4351l0852J4064N0946r092N2428M399m848
3444A389863J1804N3700K9569L5979O0685O9489L9938P2022J37363O8147J65772
3433B134331J03476J81647K23432K69552L14964L41748M00947M63875N19561N84632
3423E538165L71779J39144k0269k68324n59065n14770l20475k72859k87015k09718
$$ plain form
3413 3596593 3491392 3365175 3270953 3160999 3192369 3226524 3204966 3241456 3336055 3452357 3588481
3402 3588481 3737967 4013877 4289058 4611786 5071472 5666174 6369354 7231961 8151236 9132795
3392 9132795 10186932 10769956 10917754 10645351 9799210 8683875 7665671 6857900 6247124
3383 6247124 5726141 5307163 4973848 4687837 4408004 4103238 3870473 3726591 3576674 3449538
3373 3449538 3354558 3297461 3283887 3285382 3352635 3366604 3439534 3615584 3893303 4177345 4484923
3362 4484923 4860577 5382642 5795612 6009678 6029394 5800610 5358278 4812859 4302014 3827746
3352 3827746 3516054 3313467 3083947 2881152 2637555 2422216 2266180 2176947 2056681 1937902
3342 1937902 1801554 1719371 1667294 1598142 1474766 1396515 1399997 1335489 1355037 1276784 1185617
$$ packed form
3413C596593j05201j26217r4222j09954L1370L4155k1558L6490R4599J16302J36124
3402C588481J49486K75910K75181L22728M59686N94702P03180Q62607R19275R81559
3392I132795J054137N83024J47798k72403q46141j115335j018204q07771o10776
3383F247124n20983m18978l33315k86011k79833l04766k32765j43882j49917j27136
3373C449538r4980n7097j3574J495O7253J3969P2930J76050K77719K84042L07578
3362D484923L75654N22065M12970K14066J9716k28784m42332n45419n10845m74268
3352C827746l11692k02587k29520k02795k43597k15339j56036q9233j20266j18779
3342A937902j36348q2183n2077o9152j23376p8251L482o4508J9548p8253r1167
$$ plain form
3331 1185617 1116425 1145629 1103184 1089191 1048771 944267 948856 981857 959297 911316 889160
3320 889160 911248 877189 831296 872423 884036 829025 792965 738222 751677 725860 688039 733031
3308 733031 773729 770305 698084 703400 699952 623136 628809 637760 630614 689822 663846 617354 595512
3295 595512 600855 593295 594885 591725 644044 630270 594280 541761 520340 538841 548012 543938 527746
3282 527746 480180 499223 536723 503453 549655 526860 538098 546462 531642 509261 529394 551955
3270 551955 497571 516945 513675 507408 557610 554372 570411 585490 574887 565017 550939 526211
3258 526211 499971 503346 461916 417553 465374 493552 445251 383147 405820 382107 406191 410654
3246 410654 375231 360576 378784 435084 438135 433537 440694 472423 511184 526164 503924 509575
$$ packed form
3331A185617o9192K9204m2445j3993m0420j04504M589L3001k2560m7981k2156
3320H89160K2088l4059m5893M1127J1613n5011l6060n4743J3455k5817l7821M4992
3308G33031M0698l424p2221N316l448p6816N673Q951p146N9208k5976m6492k1842
3295E95512N343p560J590l160N2319j3774l5990n2519k1421J8501R171m074j6192
3282E27746m7566J9043L7500l3270M6202k2795J1238Q364j4820k2381K0133K2561
3270E51955n4384J9374l270o267N0202l238J6039J5079j0603r870j4078k4728
3258E26211k6240L375m1430m4363M7821K8178m8301o2104K2673k3713K4084M463
3246D10654l5423j4655J8208N6300L051m598P157L1729L8761J4980k2240N651
$$ plain form
3234 509575 494533 448461 403212 378134 369189 359747 329717 344532 367618 341699 362780 370556
3222 370556 361624 350713 310121 295667 304906 283275 244986 305630 288578 256106 226409 193871
3210 193871 210949 265361 255123 242600 230995 206958 245730 256010 284650 293779 238072 237076
3198 237076 254117 241744 259652 278204 274387 201217 238896 283158 299820 295303 190661 223912
3186 223912 261098 244470 265172 259561 230314 267020 306053 312725 330700 333700 314352 326924
3174 326924 344829 306819 286405 326989 328307 312080 267957 270262 344377 376779 414713 385849
3162 385849 376023 338565 398479 418468 382760 421575 486687 469477 498887 499192 517792 549185
3150 549185 546488 617477 632848 664483 677082 654917 619855 599225 584631 574833 632420 617549
$$ packed form
3234E09575j5042m6072m5249k5078q945r442l0030J4815K3086k5919K1081P776
3222C70556q932j0911m0592j4454R239k1631l8289O0644j7052l2472k9697l2538
3210A93871J7078N4412j0238j2523j1605k4037L8772J0280K8640R129n5707r96
3198B37076J7041j2373J7908J8552l817p3170L7679M4262J6662m517j04642L3251
3186B23912L7186j6628K0702n611k9247L6706L9033O672J7975L000j9348J2572
3174C26924J7905l8010k0414M0584J318j6227m4123K305P4115L2402L7934k8864
3162C85849r826l7458N9914J9989l5708L8815O5112j7210K9410L05J8600L1393
3150E49185k697P0989J5371L1635J2599k2165l5062k0630j4594r798N7587j4871
$$ plain form
3138 617549 610977 599668 630165 647280 564332 600186 585103 613150 613631 620827 580576 581643 620402
3125 620402 636689 659308 666056 657223 678884 683567 653453 656513 645889 659277 622387 602989
3113 602989 613769 669614 677471 576637 546870 562596 601871 559020 542032 555450 547538 551726
3101 551726 538470 553091 534561 490913 451436 497732 487428 472704 492307 500895 466986 460899
3089 460899 469812 421518 418490 353010 333190 305249 329932 379428 351519 328751 286251 314496
3077 314496 327531 315624 310685 302075 316225 303572 269470 274737 250784 205671 222567 192287
3065 192287 181064 140171 163741 163104 112050 182490 171753 174481 130457 113197 135240 126768
3053 126768 132501 135707 152220 133964 177315 131827 16158 35687 26927 63815 96228 50557
$$ packed form
3138F17549o572j1309L0497J7115q2948L5854j5083K8047M81P196m0251J067L8759
3125F20402J6287K2619O748q833K1661M683l0114L060j0624J3388l6890j9398
3113F02989J0780N5845P857j00834k9767J5726L9275m2851j6988J3418p912M188
3101E51726j3256J4621j8530m3648l9477M6296j0304j4724J9603Q588l3909o087
3089D60899Q913m8294l028o5480j9820k7941K4683M9496k7909k2768m2500K8245
3077C14496J3035j1907m939q610J4150j2653l4102N267k3953m5113J6896l0280
3065A92287j1223m0893K3570o37n1054P0440j0737K728m4024j7260K2043q472
3053A26768N733L206J6513j8256M3351m5488j15669J9529q760L6888L2413m5671
$$ plain form
3041 50557 125102 118462 107509 113421 91822 141420 158605 145824 118723 121103 111661 86531 76892
3028 76892 45070 12912 60831 59120 -8786 -13946 -14707 -22698 70830 108529 98288 60873 25961
3015 25961 29165 38104 54105 58329 58773 67531 20991 17351 16563 59565 45069 62464 52594 52528
3001 52528 65305 22479 -15006 -18308 23113 40272 -3539 -44141 -33692 -20628 910 -30792
2989 -30792 -28653 -41024 -22431 -53700 -11205 -33761 -80024 -79162 -43853 -40375 -9641 -20144 18493
2976 18493 29238 -9264 -32135 15227 -25345 -14614 44054 57934 11496 -80920 -67497 -52153
2964 -52153 -77505 -54499 7350 -51195 -18299 23814 -20293 -39342 -46991 -110842 -100611 -53711
2952 -53711 -6069 -32686 -65257 -76866 12114 -1207 -40011 -79870 -50715 -10431 -61188 -45814
$$ packed form
3041E0557P4545o640j0953N912k1599M9598J7185j2781k7101K380r442k5130r639
3028G6892l1822l2158M7919j711o7906n160p61p991R3528L7699j0241l7415l4912
3015B5961L204Q939J6001M224M44Q758m6540l640p88M3002j4496J7395r870o6
3001E2528J2777m2826l7485l302M1421J7159m3811m0602J0449J3064K1538l1702
2989c0792K139j2371J8593l1269M2495k2556m6263Q62L5309L478L0734j0503L8637
2976A8493J0745l8502k2871M7362m0572J0731N8668J3880m6438r2416J3423J5344
2964e2153k5352K3006O1849n8545L2896M2113m4107j9049p649o3851J0231M6900
2952e3711M7642k6617l2571j1609Q8980j3321l8804l9859K9155M0284n0757J5374
$$ plain form
2940 -45814 -35666 -41962 -18443 -16888 -49880 -44770 -20641 -42202 -20927 -2978 15808 66354
2928 66354 80219 24570 11931 52192 11344 -43901 -45751 -58163 -62294 -56519 -48198 -37257 -41608
2915 -41608 -26132 -43371 -59499 -94878 -48359 -22384 -3773 -36599 -48288 -42735 -28809 7267
2903 7267 15956 -30636 -12877 742 -41702 -14866 24929 1365 10849 -58046 -93737 -67751
2891 -67751 -71217 -16082 29416 13198 -3401 -8355 -17320 -51138 -89502 -27612 -8098 -60568
2879 -60568 -42063 -56636 -68564 -39880 -14864 30519 22378 36749 57711 -11788 -29974 -6616
2867 -6616 2332 5115 -27537 -64403 -31516 -36511 -70644 -33391 -22892 -10843 -41479 -41025 -21105
2854 -21105 -45064 -41928 -26304 -46992 -54655 -51360 -8392 -27353 -36574 -24577 62205 8646 -10455
$$ packed form
2940d5814J0148o296K3519J555l2992N110K4129k1561K1275J7949J8786N0546
2928F6354J3865n5649j2639M0261m0848n5245j850j2412m131N775Q321J0941m351
2915d1608J5476j7239j6128l5379M6519K5975J8611l2826j1689N553J3926L6076
2903G267Q689m6592J7759J3619m2444K6836L9795k3564R484o8895l5691K5986
2891f7751l466N5135M5498j6218j6599m954q965l3818l8364O1890J9514n2470
2879f0568J8505j4573j1928K8684K5016M5383q141J4371K0962o9499j8186K3358
2867f616Q948K783l2652l6866L2887m995l4133L7253J0499J2049l0636M54J9920
2854b1105k3959L136J5624k0688p663L295M2968j8961r221J1997Q6782n3559j9101
$$ plain form
2841 -10455 -15360 -47260 -19256 -15233 -76083 -97843 -71941 -89586 -73314 -63051 -2893 -13706
2829 -13706 -25334 -64769 -84661 -15565 12337 -3168 -27792 -28310 -11013 -37384 -49574 -51795
2817 -51795 -25079 -88859 -111693 -53581 -76299 -76585 -73543 -54133 -43433 -81369 -102772 -74373
2805 -74373 -61611 -14096 -15750 -67143 -69437 -49969 -41195 10778 -20527 -90688 -106716 -72915
2793 -72915 -60477 -54361 -49511 -56367 -46682 -52071 -73273 -62808 -53913 -88475 -56081 -81636 -115400
2780 -115400 -111784 -14483 -16394 -78647 -65191 -128994 -102538 -70495 -73263 -59881 -82896 -86843
2768 -86843 -97547 -90018 -87348 -109985 -59069 -46413 -84262 -51348 5343 11370 -13092 -27611
2756 -27611 20760 27745 20258 10152 3684 -19536 -32357 -39289 -61673 -9501 -19090 -19527 -55783
$$ packed form
2841a0455m905l1900K8004M023o0850k1760K5902j7645J6272J0263O0158j0813
2829a3706j1628l9435j9892O9096K7902j5505k4624n18J7297k6371j2190k221
2817e1795K6716o3780k2834N8112k2718k86L042J9410J0700l7936k1403K8399
2805g4373J2762M7515j654n1393k294J9468Q774N1973l1305p0161j6028L3801
2793g2915J2438O116M850o856R685n389k1202J0465Q895l4562L2394k5555l3764
2780a15400L616R7301j911o2253J3456o3803K6456L2043k768J3382k3015l947
2768h6843j0704P529K670k2637N0916J2656l7849L2914N6691O027k4462j4519
2756b7611M8371O985p487j0106o468k3220j2821o932k2384N2172r589m37l6256
$$ plain form
2743 -55783 -21044 -38003 -84497 -46882 -52346 -65311 -28980 -25653 -27261 -52935 -33145 -11980
2731 -11980 -10378 -39799 -29006 -66687 -93597 -83186 -92302 -113217 -54148 -69321 -56802 -29421
2719 -29421 -48363 -8627 -28432 -64583 -83941 -110410 -129924 -83307 -34747 -63161 -97294 -116874
2707 -116874 -114594 -81762 -50926 -26861 -109629 -158982 -131024 -54315 -28890 -96955 -115354 -77540
2695 -77540 -52029 -87795 -87800 -59046 -117275 -114402 -89808 -34271 -101209 -112916 -77693 -71281 -10122
2682 -10122 -13671 -74082 -122019 -121237 -18038 -22364 -55565 -49080 -49623 -110954 -89841 -47821 -18604
2669 -18604 1814 -52814 -64296 -71255 -100195 -105584 -76863 -79975 -58756 -70813 -47121 -45536 -39402
2656 -39402 -47560 -57598 -53102 -64724 -62074 -15171 -33569 -20299 -16326 -20265 16643 -6685 16063
$$ packed form
2743e5783L4739j6959m6494L7615n464j2965L6331L327j608k5674J9790K1165
2731a1980J602k9421J0793l7681k6910J0411r116k0915N9069j5173J2519K7381
2719b9421j8942L9736j9805l6151j9358k6469j9514M6617M8560k8414l4133j9580
2707a16874K280L2832L0836K4065q2768m9353K7958P6709K5425o8065j8399L7814
2695g7540K5511l5766nK8754n8229K873K4594N5537o6938j1707L5223O412O1159
2682a0122l549o0411m7937P82J03199m326l3201O485n43o1331K1113M2020K9217
2669a8604K0418n4628j1482o959k8940n389K8721l112K1219j2057K3692J585O134
2656c9402q158j0038M496j1622K650M6903j8398J3270L973l939L6908k3328K2748
$$ plain form
2643 16063 -7775 -83418 -80918 -79358 -74366 -32766 -106488 -68474 -57299 -62424 -98518 -112178 -89419
2630 -89419 -65602 -48095 -29313 39587 265 -41455 -49644 -51211 -3213 34119 8109 16401
2618 16401 1392 -22107 713 -10461 -17224 9463 62757 12623 -29208 -53155 -28982 -18604
2606 -18604 30986 33342 32547 5812 -42076 -31230 29964 53013 31203 19520 -59265 -68944 -94870
2593 -94870 -96644 -34101 -50545 -21460 20282 18037 -46612 -79164 -65027 -65656 -7742 -46452 -29834
2580 -29834 -59389 -90930 -42430 -15494 -22340 -52648 -32297 -40825 -88205 -95226 -133826 -78582
2568 -78582 -41525 -24465 -91047 -127036 -151864 -125051 -71004 -64747 -67702 -67025 -66314 -43395 -48735
2555 -48735 -38773 -70677 -19240 -19678 5344 -47716 -82291 -74658 -57288 -43374 -42597 -24680 -11136
$$ packed form
2643A6063k3838p5643K500J560M992M1600p3722L8014J1175n125l6094j3660K2759
2630h9419K3817J7507J8782O8900l9322m1720q189j567M7998L7332k6010Q292
2618A6401j5009k3499K2820j1174o763K6687N3294n0134m1831k3947K4173J0378
2606a8604M9590K356p95k6735m7888J0846O1194K3049k1810j1683p8785r679k5926
2593i4870j774O2543j6444K9085M1742k245o4649l2552J4137o29N7914l8710J6618
2580b9834k9555l1541M8500K6936o846l0308K0351q528m7380p021l8600N5244
2568g8582L7057J7060o6582l5989k4828K6813N4047O257k955O77P11K2919n340
2555d8735R962l1904N1437m38K5022n3060l4575P633J7370J3914P77J7917J3544
$$ plain form
2542 -11136 -17345 -23711 -43390 -81083 -23231 21692 27850 10937 -18054 -32345 -37821 -48314 -64443
2529 -64443 -83252 -91721 -25107 -11591 -60600 -83949 -74021 -63811 -68095 -39292 -50583 -100028
2517 -100028 -133987 -92541 -62959 -38092 -26804 -31018 -24158 -25881 -51024 -36347 -27670 -39996
2505 -39996 -48673 -43282 -27831 -22911 -45225 -25905 -85912 -83704 -59385 -24808 2815 15859 -4127
2492 -4127 -35419 -65821 -76860 -59652 -40410 -1882 4160 -36410 18601 -21635 -15326 -31018
2480 -31018 -6771 -26799 -21489 -2426 9837 -17045 -43406 -37875 -53019 -33211 25332 34029
2468 34029 -44909 -59778 6483 -60142 -38710 -17637 -21271 -15325 -19305 11185 1550 10780 19525
2455 19525 -25276 -36778 -35132 -9467 57268 18006 11094 33659 25192 -2297 -24059 -44011
$$ packed form
2542a1136o209o366j9679l7693N7852M4923O158j6913k8991j4291n476j0493j6129
2529f4443j8809q469O6614J3516m9009k3349R928J0210m284K8803j1291m9445
2517a00028l3959M1446K9582K4867J1288m214O860j723k5143J4677Q677j2326
2505c9996q677N391J5451M920k2314J9320o0007K208K4319L4577K7623J3044j9986
2492d127l1292l0402j1039J7208J9242L8528O042m0570N5011m0236O309j5692
2480c1018K4247k0028N310J9063J2263k6882k6361N531j5144J9808N8543Q697
2468C4029p8938j4869O6261o6625K1432K1073l634N946l980L0490r635R230Q745
2455A9525m4801j1502J646K5665O6735l9262o912K2565q467k7489k1762j9952
$$ plain form
2443 -44011 -53998 -84585 -25170 7678 -7968 -5236 31051 51676 8571 19026 41374 41026 65345
2430 65345 6439 24464 36811 24480 -25921 4926 49594 5194 -25610 -35711 -8695 -7918
2418 -7918 7097 49774 65505 65029 70492 78936 74523 82062 95675 64976 38613 89009 68426
2405 68426 13848 41639 49900 29774 92964 117269 188618 173528 221674 199524 207761 204083
2393 204083 196637 203501 239479 239600 262828 269566 253864 262178 246655 311319 312628 296081 297441
2380 297441 385864 405334 406021 459271 560144 604246 611011 606605 633334 709943 780547 929875
2368 929875 1019751 1056489 1240064 1402876 1537205 1656558 1868097 2062304 2257566 2486584
2358 2486584 2686812 2970969 3331346 3809840 4403756 5136733 5913745 6818978 7795791 8924230
$$ packed form
2443d4011r987l0587N9415L2848j5646K732L6287K0625m3105J0455K2348l48K4319
2430F5345n8906J8025J2347j2331n0401L0847M4668m4400l0804j0101K7016P77
2418g918J5015M2677J5731m76N463Q444m413P539J3613l0699k6363N0396k0583
2405F8426n4578K7791Q261k0126O3190K4305P1349j5090M8146k2150Q237l678
2393B04083p446O864L5978J21K3228O738j5702Q314j5523O4664J309j6547J360
2380B97441Q8423J9470O87N3250J00873M4102O765m406K6729P6609P0604J49328
2368I29875Q9876L6738J83575J62812J34329J19353K11539J94207J95262K29018
2358B486584K00228K84157L60377M78494N93916P32977P77012R05233R76813J128439
$$ plain form
2348 8924230 9855721 10470346 10353210 9826655 8748250 7428139 6514289 5695328 5108611
2339 5108611 4532099 4107065 3741213 3380115 3071267 2804760 2634671 2444099 2250282 2141460
2329 2141460 1958961 1811795 1637106 1504206 1480889 1382838 1299425 1174035 1057313 1034438
2319 1034438 924695 888250 853004 829642 773676 747674 760492 746055 680646 651559 585507
2308 585507 571169 540562 489405 457535 446162 430061 410158 389814 425753 424215 395102 342884
2296 342884 359695 344172 340421 295751 244427 280823 315739 283890 241870 256387 222751 229083
2284 229083 240038 223041 181692 213550 166117 136977 99893 116115 146531 167193 190958 198985
2272 198985 193922 141151 116628 103598 58968 67456 112292 135915 120466 168431 149093 93086
$$ packed form
2348H924230R31491O14625j17136n26555j078405j320111r13850q18961n86717
2339E108611n76512m25034l65852l61098l08848k66507j70089j90572j93817j08822
2329B141460j82499j47166j74689j32900k3317r8051q3413j25390j16722k2875
2319A034438j09743l6445l5246k3362n5966k6002J2818j4437o5409k9087o6052
2308E85507j4338l0607n1157l1870j1373j6101j9903k0344L5939j538k9113n2218
2296C42884J6811j5523l751m4670n1324L6396L4916l1849m2020J4517l3636O332
2284B29083J0955j6997m1349L1858m7433k9140l7084J6222L0416K0662K3765Q027
2272A98985n063n2771k4523j3030m4630Q488M4836K3623j5449M7965j9338n6007
$$ plain form
2260 93086 57431 62813 86852 88497 114041 116221 103781 74368 83282 106581 160399 131273 97306
2247 97306 55657 90624 90692 37902 43068 33672 67461 61986 22807 59782 102613 54221 34003
2234 34003 63099 27146 44753 98539 73048 68804 46935 66954 95344 30624 37068 36681 62315
2221 62315 126637 128212 96134 49168 34356 22021 21137 46824 15246 64336 37371 22250
2209 22250 49087 84645 64724 31810 36549 27223 1409 -51802 -23332 21596 21562 -17657 -13255
2196 -13255 12242 28428 13614 10875 12160 -18302 -5229 525 24222 69817 14331 23886 -28081
2183 -28081 -10474 -17481 -8621 -3723 4671 -60906 -30147 -6778 -4060 -59974 -42220 -59491 -48756
2170 -48756 -32510 -34390 -39230 -31132 38048 53843 43354 83470 112447 39687 4980 32666
$$ packed form
2260I3086l5655N382K4039J645K5544K180j2440k9413Q914K3299N3818k9126l3967
2247I7306m1649L4967O8n2790N166r396L3789n475l9179L6975M2831m8392k0218
2234C4003K9096l5953J7607N3786k5491m244k1869K0019K8390o4720O444l87K5634
2221F2315O4322J575l2078m6966j4812j2335q84K5687l1578M9090k6965j5121
2209B2250K6837L5558j9921l2914M739r326k5814n3211K8470M4928l4l9219M402
2196a3255K5497J6186j4814k739J285l0462J3073N754K3697M5595n5486R555n1967
2183b8081J7607p007Q860M898Q394o5577L0759K3369K718n5914J7754j7271J0735
2170d8756J6246j880m840Q098O9180J5795j0489M0116K8977p2760l4707K7686
$$ plain form
2158 32666 503 448 3467 2864 24714 24490 29717 -20911 16094 11321 8672 -5109 9298 9927
2144 9927 22259 19655 -45192 -46934 10132 26862 50303 57765 37559 31315 -15512 -67203 -54331
2131 -54331 -16039 440 434 15286 -30489 7236 -22019 -28882 -33068 -49333 -47266 10859 38074
2118 38074 -14111 -43123 -65023 -61495 -17702 11236 -18539 -15530 -38514 -44325 -34831 -4088 -22651
2105 -22651 11216 8976 -723 28770 27337 28477 63997 62015 24646 40690 -14694 -18177 -25984
2092 -25984 -18254 -18571 -67224 -54821 2587 10609 -24333 14395 68585 37467 21364 42072 47426
2079 47426 40437 38361 15981 42153 46872 33574 71869 22584 10321 44252 8330 71826
2067 71826 40406 15369 4977 17205 -20275 -339 -4794 -3012 -2356 4286 -10541 1241 1079
$$ packed form
2158C2666l2163n5L019o03K1850k24N227n0628L7005m773k649j3781J4407O29
2144I927J2332k604o4847j742N7066J6730K3441P462k0206o244m6827n1691J2872
2131e4331L8292J6479oJ4852m5775L7725k9255o863m186j6265K067N8125K7215
2118C8074n2185k9012k1900L528M3793K8938k9775L009k2984n811R494L0743j8563
2105b2651L3867k240r699K9493j433J140L5520j982l7369J6044n5384l483p807
2092b5984P730l17m8653J2403N7408Q022l4942L8728N4190l1118j6103K0708N354
2079D7426o989k076k2380K6172M719j3298L8295m9285j2263L3931l5922O3496
2067G1826l1420k5037j0392J2228l7480J9936m455J782O56O642j4827J1782j62
$$ plain form
2054 1079 22338 43541 -13207 5893 5866 -21244 40905 28310 -63236 -46030 -29924 3438 -29423
2041 -29423 -25802 1741 -8653 -46625 -4408 5022 6004 10968 6817 -5427 -29830 -32575 6636
2028 6636 22362 20230 28785 13666 43050 21758 -35709 10023 43601 17237 -2774 28925
2016 28925 28468 14756 -31648 -21788 -8418 -19993 -9345 -12111 -30340 -69657 -51096 7991 -41123
2003 -41123 -57358 29546 33817 22267 16176 16290 -8189 -2244 -21698 -34744 -28550 -15523 23609
1990 23609 -32748 -27520 -44824 -30417 -34868 -64283 -99386 -84065 -11266 -6033 -25541 -26125 -674
1977 -674 -43660 -33611 -26151 -37654 -49393 -51661 -77229 -63830 -50974 -100646 -67464 -46523 -18384
1964 -18384 -9011 15972 13902 -32091 -16693 -3012 -18252 -41873 -52311 -10135 -22102 -34636
$$ packed form
2054A079K1259K1203n6748J9100k7k7110O2149j2595r1546J7206J6106L3362l2861
2041b9423L621K7543j0394l7972M2217R430R82M964m151j2244k4403k745L9211
2028F636J5726k132Q555j5119K9384k1292n7467M5732L3578k6364k0011L1699
2016B8925m57j3712m6404R860J3370j1575J0648k766j8229l9317J8561N9087m9114
2003d1123j6235Q6904M271j1550o091J14k4479N945j9454j3046O194J3027L9132
1990B3609n6357N228j7304J4407m451k9415l5103J5321P2799N233j9508n84K5451
1977f74m2986J0049P460j1503j1739k268k5568J3399J2856m9672L3182K0941K8139
1964a8384R373K4983k070m5993J5398J3681j5240k3621j0438M2176j1967j2534
$$ plain form
1952 -34636 -63190 5740 -15463 -30861 -15819 -8772 1516 30143 19639 -49692 -23070 46692
1940 46692 2032 -37448 -62255 -33272 -40577 -7402 10428 -31640 -5749 13280 821 -11499
1928 -11499 -49745 -10175 -15179 -21710 -34392 -57876 -61288 -40089 -28678 6713 8339 -36628 -17223
1915 -17223 -25247 -5268 -65941 -36999 -49440 -29253 -30022 -27039 191 642 -19951 -7197 5630
1902 5630 -3082 -36372 -53445 -44369 -4228 -42888 -29253 -17463 14259 -85443 -53820 -29718
1890 -29718 -90085 -115843 -92583 -49066 -37788 -40784 -38272 -22648 -21580 -6575 -46398 -72785
1878 -72785 257 -13725 -37782 5588 33076 45924 14759 -45686 -30403 9267 40936 -16185
1866 -16185 -37753 -62344 -18757 -901 6753 55371 6561 -14435 -51464 -83223 -50938 -76132
$$ packed form
1952c4636k8554O8930k1203j5398J5042P047J0288K8627j0504o9331K6622O9762
1940D6692m4660l9480k4807K8983p305L3175J7830m2068K5891J9029j2459j2320
1928a1499l8246L9570n004o531j2682k3484l412K1199J1411L5391J626m4967J9405
1915a7223q024J9979o0673K8942j2441K0187p69K983K7230M51k0593J2754J2827
1902E630q712l3290j7073R076M0141l8660J3635J1790L1722r9702L1623K4102
1890b9718o0367k5758K3260M3517J1278k996K512J5624J068J5005l9823k6387
1878g2785P3042j3982k4057M3370K7488J2848l1165o0445J5283L9670L1669n7121
1866a6185k1568k4591M3587J7856P654M8618m8810k0996l7029l1759L2285k5194
$$ plain form
1854 -76132 -71925 -44113 -42338 -55498 -22303 27289 -6351 -14396 -28380 19863 5516 19934
1842 19934 6181 -50989 -29836 -11228 -22643 -26050 -65681 -19203 -1200 35270 -6092 -11779
1830 -11779 38429 -9378 -31673 -31401 2604 10241 -19325 -8781 -13168 -24892 -53820 -24743 8642
1817 8642 -33330 -52687 -50354 -46763 -15590 -28433 -81208 -49831 27467 37719 31852 -25045 -35906
1804 -35906 15793 17174 14200 -30601 -6231 20037 -11704 856 -5759 -26285 -43059 -17654
1792 -17654 -65409 -41083 22169 28692 -5816 -39948 -94687 -48040 -50168 -41368 -24857 -38862
1780 -38862 -9128 10180 -22205 -73472 -53014 -6234 3160 4743 28272 9132 -9276 29547
1768 29547 18419 -21792 -51744 -11407 9013 -8633 62779 56444 -13461 -80955 -56130 7987
$$ packed form
1854g6132M207K7812J775j3160L3195M9592l3640q045j3984M8243j4347J4418
1842A9934j3753n7170K1153J8608j1415l407l9631M6478J8003L6470m1362n687
1830a1779N0208m7807k2295K72L4005P637k9566J0544m387j1724k8928K9077L3385
1817H642m1972j9357K333L591L1173j2843n2775L1377P7298J0252n867n6897j0861
1804c5906N1699J381k974m4801K4370K6268l1741J2560o615k0526j6774K5405
1792a7654m7755K4326O3252O523l4508l4132n4739M6647k128Q800J6511j4005
1780c8862K9734J9308l2385n1267K0458M6780R394J583K3529j9140j8408L8823
1768B9547j1128m0211k9952M0337K0420j7646P1412o335o9905o7494K4825O4117
$$ plain form
1756 7987 7798 15498 29133 -5961 -37978 -80493 -40582 -4456 -32317 -40300 -7819 -18615 -84566
1743 -84566 -26362 -32019 -40676 -19452 -19770 8297 9645 -36370 -19896 75703 47492 8312 -62365
1730 -62365 -48781 -19385 12137 -33433 -60625 -24096 -38097 -40456 -38430 3751 17315 -28749
1718 -28749 -40543 -38985 -11733 16987 -2091 -10602 -36505 -49626 -36729 -19649 -29079 -52629
1706 -52629 -65813 -68272 -1991 34303 -8696 -34550 -12242 -30338 -1955 9013 3530 -13144
1694 -13144 13034 80072 91069 70563 41956 -1179 -32330 -40002 -9759 7824 -7427 -459
1682 -459 -2553 6922 13869 7206 -3151 38102 1590 -55658 -21659 -13916 -57928 -32152 -31100
1669 -31100 -70794 -87985 -74152 -90083 -80772 -50099 -17976 6963 -7965 26983 25313 6705
$$ packed form
1756G987j89P700J3635l5094l2017m2515L9911L6126k7861p983L2481j0796o5951
1743h4566N8204n657q657K1224l18K8067J348m6015J6474R5599k8211l9180p0677
1730f2365J3584K9396L1522m5570k7192L6529j4001k359K026M2181J3564m6064
1718b8749j1794J558K7252K8720j9078q511k5903j3121J2897J7080r430k3550
1706e2629j3184k459O6281L6294m2999k5854K2308j8096K8383J0968n483j6674
1694a3144K6178O7038J0997k0506k8607m3135l1151p672L0243J7583j5251O968
1682d59k094R475O947o663j0357M1253l6512n7248L3999P743m4012K5776J052
1669c1100l9694j7191J3833j5931R311L0673L2123K4939j4928L4948j670j8608
$$ plain form
1657 6705 -73034 -44878 33 -1338 21994 8954 27798 6702 -8112 50728 26790 -36770
1645 -36770 -42717 24266 -12064 -19105 -34503 -49867 -28521 -13018 -16312 -15495 -2734 36899 5272
1632 5272 25388 44640 -8154 -18279 -19599 -2289 -24478 -29795 -67693 -24092 8704 -6514
1620 -6514 -57871 10844 47863 -4340 -43666 -47383 -805 8956 -10700 -22690 -51847 10831
1608 10831 15041 -50948 -77919 -78159 -60360 -20209 35259 39568 -37896 22655 24056 -16648 -21966
1595 -21966 -37530 -52406 -28875 -21939 -13552 -26477 -3751 -13748 -28145 -12888 14352 -13838
1583 -13838 17360 58196 -4902 37213 50170 61049 21075 12068 31355 -2001 -59374 -23603
1571 -23603 20751 3611 -49856 -26508 -31122 -36928 -23632 -53402 -72041 -56574 -63367 -30493
$$ packed form
1657F705p9739K8156M4911j371K3332j3040J8844k1096j4814N8840k3938o3560
1645c6770n947O6983l6330p041j5398j5364K1346J5503l294Q17J2761L9633l1627
1632E272K0116J9252n2794j0125j320J7310k2189n317l7898M3601L2796j5218
1620f514n1357O8715L7019n2203l9326l717M6578R761j9656j1990k9157O2678
1608A0831M210o5989k6971k40J7799M0151N5468M309p7464O0551J401m0704n318
1595b1966j5564j4876K3531O936Q387j2925K2726r997j4397J5257K7240k8190
1583a3838L1198M0836o3098M2115J2957J0879l9974r007J9287l3356n7373L5771
1571b3603M4354j7140n3467K3348m614n806J3296k9770j8639J5467o793L2874
$$ plain form
1559 -30493 -7566 9633 28397 30058 52793 -15274 1543 -7892 32467 20349 722 34244
1547 34244 -23616 36764 74438 40014 34123 33299 -33557 -37199 -14975 -39650 -43380 33534 17903
1534 17903 -55861 -73615 -18412 -30189 3308 34771 31265 -37653 -63288 -102842 -17080 21206
1522 21206 -15420 2152 28848 57925 38744 43268 20274 25437 -11040 -25805 -15975 22913
1510 22913 -7647 2480 20026 -11332 -45657 -30919 -13864 8647 -36599 -10451 4632 -387
1498 -387 -46736 -69732 -31685 -69626 -76322 -39681 -12310 -12893 -18201 -62517 -18123 -16181 -9344
1485 -9344 8606 -8297 -32173 -5811 16056 6188 39723 -17987 -21617 -41513 -18892 9993
1473 9993 39349 50999 16808 -59679 -73672 -17925 21700 -10599 14746 -51443 -62121 -27618
$$ packed form
1559c0493K2927J7199J8764J661K2735o8067J6817r435M0359j2118j9627L3522
1547C4244n7860O0380L7674l4424n891q24o6856l642K2224k4675l730P6914j5631
1534A7903p3764j7754N5203j1777L3497L1463l506o8918k5635l9554Q5762L8286
1522B1206l6626J7572K6696K9077j9181M524k2994N163l6477j4765R830L8888
1510B2913l0560J0127J7546l1358l4325J4738J7055K2511m5246K6148J5083n019
1498c87m6349k2996L8047l7941o696L6641K7371n83n308m4316M4394J942O837
1485i344J7950j6903k3876K6362K1867r868L3535n7710l630j9896K2621K8885
1473I993K9356J1650l4191p6487j3993N5747L9625l2299K5345o6189j0678L4503
$$ plain form
1461 -27618 -40219 -16265 -3533 -2789 8198 47620 12757 7213 17049 59081 32897 -19184 -45704
1448 -45704 -33994 -57882 -77609 -47798 -63667 5714 18456 -34476 -1024 -13676 -13551 32964
1436 32964 59027 -9032 -1116 10150 -39015 -24722 -968 -17953 -35638 -41829 -42719 -58913 -16585
1423 -16585 -51060 -11919 -76 -32938 -40216 -26332 -18790 8739 18489 -11984 36896 57395
1411 57395 26741 -5750 36326 27037 856 -897 -4747 -17810 20800 79695 25240 29828 75214
1398 75214 55350 12415 -54710 -32335 -5472 -834 -9534 26331 29756 -26730 15551 42434
1386 42434 41614 44858 61733 53803 1374 -3467 14075 51228 66989 65329 50035 95564 68406
1373 68406 63666 41580 2408 -1330 5347 9036 -8317 -17531 -693 8947 18570 -10354 6392
$$ packed form
1461b7618j2601K3954J2732P44J0987L9422l4863n544R836M2032k6184n2081k6520
1448d5704J1710k3888j9727K9811j5869O9381J2742n2932L3452j2652J25M6515
1436C2964K6063o8059P916J1266m9165J4293K3754j6985j7685o191q90j6194M2328
1423a6585l4475L9141J1843l2862p278J3884P542K7529R750l0473M8880K0499
1411E7395l0654l2491M2076r289k6181j753l850j3063L8610N8895n4455M588M5386
1398G5214j9864m2935o7125K2375K6863M638q700L5865L425n6486M2281K6883
1386D2434q20L244J6875p930n2429m841J7542L7153J5761j660j5294M5529k7158
1373F8406m740k2086l9172l738O677L689j7353r214J6838R640R623k8924J6746
$$ plain form
1360 6392 11310 -25414 -24676 -41054 -35115 -30975 -63822 -39905 -3777 -36445 13705 -1554 41730
1347 41730 59569 9740 -32483 15915 31873 -4940 -5795 25302 25072 30386 5536 -11318 -22412
1334 -22412 76862 63847 34421 5480 20960 -885 -49356 -17725 -2450 10425 -9095 32672
1322 32672 23866 -19385 -39279 -10566 -84334 -72653 -19978 -19961 18934 -6316 -34611 -38453 -18064
1309 -18064 17122 2059 -389 29482 17676 27133 52208 25315 49873 -39523 -5784 4161
$$ packed form
1360F392M918l6724P38j6378N939M140l2847K3917L6128l2668N0150j5259M3284
1347D1730J7839m9829m2223M8398J5958l6813q55L1097k30N314k4850j6854j1094
1334b2412R9274j3015k9426k8941J5480k1845m8471L1631J5275J2875j9520M1767
1322C2672q806m3251j9894K8713p3768J1681N2675J7L8895k5250k8295l842K0389
1309a8064L5186j5063k448K9871j1806R457K5075k6893K4558q9396L3739R945
$$ [...]
##END NTUPLES=NMR SPECTRUM
##END=
