##TITLE=1H_EC-3361(33)
 200.13MHz, CDCl3,
 8 sc
 
 4.9.2025
##JCAMPDX= 6.0         $$ Bruker NMR JCAMP-DX V2.0
##DATA TYPE= NMR SPECTRUM
##DATA CLASS= NTUPLES
##ORIGIN= UXNMR, Bruker Analytische Messtechnik GmbH
##OWNER= pz
$$ XWIN-NMR		Version 3.5
$$ Thu Sep  4 13:45:05 2025 Russian Standard Time (UT+4h)  she@DPX200
##.OBSERVE FREQUENCY= 200.1313
##.OBSERVE NUCLEUS= ^1H
##.ACQUISITION MODE= SIMULTANEOUS
##.ACQUISITION SCHEME= undefined
##.AVERAGES= 8
##.DIGITISER RES= 18
##SPECTROMETER/DATA SYSTEM= spect
##.PULSE SEQUENCE= zg30
##.SOLVENT NAME= CDCl3
##.SHIFT REFERENCE= (INTERNAL, CDCl3, 0, 15.5056)
##AUDIT TRAIL= $$ (NUMBER, WHEN, WHO, WHERE, WHAT)
$$ ##TITLE= Audit trail, XWIN-NMR		Version 3.5
$$ ##JCAMPDX= 5.01
$$ ##ORIGIN= Bruker BioSpin GmbH
$$ ##OWNER= she
$$ F:/spectra/data/she/nmr/H-C/1/pdata/1/auditp.txt
$$ ##AUDIT TRAIL=  $$ (NUMBER, WHEN, WHO, WHERE, WHAT)
(   1,<2025-09-04 13:43:49.59 +0400>,<she>,<DPX200>,
      <created by zg, POWCHK disabled, PULCHK disabled
       configuration hash MD5:
       00 E9 B6 7A A2 85 ED C7 34 08 36 98 17 FE 4E 26
       data hash MD5: 16K
       DC 50 F2 0A E7 90 9B FA 4D F7 BA E0 EA 43 2E F6>)
(   2,<2025-09-04 13:43:52.23 +0400>,<she>,<DPX200>,
      <Start of raw data processing
       efp BC_mod = 2 LB = 0.25 FT_mod = 6 PKNL = 1 PHC0 = -1558.68 PHC1 = 6.992279 SI = 16K 
       data hash MD5: 16K
       08 03 70 5E 8E 74 25 4F A1 CF 29 0D C2 1C 4B DB>)
(   3,<2025-09-04 13:44:12.42 +0400>,<she>,<DPX200>,
      <pk PHC0 = 3.467344 PHC1 = 0 
       data hash MD5: 16K
       9F BC D2 65 CC 8E 75 69 F5 59 D0 6B 8A C4 97 CD>)
(   4,<2025-09-04 13:44:16.29 +0400>,<she>,<DPX200>,
      <abs ABSG = 5 
       data hash MD5: 16K
       A7 62 8F DC 37 D1 44 A7 AD 61 03 10 9B A2 62 4D>)
$$ ##END=
$$ 
$$ hash MD5
$$ 5A 0D BF AE 92 B5 28 3D F7 69 83 20 85 7C E5 35
##$RELAX= 
##$RELAX= 
##$RELAX= 
##$RELAX= 
##$RELAX= 
##$RELAX= 
$$ Bruker specific parameters
$$ --------------------------
##$DU= <F:/spectra>
##$EXPNO= 1
##$NAME= <H-C>
##$PROCNO= 1
##$TYPE= <nmr>
##$USER= <she>
##$AMP= (0..31)
100 100 100 100 100 100 100 100 100 100 100 100 100 100 100 100 100 100 
100 100 100 100 100 100 100 100 100 100 100 100 100 100 
##$AQSEQ= 0
##$AQ_mod= 1
##$AUNM= <au_zg>
##$AUTOPOS= <>
##$BF1= 200.13
##$BF2= 200.13
##$BF3= 200.13
##$BF4= 200.13
##$BF5= 200.13
##$BF6= 200.13
##$BF7= 200.13
##$BF8= 200.13
##$BYTORDA= 1
##$CFDGTYP= 0
##$CFRGTYP= 5
##$CHEMSTR= <none>
##$CNST= (0..31)
1 1 145 1 1 1 1 1 1 1 1 1 1 1 1 1 1 1 1 1 1 1 1 1 1 1 1 1 1 1 1 1 
##$CPDPRG= <>
##$CPDPRG1= <>
##$CPDPRG2= <>
##$CPDPRG3= <>
##$CPDPRG4= <mlev>
##$CPDPRG5= <mlev>
##$CPDPRG6= <mlev>
##$CPDPRG7= <mlev>
##$CPDPRG8= <mlev>
##$CPDPRGB= <>
##$CPDPRGT= <>
##$D= (0..31)
0 0.7 0 0 0 0 0 0 0 0 0 0.03 0 0 0 0 0 0 0 0 0 0 0 0 0 0 0 0 0 0 0 0 
##$DATE= 1756979029
##$DBL= (0..7)
120 120 120 120 120 120 120 120 
##$DBP= (0..7)
150 150 150 150 150 150 150 150 
##$DBP07= 0
##$DBPNAM0= <>
##$DBPNAM1= <>
##$DBPNAM2= <>
##$DBPNAM3= <>
##$DBPNAM4= <>
##$DBPNAM5= <>
$$ [...]
##$SUBNAM3= <"">
##$SUBNAM4= <"">
##$SUBNAM5= <"">
##$SUBNAM6= <"">
##$SUBNAM7= <"">
##$SUBNAM8= <"">
##$SUBNAM9= <"">
##$SW= 18.0517328524113
##$SWIBOX= (0..15)
0 0 2 0 0 0 0 0 0 0 0 0 0 0 0 0 
##$SW_h= 3612.71676300578
##$TD= 16384
##$TD0= 1
##$TE= 0
##$TE2= 300
##$TE3= 300
##$TEG= 300
##$TL= (0..7)
0 120 120 120 120 120 120 120 
##$TP= (0..7)
150 150 150 150 150 150 150 150 
##$TP07= 0
##$TPNAME0= <>
##$TPNAME1= <>
##$TPNAME2= <>
##$TPNAME3= <>
##$TPNAME4= <>
##$TPNAME5= <>
##$TPNAME6= <>
##$TPNAME7= <>
##$TPOAL= (0..7)
0.5 0.5 0.5 0.5 0.5 0.5 0.5 0.5 
##$TPOFFS= (0..7)
0 0 0 0 0 0 0 0 
##$TUNHIN= 0
##$TUNHOUT= 0
##$TUNXOUT= 0
##$USERA1= <user>
##$USERA2= <user>
##$USERA3= <user>
##$USERA4= <user>
##$USERA5= <user>
##$V9= 5
##$VALIST= <valist>
##$VCLIST= <CCCCCCCCCCCCCCC>
##$VD= 0
##$VDLIST= <DDDDDDDDDDDDDDD>
##$VPLIST= <PPPPPPPPPPPPPPP>
##$VTLIST= <TTTTTTTTTTTTTTT>
##$WBST= 1024
##$WBSW= 4
##$XGAIN= (0..3)
0 0 0 0 
##$XL= 0
##$YL= 0
##$YMAX_a= 430696
##$YMIN_a= -644161
##$ZGOPTNS= <>
##$ZL1= 120
##$ZL2= 120
##$ZL3= 120
##$ZL4= 120
##$ABSF1= 15.49568
##$ABSF2= -2.55617
##$ABSG= 5
##$ABSL= 3
##$ALPHA= 0
##$AQORDER= 0
##$ASSFAC= 0
##$ASSFACI= 0
##$ASSFACX= 0
##$ASSWID= 0
##$AUNMP= <proc_1d>
##$AZFE= 0.1
##$AZFW= 0.1
##$BCFW= 0
##$BC_mod= 2
##$BYTORDP= 0
##$COROFFS= 0
##$CY= -3
##$DATMOD= 1
##$DC= 0
##$DFILT= <>
##$DTYPP= 0
##$F1P= 0
##$F2P= 0
##$FCOR= 1
##$FTSIZE= 16384
##$FT_mod= 6
##$GAMMA= 0
##$GB= 0
##$INTBC= 1
##$INTSCL= 3.241238e-09
##$ISEN= 128
##$LB= 0.25
##$LEV0= 0
##$LPBIN= 0
##$MAXI= 10000
##$MC2= 0
##$MEAN= 0
##$ME_mod= 0
##$MI= 1.114404
##$NCOEF= 0
##$NC_proc= -5
##$NLEV= 6
##$NOISF1= 3.799351
##$NOISF2= 2.8
##$NSP= 0
##$NTH_PI= 0
##$NZP= 0
##$OFFSET= 15.5056
##$PC= 1
##$PHC0= -1555.213
##$PHC1= 6.992279
##$PH_mod= 1
##$PKNL= yes
##$PPARMOD= 0
##$PSCAL= 0
##$PSIGN= 0
##$REVERSE= no
##$SF= 200.130003224105
##$SI= 16384
##$SIGF1= 3
##$SIGF2= 2
##$SINO= 0.751879
##$SIOLD= 32768
##$SREGLST= <19F.Aceton>
##$SSB= 0
##$STSI= 16384
##$STSR= 0
##$SW_p= 3612.71676300578
##$SYMM= 0
##$S_DEV= 0
##$TDeff= 16384
##$TDoff= 0
##$TI= <>
##$TILT= no
##$TM1= 0
##$TM2= 0
##$TOPLEV= 0
##$USERP1= <user>
##$USERP2= <user>
##$USERP3= <user>
##$USERP4= <user>
##$USERP5= <user>
##$WDW= 1
##$XDIM= 16384
##$YMAX_p= 290864596
##$YMIN_p= -224278
$$ End of Bruker specific parameters
$$ ---------------------------------
##NTUPLES= NMR SPECTRUM
##VAR_NAME=  FREQUENCY,     SPECTRUM/REAL,   SPECTRUM/IMAG
##SYMBOL=    X,             R,               I
##VAR_TYPE=  INDEPENDENT,   DEPENDENT,       DEPENDENT
##VAR_FORM=  AFFN,          ASDF,            ASDF
##VAR_DIM=   16384,         16384,           16384
##UNITS=     HZ,            ARBITRARY UNITS, ARBITRARY UNITS
##FACTOR=    0.220516191357247, 1,           1
##FIRST=     3103.1357731057, 0,             0
##LAST=      -509.580989900084, 0,           0
##MIN=       -509.580989900084, -224278,     0
##MAX=       3103.1357731057, 290864596,     0
$$ Real data points
##PAGE= N=1
##DATA TABLE= (X++(R..R)), XYDATA
$$ [...]
7524E26586q2756l9413j353k2453J4356N5278o7185O5397L1285m6712o2603l0482
7512C39945P4342R0627m028p126n74J0925j2883R647k397l565J5035n6210p1946
7499C81792P5818L7421o9292L4848l9218l8858k545M4883k7364R2K2475J4926
7487D34978L5805J6107o2989k9113M2638J8590l6016J2364O2361K8158r4363k0190
7475D08330J7955P870o579K8827j0288m627M2593P7006R24O2259p2784q1077J5594
7462D86003m1173K9277L4547l5591n880M426Q4255P3397r6429m0005R8151N3174
7450F44152o0990j1577J6658l7242L2047R8777J3508j3359K5614j04306j7891
7439E85391L6022N7299o8390Q5735Q6610K21K2210j10439O004J09999K8961K1431
$$ y = [526586, 443830, 404417, 403064, 380611, 394967, 450245, 383060, 448457, 479742, 433030, 370427, 339945, 414287, 504914, 500886, 493760, 493186, 504111, 491228, 500875, 498478, 494913, 509948, 453738, 381792, 457610, 495031, 425739, 460587, 421369, 382511, 379966, 424849, 397485, 397577, 420052, 434978, 470783, 486890, 423901, 394788, 437426, 456016, 420000, 432364, 494725, 522883, 428520, 408330, 426285, 434155, 427576, 456403, 446115, 441488, 484081, 561087, 562011, 624270, 551486, 470409, 486003, 444830, 474107, 508654, 473063, 467183, 471609, 555864, 629261, 532832, 492827, 590978, 644152, 583162, 571585, 588243, 551001, 583048, 681825, 695333, 681974, 707588, 603282, 585391, 621413, 678712, 610322, 696057, 782667, 782888, 805098, 694659, 700663, 810662, 839623, 861054]
7427H61054m4520L813l3404O215M8193o1336P929L7094j8078j928J24072j6775
7415I12329q7339K7474O0909K3350N2019K6408p424L6834n0780o5170P5877k6445
7403I78042M0556O6971l1093K2621O0934Q8002l1536L2836P3529N4634o389m7695
7391A301412O8100L1702K9904L5429Q3802J4231J7954P9884O3923j9001J00316
7380A807656j3269k4569R6761M7939O3586o019O5095R0387O4407J05791p0493
7369B227272Q5785J66658K6588R3781R2170M0538N2863J40971J27492J12141R0077
7358C256336O2541J20221J26752P0308J40156K04975J00887K44299K04758K78064
7348D809297K29506J58677K55707K30441K50032L24913K85601K33520L25571L86252
$$ y = [861054, 816534, 820347, 786943, 793158, 841351, 780015, 787944, 825038, 806960, 805032, 929104, 912329, 824990, 852464, 913373, 936723, 988742, 1015150, 1007726, 1044560, 993780, 928610, 1004487, 978042, 1018598, 1085569, 1054476, 1077097, 1138031, 1226033, 1194497, 1227333, 1300862, 1355496, 1349107, 1301412, 1369512, 1401214, 1431118, 1466547, 1550349, 1564580, 1582534, 1662418, 1726341, 1707340, 1807656, 1794387, 1769818, 1866579, 1914518, 1978104, 1972085, 2037180, 2127567, 2191974, 2297765, 2227272, 2313057, 2479715, 2506303, 2600084, 2692254, 2732792, 2785655, 2926626, 3054118, 3166259, 3256336, 3318877, 3439098, 3565850, 3636158, 3776314, 3981289, 4082176, 4326475, 4531233, 4809297, 5038803, 5197480, 5453187, 5683628, 5933660, 6258573, 6544174, 6777694, 7103265, 7489517]
7338G489517N01081N59578M17069M80411N13664N48401O65334O58303Q36635Q23345
7328A3493338Q06413P99192R45726R70244J033412J096443J126446J184917J281060
7319B2737191J331360J324008J228108J259332J277232J165039J025153Q38427
7311C2185850P50796N58886L21852J25084j1340k72103m59602n81478q08436r42799
7301C0866710j007359j084245j155646j103181j192020j173342j070403j119510
7293B1961004r81949r76354r19602q99421q08184q22559q45766q13295o88341
7284A4205533o30118n78761n31520n47384m43419n06076m10710m09318m63540
7275I684687m49181l71365k52097l47593l77740k30571k09511k67820k57343l23462
$$ y = [7489517, 7990598, 8550176, 8967245, 9447656, 9961320, 10509721, 11175055, 11833358, 12669993, 13493338, 14299751, 15098943, 16044669, 17014913, 18048325, 19144768, 20271214, 21456131, 22737191, 24068551, 25392559, 26620667, 27879999, 29157231, 30322270, 31347423, 32185850, 32936646, 33495532, 33817384, 33942468, 33931128, 33659025, 33199423, 32617945, 31809509, 30866710, 29859351, 28775106, 27619460, 26516279, 25324259, 24150917, 23080514, 21961004, 20979055, 20002701, 19083099, 18183678, 17375494, 16552935, 15707169, 14893874, 14205533, 13575415, 12996654, 12465134, 11917750, 11474331, 10968255, 10557545, 10148227, 9684687, 9235506, 8864141, 8612044, 8264451, 7886711, 7656140, 7446629, 7178809, 6921466, 6598004]
7265F598004j28053k08171k40412k48737j80724q6025j91221j56552j79593j33283
7255D845233j27220j66220j79174p0578j13739j37021p8153j25121j42969l6752
7245C668286j25143j33989r7364q3134p9656p3719m6751n0088q903p2263l5619
7234B861657n2433j66137k4299m3850j83286r0267n4523p0692R153m2619o3949
7223B078755o1243K6203J9836r59m2344o7769m9158j5903n2344n0750M2513m7425
7211A779412m9143q8375l6661O1558o2259p9782K1759q046n4736p7484o9622l501
7199A333120m7100j0672K9174n1475J9253r6925o4268M5490K4013P1683n984o3794
7187A182515K9095J4780q4274o1107p603P9989j553L2312n6981j35138l7974J0541
$$ y = [6598004, 6469951, 6261780, 6021368, 5772631, 5591907, 5505882, 5314661, 5158109, 4978516, 4845233, 4718013, 4551793, 4372619, 4302041, 4188302, 4051281, 3973128, 3848007, 3705038, 3668286, 3543143, 3409154, 3311790, 3228656, 3149000, 3075281, 3028530, 2978442, 2969539, 2897276, 2861657, 2809224, 2643087, 2618788, 2574938, 2391652, 2301385, 2246862, 2176170, 2185323, 2142704, 2078755, 2017512, 2043715, 2063551, 2062592, 2020248, 1952479, 1903321, 1887418, 1835074, 1784324, 1826837, 1779412, 1730269, 1641894, 1605233, 1666791, 1604532, 1524750, 1546509, 1538463, 1483727, 1406243, 1336621, 1333120, 1286020, 1275348, 1304522, 1253047, 1272300, 1175375, 1111107, 1156597, 1180610, 1252293, 1246309, 1182515, 1211610, 1226390, 1142116, 1081009, 1073406, 1153395, 1151842, 1184154, 1127173, 992035, 954061, 964602]
7175I64602k189M0311O9323p2904p2124l5087J6631q368O442K0908J3282k7910
7163I12917p2895m873O7958M6045o8223l1268L0109N3303j1951j53867q6012N8390
7151G39633J7102l3030m9415K3292L5240m3971o7548M6751N0317r863n4396O867
7139F60979N929l552p777o4185k1243P1483L7188m0280Q6817p869o6106j941L8717
7126F88160q2451j23257l2696Q6351k1075K4438J9728j05920L9715R729L97m22
7114E02697K0750L5797O0217j0656p6795Q8193o483o2771K9094K0487l5244O3886
7102F29172K3765O089j49298K203P2527L5854J04638j04698n897R9672J52944
7091H66971M3508K0977J6440K1335N888q502l6617k2712m7880n0877m6872j848
$$ y = [964602, 962413, 1002724, 1072047, 999143, 927019, 891932, 908563, 900195, 906637, 927545, 940827, 912917, 840022, 835149, 903107, 949152, 880929, 849661, 879770, 933073, 921122, 767255, 681243, 739633, 756735, 723705, 674290, 697582, 732822, 688851, 621303, 668054, 718371, 708508, 654112, 660979, 666908, 663356, 655579, 591394, 570151, 641634, 678822, 638542, 725359, 717490, 651384, 649443, 688160, 605709, 482452, 449756, 536107, 515032, 539470, 559198, 453278, 492993, 502722, 503119, 502697, 523447, 559244, 619461, 608805, 532010, 620203, 613720, 550949, 580043, 600530, 565286, 629172, 652937, 659026, 509728, 511931, 584458, 620312, 724950, 620252, 614355, 714027, 866971, 910479, 931456, 947896, 969231, 975119, 966617, 930000, 907288, 859408, 808531, 761659, 759811]
7079G59811m2880p1646l0173q4494n987M5277m2506k889O0516j8034m3325j5372
7067E08298J3577l7565q790j763k2060P3385K41n9516L2775r656p1895M0097m6936
7054D10192p1281M9459j6812J976m135o8222k5012K469N1917K2510o3365L6912
7042C26608q568k7232o1492N2197o1339m462Q210J0033l4457K2779L3179l7014
7030B18442k7642l6025m9639Q7543M3713K7920M5622j43511K7900L4791k7620
7019B01494m7463l3852M1232m705k9283L5583N7644p0892K1475k1263l051J7643
7007A64562m5873k0166l843Q3852j7692L588j1106k3836Q0027J5963L2556l2323
6995B25709M9700O6373j12265o9428O743R4247K9329k915r824K1454m5729k4629
$$ y = [759811, 716931, 645285, 615112, 530618, 524631, 569908, 527402, 524513, 585029, 566995, 523670, 508298, 521875, 484310, 475520, 473757, 451697, 525082, 525323, 465807, 498582, 488926, 417031, 457128, 410192, 338911, 388370, 371558, 373534, 369399, 301177, 276165, 278634, 330551, 353061, 289696, 326608, 318040, 290808, 229316, 281513, 220174, 215712, 223922, 233955, 199498, 222277, 255456, 218442, 190800, 154775, 105136, 192679, 236392, 264312, 309934, 166423, 194323, 229114, 201494, 154031, 120179, 161411, 156706, 127423, 163006, 220650, 149758, 171233, 149970, 146919, 164562, 118689, 98523, 94680, 178532, 160840, 164428, 153322, 129486, 209513, 225476, 258032, 225709, 275409, 341782, 229517, 160089, 166832, 261079, 290408, 287493, 277669, 299123, 253394, 228765]
6983B28765o4720L0665K1332k1506n168k9292J7954n013j6684M0645K1036N3241
6971B71255j4402M6769L7183k0869k2658M1198j5887j158p263M053p0109L7140
6959B85252m0609K8140K7959P6540l3589O2826M2489L3054o8141m7487O4975L0573
6947D61982k6677K1445J04071o7335r5700o88l5627L8509j1724j33633J03110
6936C57733M7965n8454k8503L2563m0438O4525K0694p812q7085l1121K7605l5882
6924B61790q7015Q308Q0187m6897O2936k118n3003J7194m9379m5772P1589r115
6912B08705N78J09622p0644o4583O1009K6772m1896J0172r1604M6972K0853M6890
6900B62846l3392O9346n47J4620n568k8963N0359Q8232k6275j4902o691k0418
$$ y = [228765, 164045, 194710, 216042, 194536, 189368, 160076, 178030, 173017, 156333, 196978, 218014, 271255, 256853, 303622, 340805, 319936, 297278, 338476, 322589, 321431, 314168, 318221, 248112, 285252, 244643, 272783, 300742, 377282, 343693, 406519, 449008, 482062, 413921, 366434, 431409, 461982, 435305, 456750, 560821, 493486, 397786, 397098, 361471, 399980, 388256, 254623, 357733, 405698, 347244, 318741, 351304, 310866, 375391, 396085, 388273, 301188, 270067, 297672, 261790, 174775, 183083, 263270, 216373, 279309, 277191, 224188, 241382, 192003, 146231, 217820, 208705, 209283, 318905, 248261, 183678, 244687, 271459, 229563, 239735, 148131, 195103, 215956, 262846, 229454, 298800, 298253, 312873, 307305, 278342, 328701, 416933, 390658, 375756, 369065, 348647]
6888C48647j9919O9936o764j6982p06l7602m0328L8489j8001k7914n3764Q718
6876B43810p298L2259k2316L738k1928j2718J3203M6384p3169o040j1513J911
6864A86323R740q9554M0548r521O0229k9266M129M2682K7835o3740N661j66P3861
6851B58761m3030J3724J6043k1875k7735j3132O3524J7117L0189n4557L5791L3750
6839C08570N3984L3454j1715P1339o0140l8409J8420l2529k9707L264n1056r2327
6827A73148J1138O0919n5551M0230p2437O0810k6611J8943k0037l7466J744K051
6815A56881K4233K3759o71o1788J5682K1343n344K3678m3406K7701L1086J2596
6803B25750j337k9777M826l4158j7475j3298R166l5862K8702J28694L9090N2959
$$ y = [348647, 328728, 398664, 391900, 374918, 374212, 336610, 296282, 334771, 316770, 288856, 235092, 243810, 236512, 268771, 246455, 250193, 228265, 215547, 228750, 275134, 201965, 195925, 184412, 186323, 196063, 106509, 147057, 137536, 197765, 168499, 172628, 215310, 243145, 179405, 185066, 184900, 258761, 215731, 229455, 245498, 223623, 195888, 182756, 246280, 263397, 293586, 239029, 274820, 308570, 362554, 396008, 384293, 455632, 395492, 357083, 375503, 342974, 313267, 316531, 265475, 173148, 184286, 245205, 189654, 229884, 157447, 218257, 191646, 210589, 190552, 153086, 154830, 156881, 181114, 204873, 204202, 142414, 158096, 179439, 174095, 197773, 154367, 182068, 213154, 225750, 224413, 194636, 199462, 165304, 147829, 134531, 143697, 107835, 136537, 265231, 304321, 357280]
6791C57280K284n5818p2015Q499j8924m5141M1039K4483l9533M0925k493l1976
6779B08610k3717l9686N4192k3405P2810q547J1008k0852j04140N6807O1984j4437
6767B30627r1899k2847k5238M6945N5486n921k8513m8213R257L1687l0795M1090
6755A61666P874J25534r0855j19000M364P697K9607L5768l1067l7542J13225M6139
6743B53410Q1848o8140n9178J8281K879p0468K3470n9201L2098o8965Q7282n396
6731A67920L1109J6102k9905N2416l4745Q1450O9258K7989o1395M3798Q8164L9036
6719D91197l7627p9729K6524k737l5630r1522J4001P6553j3514k9137R670K75
6707C28324j5603j9672N4006l6459k9202L3751P381j07467j9627M8780l719K6077
$$ y = [357280, 359564, 303746, 231731, 240230, 221306, 176165, 217204, 241687, 202154, 243079, 240586, 208610, 184893, 145207, 199399, 175994, 248804, 240257, 251265, 230413, 126273, 183080, 245064, 230627, 138728, 115881, 90643, 137588, 193074, 187153, 158640, 110427, 119684, 151371, 120576, 161666, 169540, 295074, 204219, 85219, 89583, 97280, 126887, 162655, 131588, 94046, 207271, 253410, 335258, 267118, 207940, 226221, 229100, 158632, 182102, 122901, 154999, 86034, 173316, 167920, 199029, 215131, 185226, 237642, 202897, 284347, 353605, 381594, 320199, 363997, 452161, 491197, 453570, 373841, 400365, 397628, 361998, 270476, 284477, 361030, 347516, 318379, 328049, 328324, 312721, 293049, 347055, 310596, 281394, 315145, 322526, 215059, 195432, 244212, 240493, 266570]
6695B66570p3R940J7003J6741k2458k1519J8823J5642k4603L0910k788p9614R9047
6682C23621q9875N9257M6858j2949Q8667n8481O5709r9591J3017K5791J4753L4857
6670D11634N8475J4442L357J1703J4119K5709o6716J7060J65065n2797m4181n578
6658E52292L849N8622J4232J9428J22q6105j448l5141o6250k7005L3562L3257
6646D99415N1771M5021j21933M066R6149L3508k887n302n8255n0343K3403P0556
6634E85169L9898J2373j3161l1156K1784j7087n036K7226R058M2987J2146L6643
6622G20844N262l1632l2799k1211M0287M0692Q142m6067L9514j6591q149m0236
6610F58056p530N7527K5410l8963k0086O5657q5497J3084J2090K2760m976n7642
$$ y = [266570, 266497, 276437, 293440, 310181, 287723, 266204, 285027, 300669, 276066, 306976, 304188, 224574, 323621, 233746, 293003, 339861, 326912, 415579, 357098, 422807, 323216, 336233, 362024, 376777, 411634, 470109, 484551, 487908, 499611, 513730, 539439, 472723, 489783, 654848, 602051, 557870, 552292, 556141, 614763, 628995, 648423, 648545, 562440, 560992, 525851, 459601, 432596, 466158, 499415, 551186, 596207, 474274, 478340, 574489, 607997, 605110, 599808, 541553, 491210, 514613, 585169, 625067, 637440, 624279, 593123, 614907, 597820, 592784, 620010, 629068, 672055, 684201, 720844, 726106, 694474, 661675, 640464, 680751, 721443, 729585, 683518, 723032, 706441, 698292, 658056, 650526, 708053, 733463, 694500, 674414, 740071, 654574, 667658, 679748, 702508, 697532, 639890]
6598F39890L9217l7484k8611M857l3966j4164Q0897L1488l9831K1079n3573J4117
6586F23916q8763r1233J2109M4995L1692L0117R792k6348J7902R5824j6662J8791
6574F62132P6642J9446M3102L6065k5239j839j9450K06L8398Q213p9878P874P4373
6561H40045L45M8148N2313l9591p0195K444J22630J06757L1964K4573K1854O5295
6549A206582K6837M4429J38576O4384K729P5786J10858J54105L5064R9560m5128
6538A913782j18746n1674m9204J5690m1048j21642o1413j6244O2493j04711p8343
6527A348940k5532L724N9531J04728J8417K2532O621O1754K664j53193j50324
6516A299862q3027N4842p3780j56891n439L912l2020l3334L0599k2890P4738j5372
$$ y = [639890, 679107, 641623, 613012, 617869, 583903, 569739, 650636, 682124, 642293, 663372, 609799, 623916, 535153, 443920, 456029, 501024, 532716, 562833, 572625, 546277, 564179, 660003, 643341, 662132, 738774, 758220, 801322, 837387, 812148, 810309, 790859, 791065, 829463, 837676, 757798, 765672, 840045, 840390, 888538, 940851, 901260, 831065, 833509, 956139, 1062896, 1094860, 1119433, 1141287, 1206582, 1233419, 1277848, 1416424, 1480808, 1483537, 1559323, 1670181, 1824286, 1859350, 1958910, 1913782, 1795036, 1743362, 1694158, 1709848, 1668800, 1547158, 1485745, 1469501, 1531994, 1427283, 1348940, 1323408, 1327132, 1386663, 1491391, 1509808, 1532340, 1538961, 1600715, 1603379, 1450186, 1299862, 1216835, 1271677, 1197897, 1041006, 1035567, 1039479, 1007459, 974125, 1004724, 981834, 1056572, 1041200]
6504A041200k1598n4873O7582J5882l8132j0955n5673l2611o7683j2433j247J33058
6492I62517m3626r5824l750Q8253j18247L0129j2729j03279K0944Q0456P62l6979
6480G68627p6243L3062O7297M1960r1465l5970R716J1833L8325N2321M3561m3522
6468H19502l7354O6865M8920K3139q9806n728K9136l2137N0573M2704Q0262J9544
6456A015620n4783o5104M5020P4264K7395O6614L2423K2725J1661N9005P1631
6445A306471n9O7145J3500j1364m3205l9705N1915L7275L4531L5605q4491P0511
6433A438129O698J2348L8565o1301R872j3215N7951M4145k7766K255J6288N8464
6421A582433O4628l6832o0930r326l3330Q3397P4677J5561J09705q6737q0700
$$ y = [1041200, 1019602, 964729, 1032311, 1048193, 1010061, 999106, 943433, 910822, 843139, 830706, 829459, 962517, 918891, 823067, 819317, 907570, 789323, 819452, 806723, 703444, 724388, 804844, 805606, 768627, 692384, 725446, 792743, 834703, 743238, 707268, 716984, 728817, 767142, 819463, 863024, 819502, 782148, 849013, 897933, 921072, 831266, 825538, 854674, 822537, 873110, 915814, 996076, 1015620, 960837, 895733, 940753, 1015017, 1042412, 1109026, 1141449, 1164174, 1175835, 1234840, 1306471, 1306412, 1373557, 1387057, 1375693, 1332488, 1292783, 1344698, 1381973, 1416504, 1452109, 1367618, 1438129, 1444827, 1457175, 1495740, 1434439, 1444311, 1431096, 1489047, 1533192, 1505426, 1507681, 1523969, 1582433, 1647061, 1610229, 1549299, 1539973, 1506643, 1590040, 1664717, 1680278, 1789983, 1703246, 1622546]
6410A622546Q1229J22361K3532p041L8345j11582n0766j3977L2998m532k926Q1182
6398A811369n4712n2309R2797k9932K2187Q1185P350J15779P7502K3421n161j1461
6386B078015J0738J14510J21605J00651R6530J28047Q4872Q2954J59148J73401
6376C150471J95613K70659J80534J02911J87674J40893P0505L1431J38126K34493
6366D703310K32687K53493K75140L65130M02446M43744M25879L58915M25554L23337
6356H209635K77844J69792K01775L34773L66067M09119M06126N49012N83433L33365
6346A1840941K83476K75252L16922L46857L46321L69113K64469M60843L96581
6337A4900775L40458K67885M25428O62574P76911J047530J312423J715494J879954
$$ y = [1622546, 1703775, 1826136, 1849668, 1842627, 1880972, 1769390, 1718624, 1704647, 1737645, 1733113, 1730187, 1811369, 1756657, 1704348, 1797145, 1767213, 1789400, 1870585, 1877935, 1993714, 2071216, 2094637, 2089476, 2078015, 2088753, 2203263, 2324868, 2425519, 2522049, 2650096, 2734968, 2817922, 2977070, 3150471, 3346084, 3616743, 3797277, 3900188, 4087862, 4228755, 4299260, 4330691, 4468817, 4703310, 4935997, 5189490, 5464630, 5829760, 6232206, 6675950, 7101829, 7460744, 7886298, 8209635, 8487479, 8657271, 8859046, 9193819, 9559886, 9969005, 10375131, 10924143, 11507576, 11840941, 12124417, 12399669, 12716591, 13063448, 13409769, 13778882, 14043351, 14504194, 14900775, 15241233, 15509118, 15934546, 16597120, 17374031, 18421561, 19733984, 21449478, 23329432]
6328B3329432J961867J769046J513780J062763M36542k48677p94576j065166r64125
6319B7000886p54503m79245j36899J53316L47794O79899R15569J081866J277196
6310C0085879J456869J465927J364378J142259O41619K4492m29334q08174j270292
6301C3673623j639933j982042j928560j693292j368243j186577r60319p85720
6293B2128937n39147l03245j49004O2704L58950M79399Q28662J166391J410428
6284B5444075J604513J587612J661399J533112J251051P56956K04777l95108q19471
6275C2828916j075987j358890j388069j395128j250234r38532p82766m19567j71411
6266B4048332J94313N16227Q15366J031224J040257J032576P77406L57353k72221
$$ y = [23329432, 25291299, 27060345, 28574125, 29636888, 30073430, 29824753, 29030177, 27965011, 27000886, 26246383, 25767138, 25630239, 25783555, 26131349, 26811248, 27726817, 28808683, 30085879, 31542748, 33008675, 34373053, 35515312, 36156931, 36181423, 35752089, 34943915, 33673623, 32033690, 30051648, 28123088, 26429796, 25061553, 23874976, 22914657, 22128937, 21589790, 21286545, 21137541, 21200245, 21559195, 22038594, 22867256, 24033647, 25444075, 27048588, 28636200, 30297599, 31830711, 33081762, 33838718, 34043495, 33648387, 32828916, 31752929, 30394039, 29005970, 27610842, 26360608, 25422076, 24639310, 24219743, 24048332, 24242645, 24758872, 25574238, 26605462, 27645719, 28678295, 29455701, 29813054, 29540833]
6257B9540833p68290j236639j636230j619849j484275j246219j033306q82427
6249A9633598p79932n73085m79079n31550l68825l04768l88567m69388n17198
6240A5221206l71365k84098l41024l21913l19393l80932l97892m15787m50796
6231A1938006l71907l59793k77820k34132k28098k47448l74984l93163l98040
6222I052621m63730m97505m73886m05743m23231l01459k60215k77280k92413k50643
6212E406516k13920j47832j52814o9103j42077j62067m3546j36819j84150j18914
6202D035274r5144q6132k4489j13340j21714l2981r4018j05222m1567K9848r6213
6191C254302j2568L2694m8824r6365L3221o7666k5253j8306l5067j0940j45952
$$ y = [29540833, 28772543, 27535904, 25899674, 24279825, 22795550, 21549331, 20516025, 19633598, 18853666, 18280581, 17801502, 17269952, 16901127, 16596359, 16207792, 15738404, 15221206, 14849841, 14565743, 14224719, 13902806, 13583413, 13202481, 12804589, 12388802, 11938006, 11566099, 11206306, 10928486, 10694354, 10466256, 10218808, 9843824, 9450661, 9052621, 8588891, 8091386, 7617500, 7211757, 6788526, 6487067, 6226852, 5949572, 5657159, 5406516, 5192596, 5044764, 4891950, 4822847, 4680770, 4518703, 4475157, 4338338, 4154188, 4035274, 3940130, 3853998, 3829509, 3716169, 3594455, 3561474, 3467456, 3362234, 3320667, 3350515, 3254302, 3241734, 3274428, 3225604, 3129239, 3162460, 3094794, 3069541, 3051235, 3016168, 3005228, 2859276]
6180B859276j2551K4146M0828p1004m3989j7653j3216j34592o9332p9166n1616
6169B431131l7176Q977k1662p3736l8822m2911o7846O7857K6636p4585r151r3898
6157B074814k0058K1997o5138N2277K4666l0701n0307l8228M2858j3251k2876
6146A976053k4932J7500K1615R761O2553L8835k3441j3383l8901l7761O036j518
6134A992417j09040p4624K9598m4222q1984J1932j8456p1348j06627l3712N1261
6123A545195m6960j07073J4914L6018m9412J6438K391J1674m9534M5090l0364
6112A388377j22517N0007K481n1007j17763O3178P035J8364M2540k2824m5326
6101A212545l6538N0336P9546m2443r7083Q9687r811O0980P5474q6544K4693K5361
$$ y = [2859276, 2846725, 2870871, 2911699, 2840695, 2796706, 2779053, 2765837, 2631245, 2561913, 2482747, 2431131, 2393955, 2402932, 2381270, 2307534, 2268712, 2225801, 2157955, 2225812, 2252448, 2177863, 2168712, 2074814, 2054756, 2076753, 2011615, 2063892, 2088558, 2057857, 2007550, 1969322, 2012180, 1998929, 1976053, 1951121, 1968621, 1990236, 1999997, 2062550, 2101385, 2077944, 2064561, 2025660, 1987899, 1993935, 1992417, 1883377, 1808753, 1838351, 1794129, 1712145, 1724077, 1705621, 1634273, 1527646, 1493934, 1545195, 1498235, 1391162, 1406076, 1442094, 1392682, 1409120, 1411511, 1423185, 1373651, 1418741, 1388377, 1265860, 1315867, 1318348, 1267341, 1149578, 1212756, 1219791, 1238155, 1280695, 1257871, 1212545, 1176007, 1226343, 1305889, 1263446, 1166363, 1256050, 1246239, 1307219, 1382693, 1296149, 1320842, 1346203]
6089A346203m3874J8229M0168L839K655J600M48R2782l2564j0032k6164q19P2886
6076A465357n3433p1235l8667j9879j3013M1886P7267k1672K3418l297N7630K6552
6064A470914k6393L2890j8530m4887J01756k2064K7369N9547J8541m5155P4770
6053A628758J1972j22565M970j9038J9546j2682n3842R53K5673q5023R058m9533
6041A358247K2233M4342k7843k2888K2404J07725q6837m957K6349Q1536l7412
6030A482899n0642K0361m9221J345n7559K8975j8254J2738O0338p6915l248R5021
6018A445838K3666l1700j03565M8145o0631R427L7539M9088R4629M5916p0997
6007A487355P145q5516J07747J04189o538k4330l6042K5357K6925r131o8430M2636
$$ y = [1346203, 1302329, 1320558, 1360726, 1364565, 1367220, 1368820, 1369268, 1462050, 1429486, 1419454, 1393290, 1392471, 1465357, 1411924, 1340689, 1302022, 1282143, 1269130, 1311016, 1388283, 1366611, 1390029, 1386732, 1444362, 1470914, 1444521, 1477411, 1458881, 1413994, 1515750, 1493686, 1521055, 1580602, 1599143, 1553988, 1628758, 1640730, 1518165, 1523135, 1504097, 1523643, 1510961, 1457119, 1458072, 1483745, 1398722, 1407780, 1358247, 1380480, 1424822, 1396979, 1374091, 1396495, 1504220, 1417383, 1412426, 1438775, 1520311, 1482899, 1432257, 1452618, 1403397, 1404742, 1347183, 1376158, 1357904, 1370642, 1430980, 1354065, 1350817, 1445838, 1469504, 1437804, 1334239, 1382384, 1321753, 1331180, 1368719, 1417807, 1512436, 1558352, 1487355, 1494500, 1408984, 1516731, 1620920, 1614382, 1590052, 1554010, 1579367, 1606292, 1597161, 1528731, 1571367]
5995A571367J5365p5635J285l1360J8374N886n5702j4057O0407K5945m5330L6761
5983A513306N7991Q608J0738l647m8058Q3795N5175j7799l84n871N0596J6085
5971A720535l985L0792J0175k433N6705j5809k7923Q6567j8718J0109M5086J15352
5959B006453J34854O0783J311Q588L4964P1369j5039N1959o5636n3865r1455j29036
5947B015250o3631q3618P305O1372m3065j08976k6540q0642l9863M5598j5795
5936A667395j1475r6432J7920J27460q0998k1613l2688R474K834j0684K2445K3400
5924A617038l7927m3297J2611l3678M7958n5309M9215O4591P4892K7330P125m2393
5912A688156P369k7156j6716N5841N456p9084J0879L8706o0543R8654K9096m5101
$$ y = [1571367, 1586732, 1511097, 1512382, 1481022, 1499396, 1505282, 1449580, 1435523, 1495930, 1521875, 1476545, 1513306, 1571297, 1579905, 1590643, 1586996, 1538938, 1622733, 1677908, 1660109, 1659725, 1653854, 1704450, 1720535, 1716550, 1747342, 1757517, 1755084, 1811789, 1795980, 1768057, 1854624, 1835906, 1846015, 1891101, 2006453, 2141307, 2202090, 2203401, 2211989, 2246953, 2318322, 2303283, 2355242, 2289606, 2235741, 2144286, 2015250, 1951619, 1868001, 1875306, 1936678, 1893613, 1784637, 1758097, 1677455, 1637592, 1683190, 1667395, 1655920, 1559488, 1577408, 1704868, 1623870, 1602257, 1569569, 1579043, 1581877, 1571193, 1593638, 1617038, 1579111, 1535814, 1548425, 1514747, 1562705, 1507396, 1556611, 1621202, 1696094, 1723424, 1730549, 1688156, 1695525, 1668369, 1651653, 1707494, 1712950, 1633866, 1644745, 1683451, 1622908, 1721562, 1750658, 1705557]
5900A705557l1077N3963J22649R0264J5368O391l767n5546Q2375P2451j2772q9269
5888A956587P3315J24885q4173q5382J3670Q9151J8166n3014k6783L7473n3988
5877B009907J9242L097K480p0126r1985L5595j2423l9397j9883K2274m9059J8823
5865A828545M9910M9258j5857n1212k9518r0663r3960k3320j1099j505M5669k9775
5853A626473m246N3355K3807j3693m7433K9520J00169O4326j02755j3655l0767
5842A685101n4541J06691q4140m6100k1860M8671l6210n4491j7133L2676P8258
5831A636922K9440n0724J0676J00140J4743K3553J29743J3575P5830M2066o0225
5820A965739K28O8305J38796Q8885J136P8637q114L5515J9412j7943l1284p0878
$$ y = [1705557, 1674480, 1728443, 1851092, 1941356, 1956724, 1963115, 1959348, 1903802, 1986177, 2058628, 2045856, 1956587, 2029902, 2154787, 2070614, 1985232, 1998902, 2088053, 2106219, 2053205, 2026422, 2063895, 2009907, 2029149, 2032246, 2034726, 1964600, 1872615, 1908210, 1895787, 1856390, 1836507, 1858781, 1809722, 1828545, 1878455, 1927713, 1911856, 1860644, 1831126, 1740463, 1646503, 1623183, 1612084, 1610579, 1656248, 1626473, 1622227, 1675582, 1699389, 1685696, 1638263, 1667783, 1767952, 1832278, 1729523, 1715868, 1685101, 1630560, 1737251, 1653111, 1607011, 1585151, 1633822, 1597612, 1543121, 1525988, 1558664, 1636922, 1666362, 1615638, 1626314, 1726454, 1741197, 1764750, 1894493, 1908068, 1983898, 2025964, 1965739, 1965967, 2034272, 2173068, 2261953, 2263089, 2341726, 2333612, 2369127, 2388539, 2370596, 2339312, 2268434]
5808B268434k7040j736J4235m7427J3894o8453j9858o3383k1530J922m4118j6953
5796A987987r7100l1432K0545k3873m610r5952M5673l294j0376m2170L8129M7567
5784A831094j1041J9446m4327k1214L897Q0293R1931k5449o8052J7535K9907m5572
5772A858448l144o5733L5481N339l2755j4528j5435k1692j2430M3219o4707j7700
5760A694363j4330J0615K6797R0888m6189k0656O2942l3487q7766N3031J1043
5749A747251j43639K0936N045k2897J0592n0730r6702k0537P5653k4388M9031
5738A549615Q1533j31961j23571Q0182J8583j9785m4457K3373J32661O9665k359
5727A633479n435j5919L5211j0438L3265J59995K4042M163j1816K6056Q2040M1859
$$ y = [2268434, 2241394, 2239658, 2253893, 2206466, 2220360, 2151907, 2132049, 2068666, 2047136, 2049058, 2004940, 1987987, 1890887, 1859455, 1880000, 1856127, 1851517, 1755565, 1801238, 1797944, 1787568, 1745398, 1783527, 1831094, 1820053, 1839499, 1795172, 1773958, 1777855, 1858148, 1950079, 1924630, 1856578, 1874113, 1904020, 1858448, 1855304, 1789571, 1825052, 1830391, 1797636, 1783108, 1767673, 1745981, 1733551, 1776770, 1712063, 1694363, 1680033, 1690648, 1717445, 1808333, 1762144, 1741488, 1804430, 1770943, 1683177, 1736208, 1747251, 1603612, 1624548, 1629593, 1606696, 1617288, 1566558, 1469856, 1449319, 1524972, 1500584, 1549615, 1631148, 1499187, 1375616, 1455798, 1474381, 1454596, 1410139, 1433512, 1566173, 1635838, 1633479, 1628044, 1612125, 1647336, 1636898, 1670163, 1830158, 1854200, 1858363, 1846547, 1872603, 1954643, 1996502]
5715A996502N2477N0054Q0392O430J3922L1408k4418n1641N4593j9089k079M3440
5703B231991k3789k9968N4123l3746N2625N3719R7222J99611N0417q105J12627
5692B756727P7588k3303J01396Q5374J55970O0414J50755K14803K29546J11334
5682C920604J17536N5690n4382r6290p8431L0857o4960n629n2031m9775l3634
5671C689555r0430k1312J3942P4802j7083o0760o2835N5881J09009q14Q818J16262
5659C815035L9519P9425J17496J07933R4501J95989J85004J33881L4167J16291
5649D919241N4520n3154o1817j24700q7265o10K1754n793j39557q3843N6384j4407
5637D480753M8261o162k4653R4775O2646p7877J06931J33953L1418Q9644J30497
$$ y = [1996502, 2048979, 2099033, 2179425, 2185855, 2199777, 2231185, 2206767, 2155126, 2209719, 2190630, 2188551, 2231991, 2208202, 2178234, 2232357, 2198611, 2251236, 2304955, 2402177, 2601788, 2652205, 2644100, 2756727, 2834315, 2811012, 2912408, 2997782, 3153752, 3214166, 3364921, 3579724, 3809270, 3920604, 4038140, 4093830, 4039448, 3943158, 3864727, 3895584, 3830624, 3824995, 3772964, 3723189, 3689555, 3599125, 3577813, 3591755, 3666557, 3649474, 3588714, 3525879, 3581760, 3690769, 3689955, 3698773, 3815035, 3854554, 3933979, 4051475, 4159408, 4253909, 4449898, 4634902, 4768783, 4802950, 4919241, 4973761, 4920607, 4858790, 4734090, 4646825, 4646215, 4667969, 4662176, 4522619, 4438776, 4495160, 4480753, 4529014, 4522852, 4498199, 4592974, 4655620, 4577743, 4684674, 4818627, 4850045, 4939689, 5070186]
5626E070186J12555N5844J53558J53342J20708K02407J42467J00760J00044Q4732
5616F296603R7808J53026K28770K48292J60911J71261J81046K39780L45192L45297
5606H467986L49113L91473M33320N43390N04767N21265P06829P83968Q25672R76569
5596A4504352J102882J186608J295761J664735J776240J990931K244656K429721
5588B8195886K683634K763624K808578K997481K759590K546163K150430J693753
5580D8599139J082155L66448n06657j189923j481827j913616j980085k127486
5572D0848148k363775k518582k422642k415840k341086k154430j999171j833697
5564B2798925j614867j419027j274892j194138j009924r99214q55575q09123p27518
$$ y = [5070186, 5182741, 5238585, 5392143, 5545485, 5666193, 5868600, 6011067, 6111827, 6211871, 6296603, 6394411, 6547437, 6776207, 7024499, 7185410, 7356671, 7537717, 7777497, 8122689, 8467986, 8817099, 9208572, 9641892, 10185282, 10690049, 11211314, 11918143, 12702111, 13527783, 14504352, 15607234, 16793842, 18089603, 19754338, 21530578, 23521509, 25766165, 28195886, 30879520, 33643144, 36451722, 39449203, 42208793, 44754956, 46905386, 48599139, 49681294, 50047742, 49541085, 48351162, 46869335, 44955719, 42975634, 40848148, 38484373, 35965791, 33543149, 31127309, 28786223, 26631793, 24632622, 22798925, 21184058, 19765031, 18490139, 17296001, 16286077, 15286863, 14431288, 13622165, 12894647]
5555A2894647n57851n19870n75247m58920k80436m02710l59494l14789l46131
5546I079199j47648k46030k42812k51261l44016j52571k32456k84533k06128j91856
5536F779888j77557j21524j51614j34064j77383j48731j42159j37004k06942p4438
5526E308472j85774j20407j51392j38022o2771j21005q7553r9345n9765j45919
5516D136519l2860j48628j6909m0195j50188j5447q7281j56234l7125j10043j35815
5505C205794p2547n9150n4700N6004K8015j6736n4211j31972l0110k5421K3184
5494B868150o9227q9145J129L5339L7838K3799l9004j1665m5750r8112O5962N9600
5482B738914L5691L4976j02832p6333P317o5774q0380m3806j3190J5624o7253
$$ y = [12894647, 12336796, 11816926, 11241679, 10782759, 10502323, 10099613, 9740119, 9425330, 9079199, 8931551, 8685521, 8442709, 8191448, 7847432, 7694861, 7462405, 7177872, 6971744, 6779888, 6602331, 6480807, 6329193, 6195129, 6017746, 5869015, 5726856, 5589852, 5382910, 5308472, 5122698, 5002291, 4850899, 4712877, 4650106, 4529101, 4441548, 4342203, 4282438, 4136519, 4103659, 3955031, 3938122, 3897927, 3747739, 3732292, 3645011, 3488777, 3451652, 3341609, 3205794, 3133247, 3074097, 3019397, 3075401, 3103416, 3086680, 3032469, 2900497, 2870387, 2844966, 2868150, 2798923, 2709778, 2710907, 2746246, 2784084, 2807883, 2768879, 2757214, 2711464, 2613352, 2679314, 2738914, 2774605, 2809581, 2706749, 2630416, 2637733, 2571959, 2491579, 2447773, 2434583, 2450207, 2382954]
5471B382954J6052j08418K1083N5743p0581l2553n3390L4275L9012K6831m5570
5460B265438o5853l4195N1984j9659l3606J2681k6750r3581L1486K421M8124N2782
5448B191272O0691K2620M0514L5148j5291O2324n6356J4252L3778l0954j82939
5437B175059r7962K9737N1907l6833K8213L3142l2824O5308M7355J28404M851
5426B396357k5628O9820Q3150O8676K0712k6323l4997p4234k4866j2282N129j42066
5414B303448p4789K994k6650n2728K1029n6667q4232N9627p7478k2927N2670m5878
5402A998419j7045n2163N0176l5738j04250J0044K1546m3069j13574o8703K9393
5391A675036M0040n4142L5340N5536l7189o1823N0960J0982K4877K9641k7103
$$ y = [2382954, 2399006, 2290588, 2311671, 2367414, 2296833, 2264280, 2210890, 2245165, 2284177, 2311008, 2265438, 2199585, 2165390, 2217374, 2197715, 2164109, 2176790, 2150040, 2056459, 2087945, 2090366, 2138490, 2191272, 2251963, 2274583, 2315097, 2350245, 2334954, 2397278, 2340922, 2355174, 2388952, 2357998, 2175059, 2077097, 2106834, 2158741, 2121908, 2150121, 2183263, 2150439, 2215747, 2263102, 2391506, 2396357, 2370729, 2440549, 2523699, 2592375, 2613087, 2586764, 2551767, 2477533, 2452667, 2440385, 2445514, 2303448, 2228659, 2231653, 2205003, 2152275, 2173304, 2116637, 2032405, 2092032, 2014554, 1991627, 2044297, 1998419, 1981374, 1929211, 1979387, 1943649, 1839399, 1849443, 1870989, 1827920, 1714346, 1645643, 1675036, 1715076, 1660934, 1696274, 1751810, 1714621, 1652798, 1703758, 1714740, 1739617, 1769258, 1742155]
5380A742155r5205M7152L4881Q6313j6585n3632j6018k6105J0201q1867q227j3620
5368A609443m1446K9148L1116P356p8554q309j309q2852M020J10122P9175n9492
5356A598418k1313P0705m6278m1853N3764r6555j7603r704M4446K7880q2268Q2963
5344A562602l3373o4137j8816q005N4761J12833K236R485M6502j5415j5539r19
5332A632215K1470p1633J936R274j8445k3438O0114K3554k4476p0418O83Q5039
5320A625875p4279k4979M571P6174P0064L1531J3592j3554l3180L6021K5100p1425
5308A665511l2379P6656M6819l6658q3371L6302R1685R4496o918P44J1848P9259
5296A943994M3423k3782M4352Q4487K2486j042J06650m7322j4376P7302J50716
$$ y = [1742155, 1646950, 1694102, 1728983, 1815296, 1798711, 1745079, 1729061, 1702956, 1713157, 1631290, 1623063, 1609443, 1567997, 1597145, 1628261, 1635617, 1557063, 1548754, 1547445, 1464593, 1468613, 1578735, 1657910, 1598418, 1577105, 1647810, 1601532, 1559679, 1613443, 1516888, 1499285, 1489581, 1534027, 1561907, 1479639, 1562602, 1529229, 1465092, 1446276, 1438271, 1493032, 1605865, 1608101, 1617586, 1664088, 1648673, 1633134, 1632215, 1653685, 1582052, 1583988, 1593262, 1574817, 1551379, 1611493, 1635047, 1610571, 1540153, 1540836, 1625875, 1551596, 1526617, 1531188, 1607362, 1677426, 1708957, 1722549, 1708995, 1675815, 1711836, 1736936, 1665511, 1633132, 1709788, 1756607, 1719949, 1636578, 1672880, 1764565, 1859061, 1852143, 1852887, 1864735, 1943994, 1987417, 1963635, 2007987, 2092474, 2114960, 2113918, 2220568, 2173246, 2158870, 2236172, 2386888]
5285B386888K9176N5631R5560k7195J34227L2387L9772J59101J70174J96925J38223
5274C410869R8098J68162J79704K54054M19589M02145N34750N27452N19471L93921
5264F908215M04429K38995N3395q0521k93060n10151l66256l64789m36435k55297
5254E298525k77473k75481j58734j68196j15571p4693j8963j4602j86597r2305
5244C915910K5381m4501j35450m0196P0772o8149j5787q601M3539J5511R5184
5233C853613N322m3552J32942K1971J36425J34773J21770J14431Q5407J99417
5223D762519J21080N6016J46257J06225K06946J64603K19828K15815K82607L63175
5213F645071L68321N16104N15346N75729P44166P05582P45040Q50957Q11745O72027
$$ y = [2386888, 2416064, 2471695, 2567255, 2540060, 2674287, 2706674, 2746446, 2905547, 3075721, 3272646, 3410869, 3508967, 3677129, 3856833, 4110887, 4530476, 4932621, 5467371, 5994823, 6514294, 6908215, 7312644, 7551639, 7605034, 7524513, 7231453, 6721302, 6355046, 5990257, 5553822, 5298525, 5021052, 4745571, 4586837, 4418641, 4303070, 4228377, 4209414, 4194812, 4008215, 3915910, 3941291, 3896790, 3761340, 3721144, 3791916, 3723767, 3707980, 3699379, 3742918, 3758429, 3853613, 3858935, 3815383, 3948325, 3970296, 4106721, 4241494, 4363264, 4477695, 4563102, 4762519, 4883599, 4939615, 5085872, 5192097, 5399043, 5563646, 5783474, 5999289, 6281896, 6645071, 7013392, 7529496, 8044842, 8620571, 9364737, 10070319, 10815359, 11666316, 12478061, 13150088]
5203A3150088N44741M16800L44227K13012N5606J16603K4032J58844K31231M00590
5193A5655774L81530M46987N59966M70193M15138K06063j01316l40673l58242
5184A7335420n82480n94957n67573n35823n03222l83771l58373k01145n04J48572
5174A3756144N6970L62660M18364M52389O70807P48913Q60464R87728J109933
5165A9424372J010836J096192J074106R93132R30237Q85370R45452R91065J003826
5156B8354588J028063J122827J157409Q70147P99631N22280K28232k33185o26392
5147C3223600q07303j123239j332506j436706j454014j298192j133042r92027
5139B3646571q10596n62230m10932k93100q3469K23246M64182P20742R38470J107437
$$ y = [13150088, 13694829, 14111629, 14455856, 14668868, 14724474, 14841077, 14865109, 15023953, 15255184, 15655774, 16037304, 16484291, 17044257, 17514450, 17929588, 18135651, 18034335, 17693662, 17335420, 16752940, 16157983, 15590410, 15054587, 14551365, 14167594, 13809221, 13608076, 13607572, 13756144, 13813114, 14175774, 14594138, 15046527, 15717334, 16466247, 17326711, 18314439, 19424372, 20435208, 21531400, 22605506, 23598638, 24528875, 25414245, 26359697, 27350762, 28354588, 29382651, 30505478, 31662887, 32533034, 33332665, 33854945, 34083177, 33849992, 33223600, 32416297, 31293058, 29960552, 28523846, 27069832, 25771640, 24638598, 23646571, 22835975, 22273745, 21862813, 21569713, 21486244, 21709490, 22173672, 22894414, 23832884, 24940321]
5129B4940321J248466J294594J256299J006449Q30504L01742j13185m30398p64578
5120B9570214r58493j235565j455108j422709j318966j249217j103244j004614
5112A9822298q98171p73368o98952o12162m87382m42852m52247k85100k70104
5103A4901960l08336k97240k13210j88389k07303j81273j48664r0744j22021j2769
5093A3132011l7712n010O4172J09083P6719M6807m6062O374n5081j71316j45138
5082A2974847k37184k51203k11775k53410k47583k09141k95463k50428j70279
5073A0848381k33136j59375m6456j81953j57860n3535r7038j25475r2053q9404
5063I612096j17952p7757M667j11386j57648r4837m8965j15312m7556k9612r4727
$$ y = [24940321, 26188787, 27483381, 28739680, 29746129, 30576633, 30878375, 30765190, 30334792, 29570214, 28611721, 27376156, 25921048, 24498339, 23179373, 21930156, 20826912, 19822298, 18924127, 18150759, 17451807, 16839645, 16352263, 15909411, 15457164, 15172064, 14901960, 14593624, 14296384, 14083174, 13894785, 13687482, 13506209, 13357545, 13266801, 13144780, 13132011, 13094299, 13089289, 13153461, 13262544, 13339263, 13386070, 13340008, 13346382, 13291301, 13119985, 12974847, 12737663, 12486460, 12274685, 12021275, 11773692, 11564551, 11269088, 11018660, 10848381, 10615245, 10455870, 10409414, 10227461, 10069601, 10016066, 9919028, 9793553, 9701500, 9612096, 9494144, 9416387, 9421054, 9309668, 9152020, 9057183, 9008218, 8892906, 8845350, 8815738, 8721011]
5052H721011k8618J607P8672n1723q3054J3509o1094m3406N6526r0460r8362o1115
5040H353493j10431j1310J1743j01458r4540N1174m343N2264P8542L252O5484
5029H293870K6647o7211J0302J7o650N4888k5259o9415r5262M340M0153j12007
5017H054413r4482p2193n0377j49085o3937m8158k2147o6931K004O1901o3824
5006G487184M8584n0310o6407l4733K7137J08885J23814m0060K7111J13317P3149
4995G817671O7601P5993J10160Q4829J89522J20610m4615N9293J2254K4513o5764
4984H452067p3883j7692p9209n9134J7838q10j8282Q1541M1294J28886J45392
4973H618008J19929K5374J28171O7185J36615K33191J30100K30675K01274K07554
$$ y = [8721011, 8692393, 8694000, 8772672, 8720949, 8637895, 8651404, 8590310, 8546904, 8603430, 8512970, 8414608, 8353493, 8243062, 8231752, 8243495, 8142037, 8047497, 8098671, 8094328, 8146592, 8225134, 8228386, 8293870, 8320517, 8253306, 8263608, 8263625, 8256975, 8311863, 8286604, 8217189, 8121927, 8126267, 8166420, 8054413, 7959931, 7887738, 7837361, 7688276, 7624339, 7576181, 7554034, 7487103, 7489107, 7551008, 7487184, 7535768, 7485458, 7419051, 7384318, 7411455, 7520340, 7644154, 7604094, 7631205, 7744522, 7817671, 7885272, 7961265, 8071425, 8156254, 8345776, 8466386, 8421771, 8481064, 8493318, 8517831, 8452067, 8378184, 8360492, 8281283, 8222149, 8239987, 8239177, 8220895, 8302436, 8343730, 8472616, 8618008, 8737937, 8763311, 8891482, 8958667, 9095282, 9328473, 9458573, 9689248, 9890522, 10098076]
4963A0098076J50409K22136K95391K02355J19849K31336K74416K18408K38410
4954A2050786L08622K45448J58255L23381L07119K47487K36530J76259K85554
4945A4339441K08124L07267L42478L60639M01879M96081M02768N19851O85878
4936A8064406Q15001Q32948R14079J062389J175058J195065J356853J575547J594985
4927B8586331J591237J727106J993742K072178K181911K460120K657717K813804
4919D6084146L122020L327634L480888L601090L984905M140526M227215M296023
4911G6264447M232976L805542L347634K595852J837765R23992J77758l49536p16267
4902I2120163p76450p28287p35415o83353p76948j016492j565620k213727k891442
$$ y = [10098076, 10248485, 10470621, 10766012, 10968367, 11088216, 11319552, 11593968, 11812376, 12050786, 12359408, 12604856, 12763111, 13086492, 13393611, 13641098, 13877628, 14053887, 14339441, 14547565, 14854832, 15197310, 15557949, 15959828, 16455909, 16858677, 17378528, 18064406, 18879407, 19712355, 20626434, 21688823, 22863881, 24058946, 25415799, 26991346, 28586331, 30177568, 31904674, 33898416, 35970594, 38152505, 40612625, 43270342, 46084146, 49206166, 52533800, 56014688, 59615778, 63600683, 67741209, 71968424, 76264447, 80497423, 84302965, 87650599, 90246451, 92084216, 93008208, 93185966, 92836430, 92120163, 91343713, 90615426, 89880011, 89196658, 88419710, 87403218, 85837598, 83623871, 80732429]
4893H0732429l438058l808460l972816m106296m009232l791123l753953l508225
4885E0344266l249873k972255k568620k186141j937227j646621j347682j198599
4877C3237248r66617r48931r36036p13683n58054n40264n10331l34141k91244
4868B7437947k4254J63497K55829M38107O65074R02008J265153J515856J839665
4859C4458882K105610K407180K479486K505314K378592K074275J549066R69707
4851E0928112K88616m55402j109465j791879k206097k512290k756634k733118
4843C7651843k562298k505717k319534k022720j858813j642550j379796j201280
4835B2159135j180626j051649q22953q51164o32258o66497o09848n91609m82656
$$ y = [80732429, 77294371, 73485911, 69513095, 65406799, 61397567, 57606444, 53852491, 50344266, 47094393, 44122138, 41553518, 39367377, 37430150, 35783529, 34435847, 33237248, 32270631, 31321700, 30385664, 29671981, 29113927, 28573663, 28063332, 27729191, 27437947, 27413693, 27577190, 27833019, 28271126, 28936200, 29838208, 31103361, 32619217, 34458882, 36564492, 38971672, 41451158, 43956472, 46335064, 48409339, 49958405, 50928112, 51216728, 50761326, 49651861, 47859982, 45653885, 43141595, 40384961, 37651843, 35089545, 32583828, 30264294, 28241574, 26382761, 24740211, 23360415, 22159135, 20978509, 19926860, 19103907, 18252743, 17620485, 16953988, 16344140, 15752531, 15269875]
4826A5269875l68279m44830n13294l18062k94906l68723l63668l53884l54547
4817A1889682l91574k30359k66404k14883j86407k55553l11967j62760j91339
4808I678436j57671q4885j82352j30333J3337j16677o8278m5008p6290p1208N8907
4797H817978P6708m441k3649Q0968R878m0914R899j60151k20959o2761j09936
4786H372620j10068o9542l0525O4562O2209k7769j43925j8501n4217j26313l9472
4775G879059k3642l5060o0758l7882j02200j5131l785J5649N4504J0116l9110
4764G641760k956J07941R6345N1273J14507J40648J11496J35908J22008J71973
4754H690903K24704J36177J52181J07711q237j7121Q5277J54356M3252K710r3058
$$ y = [15269875, 14901596, 14456766, 13943472, 13625410, 13330504, 12961781, 12598113, 12244229, 11889682, 11498108, 11267749, 11001345, 10786462, 10600055, 10344502, 10032535, 9869775, 9678436, 9520765, 9435880, 9253528, 9123195, 9136532, 9019855, 8951577, 8906569, 8830279, 8759071, 8817978, 8894686, 8890245, 8866596, 8947564, 8957442, 8916528, 8926427, 8766276, 8545317, 8482556, 8372620, 8262552, 8193010, 8162485, 8227047, 8289256, 8261487, 8117562, 8099061, 8044844, 7918531, 7879059, 7855417, 7820357, 7759599, 7721717, 7619517, 7604386, 7600601, 7616250, 7670754, 7680870, 7641760, 7638804, 7746745, 7843090, 7894363, 8008870, 8149518, 8261014, 8396922, 8518930, 8690903, 8915607, 9051784, 9203965, 9311676, 9303439, 9286318, 9371595, 9525951, 9569203, 9571913, 9478855]
4743I478855l4224j1418O5715l2337K6792M8116J59212Q5791J08262K43348K76236
4732A0414348L39373L31523K86632M87910M64482N77511O61998P18578Q12134
4723A5094489Q66369J075432J268665J386757J768925J829967K017274K290249
4715B7598127K652543K990210L659346M638414N936387P644979R561432J0401644
4707G5083082J0217308J0110650P990631M490581J174543n467209j1950223j0910144
4699H0739219q490911p068011n856438m850360m156134l460325l001833k758132
4691D1097075k573036k172329j900892j649062j493764j182047j035955r45300
4683B8144690o69141n39027m35422l25513j7880J14193J70589K86624L94439L76322
$$ y = [9478855, 9444631, 9433213, 9498928, 9466591, 9493383, 9541499, 9700711, 9786502, 9894764, 10138112, 10414348, 10753721, 11085244, 11371876, 11859786, 12324268, 12901779, 13563777, 14282355, 15094489, 15960858, 17036290, 18304955, 19691712, 21460637, 23290604, 25307878, 27598127, 30250670, 33240880, 36900226, 41538640, 47475027, 55120006, 64681438, 75083082, 85300390, 95411040, 103401671, 107892252, 109066795, 103599586, 91649363, 80739219, 72248308, 65180297, 59323859, 54473499, 50317365, 46857040, 43855207, 41097075, 38524039, 36351710, 34450818, 32801756, 31307992, 30125945, 29089990, 28144690, 27475549, 26936522, 26501100, 26175587, 26157707, 26271900, 26442489, 26729113, 27123552, 27499874]
4673B7499874N00982L86069M86128O14576P56338R37524R86715J024813J341798
4664C4534817J535008J884609K312648K838475L448937M036095M340249M412293
4656E9343131L994543L151712J810803M5359j569222k665608l232518l032601
4648E7845599k251517j486557r68497l81554O1525N90350R97979J541449K330109
4639E8278886L034069M013572N327380O584052P348084P716749P482078O495129
4631A06279999M431431J710415j500912n267671p379996p320458o467761n459495
4623G9025552m543312l671793k909165k145969j532160q33975j30747L87823P78512
4614F4424766J054603Q63392K70790n14941j590346k554882l360206l583111l254030
$$ y = [27499874, 28000856, 28386925, 28873053, 29487629, 30243967, 31181491, 32168206, 33193019, 34534817, 36069825, 37954434, 40267082, 43105557, 46554494, 50590589, 54930838, 59343131, 63337674, 66489386, 68300189, 68345548, 66776326, 64110718, 60878200, 57845599, 55594082, 54107525, 53139028, 52757474, 52818999, 53409349, 54407328, 55948777, 58278886, 61312955, 65326527, 70653907, 77237959, 84586043, 92302792, 99784870, 106279999, 110711430, 112421845, 110920933, 105653262, 98273266, 90952808, 84485047, 79025552, 74482240, 70810447, 67901282, 65755313, 64223153, 63389178, 63258431, 63646254, 64424766, 65479369, 66342761, 66613551, 66098610, 64508264, 61953382, 58593176, 55010065, 51756035]
4605E1756035k652737k334341j796078j379581j273905j042259j066335r91851
4597C9218948j163705j368857j461428j644002j689495j582759j506850j305622
4589B7496230j119839r88635p96632p31181p73021o18110m48209m00626l49797
4580B1270180k09064j71560k6371j6865O5436K61683L78642M14581O30319O64436
4570B3261417O76184Q47131R12370J040120J145917J146257J186410J164734J228886
4561C2609426J267422J263895J225713R81727P02341K47536m21136j006543j468023
4552C5402358j864227j986179j651378j368355j248436q64996o37315n33791m50633
4543B4797048m40801k15164j32939m1820K2697J00669J61567K72777N03904O46521
$$ y = [51756035, 49103298, 46768957, 44972879, 43593298, 42319393, 41277134, 40210799, 39218948, 38055243, 36686386, 35224958, 33580956, 31891461, 30308702, 28801852, 27496230, 26376391, 25387756, 24591124, 23859943, 23086922, 22468812, 22020603, 21619977, 21270180, 21061116, 20889556, 20863185, 20846320, 20911756, 21173439, 21552081, 21966662, 22596981, 23261417, 23937601, 24784732, 25697102, 26737222, 27883139, 29029396, 30215806, 31380540, 32609426, 33876848, 35140743, 36366456, 37348183, 38050524, 38298060, 37876924, 36870381, 35402358, 33538131, 31551952, 29900574, 28532219, 27283783, 26418787, 25781472, 25247681, 24797048, 24356247, 24141083, 24008144, 23966324, 23989021, 24089690, 24251257, 24524034, 25027938, 25674459]
4533B5674459P48149Q82545J242417J495340J702585K054443K167946K380282
4525C8348166K593992K393287K314132K156964J631366J320508J077960R16448
4517E2752823Q29789P25619O72251P88220R18537J109116J595411K073562K681244
4508F4146572L400823M093935M788336N544333O427122P533066Q724137J0423452
4500A15081776J2492197J4843995J7943318K1256623K3709464K4156304K2755092
4493B52238769J9637329J3546838N441660m254624j6390505k5657032k6271540
4486B18290895k2685554j9462222j6745621j4400909j2464422j0897865r951075
4479A11683227r162705q365365p603137o705522n771258n191766m540304l960285
$$ y = [25674459, 26422608, 27305153, 28547570, 30042910, 31745495, 33799938, 35967884, 38348166, 40942158, 43335445, 45649577, 47806541, 49437907, 50758415, 51836375, 52752823, 53582612, 54308231, 54980482, 55768702, 56687239, 57796355, 59391766, 61465328, 64146572, 67547395, 71641330, 76429666, 81973999, 88401121, 95934187, 104658324, 115081776, 127573973, 142417968, 160361286, 181617909, 205327373, 229483677, 252238769, 271876098, 285422936, 290864596, 286609972, 270219467, 244562435, 218290895, 195605341, 176143119, 159397498, 144996589, 132532167, 121634302, 111683227, 102520522, 94155157, 86552020, 79846498, 74075240, 68883474, 64343170, 60382885]
4471F0382885l460695l097898k794493k450939k102187j818363j643376j386408
4463D1628526j104112r12817q04535o10387l05478o6391K03734M56857O06188
4454C9091585P93479P21554N77828L78057j9216o41601j079832j575314j654845
4445C6591695j435038j116174p02375l52765j57733J77240L88226L20512K37587
4436C3951175R6158l80348r22374j300341j669314j722507j578376j369409j213380
4427B3891284j068407r50204q61050p36407o33193n93018m58657l92242l38623
4418A7859483j16121J6775P7701K88831M17161M85897N32058L64717K35651K10651
4408B0372804j71599m28270o30568o40589m77468l90449j28584J24481O7293J29352
$$ y = [60382885, 56922190, 53824292, 51029799, 48578860, 46476673, 44658310, 43014934, 41628526, 40524414, 39611597, 38807062, 38196675, 37891197, 37824806, 38028540, 38485397, 39091585, 39885064, 40606618, 41184446, 41562503, 41543287, 40901686, 39821854, 38246540, 36591695, 35156657, 34040483, 33338108, 32985343, 32827610, 33004850, 33393076, 33713588, 33951175, 34047333, 33666985, 32744611, 31444270, 29774956, 28052449, 26474073, 25104664, 23891284, 22822877, 21872673, 21011623, 20275216, 19642023, 19049005, 18590348, 18198106, 17859483, 17743362, 17760137, 17837838, 18126669, 18543830, 19029727, 19561785, 19926502, 20162153, 20372804, 20201205, 19772935, 19142367, 18501778, 18024310, 17633861, 17505277, 17629758, 17697051, 17826403]
4398A7826403L25452K73198K59286o763k69728m50290p31112q56782p45273p06393
4388A4917998o53650p11568n12919n46578n90983m60047m88779n43353m40802
4379I969319m71895l19221l00291k49527k67804j87831j78465k55710j41285j91132
4369G406158j65296n4985m4049p7068j13113o2604j07247j23531j21218j23550
4359F413497j89960j14112n0902p4975l4133j58287j27712n7275k9246r3838j14347
4348E368710j17792o9540j75475k5381j05257j45405p7866M165p0984j22349p5331
4337D387495j30004r4275p413q170n2936p517j0579n1437n726K9800M8101r4288
4325D003051m7762K6404n9916n8977n7400p0516L7104j40410j39582o3718j2795
$$ y = [17826403, 18151855, 18425053, 18684339, 18677576, 18407848, 17957558, 17226446, 16369664, 15624391, 14917998, 14264348, 13552780, 13039861, 12493283, 11902300, 11442253, 10953474, 10410121, 9969319, 9497424, 9178203, 8877912, 8628385, 8360581, 8172750, 7994285, 7738575, 7597290, 7406158, 7240862, 7185877, 7141828, 7064760, 6951647, 6889043, 6781796, 6658265, 6537047, 6413497, 6223537, 6109425, 6058523, 5983548, 5949415, 5791128, 5663416, 5606141, 5576895, 5483057, 5368710, 5250918, 5181378, 5005903, 4980522, 4875265, 4729860, 4651994, 4656159, 4585175, 4462826, 4387495, 4257491, 4163216, 4155803, 4147633, 4094697, 4087180, 4076601, 4025164, 4019438, 4049238, 4097339, 4003051, 3955289, 3981693, 3921777, 3862800, 3805400, 3734884, 3771988, 3631578, 3491996, 3428278, 3415483]
4314C415483n5873j15084k6263p408r6121l9437r851l7123m2211N722N6475n3117
4302B995192j6679j09228P3380K0975l5173K1370N0754L5793P536L095r3688N7254
4290C010581K7194N7709N0840J7650M3660m0348k64j2762n7262l0561M4061J913
4278C112411r5377p3097j6239j01390j23856M0801O965m9194j7086P0092j8363
4267B735667k4626r8200l9105q489n4585k581m8706r9507L0076J27309k436k2740
4255B492077k9819J9312k9111R4587K3886K3206k9601Q9447k3012o8767L988L5583
4243B601776O2250O2275j03969P4168N2622J628P7687L9928N1610J14410J18999
4232C153384P4481J18448J87064K31576K22447K21968J80784L66825L47834K86758
$$ y = [3415483, 3359610, 3244526, 3218263, 3210855, 3114734, 3075297, 3065446, 3028323, 2986112, 2991834, 3048309, 2995192, 2978513, 2869285, 2942665, 2963640, 2928467, 2949837, 3000591, 3036384, 3043920, 3047015, 2953327, 3010581, 3037775, 3095484, 3146324, 3163974, 3207634, 3167286, 3167022, 3154260, 3096998, 3066437, 3110498, 3112411, 3017034, 2943937, 2927698, 2826308, 2702452, 2743253, 2750218, 2701024, 2683938, 2754030, 2735667, 2711041, 2612841, 2573736, 2565247, 2510662, 2508081, 2459375, 2359868, 2389944, 2517253, 2514817, 2492077, 2462258, 2481570, 2452459, 2547046, 2570932, 2594138, 2564537, 2653984, 2630972, 2562205, 2566193, 2601776, 2664026, 2726301, 2622332, 2696500, 2749122, 2750750, 2828437, 2868365, 2919975, 3034385, 3153384, 3227865, 3346313, 3533377, 3764953, 3987400, 4209368, 4390152, 4756977, 5104811, 5391569]
4222E391569L57545M10649L35300K50874J67550P6830n1303p1952k50798k47044
4212F369220l06976l48381k47282j99749j45021j62749j04943j50809j4953L8850
4202D727207l0579j9946l7994Q7646J69743J81388K00834K00848K01742L05923
4192E986812L57754M29132N75630N50127N76898N50665O11811P58626O05175O16807
4182A1619437N47706L26549J49149O8708q2223j63907k77793m08681l99538j86106
4172A1193301j19655m0834R1183K17528L24494M80572O25225P54468Q75031J226390
4162A5627703J396489J393308J403573J345091J179457Q74766N35496L23643j29277
4153B3950249n85931p68257r90391j124327j249401j253042j061565q62898o81206
$$ y = [5391569, 5749114, 6159763, 6495063, 6745937, 6913487, 6990317, 6939014, 6867062, 6616264, 6369220, 6062244, 5713863, 5466581, 5266832, 5121811, 4959062, 4854119, 4703310, 4688357, 4727207, 4696628, 4676682, 4638688, 4726334, 4896077, 5077465, 5278299, 5479147, 5680889, 5986812, 6344566, 6773698, 7349328, 7899455, 8476353, 9027018, 9638829, 10397455, 11002630, 11619437, 12167143, 12493692, 12642841, 12711549, 12629326, 12465419, 12187626, 11778945, 11379407, 11193301, 11073646, 11032812, 11123995, 11341523, 11666017, 12146589, 12771814, 13526282, 14401313, 15627703, 17024192, 18417500, 19821073, 21166164, 22345621, 23220387, 23755883, 24079526, 23950249, 23364318, 22596061, 21605670, 20481343, 19231942, 17978900, 16917335, 16054437, 15373231]
4144A5373231n22520l85011k12150K5583K14944K07512K90202L75704M21119M97837
4134A6286451K79324R0074J2170o1131j05120o6061q9938j28911J49245K42648
4124A6608751K89622L75773L19234J74173J48123q2825j11222j37270k50984k84467
4114A7048908m70412m13788l14054l48050l36264l63928l50998l42900k83829
4105A3824685l11678k44727r5937J1081J23554J89255K80249J30772l1494j45616
4095A3730144k61385l31631n27289n39424o65991p41123o94955m52591n25682
4086H990073m64712l09835k51329k27914k11499j71199q0690j5824k7768J0388
4076G239691m6J02419J77149J06442J27934J25187J24070K36078L22091L20936
$$ y = [15373231, 14850711, 14465700, 14253550, 14279133, 14494077, 14701589, 14991791, 15367495, 15788614, 16286451, 16565775, 16655849, 16668019, 16606888, 16501768, 16435707, 16345769, 16216858, 16366103, 16608751, 16898373, 17274146, 17593380, 17767553, 17915676, 17832851, 17721629, 17584359, 17333375, 17048908, 16578496, 16164708, 15850654, 15502604, 15166340, 14802412, 14451414, 14108514, 13824685, 13513007, 13268280, 13172343, 13183424, 13306978, 13496233, 13776482, 13907254, 13875760, 13730144, 13468759, 13137128, 12609839, 12070415, 11404424, 10663301, 9968346, 9515755, 8990073, 8525361, 8215526, 7964197, 7736283, 7524784, 7353585, 7272895, 7257071, 7229303, 7239691, 7239645, 7342064, 7519213, 7625655, 7753589, 7878776, 8002846, 8238924, 8561015, 8881951]
4066H881951K72670K10376J87917O8747l3383j87090l20222l75905l64307n07980
4056G832774o11576n37018m74089l91702l35601l13735l14117k56548k47923j65255
4046D185210k73543k59637j45531q4690j77212k35419p3406n4896j46493j15238
4036B619145n2896q8421r7934L734j6305j14634m7890j17818n9650k4269l5127
4025A967935m0479p5956j10063j22219M4116O1591k9802m8004k7849J0859o6997
4014A563132m3881J9917q5696J368J0916k5723j0302M2319n291o5027Q191k3021
4002A386902n2296k9641r6209J64762l3132m0940n7100N8416j996p2913K3593
3991A249446J1694l8297P5985l9452r2769J2274k0227j0745M3941o0777o1233
$$ y = [8881951, 9154621, 9364997, 9552914, 9621661, 9588278, 9401188, 9080966, 8705061, 8340754, 7832774, 7221198, 6684180, 6210091, 5818389, 5482788, 5169053, 4854936, 4598388, 4350465, 4185210, 3911667, 3652030, 3506499, 3421809, 3244597, 3009178, 2935772, 2880876, 2734383, 2619145, 2566249, 2477828, 2379894, 2383628, 2367323, 2252689, 2204799, 2086981, 2027331, 2003062, 1967935, 1927456, 1851500, 1741437, 1619218, 1663334, 1724925, 1695123, 1647119, 1619270, 1630129, 1563132, 1519251, 1539168, 1453472, 1454840, 1465756, 1440033, 1429731, 1472050, 1466759, 1401732, 1409923, 1386902, 1334606, 1304965, 1208756, 1373518, 1340386, 1299446, 1242346, 1300762, 1298766, 1225853, 1249446, 1261140, 1222843, 1298828, 1259376, 1166607, 1178881, 1158654, 1147909, 1191850, 1131073, 1069840]
3980A069840o681J6272k038L6472m1828q9482K3691p790p1322o9758N6610O4301
3968I78287J5924N1294k8299j5804P4142r5607p5068m9188M2599L2122l415J6950
3956I43937l6214J7824m6004n8902K1892K9278k6454R940l1162J2573R9052j1062
3944I24698r4274J7866O0242l0484o041o4570K7351O5219J3593j3580q4405n274
3932H10341K5494r443k1704n8990N9495M5774q2340j34072M7905k9314Q3698l3943
3920G02901L1043m2124L5077L5107M1367l3396K5428j6454n1074k1842O2615K5182
3908G93830m6301M915J8806n92m9751O3778j2607l1037M4543J545K9992j5316
3896H01805K29O0935m4541q7704M4493j5405m3116m4051p048L2876K8161m3187
$$ y = [1069840, 1063159, 1079431, 1077393, 1113865, 1072037, 982555, 1006246, 998456, 927134, 857376, 913986, 978287, 994211, 1045505, 1017206, 1001402, 1075544, 979937, 904869, 855681, 898280, 930402, 926987, 943937, 907723, 925547, 879543, 820641, 842533, 871811, 845357, 855297, 824135, 836708, 935760, 924698, 830424, 848290, 908532, 878048, 872007, 807437, 834788, 900007, 913600, 900020, 815615, 810341, 835835, 826392, 804688, 745698, 805193, 850967, 768627, 634555, 682460, 653146, 736844, 702901, 733944, 691820, 726897, 762004, 803371, 769975, 795403, 778949, 727875, 706033, 768648, 793830, 747529, 752444, 771250, 770658, 720907, 784685, 772078, 741041, 785584, 787129, 817121, 801805, 802034, 862969, 818428, 730724, 775217, 759812, 716696, 672645, 665597, 698473, 726634, 683447]
3884F83447p0496J1378N9128O9537p6570j4205J2975l6518J4019K3508Q3333q475
3872G51061j2079O225m6537j6772Q8238J07374n028n8698q7611Q9824p5207j6702
3860G24088k0268M5765k5791O497M7835N1392m2535j8383n027L9961q583k5057
3848G69894L03j2303K8213o7565o3445L9713N7324j2839l0741n3238Q552r182
3836F54686K7085l5393L1325P5607n6657q50j6442O7425P0418k0528o0962o1753
3824F73961Q984L9967j1865m9613j3796O4006L8342j7342j15288M1403K5629J13494
3812G97882m2631N8172j00909r070J4991j24669J528k2035R594R03K65m0480M669
3799E48210p756l9236o2788J30928P2586k9059N91K5022L3856j3599K9027m9569
$$ y = [683447, 612951, 624329, 683457, 752994, 676424, 662219, 675194, 638676, 652695, 676203, 759536, 751061, 738982, 745207, 698670, 681898, 770136, 877510, 872482, 813784, 726173, 815997, 740790, 724088, 703820, 749585, 723794, 730291, 778126, 829518, 786983, 768600, 763573, 803534, 794951, 769894, 770197, 757894, 786107, 718542, 655097, 694810, 752134, 739295, 708554, 655316, 663868, 654686, 681771, 646378, 677703, 753310, 696653, 695803, 679361, 746786, 817204, 796676, 735714, 673961, 682945, 722912, 711047, 661434, 647638, 711644, 749986, 732644, 617356, 658759, 684388, 797882, 755251, 813423, 712514, 703444, 718435, 593766, 595294, 573259, 582853, 583756, 584021, 543541, 548210, 540454, 501218, 438430, 569358, 641944, 612885, 613476, 638498, 672354, 658755, 687782, 638213]
3787F38213j03693J28346m7909n7847N061J6720P5183L2163j9022j9490k5136
3776F22589n4183J8939J17436l4928p1918L9902L0964l8543N4909j42087P5118
3765F18198M4102j1486l4192J2052L2317j9962j754q3363k222M7521N2313n8627
3753E94897m7043M5036O059n7394M9822J4098m0411m6856j08203J02145Q1041
3742E93191j1709M4903j16944K0426K6899m4593m9689K2179Q0333o1922l6821
3731D66253K1356K5406J0410p8994M5843o1308m4557N1558K9163o9923M3099Q0328
3719E18634N5688J6515o7253o8964p9584k2273m297P1947J2748O8969n441j17754
3707C78935p441k6288O948R791O0638m7671j00726p51J9550J07121j30n9655l7287
$$ y = [638213, 534520, 662866, 614957, 557110, 562171, 578891, 654074, 686237, 667215, 647725, 622589, 568406, 587345, 704781, 669853, 597935, 637837, 668801, 630258, 685167, 543080, 618198, 662300, 650814, 616622, 628674, 660991, 641029, 639275, 555912, 553690, 601211, 653524, 594897, 547854, 592890, 598949, 541555, 591377, 605475, 565064, 518208, 410005, 512150, 593191, 581482, 626385, 509441, 529867, 556766, 512173, 462484, 484663, 564996, 503074, 466253, 487609, 513015, 523425, 444431, 490274, 428966, 384409, 435967, 465130, 395207, 438306, 518634, 574322, 590837, 523584, 454620, 375036, 352763, 348466, 420413, 433161, 502130, 496689, 378935, 371494, 345206, 352154, 361945, 422583, 374912, 274186, 273435, 292985, 400106, 399976, 340321, 303034]
3694C03034Q2026k0420p701M0693N4724l4340n7299L6198k7815l4842k6654J8122
3682C25726M9955O712J3477J2828J1864n4947j1906J3824P898p9210l239n632
3670B87350J816J4054J907j5853m6518K7541n7387N0430J7691L3852n915k80L961
3657C12649j8854o2541P1125N0951n5957N7194j7293L9652n7459p4576n0189N5959
3645B50661J01541m7843q9212L5460J6378k841K0775o508q734K4154M7740j07171
3633B34400N5047N8593L2132n9645j7848M0686m0039L1215M812p5909j12579M1405
3621A92270P2670L9129q510L1479K4652r20J843j1282O0601N5018j36796l0418
3609B89736J7199k0327J02881k914L6349p8259L496O2807l0611j6096p169o6568
$$ y = [303034, 385060, 364640, 356939, 397632, 452356, 418016, 360717, 396915, 369100, 334258, 307604, 325726, 375681, 382393, 395870, 408698, 420562, 365615, 353709, 367533, 375431, 296221, 292982, 287350, 289166, 303220, 305127, 289274, 242756, 270297, 212910, 263340, 281031, 314883, 308968, 308688, 312649, 293795, 231254, 302379, 353330, 297373, 354567, 337274, 376926, 319467, 244891, 194702, 250661, 352202, 304359, 215147, 250607, 266985, 264144, 284919, 278411, 269677, 293831, 341571, 234400, 289447, 348040, 380172, 320527, 302679, 343365, 303326, 334541, 339353, 263444, 150865, 192270, 264940, 304069, 295559, 327038, 351690, 350770, 352613, 341331, 401932, 456950, 320154, 289736, 306935, 286608, 389489, 386575, 422924, 344665, 348161, 410968, 380357, 364261, 357092, 290524]
3597B90524l893R3694j0564K007O9930p0988J5285N7990l0222j53629P6662k1966
3585C14830j4309P0332o9658J02671J1505N0243M848k9109o0678N5355K2363n5385
3573D03008K6542j4756N6681J7860j6223q223l1115k1799K2865K1186J0641M4616
3561E11283P264o6251n6407k969N6145j5256M3131J5268j5365J6144M3240N2368
3549E88595N152l2166K794Q253k9991q0248L5282K0498p2937R1031o459j6868
3537E12936L0228N239o6981L1818l6618M0698O7223M5607k3693m682k683m2311
3525E56781m3350O7325K3175j00321K3735L9362P2739M1502m6105q7670j9795
3514E27378L0184M5749k6620L1143N4974m6507R0583K3787K8085J14598n795o5442
$$ y = [290524, 286631, 380325, 369761, 371768, 441698, 370710, 385995, 443985, 413763, 260134, 336796, 314830, 300521, 370853, 301195, 403866, 415371, 465614, 470462, 441353, 380675, 436030, 458393, 403008, 429550, 414794, 471475, 489335, 473112, 464889, 433774, 411975, 434840, 456026, 466667, 511283, 518547, 452296, 395889, 392920, 449065, 433809, 476940, 492208, 476843, 492987, 536227, 588595, 593747, 561581, 564375, 572628, 542637, 462389, 497671, 518169, 445232, 536263, 529804, 512936, 543164, 548403, 481422, 513240, 476622, 517320, 584543, 630150, 606457, 601775, 599092, 556781, 513431, 580756, 603931, 503610, 527345, 566707, 639446, 680948, 634843, 547173, 527378, 557562, 603311, 576691, 607834, 662808, 616301, 706884, 730671, 758756, 873354, 867559, 802117]
3502H02117o3466O9476N9093L1831l2350l2518Q769O1559N8071K9334j17745j503
3490H72668P3254J85433j2244j03915Q2593J2821K3492L8284P4445J0954P4915
3479A332700j3732L1605N8634P6410M4986n579J14715J01219R9785R7331J44249
3468B082323J51212J32091K03304J80826K84672J96273J22913J08080J12428m5651
3458C528471r2613j11213M7832J5217o68L3217r7350q7911n1435L7173j9313o2592
3446C138815o0296j46932j02024P3718l9863l5263k578Q4237O9316M3572J38456
3435C161158J88537K19291J59884K11121J45567L0058j27895k06692k70713k73942
3425C236374j89383j91463j27282j90377k29931q5351O0871q7311n7842j03420
$$ y = [802117, 738651, 808127, 867220, 899051, 866701, 834183, 842952, 904511, 962582, 991916, 874171, 872668, 945922, 1131355, 1119111, 1015196, 1097789, 1110610, 1134102, 1172386, 1246831, 1257785, 1332700, 1318968, 1350573, 1409207, 1485617, 1530603, 1525024, 1639739, 1740958, 1840743, 1938074, 2082323, 2233535, 2365626, 2568930, 2749756, 3034428, 3230701, 3353614, 3461694, 3574122, 3528471, 3435858, 3324645, 3372477, 3387694, 3387026, 3420243, 3322893, 3234982, 3183547, 3220720, 3201407, 3138815, 3078519, 2931587, 2829563, 2903281, 2863418, 2828155, 2825577, 2909814, 2979130, 3022702, 3161158, 3349695, 3568986, 3728870, 3939991, 4085558, 4115616, 3987721, 3781029, 3510316, 3236374, 3046991, 2855528, 2728246, 2537869, 2307938, 2222587, 2283458, 2196147, 2138305, 2034885]
3415B034885j71456j6211m6230o7928J7814M8808l7040n424q1727q976J04909
3404A771424L0970J07824J45149J30232K6121O5191o5271N7523o3561k25661k15273
3393A764668j5442o5771k26827q6006p7151j7979k6086k5031j20430n9049J330
3382A046226K7069j28182K9201R015j61050p3324K3315m8265j1751k4957k57Q790
3370F95830j3245Q1408j481j31134k6611k6604o207L7916o2160J06262k730j109
3358F50135O241J798o0595p1107K852P795o6828L8863k3549J0367j0553J7372
3346E02791o8775p6J6769N9473K4740p6794k1963J8859L6636M5530p16n0183j0257
3333D76034n9624q158k6695O7159m888m416m9362M2706l080q5127j4580L5262
$$ y = [2034885, 1863429, 1847218, 1800988, 1733060, 1750874, 1799682, 1762642, 1757218, 1675491, 1666515, 1771424, 1802394, 1910218, 2055367, 2185599, 2211720, 2276911, 2211640, 2269163, 2205602, 1979941, 1764668, 1749226, 1683455, 1456628, 1370622, 1293471, 1275492, 1249406, 1224375, 1103945, 1044896, 1046226, 1073295, 945113, 974314, 983329, 822279, 748955, 772270, 724005, 712254, 687297, 687040, 695830, 682585, 763993, 762512, 631378, 604767, 578163, 571956, 609872, 547712, 653974, 651244, 650135, 656376, 658174, 597579, 526472, 529324, 537119, 470291, 509154, 485605, 495972, 485419, 502791, 434016, 433940, 450709, 510182, 534922, 458128, 436165, 455024, 491660, 537190, 536474, 486291, 476034, 416410, 408252, 381557, 448716, 443828, 439412, 390050, 432756, 429676, 344549, 329969, 365231]
3321C65231Q537J2296l73N6060j7169l1499l785m9166k1328M1216k4148J1330
3309C47202K7720N0997L340o9889k8245L7479Q0163j29958L0141M819m5285k0734
3297B87750R60p912k4896k0431m444N3650J7367k0194j2958J6878j2880N2103
3285C24993j742k1266l3976L2925M5592o9623o2049k6034R1329P7481k6898N839
3273C36571p2761k7404J0399n076K2118m1269l164O6710K6692N309m1933K064
3261B78256l5973J3137k792m9240k8057M768K6458j8846j4208L5605P3337L248
3249B85693k0282R999r7616m0948K1500L3953N699m9730J4358J23907k400p1956
3237B12177J3279l7508M4835l7357o3974J08615K5142j04867j0030P1612J698
$$ y = [365231, 373768, 386064, 385691, 441751, 424582, 393083, 389298, 340132, 318804, 360020, 335872, 347202, 374922, 425919, 429259, 359370, 331125, 368604, 448767, 318809, 348950, 353769, 308484, 287750, 288710, 280798, 255902, 235471, 231027, 284677, 302044, 281850, 268892, 285770, 272890, 324993, 323251, 301985, 268009, 300934, 346526, 276903, 214854, 188820, 280149, 357630, 330732, 336571, 263810, 236406, 246805, 241729, 263847, 222578, 219414, 286124, 312816, 318125, 276192, 278256, 242283, 255420, 252628, 203388, 175331, 180099, 206557, 187711, 173503, 209108, 282445, 285693, 265411, 275410, 177794, 136846, 158346, 192299, 197998, 148268, 162626, 286533, 284133, 212177, 225456, 187948, 232783, 195426, 131452, 240067, 265209, 160342, 150312, 221924, 223622]
3226B23622m751o0063J9476p0295J5378O7041L3054M5095k9651j2153o9586p543
3214A49624J5194J1202j7175K2546j6596J3423n3034P3936N8804j18680k1548
3203A17696M7466L3996j04228p274J28974j3816M6405M6684l9604r1903l3667
3192A30729m2298M6072L2972R3335L6483J0385j62417l6114O2601Q3513k94k0633
3180B34334J11395k5605k8553r0060l8895O1745N4943l7379j2429J5485Q6991
3169C31972m0951n1165K1651m0568K3936K9895l0153k2311K4971P118q9835M0767
3157B05327Q3356k7884o1656N8377M9267o0061N971J7752L9010L0891j6438P9595
3145D03507k726l3980l9901J2391L7869k9885L1558n1751L828Q3579n0686Q6992
$$ y = [223622, 218871, 158808, 178284, 107989, 123367, 190408, 223462, 268557, 238906, 226753, 157167, 149624, 164818, 176020, 158845, 181391, 164795, 178218, 125184, 199120, 257924, 139244, 117696, 165162, 199158, 94930, 87656, 216630, 202814, 249219, 295903, 256299, 164396, 130729, 88431, 134503, 167475, 260810, 297293, 307678, 145261, 109147, 171748, 255261, 254967, 234334, 345729, 320124, 291571, 201511, 162616, 224361, 279304, 241925, 229496, 244981, 331972, 291021, 239856, 261507, 220939, 244875, 274770, 244617, 222306, 247277, 254395, 164560, 205327, 288683, 260799, 199143, 257520, 306787, 246726, 252697, 270449, 309459, 340350, 323912, 403507, 400781, 366801, 326900, 339291, 377160, 347275, 378833, 327082, 330910, 414489, 363803, 450795]
3133D50795N8645J6364K7357m8996J0993K2457o6079J7597J1416Q1972K2716M3560
3121F48797K690l2039j2046K6525N0534l8685N4954J06821N2672p25k7120m8611
3109G83767j8685l7655O0094q1128l8045m753K2716O6484j1744m9803m4087j1301
3097F35860J24117L6923l5308Q3156J1143n3060r334k9857L0181R4891L6800j13170
3085H12342P5274M083j7644M7212r3009l9631K7497K565j49597L6035K3269j6314
3073G12082L3710j18974n0938O609O6978k6945o9131L2477Q1597O3837l6594k3895
3061F70813m9390j8232k4840j4030k4020K2555n5867k3323m0690n3382j02889
3050B86705J7112J15109k0129m7454j1410n156n5847k5135K0074K2028L8311J0833
$$ y = [450795, 509440, 525804, 553161, 504165, 515158, 537615, 471536, 489133, 500549, 582521, 605237, 648797, 651487, 619448, 607402, 633927, 684461, 645776, 700730, 807551, 860223, 859498, 832378, 783767, 765082, 727427, 787521, 706393, 668348, 663595, 686311, 752795, 741051, 691248, 647161, 635860, 759977, 796900, 761592, 844748, 855891, 802831, 793497, 763640, 793821, 888712, 925512, 812342, 887616, 891699, 874055, 921267, 828258, 788627, 816124, 818689, 669092, 705127, 728396, 712082, 745792, 626818, 575880, 582489, 649467, 622522, 553391, 585868, 667465, 731302, 694708, 670813, 621423, 603191, 578351, 564321, 540301, 562856, 506989, 483666, 442976, 389594, 286705, 303817, 418926, 398797, 351343, 339933, 334777, 278930, 253795, 273869, 295897, 334208, 345041]
3038C45041n3876N7076j4265J8646r2581K034J18758m7681n6604r1041l7714Q4735
3026B32528N3087M890l1150l4093k7665N0943m2179k9287R3632j5563j4857m7207
3014A93079k2431n4803k243j01174M0856R8757K3914l6551o9853M5762M5345j20116
3002D0542J0413J10832l750r952p3213j7645l0614m0091n5323M6016N7287O0249
2990I4751L2962m6812P0234K5177k4636J4252m4023k1211p6612L2060J9027K8689
2978A03858l7611o1557L2406L522K9150M5209j2360Q406L0077j38339O884n7365
2966d7720j0149O1753k189o15R98L5839K0449k4835R3716P6294j54953N306Q908
2953F2802J6011j4124k2441j0235j6448K2741k2845j7386N787R748q8572K8881
$$ y = [345041, 291165, 348241, 333976, 352622, 260041, 262075, 380833, 333152, 276548, 185507, 147793, 232528, 285615, 290505, 259355, 225262, 197597, 248540, 206361, 177074, 270706, 255143, 240286, 193079, 170648, 115845, 113602, 12428, 53284, 152041, 175955, 139404, 69551, 115313, 160658, 40542, 50955, 161787, 158037, 148085, 74872, 57227, 26613, -13478, -68801, -22785, 34502, 94751, 127713, 80901, 151135, 176312, 151676, 165928, 121905, 100694, 24082, 56142, 75169, 103858, 66247, 4690, 37096, 40618, 69768, 114977, 102617, 111023, 141100, 2761, 9645, -47720, -57869, 3884, 1695, 1080, 2078, 37917, 58366, 33531, 127247, 203541, 48588, 53894, 62802, 78813, 64689, 42248, 32013, 15565, 38306, 15461, -1925, 3862, 13610, -74962, -46081]
2941d6081m716M894k3133M7529k9581J2327N5111J09866q114p1193j9134l7752
2929i977J3363J5732m3796N8759J18488l3946o0430j1719j9126m7910N8930K3611
2917F1979N3604M7989K5999k0993K411r3514j17888l4609M0591O1709L9630k2596
2905D4312r599q033J1063J467j0299n6088P391n8243N0656j8937k6083K8456r46
2892d4883R2480L1579m2566o3806l3223J09041K5220j6330K7462M7557J1196o8757
2880G4970K5607n02m6461N6867r4551k2500O869J4598l9429n3732Q7792K9393
2868C8921l6652l8320O490M0624K8508j1119j6160o744J11225j10364q288O5071
2856F3192n1576P3167L410k1960o625m7718K132j3782N2445n584o2057J3942j0475
$$ y = [-46081, -50797, -45903, -69036, -21507, -51088, -38761, 16350, 126216, 118102, 46909, 27775, -9977, 3386, 19118, -24678, 34081, 152569, 118623, 58193, 46474, 27348, -20562, 38368, 61979, 115583, 163572, 189571, 168578, 170989, 77475, -40413, -75022, -34431, 27278, 66908, 44312, 34713, 26680, 37743, 39210, 28911, -27177, -19786, -78029, -27373, -46310, -72393, -43937, -44883, 47597, 79176, 36610, -27196, -60419, 48622, 73842, 57512, 84974, 132531, 143727, 74970, 100577, 100075, 53614, 110481, 15930, -6570, 299, 14897, -24532, -78264, 9528, 38921, 2269, -36051, -29561, 11063, 39571, 28452, 12292, 5548, 116773, 6409, -1879, 63192, 11616, 84783, 88193, 66233, 59608, 11890, 14022, 240, 52685, 47101, -14956, -1014, -11489]
2843a1489N3688m756q7686j06835L8997P1121M9708R2847m5029o3038K5376J02654
2831A15558l2892o298j00256J1473K0995m8657L205M9136J5503m1991j3334K6517
2819a041l5694m7651o486O4038J2246k7923J12584K6709k4963l3454O3124K3761
2807A25250r8305p048o8328K1311l7713J1790J51517J5277o527o2618k371k9347
2795A2888o3005R0886k3242j9057O8146p6321r540J13533j0980k5656r5974l5932
2783g4254N2284P8535L0979m5584l8931m2804N8785L0467o9174p4104N5988L4040
2771c773k9787r508P1042J4633J2277L709j1482m1904k3046J5000j0745N4926
2759D1342j3115l8351l0429j9151k0156O4032O8448o9352J7609l0483M471Q9497
$$ y = [-11489, 42199, 37443, -50243, -157078, -118081, -46960, 2748, 95595, 50566, -12472, 12904, 115558, 82666, 76368, -23888, -12415, 8580, -40077, -36872, 12264, 27767, -14224, -27558, -1041, -36735, -84386, -90872, -26834, -14588, -42511, 70073, 96782, 71819, 38365, 101489, 125250, 26945, 19897, -48431, -27120, -64833, -53043, 98474, 113751, 107224, 44606, 42235, 12888, -50117, 40769, 17527, -1530, 66616, -9705, -19245, 94288, 83308, 57652, -38322, -74254, -21970, 56565, 87544, 41960, 3029, -39775, 19010, 49477, -19697, -93801, -37813, -3773, -33560, -43068, 27974, 42607, 54884, 58593, 47111, 5207, -17839, -2839, -13584, 41342, 28227, -10124, -40553, -59704, -79860, -15828, 52620, -16732, 877, -29606, -25135, 64362]
2747F4362l5603l4459p6705J1461R1843q9315m5853M8396N0867Q2541o2906k5626
2735b0997K0917l0819L7892j1082k421K6017q5430k604P7042M7208O6709m9089
2723G3343p5375l0230R146J259k6840R6932p200r2109l460L3251O7001K4467p673
2710F2512q283k2920L7893l6442l6247K326K3645o0780p126L0634j1463J4986
2698a1265M6219n7410m3300j3538K5534M7512j7047p78m9884K7618L7988K0179
2686A1828j19470O1023K4837R0089j14709K3741L0409M800l7650J6534J236P4929
2674F7597L1372j58105j9417O339M3058N710L2779J7466J29966m3524L853q0754
2662C6340j05097K1287l6021m283O2051m1996M8281n317r617J5771M9176J1373
$$ y = [64362, 28759, -5700, -82405, -70944, 20899, -68416, -114269, -65873, -15006, 67535, 4629, -20997, -80, -30899, 6993, -4089, -6510, 19507, -65923, -68527, 8515, 55723, 122432, 73343, -2032, -32262, -23116, -21857, -48697, 48235, 41035, -51074, -54534, -21283, 45718, 70185, 62512, 54229, 31309, 69202, 32760, -3487, -1161, 22484, -38296, -45422, -14788, -26251, -11265, 34954, -22456, -65756, -79294, -53760, -6248, -23295, -24073, -73957, -46339, -8351, 11828, -107642, -46619, -21782, 68307, -46402, -22661, 7748, 12548, -25102, -8568, -7332, 67597, 98969, -59136, -78553, -72214, -29156, -23446, 9333, 26799, 156765, 113241, 117094, 36340, -68757, -47470, -83491, -87774, -25723, -67719, -19438, -24755, -34372, -18601, 30575, 41948]
2650D1948o8551L2003j3840J3203m3632j47375p362J16629l9036M8157M4982L1688
2638H814o5077M226l5347K3242O5030M2957L9982j0386k0196O307r6014J8739
2626a7723L7250l5360L7781M3041o746j0534k3658J405o7493j7621R335m2923
2614i3246K3991J2208N3954m6594n823K9692j6465n371J09465M964j5976n1944
2602a145J6143K8323m0970k9057P7157n0257K5330l9535J1118J7197R135J2182
2590C5621m6763K6994P0669j6029o555l2006N646k1463J4599J1615J2805M0163
2578I5296P518l2819P5691p4772O2656M0282J8637o0472j01383j6514j5604j6377
2566a7861m0912P7888M431M0848P5720j02703n434l6171l1956M0099J1599L0219
$$ y = [41948, -26603, 5400, -8440, 4763, -38869, -186244, -193606, -76977, -116013, -67856, -22874, 8814, -56263, -52037, -87384, -64142, 888, 43845, 83827, 73441, 53245, 59552, -36462, -17723, 19527, -15833, 21948, 64989, 58243, 47709, 24051, 25456, -42037, -59658, -50323, -93246, -69255, -57047, -3093, -49687, -55510, -25818, -42283, -47654, 61811, 66775, 50799, -1145, 14998, 43321, 2351, -26706, 50451, 194, 25524, -14011, -2893, 14304, 23439, 35621, -11142, 15852, 86521, 70492, 63937, 31931, 37577, 16114, 30713, 42328, 55133, 95296, 102814, 69995, 145686, 70914, 133570, 173852, 192489, 132017, 30634, 14120, -1484, -17861, -58773, 19115, 23546, 64394, 140114, 37411, 31977, -4194, -36150, 3949, 15548, 45767]
2554D5767K5299M008o9652k7711J3022N7048l7389J0766J2093m8783m0503Q7192
2542C1157q80L8544j1608p6081N1653L6962p6411P290K6960M3601p8761l5509
2530d3083J5677R756J07023n3199k2731K697n5370K2983J0178k2664P3449M4645
2518H9361o7740j5897m5770J006M0495K4532o5934K0963L9939k510m4476K697
2506b3334L4699J12308o0845j04081P405n862j5734N6874N1465R837k0632K180
2494D4280o0271N055n1630O4490K1178M0663R2406p9850n8518k8218k9835q68
2482d1118K5712l2174O3613N2299j3192O5283m0891m5392L2265L5397l066l7084
2470F1652l1546Q782m7114K1036n634J1645j67j2337m737j9727L0466L595O3984
$$ y = [45767, 71066, 75074, 5422, -22289, -9267, 47781, 10392, 21158, 33251, -15532, -56035, 31157, 30277, 68821, 57213, -18868, 32785, 69747, -6664, 626, 27586, 71187, -7574, -43083, -27406, -17650, 89373, 36174, 13443, 16140, -39230, -16247, -6069, -28733, 44716, 89361, 21621, 5724, -40046, -39040, 1455, 25987, -39947, -18984, 20955, 18445, -26031, -23334, 11365, 123673, 62828, -41253, -33848, -39710, -55444, 1430, 52895, 62732, 42100, 44280, -15991, -10936, -62566, 1924, 23102, 63765, 156171, 76321, 17803, -10415, -40250, -41118, -15406, -47580, 16033, 68332, 55140, 120423, 79532, 34140, 66405, 101802, 98736, 61652, 30106, 38888, -8226, 12810, 7176, 18821, 18654, 6317, 1580, -18147, 12319, 15914, 79898]
2457G9898m1969m0090K2549J6922k3769o6141M7060K7050r123R6757J1391r4896
2445B5639m2209R091M1933N6820o9885M031l6771J0051Q0527J450K6715r665l270
2432I4457L5661l8643L5703o0282k2204o544N1895M5764m1132O840L6644p8161
2420E9998k051m9704r68n491J6812J9934J4177J4009n5075l6389k897l1191P3372
2407A4536n3793j7296N1645p0502J16124o1N3826j1673m9545P2963k2525M2099
2395A25798O2716K4703j01084K6347J09806J854p6160k6766O197j9250m6639J5196
2383A02718N1430P8385k1434J11996P128r5039p6387L4730j5482Q401N766r65
2371A91247K3094l6138J07643k0278o4079L5171k6120M3114L96k6587O9851J4119
$$ y = [79898, 37929, -2161, 20388, 37310, 13541, -52600, -5540, 21510, 12387, 109144, 120535, 25639, -16570, -7479, 34454, 91274, 21389, 25420, -11351, -1300, 79227, 80677, 107392, 97727, 94457, 130118, 91475, 127178, 66896, 44692, 38148, 90043, 135807, 94675, 101515, 138159, 59998, 57947, 8243, 7275, 1784, 18596, 38530, 52707, 66716, 11641, -24748, -27645, -58836, 14536, -39257, -56553, -4908, -75410, 40714, 40653, 94479, 82806, 33261, 106224, 83699, 125798, 188514, 213217, 112133, 138480, 248286, 250140, 173980, 147214, 153411, 134161, 87522, 102718, 154148, 232533, 211099, 323095, 330223, 235184, 158797, 193527, 178045, 186446, 192212, 191247, 214341, 178203, 285846, 265568, 201489, 236660, 210540, 253654, 254050, 227463, 297314, 311433]
2359C11433R0700M3220j84m4056P1638K1030l6626M7823Q2195l2389N8914P760
2347F21458m662k4185L7428O1304P4818k4873J11272J33717M9452Q4062N0545
2336A170336J46493J57821R5698J85623J83395K98669L13512K15006K10741L40841
2326C318135M94232L49839L48693M28505M76830O98564Q56820J124185J502917
2317I598720J847031J928384J951078J957623J319736N65576R4287j768635k698449
2308A4795351j859302j499154j264750r69136q98828p85786o30058o28079m62518
2299E797740n22208m93297l59375k83024l11037l63899k30626j76150j65239k87623
2289B605262k22866j67595l1706j27733j29151o8969n6041m6988j13166j35802
$$ y = [311433, 402133, 445353, 445169, 401113, 472751, 493781, 457155, 504978, 587173, 554784, 613698, 621458, 616796, 592611, 630039, 691343, 766161, 741288, 852560, 986277, 1035729, 1119791, 1170336, 1316829, 1474650, 1570348, 1755971, 1939366, 2238035, 2551547, 2766553, 2977294, 3318135, 3812367, 4162206, 4510899, 4939404, 5416234, 6114798, 6971618, 8095803, 9598720, 11445751, 13374135, 15325213, 17282836, 18602572, 19168148, 19262435, 17493800, 14795351, 12936049, 11436895, 10172145, 9203009, 8304181, 7518395, 6888337, 6260258, 5797740, 5275532, 4782235, 4422860, 4139836, 3828799, 3464900, 3234274, 3058124, 2892885, 2605262, 2382396, 2214801, 2183095, 2055362, 1926211, 1857242, 1801201, 1754213, 1641047, 1505245]
2279A505245o1558k5394q1054p5432l3004n7330j39841o637m9757m4929m0516
2268H89793k8921n0704n3478L390M438p4951q1933j8221j6214J0138M9079j08228
2256E24188J5478j137l5191k1659p2222j2582L4087L4265j0262j30350O368M0692
2244C71675L8749q2471l6036M6935P3212J4325l3406p0407R255L7987j7846k7692
2232C24280j4602K6938m70o3199j9239M0617p1066o973L4818N306p4783Q553Q6665
2219B76845m6361l3459l6766k2943j3227Q5878R9299j08840n1176L207P6702Q183
2207B37342N85k2934o9940J357M3418j5393q0724j8960L5008L7495k7972O4754
2195A84036n5332k6408R6218L3546o0993l0308L646j6063P8503r0345K3809k9021
$$ y = [1505245, 1443687, 1418293, 1337239, 1261807, 1228803, 1171473, 1031632, 1024995, 975238, 930309, 889793, 860872, 810168, 756690, 760080, 764518, 689567, 607634, 589413, 573199, 583337, 632416, 524188, 539666, 538529, 503338, 481679, 409457, 396875, 430962, 465227, 454965, 324615, 330983, 371675, 410424, 327953, 291917, 338852, 412064, 426389, 392983, 322576, 331831, 369818, 351972, 324280, 309678, 336616, 336146, 272947, 253708, 294325, 223259, 216286, 251104, 256410, 181627, 190180, 276845, 230484, 197025, 160259, 137316, 124089, 209967, 309266, 200426, 149250, 152457, 229159, 237342, 237927, 214993, 145053, 146410, 189828, 174435, 93711, 74751, 109759, 147254, 119282, 184036, 128704, 102296, 198514, 232060, 171067, 140759, 144405, 128342, 206845, 116500, 140309, 111288]
2183A11288n9840M4495m6220p094l2791J1373J3329N1933M687J7429j22260J8421
2171D750P4350J3791R307p881N3146j01852P0162K9410k9026j268p4564j9269
2159B1056L8081l5849M9336k8926R488L672n1470P0859J8697r8081P500N5486
2147E9849q9889J2337j992m9420O0535P1476n8489j8895n899L2758N2873N6441
2135A21685j22001l0826J05590j00195L7956J8224l87j42802P488Q359K047N2507
2123d2355L2407J8943j355J1710J3429o9724k606N903J2761l5682J06084K6721
2111G6236r2165K4083n5574j9390M0777k1486Q4321m6532q0589K6628J5562N9531
2099A1402L6356k485L3923L9900L6561n5901p7239l0874k5882K9565j6137l3177
$$ y = [111288, 51448, 95943, 49723, 42629, 9838, 21211, 34540, 86473, 91160, 108589, -13671, 4750, 79100, 92891, 102198, 94317, 147463, 45611, 115773, 145183, 116157, 114889, 40325, 21056, 59137, 23288, 72624, 43698, 53186, 56858, 5388, 76247, 94944, -3137, 4363, 59849, -30040, -17703, -19695, -69115, -8580, 62896, 4407, -14488, -20387, 12371, 65244, 121685, -316, -31142, 74448, -25747, 12209, 30433, 30046, -112756, -105268, -96909, -94862, -42355, -9948, 8995, 7640, 19350, 32779, -36945, -39551, -33648, -20887, -56569, 49515, 76236, -15929, 8154, -47420, -66810, -26033, -47519, 36802, -9730, -90319, -63691, -48129, 11402, 47758, 45273, 79196, 119096, 155657, 99756, 22517, -8357, -34239, -4674, -20811, -53988]
2087e3988O0917M9011K1538L2400m2656j0563o4878O4849l7571M5530J4344j14335
2075c5402J5300L2426j8421N6063j289k75k3680n1733J3174O5527p2899J8870
2063b339l6750J19091L7318j2524o5666p9359N6648J7242j8772m6759l5624O0291
2051g203q427J7231J874R3793L339j50087P8525J19420K6165L2978j6702o5095
2039A25811l1974o41o5351J0369r162k5137K2235K74J7538j7367N0288P355r2004
2026g766l6070L6538N5220l5855j3814n814n8473J4439Q5251K1143j13522L3530
2014b5193J969r181M8214L3019O669m6624J3446O7194q6479K3252J5625j47650
2002a05739L7678L4567l2744O900K3319Q0630l9016L4961n7468R431j1174J4509
$$ y = [-53988, 6929, 55940, 77478, 109878, 67222, 56659, -8219, 56630, 19059, 64589, 78933, -35402, -20102, 12324, -6097, 49966, 48677, 48402, 24722, -27011, -13837, 51690, -21209, -2339, -39089, 80002, 117320, 104796, 39130, -40229, 16419, 33661, 14889, -31870, -67494, -7203, -15630, 1601, 3475, 97268, 100607, -49480, 29045, 148465, 174630, 207608, 190906, 125811, 93837, 93196, 27845, 38214, 29052, 3915, 26150, 26424, 43962, 26595, 76883, 84238, -7766, -43836, -7298, 47922, 12067, -1747, -7561, -66034, -51595, 33656, 54799, -58723, -25193, -23224, -32405, 15809, 48828, 55497, 8873, 22319, 89513, 3034, 26286, 41911, -105739, -68061, -33494, -66238, -59338, -36019, 44611, 5595, 40556, -16912, -7481, -18655, -4146]
1990d146L1440M5610l8336r385r5097Q956O5150O0275l5268j005J9778j11541
1978f3569l151O6776N9824n6130p1390N8205m6128L2368n0274j005J3695k33M37
1965f0575K8226P6717K0181o9442k5694P3027m7698J0788K6917J7635n6818M9016
1953D2280N8039K003j67502L4140K5907j2148Q1671k5883j07592O8222J08575
1942A07712n5632M6117o2930q6917k5273N3632k2127M013O4183J4854K9871Q452
1930G5955p588m9107L734o6743k5724K2074K3060P747m7567k8879Q2192l2271
1918d3117l6984L3271L4828O3568P2453n7794r8047K1375L0394m9256l1070P9851
1906A9472L6833m8615L1417j5131O605M3365j3175K1653N618m6019l5233j01988
$$ y = [-4146, 27294, 72904, 34568, 25183, -69914, -60958, 4192, 64467, 29199, 28194, 47972, -63569, -66720, 56, 59880, 3750, -67640, -9435, -55563, -23195, -73469, -74474, -60779, -61012, -60575, -32349, 44368, 64549, -4893, -30587, 42440, -5258, 5530, 32447, 50082, -6736, 42280, 100319, 102322, -65180, -31040, -5133, -17281, 64390, 38507, -69085, -863, 107712, 52080, 98197, 35267, -51650, -76923, -23291, -45418, -41405, 22778, 37632, 67503, 75955, 68367, 19260, 22994, -43749, -69473, -47399, -24339, -16592, -64159, -93038, -10846, -43117, -80101, -46830, -12002, 51566, 124019, 66225, -31822, -10447, 19947, -29309, -60379, 19472, 56305, 7690, 39107, 23976, 30581, 73946, 60771, 82424, 88042, 42023, 6790, -95198]
1894i5198O7579L5843l2243K6652j0181j6092J3605k8699M3386j1660n5013K8055
1882c3966R901k4033K0989Q477j5640O942L4933O4340r476m6403k1894Q941o276
1869c165m2132L0671N1351l5610n7578j8806L0647j9364J349K4457n871L361N1315
1856A0625j975J628n785p0494m5393k8305M0802O516J5356Q7235Q7175n6053o3447
1843b2115r6120M2828N9288L7031o9960p8963J24207L8585L0753l1967l213o0207
1831b9853p4502K508K7138L653L0854j9093P7172j4400k3497Q5236j06550o205
1819d7539L0290L3014p438M896J00779o1846k4516k3171N6725o7388O82o8008
1807g3520K6129N0052m0374N985m4794J16298n6230L2743J6784o9138P1470l0176
$$ y = [-95198, -27619, 8224, -24019, 2633, -7548, -23640, -10035, -38734, 4652, -7008, -62021, -33966, -24065, -48098, -27109, -18632, -34272, -27330, 7603, 71943, 62467, 16064, -5830, 3111, -3165, -45297, -14626, 36725, 1115, -56463, -75269, -44622, -63986, -62637, -38180, -44051, -40690, 10625, 8650, 10278, 4493, -66001, -111394, -139699, -98897, -92381, -77025, 10210, 97385, 41332, -22115, -118235, -75407, -16119, 20912, -49048, -128011, -3804, 34781, 65534, 33567, 30354, -29853, -104355, -101847, -74709, -71056, -40202, -59295, 17877, 3477, -20020, 65216, -41334, -47539, -17249, 15765, 8327, 13223, 114002, 52156, 27640, 4469, 61194, -6194, -5512, -73520, -47391, 2661, -37713, -31728, -76522, 39776, -16454, 16289, 33073, -36065, 35405, 5229]
1795E229P6923M558o2386n2530M14J7529l8652l523k9266L3653k210j5026n4959
1782a20246M1391K9193j0292K7817l5146K383R978L7911O6989k6470o9519j237
1770d7248p3316M7535R2994m6347J802J625K6728L5603r022L4036j6027n9967
1758a1604l995N1171j05140J2397L2628O20n8957K6416M0393o537M0364k2613
1746d857j8532j1655L0302R226n1185k418p1258j0630L8634K1507P592p4224K4451
1733a13047L9898o4672K5761J41256R938m1514o96l3349j916L2822M8625N4631
1721I7737l5114m4876p1944K7678L100R152k8154M0671l034j00087m998R0075
1709a9794k6202K626K1879j1823j0881l7581J280O1491k6745j06744K6968J58393
$$ y = [5229, 82152, 86710, 24324, -28206, -27792, -10263, -48915, -52438, -81704, -48051, -50261, -65287, -120246, -78855, -49662, -59954, -32137, -67283, -64900, -54922, -17011, 49978, 23508, -46011, -47248, -120564, -73029, 19965, -26382, -24580, -22955, 3773, 39376, 30354, 64390, 48363, -11604, -15599, 35572, -69568, -57171, -24543, -23923, -82880, -56464, -16071, -22608, 17756, -4857, -23389, -35044, -4742, 4484, -46701, -49119, -120377, -131007, -92373, -70866, -63274, -137498, -113047, -73149, -137821, -112060, 29196, 39134, -2380, -3076, -36425, -38341, -5519, 43106, 97737, 62623, 17747, -54197, -26519, -23419, -14267, -42421, -1750, -4784, -104871, -109869, -19794, -45996, -43370, -21491, -33314, -44195, -81776, -80496, -19005, -45750, -152494, -125526, 32867]
1697C2867l1788q616J1689l3444O2763o3610K3138J5747K3688R859N14j7191j3917
1684A1699P0194q3586K6852J9133j4275m959O041m2328j5395M2330N1938n3863
1672A3781l6178M3891P7204p0671j0084m7840o902J7668K2783n2297l5941Q148
1660g6438O932j2360O1039l5146L0555J8853m5768O7002p6989K8133L905K7737
1648b545k7189j9282n056j8566o0606J08220M3374l6825j3879j1269l1200J8389
1636e6434L2630o101J9367O1481j6477J8291m0379j2186K7301O2599J3076p2582
1624C0586r6582o612j8800K9110j9686R1459R5405q5489l0936k4399K3800l0032
1612d2176R746L3390k1145n3151o2874K4065L0135P4533R3183P477o2452q9351
$$ y = [32867, 1079, -7537, 4152, -29292, 33471, -30139, -7001, 8746, 32434, 42293, 42807, 25616, 11699, 81893, -1693, 25159, 44292, 30017, 25058, 31099, -11229, -26624, 15706, 67644, 13781, -22397, 21494, 98698, 28027, 17943, -29897, -36799, -19131, 3652, -48645, -84586, -76438, -69506, -81866, -20827, -55973, -25418, -6565, -52333, 14669, -62320, -34187, -30282, -2545, -29734, -49016, -54072, -72638, -133244, -25024, 18350, -18475, -32354, -43623, -74823, -56434, -23804, -29905, -10538, 50943, 34466, 52757, 12378, 192, 27493, 90092, 103168, 30586, -65996, -72608, -91408, -62298, -81984, 9475, 104880, 19391, -11545, -35944, -12144, -42176, -32430, 960, -20185, -73336, -136210, -112145, -82010, -7477, 85706, 93183, 30731, -58620]
1600e8620K6003M5232l72K7773n0893o2850K4175l6938k4816M0447J2023K7994
1588c0842k9000K8362O7106l606n6919l7054L1139K0220L6274q6692J6859R1317
1576D7164J8612M9400j39809r085p2404n4042Q7404O4438O501K0770P9704l9086
1564E9567M9868j0494j03752l3046K629l759m925L1136k0911O4692l9591m6952
1552e5538J44960K7265q6738K6526J3379m0070o242K3664M0783m1295l7386k716
1540F592n2085n9550K6679N2539J5726k4625o270J0779J18944k2983n7939K7806
1528C5613k7073O6042k3928r1304r943P3622M4312j37027P5648J09688j03471
1517A2179p9359l9924J1748M0401k4898L627j5968N4347R021j1895J2587L2732
$$ y = [-58620, -32617, 12615, 12243, 40016, -10877, -73727, -49552, -86490, -111306, -70859, -58836, -30842, -59842, -31480, 35626, 32020, -24899, -61953, -30814, -10594, 25680, -61012, -44153, 47164, 65776, 115176, -24633, -33718, -106122, -160164, -72760, -8322, -1821, 18949, 98653, 59567, 109435, 98941, -4811, -37857, -35228, -38987, -43912, -12776, -33687, 31005, -8586, -55538, 89422, 116687, 29949, 56475, 69854, 29784, 23542, 47206, 87989, 46694, 9308, 6592, -45493, -105043, -78364, -25825, -10099, -34724, -40994, -30215, 88729, 65746, 7807, 35613, 8540, 74582, 50654, -40650, -50593, 23029, 67341, -69686, 5962, 115650, 12179, -67180, -107104, -95356, -54955, -79853, -76226, -92194, -37847, -28826, -40721, -28134, 4598]
1505D598K9558N9048n5116P2916j04990o6534l7159J8862J55351M824K491Q5515
1493A69364K0019j92521p3258Q3230o051K1829J3133p426n5775n4261N7001k8545
1481e3261m3330J11048N0064o9538L6495l8456O6509p4895L292O230k4325J7226
1469a2941J044k3673O9045P8369p3765n5990q154L6915N5877k503n8009p0866
1457f4651k197L974N6891P2934q5287M123J5782r0316L0117N117o875Q8389M6602
1444G4603n7622j00689L3978N5644o4481R38L0509M1811l8229K2167N892k2215
1432a7694n304l8629J9356Q439K9511K3470k9436l4763J6874M6305P0566r3645
1420d950Q5210p8282m4469j7977K5032O634l8338J8282L749o1075J0829N4285
$$ y = [4598, 34156, 93204, 38088, 111004, 6014, -60520, -97679, -78817, 76534, 81358, 83849, 169364, 189383, -3138, -76396, 6834, 783, 22612, 35745, 28319, -27456, -81717, -24716, -53261, -96591, 14457, 64521, -5017, 31478, -6978, 59531, -15364, -12072, -5842, -30167, -12941, -11897, -35570, 33475, 111844, 38079, -17911, -26065, 10850, 66727, 64224, 6215, -64651, -66848, -62874, -5983, 66951, -18336, -14213, 1569, -88747, -58630, -53513, -60388, 28001, 74603, 16981, -83708, -49730, 5914, -58567, -57629, -27120, 14691, -23538, -1371, 4521, -17694, -22998, -61627, -42271, -33832, -4321, 19149, -10287, -45050, -28176, 18129, 88695, -4950, 80260, 1978, -42491, -60468, -35436, -28802, -67140, -48858, -45109, -106184, -95355, -41070]
1408d1070N4896O2977l8068K6638n1505k2656Q900L1590j1651l6251q0719M2239
1396e4680J04544M2470l6515n5822o5949k3214Q5613M407J0290m7983j1627p335
1384e5801l3723P3731J372m2462j8173L3957n7605L4780J3143N1316r336O4679
1372E5878k9908o1876J7268K5128K5050n0449n1859M5161j2669M1526Q330j4514
1360b934N6990l5008m0114J7738K611J60j4163q1382l9567J21835M5439k8023
1348C582n8422K2403P2881o0961J1810k7620j691M4578q891j3161N0128j0337
1336B4299K9410m0648K4825o2936j202K4053k7453K256l7802N398O4884L1007
1324C6091n0649O1196k4729o1458j4381k8768m8599P5385L3329K4546L8047j7493
$$ y = [-41070, 13826, 76803, 38735, 65373, 13868, -8788, 112, 31702, 20051, -16200, -96919, -54680, 49864, 92334, 55819, -3, -65952, -89166, -3553, 854, 11144, -36839, -48466, -55801, -89524, -15793, -14421, -56883, -75056, -41099, -98704, -63924, -50781, 535, -8801, 55878, 25970, -35906, -18638, 6490, 31540, -18909, -70768, -25607, -38276, 3250, 11580, -2934, 54056, 19048, -21066, -3328, -717, -557, -14720, -96102, -135669, -13834, 31605, 3582, -54840, -32437, 40444, -20517, -8707, -36327, -38018, 6560, -2331, -15492, 34636, 24299, 53709, 13061, 37886, -25050, -26252, -2199, -29652, -27396, -65198, -59800, 5084, 36091, -14558, 46638, 21909, -39549, -53930, -82698, -131297, -55912, -22583, 1963, 40010, 22517]
1312B2517L4220o3481j4842k1629j9733n233N0958J7353n8642k5826l4822L3277
1300h5883R6771L2784r2930P066P6713l3950j8372m0719J4972Q68N6695j3013
1288A002l3383L5225J5013J6587J5487m7006m02N3561q1289M0746N4795n0350
1276A9986o3683k7137Q9404k8089P1117m3173m2592R501k2103o7931J2938J24881
1264C3119P2223n9850l8867l677l6894J696L8414m2142j2153J7121O2640J6367
1252D7997j03848J136Q5630J8740q483k7903r3610p1917J11188J05779n7382m9790
1240d2463k5019j7402O9415J05828o2199n669K2547n4055o7192P0332o1877K4635
1228d3119r389J1461Q124M740K4111M1969j6382m3893n8049K9230M4213k4738
$$ y = [22517, 56737, -6744, -21586, -43215, -62948, -68181, -17223, 130, -58512, -84338, -119160, -85883, 10888, 43672, -49258, -42192, 34521, 571, -17801, -58520, -43548, -42680, 14015, 1002, -32381, 2844, 17857, 34444, 49931, 2925, 2523, 56084, -25205, 15541, 70336, 19986, -43697, -70834, 18570, -9519, 61598, 18425, -24167, -14666, -36769, -104700, -91762, 33119, 105342, 45492, 6625, 2948, -33946, -32250, 6164, -35978, -48131, -31010, 31630, 47997, -55851, -54715, 30915, 49655, 41172, 13269, -80341, -152258, -41070, 64709, 7327, -42463, -67482, -84884, -15469, 90359, 28160, 22491, 45038, -9017, -76209, -5877, -67754, -43119, -52508, -41047, -32923, -28183, -4072, 37897, 21515, -22378, -80427, -51197, -6984, -31722]
1216c1722j2731K8466n7462m7608J6011O3389j9217J1628L0759N2609n7522M2043
1204A8643r455k9564j9980L9321L8856l6995N949q6596J2500k5746J2710R5951
1192A5594j2687P547k5487J1261J6912j03750R246K6227o0171O3866J9771n8623
$$ y = [-31722, -44453, -15987, -73449, -121057, -105046, -41657, -60874, -49246, -18487, 34122, -23400, 18643, 9188, -20376, -40356, -1035, 37821, 826, 6775, -79821, -67321, -93067, -80357, 15594, 2907, 10454, -15033, -3772, 13140, -90610, -81364, -55137, -115308, -51442, -31671, -90294]
$$ [...]
##END NTUPLES=NMR SPECTRUM
##END=
