##TITLE=1H_EC-3361(3)
 200.13MHz, CDCl3,
 8 sc
 
 3.9.2025
##JCAMPDX= 6.0         $$ Bruker NMR JCAMP-DX V2.0
##DATA TYPE= NMR SPECTRUM
##DATA CLASS= NTUPLES
##ORIGIN= UXNMR, Bruker Analytische Messtechnik GmbH
##OWNER= pz
$$ XWIN-NMR		Version 3.5
$$ Wed Sep  3 13:47:03 2025 Russian Standard Time (UT+4h)  she@DPX200
##.OBSERVE FREQUENCY= 200.1313
##.OBSERVE NUCLEUS= ^1H
##.ACQUISITION MODE= SIMULTANEOUS
##.ACQUISITION SCHEME= undefined
##.AVERAGES= 8
##.DIGITISER RES= 18
##SPECTROMETER/DATA SYSTEM= spect
##.PULSE SEQUENCE= zg30
##.SOLVENT NAME= CDCl3
##.SHIFT REFERENCE= (INTERNAL, CDCl3, 0, 15.4836)
##AUDIT TRAIL= $$ (NUMBER, WHEN, WHO, WHERE, WHAT)
$$ ##TITLE= Audit trail, XWIN-NMR		Version 3.5
$$ ##JCAMPDX= 5.01
$$ ##ORIGIN= Bruker BioSpin GmbH
$$ ##OWNER= she
$$ F:/spectra/data/she/nmr/H-C/1/pdata/1/auditp.txt
$$ ##AUDIT TRAIL=  $$ (NUMBER, WHEN, WHO, WHERE, WHAT)
(   1,<2025-09-03 13:45:32.92 +0400>,<she>,<DPX200>,
      <created by zg, POWCHK disabled, PULCHK disabled
       configuration hash MD5:
       00 E9 B6 7A A2 85 ED C7 34 08 36 98 17 FE 4E 26
       data hash MD5: 16K
       65 44 41 B9 5D B5 AB 64 26 63 F1 58 B1 B7 D2 33>)
(   2,<2025-09-03 13:45:35.35 +0400>,<she>,<DPX200>,
      <Start of raw data processing
       efp BC_mod = 2 LB = 0.25 FT_mod = 6 PKNL = 1 PHC0 = -1557.217 PHC1 = 6.392282 SI = 16K 
       data hash MD5: 16K
       5A C7 8F FD 0A 44 39 44 A5 41 03 40 E0 5E 98 F9>)
(   3,<2025-09-03 13:45:56.15 +0400>,<she>,<DPX200>,
      <pk PHC0 = -5.393513 PHC1 = 7.8 
       data hash MD5: 16K
       AA 29 76 46 B3 6C 1A 8E 26 33 39 FC 75 94 31 26>)
(   4,<2025-09-03 13:45:59.87 +0400>,<she>,<DPX200>,
      <abs ABSG = 5 
       data hash MD5: 16K
       AB 0E DC 13 1E 4A A9 F1 7B 32 61 D1 87 D7 8C 27>)
$$ ##END=
$$ 
$$ hash MD5
$$ 78 95 54 61 31 8B B0 A0 52 79 CD 19 7D 4C 10 58
##$RELAX= 
##$RELAX= 
##$RELAX= 
##$RELAX= 
##$RELAX= 
##$RELAX= 
$$ Bruker specific parameters
$$ --------------------------
##$DU= <F:/spectra>
##$EXPNO= 1
##$NAME= <H-C>
##$PROCNO= 1
##$TYPE= <nmr>
##$USER= <she>
##$AMP= (0..31)
100 100 100 100 100 100 100 100 100 100 100 100 100 100 100 100 100 100 
100 100 100 100 100 100 100 100 100 100 100 100 100 100 
##$AQSEQ= 0
##$AQ_mod= 1
##$AUNM= <au_zg>
##$AUTOPOS= <>
##$BF1= 200.13
##$BF2= 200.13
##$BF3= 200.13
##$BF4= 200.13
##$BF5= 200.13
##$BF6= 200.13
##$BF7= 200.13
##$BF8= 200.13
##$BYTORDA= 1
##$CFDGTYP= 0
##$CFRGTYP= 5
##$CHEMSTR= <none>
##$CNST= (0..31)
1 1 145 1 1 1 1 1 1 1 1 1 1 1 1 1 1 1 1 1 1 1 1 1 1 1 1 1 1 1 1 1 
##$CPDPRG= <>
##$CPDPRG1= <>
##$CPDPRG2= <>
##$CPDPRG3= <>
##$CPDPRG4= <mlev>
##$CPDPRG5= <mlev>
##$CPDPRG6= <mlev>
##$CPDPRG7= <mlev>
##$CPDPRG8= <mlev>
##$CPDPRGB= <>
##$CPDPRGT= <>
##$D= (0..31)
0 0.7 0 0 0 0 0 0 0 0 0 0.03 0 0 0 0 0 0 0 0 0 0 0 0 0 0 0 0 0 0 0 0 
##$DATE= 1756892732
##$DBL= (0..7)
120 120 120 120 120 120 120 120 
##$DBP= (0..7)
150 150 150 150 150 150 150 150 
##$DBP07= 0
##$DBPNAM0= <>
##$DBPNAM1= <>
##$DBPNAM2= <>
##$DBPNAM3= <>
##$DBPNAM4= <>
$$ [...]
##$SUBNAM3= <"">
##$SUBNAM4= <"">
##$SUBNAM5= <"">
##$SUBNAM6= <"">
##$SUBNAM7= <"">
##$SUBNAM8= <"">
##$SUBNAM9= <"">
##$SW= 18.0517328524113
##$SWIBOX= (0..15)
0 0 2 0 0 0 0 0 0 0 0 0 0 0 0 0 
##$SW_h= 3612.71676300578
##$TD= 16384
##$TD0= 1
##$TE= 0
##$TE2= 300
##$TE3= 300
##$TEG= 300
##$TL= (0..7)
0 120 120 120 120 120 120 120 
##$TP= (0..7)
150 150 150 150 150 150 150 150 
##$TP07= 0
##$TPNAME0= <>
##$TPNAME1= <>
##$TPNAME2= <>
##$TPNAME3= <>
##$TPNAME4= <>
##$TPNAME5= <>
##$TPNAME6= <>
##$TPNAME7= <>
##$TPOAL= (0..7)
0.5 0.5 0.5 0.5 0.5 0.5 0.5 0.5 
##$TPOFFS= (0..7)
0 0 0 0 0 0 0 0 
##$TUNHIN= 0
##$TUNHOUT= 0
##$TUNXOUT= 0
##$USERA1= <user>
##$USERA2= <user>
##$USERA3= <user>
##$USERA4= <user>
##$USERA5= <user>
##$V9= 5
##$VALIST= <valist>
##$VCLIST= <CCCCCCCCCCCCCCC>
##$VD= 0
##$VDLIST= <DDDDDDDDDDDDDDD>
##$VPLIST= <PPPPPPPPPPPPPPP>
##$VTLIST= <TTTTTTTTTTTTTTT>
##$WBST= 1024
##$WBSW= 4
##$XGAIN= (0..3)
0 0 0 0 
##$XL= 0
##$YL= 0
##$YMAX_a= 590279
##$YMIN_a= -884828
##$ZGOPTNS= <>
##$ZL1= 120
##$ZL2= 120
##$ZL3= 120
##$ZL4= 120
##$ABSF1= 15.49678
##$ABSF2= -2.555069
##$ABSG= 5
##$ABSL= 3
##$ALPHA= 0
##$AQORDER= 0
##$ASSFAC= 0
##$ASSFACI= 0
##$ASSFACX= 0
##$ASSWID= 0
##$AUNMP= <proc_1d>
##$AZFE= 0.1
##$AZFW= 0.1
##$BCFW= 0
##$BC_mod= 2
##$BYTORDP= 0
##$COROFFS= 0
##$CY= -3
##$DATMOD= 1
##$DC= 0
##$DFILT= <>
##$DTYPP= 0
##$F1P= 0
##$F2P= 0
##$FCOR= 1
##$FTSIZE= 16384
##$FT_mod= 6
##$GAMMA= 0
##$GB= 0
##$INTBC= 1
##$INTSCL= 3.241238e-09
##$ISEN= 128
##$LB= 0.25
##$LEV0= 0
##$LPBIN= 0
##$MAXI= 10000
##$MC2= 0
##$MEAN= 0
##$ME_mod= 0
##$MI= 1.114404
##$NCOEF= 0
##$NC_proc= -6
##$NLEV= 6
##$NOISF1= 3.799351
##$NOISF2= 2.8
##$NSP= 0
##$NTH_PI= 0
##$NZP= 0
##$OFFSET= 15.48356
##$PC= 1
##$PHC0= -1562.611
##$PHC1= 14.19228
##$PH_mod= 1
##$PKNL= yes
##$PPARMOD= 0
##$PSCAL= 0
##$PSIGN= 0
##$REVERSE= no
##$SF= 200.130007633957
##$SI= 16384
##$SIGF1= 3
##$SIGF2= 2
##$SINO= 0.751879
##$SIOLD= 32768
##$SREGLST= <19F.Aceton>
##$SSB= 0
##$STSI= 16384
##$STSR= 0
##$SW_p= 3612.71676300578
##$SYMM= 0
##$S_DEV= 0
##$TDeff= 16384
##$TDoff= 0
##$TI= <>
##$TILT= no
##$TM1= 0
##$TM2= 0
##$TOPLEV= 0
##$USERP1= <user>
##$USERP2= <user>
##$USERP3= <user>
##$USERP4= <user>
##$USERP5= <user>
##$WDW= 1
##$XDIM= 16384
##$YMAX_p= 451058201
##$YMIN_p= -256790
$$ End of Bruker specific parameters
$$ ---------------------------------
##NTUPLES= NMR SPECTRUM
##VAR_NAME=  FREQUENCY,     SPECTRUM/REAL,   SPECTRUM/IMAG
##SYMBOL=    X,             R,               I
##VAR_TYPE=  INDEPENDENT,   DEPENDENT,       DEPENDENT
##VAR_FORM=  AFFN,          ASDF,            ASDF
##VAR_DIM=   16384,         16384,           16384
##UNITS=     HZ,            ARBITRARY UNITS, ARBITRARY UNITS
##FACTOR=    0.220516191357247, 1,           1
##FIRST=     3098.72490264182, 0,            0
##LAST=      -513.991860363958, 0,           0
##MIN=       -513.991860363958, -256790,     0
##MAX=       3098.72490264182, 451058201,    0
$$ Real data points
##PAGE= N=1
##DATA TABLE= (X++(R..R)), XYDATA
$$ [...]
$$ plain form
7523 940689 964344 845732 788255 787700 749126 774317 760504 666547 608321 619609 717546 748046
7511 748046 789147 715315 782805 735437 800162 806867 799684 699291 645835 643305 663895 703251
7499 703251 719448 726494 755263 736820 677993 717571 660999 689851 660770 670953 714083 701330
7487 701330 691671 718310 726249 753755 839037 897581 848597 851823 819151 887410 913705 968609
7475 968609 1048555 1035119 1046484 1075383 1066092 973929 995136 979674 960678 933613 914258 838076
7463 838076 865188 869200 739386 682990 844834 868297 806770 722508 780938 812554 739816
7452 739816 836495 811116 889264 872289 919093 968154 914438 904645 928126 880494 881462 878757
7440 878757 975920 1008302 949722 1030602 976140 924582 1011075 1068258 1175073 1118668 1072323
$$ packed form
7523I40689K3655j18612n7477n55l8574K5191j3813r3957n8226J1288R7937L0500
7511G48046M1101p3832O7490m7368O4725O705p183j00393n3456k530K0590L9356
7499G03251J6197P046K8769j8443n8827L9578n6572K8852k9081J0183M3130j2753
7487G01330r659K6639P939K7506Q5282N8544m8984L226l2672O8259K6295N4904
7475I68609P9946j3436J1365K8899r291r2163K1207j5462j8996k7065j9355p6182
7463H38076K7112M012j29814n6396J61844K3463o1527q4262N8430L1616p2738
7452G39816R6679k5379P8148j6975M6804M9061n3716r793K3481m7632R68k705
7440H78757R7163L2382n8580Q0880n4462n1558Q6493N7183J06815n6405m6345
$$ plain form
7429 1072323 1133020 1039870 1078127 1179051 1133722 1106254 1157087 1187266 1216213 1201799 1186854
7418 1186854 1215246 1195211 1227022 1266382 1357579 1399762 1324959 1278195 1393766 1445611 1578987
7407 1578987 1538939 1456917 1541999 1495365 1546050 1574564 1546637 1497475 1431650 1528239 1584529
7396 1584529 1566531 1593005 1639163 1747662 1878570 1897875 1882136 1870036 1990515 2029775 2108285
7385 2108285 2179586 2142147 2234927 2416248 2480518 2618931 2737648 2838086 2906911 3038201
7375 3038201 3113089 3166154 3399848 3469412 3723494 3918206 3989369 4231725 4438434 4730396
7365 4730396 5053488 5284076 5564343 5924936 6214537 6625593 6962109 7308912 7751290 8229966
7355 8229966 8761149 9248221 9813515 10461794 11021159 11516263 12311164 13060822 13848562 14605368
$$ packed form
7429A072323O0697r3150L8257J00924m5329k7468N0833L0179K8947j4414j4945
7418A186854K8392k0035L1811L9360R1197M2183p4803m6764J15571N1845J33376
7407A578987m0048q2022Q5082m6634N0685K8514k7927m9162o5825R6589N6290
7396A584529j7998K6474M6158J08499J30908J9305j5739j2100J20479L9260P8510
7385B108285P1301l7439R2780J81321O4270J38413J18717J00438O8825J31290
7375C038201P4888N3065K33694O9564K54082J94712P1163K42356K06709K91962
7365D730396L23092K30588K80267L60593K89601M11056L36516L46803M42378M78676
7355H229966N31183M87072N65294O48279N59365M95104P94901P49658P87740P56806
$$ plain form
7345 14605368 15317723 16047236 16717373 17333903 18051543 18645174 19163836 19605578 19937856
7336 19937856 20107984 20250572 20248905 19929206 19634476 19320430 19051635 18684495 18211634 17777299
7326 17777299 17479812 17038609 16778469 16485908 16117871 15774988 15506153 15195970 14754035
7317 14754035 14343546 13923887 13519732 13136185 12636273 12106344 11742997 11254994 10712328
7308 10712328 10197338 9840964 9356928 9056483 8597888 8173075 7787045 7338547 6999457
7299 6999457 6807926 6623391 6252193 5961092 5696822 5498077 5287077 5074153 4854512 4692234
7289 4692234 4523624 4375499 4252508 4016039 3724727 3655181 3587826 3525518 3477600 3310350
7279 3310350 3195793 3040087 2903967 2780147 2732480 2721324 2704035 2597557 2501761 2416292
$$ packed form
7345A4605368P12355P29513O70137O16530P17640N93631N18662M41742L32278
7336A9937856J70128J42588j667l19699k94730l14046k68795l67140m72861m34335
7326A7777299k97487m41203k60140k92561l68037l42883k68835l10183m41935
7317A4754035m10489m19659m04155l83547m99912n29929l63347m88003n42666
7308A0712328n14990l56374m84036l00445m58595m24813l86030m48498l39090
7299F999457j91531j84535l71198k91101k64270j98745k11000k12924k19641j62278
7289D692234j68610j48125j22991k36469k91312o9546o7355o2308m7918j67250
7279C310350j14557j55706j36120j23820m7667j1156j7289j06478r5796q5469
$$ plain form
7269 2416292 2248550 2148446 2167916 2108772 2031433 1949351 1865209 1861375 1758119 1764567 1725386
7258 1725386 1640442 1638468 1568215 1525090 1531786 1538324 1428709 1424778 1490694 1476894 1382262 1313036
7246 1313036 1213437 1252763 1259839 1219831 1198978 1191412 1161750 1125393 1063794 1122708 1185234 1116188
7234 1116188 1085573 1093514 1055062 990947 997659 945352 928225 875676 806769 875160 911658 971392
7222 971392 986672 905368 905234 933989 957072 848251 787943 734655 718128 639391 649045 663006
7210 663006 699275 730601 712889 749696 671183 729099 735300 674535 626787 763907 793535 698659
7198 698659 669895 740870 742666 569152 592807 741085 689567 633081 631385 662884 550086
7187 550086 458087 475238 501167 557557 543381 578292 553102 616274 747136 738794 661080 686614
$$ packed form
7269B416292j67742j00104J9470n9144p7339q2082q4142l834j03256O448l9181
7258A725386q4944j974p0253m3125O696O538j09615l931O5916j3800r4632o9226
7246A313036r9599L9326P076m0008k0853p566k9662l6357o1599N8914O2526o9046
7234A116188l0615P941l8452o4115O712n2307j7127n2549o8907O8391L6498N9734
7222I71392J5280q1304j34K8755K3083j08821o0308n3288j6527p8737R654J3961
7210F63006L6269L1326j7712L6807p8513N7916O201o0765m7748J37120K9628r4876
7198F98659k8764P0975J796j73514K3655J48278n1518n6486j696L1499j12798
7187E50086r1999J7151K5929N6390j4176L4911k5190O3172J30862q342p7714K5534
$$ plain form
7175 686614 665084 699103 621890 700022 724077 666983 632901 608485 560197 716261 731370
7164 731370 645604 609686 683530 767223 794140 811042 860409 918333 884980 746448 951936
7153 951936 1047072 1025649 1052985 1002881 1035082 1017633 957970 1017192 929141 835666 840198 846921
7141 846921 859625 840145 783086 771731 819497 721304 752448 762933 764803 752416 740904 661888
7129 661888 750657 902439 847785 739443 764975 850943 669014 611175 652338 586661 605710
7118 605710 688791 763548 736996 636277 620499 651082 600112 613816 624462 466382 459653
7107 459653 508164 433726 494203 565461 680908 737819 708264 592717 573722 494165 501744
7096 501744 553134 568412 564606 615885 573683 516153 554871 564617 541917 466011 536603 579346
$$ packed form
7175F86614k1530L4019p7213P8132K4055n7094l4082k4416m8288J56064J5109
7164G31370q5766l5918P3844Q3693K6917J6902M9367N7924l3353j38532K05488
7153I51936R5136k1423K7336n0104L2201j7449n9663N9222q8051r3475M532O723
7141H46921J2704j9480n7059j1355M7766r8193L1144J0485J870j2387j1512p9016
7129F61888Q8769J51782n4654j08342K5532Q5968j81929n7839M1163o5677J9049
7118F05710Q3081P4757k6552j00719j5778L0583n0970J3704J0646j58080o729
7107D59653M8511p4438O0477P1258J15447N6911k9555j15547j8995p9557P579
7096E01744N1390J5278l806N1279m2202n7530L8718R746k2700p5906P0592M2743
$$ plain form
7084 579346 535781 557827 651847 727738 688516 738811 723802 735250 755960 735271 743844 674451
7072 674451 672813 743428 695204 798665 787475 755555 787903 858375 843939 859790 925302 995221
7060 995221 848966 809773 838875 999695 1070241 993544 987490 930562 956422 976259 1006891
7049 1006891 975189 950386 845369 918108 1030694 964836 929010 893939 854248 778498 757793
7038 757793 784383 775734 800285 834738 919648 796366 780312 796446 657777 639356 743605
7027 743605 807811 704549 588961 665791 762778 735016 805091 822035 818212 827890 817641 712647
7015 712647 723153 740252 702734 749380 721559 709083 665683 553821 534785 522856 479002
7004 479002 618843 531886 590294 630659 661040 625456 573395 655367 673038 591955 502565
$$ packed form
7084E79346m3565K2046R4020P5891l9222N0295j5009J1448K0710k0689Q573o9393
7072F74451j638P0615m8224J03461j1190l1920L2348P0472j4436J5851O5512O9919
7060I95221j46255l9193K9102J60820P0546p6697o054n6928K5860J9837L0632
7049A006891l1702k4803j05017P2739J12586o5858l5826l5071l9691p5750k0705
7038G57793K6590q649K4551L4453Q4910j23282j6054J6134j38669j8421J04249
7027G43605O4206j03262j15588P6830R6987k7762P0075J6944l823R678j0249j04994
7015G12647J0506J7099l7518M6646k7821j2476m3400j11862j9036j1929m3854
7004D79002J39841q6957N8408M0365L0381l5584n2061Q1972J7671q1083q9390
$$ plain form
6993 502565 622444 666056 700558 808854 750445 711345 704335 701063 637056 685067 590275 691834
6981 691834 736086 664705 595814 556636 660401 670381 731234 666997 573133 618305 633866 664978
6969 664978 654244 732513 686661 605701 716294 686281 666032 633122 684964 737414 732604 741769
6957 741769 674740 665106 723849 738952 698703 674886 689333 683788 663996 692753 658041 667775
6945 667775 683898 749859 741129 690273 753648 724627 738059 731806 781795 816320 752118 779847
6933 779847 777944 781531 715422 694283 713108 651078 593213 540530 641499 612847 568168 657097
6921 657097 632196 564154 538665 497879 550387 603575 703587 684965 784189 714106 615895
6910 615895 608354 586248 609436 517202 528089 502682 559445 599710 671803 683270 632815 626267
$$ packed form
6993E02565J19879M3612L4502J08296n8409l9100p010l272o4007M8011r4792J01559
6981F91834M4252p1381o8891l9178J03765R980O0853o4237r3864M5172J5561L1112
6969F64978j0734P8269m5852q0960J10593l0013k0249l2910N1842N2450m810R165
6957G41769o7029r634N8743J5103m0249k3817J4447n545j9792K8757l4712R734
6945F67775J6123O5961q730n0856O3375k9021J3432o253M9989L4525o4202K7729
6933G79847j903L587o6109k1139J8825o2030n7865n2683J00969k8652m4679Q8929
6921F57097k4901o8042k5489m0786N2508N3188J00012j8622R9224p0083r8211
6910F15895p541k2106K3188r2234J0887k5407N6763M0265P2093J1467n0455o548
$$ plain form
6898 626267 524950 512345 473519 469865 590487 623781 611117 558036 488421 534532 588139
6887 588139 570544 530013 543516 588289 703543 618962 541559 581542 626481 649534 510214
6876 510214 492560 497981 496229 552824 505590 525221 540549 578733 579560 526159 476518 476555 495938
6863 495938 476944 463327 458533 404299 463880 538808 608414 632427 531791 557316 506949 421215
6851 421215 449067 561212 585094 546681 522839 561154 537331 515017 501608 569157 654607
6840 654607 552527 577067 598679 606204 592434 682741 761697 671188 672100 742014 739893 795317
6828 795317 820264 828235 811268 781680 785907 782212 785400 803798 740345 739985 768086 718152 665461
6815 665461 651536 731035 754640 837539 746152 747135 688283 639069 587623 558341 683068 668540
$$ packed form
6898F26267j01317j2605l8826l654J20622L3294j2664n3081o9615M6111N3607
6887E88139j7595m0531J3503M4773J15254q4581p7403L9983M4939K3053j39320
6876E10214j7654N421j752N6595m7234J9631J5328L8184Q27n3401m9641L7J9383
6863D95938j8994j3617m794n4234N9581P4928O9606K4013j00636K5525n0367q5734
6851D21215K7852J12145K3882l8413k3842L8315k3823k2314j3409O7549Q5450
6840F54607j02080K4540K1612P525j3770R0307P8956r0509R12O9914k121N5424
6828G95317K4947P971j6967k9588M227l695L188J8398o3453l60K8101m9934n2691
6815F65461j3925P9499K3605Q2899r1387R83n8852m9214n1446k9282J24727j4528
$$ plain form
6803 668540 691305 677817 595512 588890 632960 736223 735289 695887 673693 647425 681820 651739
6791 651739 541373 642477 729428 778003 752098 694220 760321 803455 685829 688981 643312
6780 643312 644895 711622 714148 658074 782800 813136 746920 813921 693981 739301 727928 862777
6768 862777 907900 784482 789762 850340 669575 672181 804168 752562 714173 678454 680969 836514
6756 836514 828919 822151 831811 825597 887915 936858 856261 831703 917969 886034 882311 938418 943301
6743 943301 944562 1077150 1022088 976894 984405 952763 909681 952733 849209 838812 891127 648393
6731 648393 751763 979944 876413 733352 786098 772052 768322 815690 785136 803980 852889
6720 852889 801231 809049 795824 760886 725596 786925 884923 785413 736409 871634 965212 854642
$$ packed form
6803F68540K2765j3488q2305o622M4070J03263r34l9402k2194k6268L4395l0081
6791F51739j10366J01104Q6951M8575k5905n7878O6101M3134j17626L152m5669
6780F43312J583O6727K526n6074J24726L0336o6216O7001j19940M5320j1373J34849
6768H62777M5123j23418N280O0578j80765K606J31987n1606l8389l5719K515J55545
6756H36514p595o768R660o214O2318M8943q0597k4558Q6266l1935l723N6107M883
6743I43301J261J32588n5062m5194P511l1642m3082M3052j03524j0397N2315k42734
6731F48393J03370K28181j03531j43061N2746j4046l730M7368l0554J8844M8909
6720H52889n1658P818j3225l4938l5290O1329R7998r9510m9004J35225R3578j10570
$$ plain form
6708 854642 924002 887910 857653 818753 771755 868519 919707 934152 908864 870286 829844 829850
6696 829850 885453 917144 944700 971134 1066566 1062581 1082419 1063820 1099866 1078140 1080196 1098424
6684 1098424 1188375 1221760 1144748 1133703 1098704 1265015 1208074 1178543 1229070 1264658 1269013
6673 1269013 1294578 1355272 1441454 1436402 1357495 1200001 1268886 1312914 1346222 1309430 1307299 1280580
6661 1280580 1299991 1383381 1388978 1392708 1281000 1355413 1304047 1334693 1423631 1454710 1484994 1465005
6649 1465005 1397279 1411540 1412948 1457882 1387923 1330774 1227782 1164023 1233640 1245349 1255854
6638 1255854 1262036 1221546 1274207 1245956 1253233 1263038 1239905 1175079 1231920 1358806 1227701 1212650
6626 1212650 1305736 1316028 1298084 1286790 1333052 1384949 1432537 1505759 1426090 1359706 1481985
$$ packed form
6708H54642O9360l6092l0257l8900m6998R6764N1188J4445k5288l8578m0442O
6696H29850N5603L1691K7556K6434R5432l985J9838j8599L6046k1726K056J8228
6684A098424Q9951L3385p7012j1045l4999J66311n6941k9531N0527L5588M355
6673A269013K5565O0694Q6182n052p8907j57494O8885M4028L3308l6792k131k6719
6661A280580J9411Q3390N597L730j11708P4413n1366L0646Q8938L1079L0284j9989
6649A465005o7726J4261J408M4934o9959n7149j02992o3759O9617J1709J0505
6638A255854O182m0490N2661k8251P277R805k3133o4826N6841J26886j31105j5051
6626A212650R3086J0292j7944j1294M6262N1897M7588P3222p9669o6384J22279
$$ plain form
6615 1481985 1571506 1535047 1614852 1631816 1592573 1630007 1607609 1578618 1644641 1695496 1656241
6604 1656241 1735052 1712641 1746459 1629018 1516185 1609875 1591313 1598111 1566802 1521019 1582870
6593 1582870 1676603 1555209 1538187 1538575 1688532 1665847 1581556 1553063 1462167 1447651 1484196
6582 1484196 1404101 1460403 1468472 1559127 1658847 1548701 1462037 1504704 1437093 1403711 1416508
6571 1416508 1433587 1526069 1552744 1545333 1596613 1543143 1520707 1482805 1481407 1506311 1487072 1600063
6559 1600063 1515874 1585422 1580002 1522362 1557678 1652948 1727109 1602202 1698796 1710171 1756838
6548 1756838 1809625 1853385 1915867 1956940 2107167 2103440 2121301 2142931 2223337 2332365 2404026
6537 2404026 2427901 2482202 2637329 2750626 2758685 2872251 2895617 2964436 2988801 2967390 2942885
$$ packed form
6615A481985Q9521l6459P9805J6964l9243L7434k2398k8991O6023N0855l9255
6604A656241P8811k2411L3818j17441j12833R3690j8562O798l1309m5783O1851
6593A582870R3733j21394j7022L88J49957k2685q4291k8493r0896j4516L6545
6582A484196q0095N6302Q069R0655R9720j10146q6664M2667o7611l3382J2797
6571A416508J7079R2482K6675p411N1280n3470k2436l7902j398K4904j9239J12991
6559A600063q4189O9548n420n7640L5316R5270P4161j24907R6594J1375M6667
6548A756838N2787M3760O2482M1073J50227l727J7861K1630Q0406J09028P1661
6537B404026K3875N4301J55127J13297Q059J13566K3366O8819K4365k1411k4505
$$ plain form
6526 2942885 2939597 2829228 2727087 2698587 2609707 2670208 2744409 2620316 2402131 2457523 2524882
6515 2524882 2418793 2410352 2358849 2398786 2334574 2291670 2242189 2277673 2319371 2326131 2299605 2325639
6503 2325639 2312687 2407805 2512847 2539223 2529885 2420018 2371043 2405998 2429258 2466226 2450183
6492 2450183 2498157 2498699 2408613 2390601 2365314 2355097 2387524 2379538 2371054 2274769 2275469 2329716 2268884
6479 2268884 2191102 2230913 2284165 2177776 2202342 2228495 2272755 2257420 2301416 2253035 2267228
6468 2267228 2286087 2344905 2300718 2249520 2303512 2338830 2395825 2276026 2289800 2326690 2365764
6457 2365764 2448355 2386304 2376279 2411919 2447130 2450347 2472222 2381885 2326704 2416247 2500901 2435957
6445 2435957 2475794 2474746 2545290 2615186 2533738 2555424 2700984 2599454 2578367 2547719 2619775
$$ packed form
6526B942885l288j10369j02141k8500q8880O0501P4201j24093k18185N5392O7359
6515B524882j06089q441n1503L9937o4212m2904m9481L5484M1698O760k6526K6034
6503B325639j2952R5118J05042K6376r338j09867m8975L4955K3260L6968j6043
6492B450183M7974N42r0086j8012k5287j0217L2427p986q484r6285P00N4247o0832
6479B268884p7782L9811N3252j06389K4566K6153M4260j5335M3996m8381J4193
6468B267228J8859N8818m4187n1198N3992L5318N6995j19799J3774L6890L9074
6457B365764Q2591o2051j0025L5640L5211L217K1875r0337n5181Q9543Q4654o4944
6445B435957L9837j048P0544O9896q1448K1686J45560j01530k1087l0648P2056
$$ plain form
6434 2619775 2554556 2517930 2645893 2781667 2741204 2689793 2788746 2805366 2781174 2689346 2847082
6423 2847082 2934978 2919287 3023439 3054165 3041335 3146863 3241838 3242255 3320319 3370344 3379520 3449878
6411 3449878 3592871 3606691 3654305 3774812 3748826 3798422 3838186 3848928 3897283 4062160 4141804
6400 4141804 4091005 4158375 4389733 4541297 4582840 4656214 4764239 4828286 5034138 5140289
6390 5140289 5180304 5334548 5527822 5540354 5693509 5831795 5906608 5991992 6166650 6376003
6380 6376003 6602987 6646074 6791721 6921156 7095855 7327937 7550457 7661285 7843408 8057353
6370 8057353 8259908 8584442 8767208 9069696 9401600 9739366 10127842 10445589 10856950 11295484
6360 11295484 11694873 12257279 12903977 13557193 14190648 14845203 15715721 16627765 17572568
$$ packed form
6434B619775o5219l6626J27963J35774m0463n1411R8953J6620k4192r1828J57736
6423B847082Q7896j5691J04152L0726j2830J05528R4975M17P8064N0025R176P0358
6411C449878J42993J3820M7614J20507k5986M9596L9764J0742M8355J64877P9644
6400D141804n0799O7370K31358J51564M1543P3374J08025O4047K05852J06151
6390E140289M0015J54244J93274J2532J53155J38286P4813Q5384J74658K09353
6380F376003K26984M3087J45647J29435J74699K32082K22520J10828J82123K13945
6370H057353K02555L24534J82766L02488L31904L37766L88476L17747M11361M38534
6360A1295484L99389N62406O46698O53216O33455O54555Q70518R12044R44803
$$ plain form
6351 17572568 18502153 19543767 20670884 22023480 23563272 25217671 26974463 29218076
6343 29218076 31706425 34312120 37430871 41137959 45533624 50494098 55959673 61964659
6335 61964659 68902793 77589167 88458750 99697928 109876169 121173165 131559064
6328 131559064 137146646 137404693 127199783 112187515 99215964 87738082 78019490 70026227
6320 70026227 63306324 57439721 52541525 48276802 44390752 40609837 37281654 34530428
6312 34530428 32380607 30578650 29065790 27881982 26833536 25827043 24815289 23840887
6304 23840887 23005948 22283591 21747296 21312835 20845730 20498824 20323408 20180960 20010601
6295 20010601 19857358 19689253 19619115 19590230 19615437 19722957 19902200 20315324 20637857 20905967
$$ packed form
6351A7572568R29585J041614J127117J352596J539792J654399J756792K243613
6343B9218076K488349K605695L118751L707088M395665M960474N465575O004986
6335F1964659O938134Q686374J0869583J1239178J0178241J1296996J0385899
6328A31559064N587582K58047j0204910j5012268j2971551j1477882r718592p993263
6320G0026227o719903n866603m898196m264723l886050l780915l328183k751226
6312C4530428k149821j801957j512860j183808j048446j006493j011754r74402
6304B3840887q34939p22357n36295m34461m67105l46906j75416j42448j70359
6295B0010601j53243j68105p0138k8885K5207J07520J79243M13124L22533K68110
$$ plain form
6285 20905967 21264929 21606441 22020695 22558697 23132178 23842837 24722639 25774083 26651969
6276 26651969 27512521 28215887 28506426 28387282 28017939 27322834 26395100 25414070 24633941
6267 24633941 24075710 23788736 23673550 23670566 23968523 24325120 24949598 25575776 26368355 27265180
6257 27265180 28081797 28809063 29295886 29433384 29274241 28909903 28119325 27186951 26130786
6248 26130786 24914257 23704602 22596244 21590331 20734401 19866565 19160660 18605627 18055380
6239 18055380 17598102 17348849 17156087 17075678 17258732 17536088 17918770 18328080 18769920 19457505
6229 19457505 20179222 21007152 22008769 22985746 23978547 25004326 25866037 26436816 26817041
6220 26817041 26724597 26370145 25970575 25301005 24510200 23654714 22835887 22186360 21683531 21273252
$$ packed form
6285B0905967L58962L41512M14254N38002N73481P10659Q79802J051444Q77886
6276B6651969Q60552P03366K90539j19144l69343o95105r27734r81030p80129
6267B4633941n58231k86974j15186k984K97957L56597O24478O26178P92579Q96825
6257B7265180Q16617P27266M86823J37498j59143l64338p90578r32374j056165
6248B6130786j216529j209655j108358j005913q55930q67836p05905n55033n50247
6239A8055380m57278k49253j92762q0409J83054K77356L82682M09310M41840O87585
6229A9457505P21717Q27930J001617R76977R92801J025779Q61711N70779L80225
6220B6817041r2444l54452l99570o69570p90805q55486q18827o49527n02829m10279
$$ plain form
6210 21273252 21145106 21105419 21143253 21371939 21836307 22390991 22955305 23546011 23976495 24209940
6200 24209940 24145654 23693241 23053186 22231874 21265195 20364787 19516310 18815073 18111344 17536789
6190 17536789 16991192 16529291 16136621 15696479 15220802 14830167 14430895 14043562 13758754
6181 13758754 13541367 13303152 13115770 12938675 12708984 12325724 12028168 11887999 11681988
6172 11681988 11331364 11095918 10891793 10534150 10164244 9783440 9501808 9101330 8807709
6163 8807709 8521511 8122588 7836672 7587538 7303212 7183416 6976524 6758347 6556405 6277703
6153 6277703 6203554 6121528 6027101 5816653 5739994 5663919 5495238 5363842 5317004 5207736 5048635
6142 5048635 4973312 4775197 4805462 4820144 4868392 4837258 4734189 4593258 4395001 4331375 4350452
$$ packed form
6210B1273252j28146l9687L7834K28686M64368N54684N64314N90706M30484K33445
6200B4209940o4286m52413o40055q21312r66679r00408q48477p01237p03729n74555
6190A7536789n45597m61901l92670m40142m75677l90635l99272l87333k84808
6181A3758754k17387k38215j87382j77095k29691l83260k97556j40169k06011
6172A1681988l50624k35446k04125l57643l69906l80804k81632m00478k93621
6163H807709k86198l98923k85916k49134k84326j19796k06892k18177k01942k78702
6153F277703p4149q2026r4427k10448p6659p6075j68681j31396m6838j09268j59101
6142E048635p5323j98115L0265J4682M8248l1134j03069j40931j98257o3626J9077
$$ plain form
6131 4350452 4304778 4275498 4193600 4203309 4070082 4006914 4115622 4084560 3920985 3781292 3856566
6120 3856566 3875467 3791235 3835520 3886427 3830171 3806985 3749208 3682641 3647982 3751533 3696366
6109 3696366 3685248 3637085 3560146 3594559 3586907 3667164 3627589 3502030 3402487 3336238 3404279
6098 3404279 3259707 3348241 3232834 3248755 3262754 3157071 3180730 3106456 3163198 3103136 3086424
6087 3086424 3087797 3060966 2998823 3054800 3079808 3043359 2884937 2874020 2880404 2909898 2834030 2805278
6075 2805278 2819889 2887394 2848582 2818121 2914330 2820519 2804142 2870409 2907205 2841599 2839188 2909142
6063 2909142 2928689 2853485 2838566 2859588 2921864 2932104 2886923 2868369 2941742 2927314 2955932
6052 2955932 3038458 3123646 3146515 3090693 3025761 3163018 3222104 3189970 3211365 3185819 3126325
$$ packed form
6131D350452m5674k9280q1898R709j33227o3168J08708l1062j63575j39693P5274
6120C856566J8901q4232M4285N0907n6256k3186n7777o6567l4659J03551n5167
6109C696366j1118m8163p6939L4413p652Q0257l9575j25559r9543o6249O8041
6098C404279j44572Q8534j15407J5921J3999j05683K3659p4274N6742o0062j6712
6087C086424J373k6831o2143N5977K5008l6449j58422j0917O384K9494p5868k8752
6075B805278J4611O7505l8812l0461R6209r3811j6377O6267L6796o5606k411O9954
6063B909142J9547p5204j4919K1022O2276J0240m5181j8554P3373j4428K8618
6052B955932Q2526Q5188K2869n5822o4932J37257N9086l2134K1395k5546n9494
$$ plain form
6041 3126325 3091122 3051087 3041918 3003519 2958799 3039062 3060079 3073350 3229636 3152821 3167588
6030 3167588 3182914 3206995 3256735 3211916 3212597 3137603 3158426 3311010 3318486 3364119 3388016 3288405
6018 3288405 3351227 3367526 3386351 3504832 3550924 3496967 3513997 3472443 3459257 3539074 3498598
6007 3498598 3479406 3594189 3642571 3669747 3689268 3788640 3829117 3810914 3835828 3922202 4010981
5996 4010981 4154478 4170454 4261777 4166736 4137039 4323381 4415934 4367799 4467135 4566306 4581044
5985 4581044 4629456 4626786 4599839 4598699 4615501 4734792 4817784 4763607 4750769 4799814 4741064 4781925
5973 4781925 4792920 4824550 4815950 4715269 4807584 4884396 4941967 5021971 4995914 5013373 5177018
5962 5177018 5287246 5440997 5418737 5534266 5712666 5703843 5811399 5783171 5878057 5881374 5858625
$$ packed form
6041C126325l5203m0035r169l8399m4720Q0263K1017J3271J56286p6815J4767
6030C167588J5326K4081M9740m4819O81p4994K0823J52584P476M5633K3897r9611
6018C288405O2822J6299J8825J18481M6092n3957J7030m1554j3186P9817m0476
6007C498598j9192J14783M8382K7176J9521R9372M0477j8203K4914Q6374Q8779
5996D010981J43497J5976R1323r5041k9697J86342R2553m8135R9336R9171J4738
5985D581044M8412k670k6947j140J6802J19291Q2992n4177j2838M9045n8750M0861
5973D781925J0995L1630q600j00681R2315P6812N7571Q0004k6057J7459J63645
5962E177018J10228J53751k2260J15529J78400q823J07556k8228R4886L317k2749
$$ plain form
5951 5858625 5747954 5662131 5555564 5419473 5467165 5426338 5427801 5321778 5290944 5291854 5265473
5940 5265473 5270536 5272364 5224514 5295072 5307568 5261188 5205951 5207955 5263274 5246878 5285446 5288030
5928 5288030 5264282 5230223 5235666 5335190 5335981 5433281 5507449 5451716 5475221 5600111 5621983 5534936
5916 5534936 5575549 5570409 5449101 5595353 5680283 5701272 5661105 5664541 5670501 5700950 5732252 5772502
5904 5772502 5940865 5958543 5899815 5844384 5847552 6007482 5980812 5946231 6096291 6116171 6040738
5893 6040738 6063033 6055805 5981781 6034298 5995035 5953457 5878360 5829648 5874338 5853529 5826927 5855587
5881 5855587 5904423 5905342 5937067 6003123 5977315 5970799 5978756 6124514 6243265 6133287 6081193 6082771
5869 6082771 6177332 6165522 6081117 6072852 6017770 5911545 5894552 5880256 5704984 5602307 5501136
$$ packed form
5951E858625j10671q5823j06567j36091M7692m0827J463j06023l0834R10k6381
5940E265473N063J828m7850P0558J2496m6380n5237K004N5319j6396L8568K584
5928E288030k3748l4059N443R9524P91R7300P4168n5733K3505J24890K1872q7047
5916E534936M0613n140j21308J46252Q4930K0989m0167L436N960L0449L1302M0250
5904E772502J68363J7678n8728n5431L168J59930k6670l4581J50060J9880p5433
5893F040738K2295p228p4024N2517l9263m1578p5097m8712M4690k0809k6602K8660
5881E855587M8836R19L1725O6056k5808o516P957J45758J18751j09978n2094J578
5869F082771R4561j1810q4405q265n5082j06225j6993j4296j75272j02677j01171
$$ plain form
5858 5501136 5410160 5320380 5277979 5219829 5106759 5126715 5203941 5169998 5201999 5206361 5133530
5847 5133530 5135252 5113336 5042039 5010788 5024543 5019188 5011308 5108279 5082424 5095876 5072016 5033399
5835 5033399 5165621 5126307 5194772 5131712 5170535 5243822 5340446 5284368 5287224 5245851 5266249
5824 5266249 5306467 5252587 5341838 5405646 5477100 5495677 5510984 5606644 5621006 5856984 5978119
5813 5978119 6046221 6103006 6045152 6082898 6119791 6208154 6260523 6346102 6329986 6289095 6307409
5802 6307409 6372401 6482365 6547990 6429582 6466055 6509599 6493549 6452282 6523124 6532945 6479470
5791 6479470 6311048 6423560 6361059 6356576 6398165 6269726 6292703 6350291 6249852 6261065 6288858
5780 6288858 6355853 6389828 6403583 6451248 6507441 6653982 6678892 6697926 6715559 6685490 6673076
$$ packed form
5858E501136r0976q9780m2401n8150j13070J9956P7226l3943L2001M362p2831
5847E133530J722k1916p1297l1251J3755n355p880R6971k5855J3452k3860l8617
5835E033399J32222l9314O8465o3060L8823P3287R6624n6078K856m1373K0398
5824E266249M0218n3880Q9251O3808P1454J8577J5307R5660J4362K35978J21135
5813E978119O8102N6785n7854L7746L6893Q8363N2369Q5579j6116m0891J8314
5802F307409O4992J09964O5625j18408L6473M3544j6050m1267P0842R821n3475
5791F479470j68422J12512o2501m483M1589j28439K2977N7588j00439J1213K7793
5780F288858O6995L3975J3755M7665N6193J46541K4910J9034J7633l0069j2414
$$ plain form
5769 6673076 6634826 6661007 6737656 6655638 6745327 6788789 6830826 6869893 7067134 7124304 7169623
5758 7169623 7279984 7221100 7289994 7421108 7414521 7543716 7549985 7516922 7555227 7621444 7755302
5747 7755302 7823670 7974178 8076789 8167135 8349223 8458083 8486112 8619186 8801780 8888221
5737 8888221 8965552 8969672 8928405 9234937 9325764 9562583 9781040 9933696 10046795 10078485 10153380
5726 10153380 10247980 10240870 10192641 10197302 10185853 10252183 10303956 10435987 10525353 10523608 10556336 10661725
5714 10661725 10720481 10725953 10724312 10719329 10857611 10894108 10853919 10833452 10947421 10934423 10990186
5703 10990186 11017955 10887588 10897986 10987841 10921064 10833003 10988339 11026936 11068170 11024906 11061310
5692 11061310 11148368 11283479 11387771 11498815 11813075 11970494 12156631 12487695 12886420 13250181
$$ packed form
5769F673076l8250K6181P6649q2018Q9689M3462M2037L9067J97241N7170M5319
5758G169623J10361n8884O8894J31114o587J29195O269l3063L8305O6217J33858
5747G755302O8368J50508J02611R0346J82088J08860K8029J33074J82594Q6441
5737H888221P7331M120m1267L06532R0827K36819K18457J52656J13099L1690P4895
5726A0153380R4600p110m8229M661j1449O6330N1773J32031Q9366j745L2728J05389
5714A0661725N8756N472j641m983J38282L6497m0189k0467J13969j2998N5763
5703A0990186K7769j30367J0398Q9855o6777q8061J55336L8597M1234m3264L6404
5692A1061310Q7058J35111J04292J11044L14260J57419J86137L31064L98725L63761
$$ plain form
5682 13250181 13564864 14046355 14392032 14759447 15066693 15524479 15876160 16078683 16274844
5673 16274844 16324895 16243771 16250736 16157722 16150275 16289906 16475033 16580760 16633226 16719869 16823305
5662 16823305 16973115 17175178 17295378 17483011 17536553 17814303 18042732 18306539 18520429 18785640
5652 18785640 19251415 19818379 20389399 20991079 21758544 22615334 23508678 24213355 24989652
5643 24989652 25686241 26048487 25815459 25397303 25178108 25080924 25175317 25421369 25887205 26423915
5633 26423915 27040112 27792242 28623088 29454124 30467059 31676204 32807094 34230407 35696762
5624 35696762 37438373 39225478 41143703 43292693 45701395 48355486 51253140 54599805
5616 54599805 58470406 62537228 66877724 71734508 76938958 82506438 88312330 94334175
$$ packed form
5682A3250181L14683M81491L45677L67415L07246M57786L51681K02523J96161
5673A6274844N0051q1124O965r3014p447J39631J85127J05727N2466Q6643J03436
5662A6823305J49810K02063J20200J87633N3542K77750K28429K63807K13890K65211
5652A8785640M65775N66964N71020O01680P67465Q56790Q93344P04677P76297
5643B4989652O96589L62246k33028m18156k19195r7184R4393K46052M65836N36710
5633B6423915O16197P52130Q30846Q31036J012935J209145J130890J423313J466355
5624C5696762J741611J787105J918225K148990K408702K654091K897654L346665
5616E4599805L870601M066822M340496M856784N204450N567480N805892O021845
$$ plain form
5608 94334175 100935622 108338964 116843647 126097846 136209097 146898073 157942056 169387167
5600 169387167 180853126 192034233 202495771 211978028 220122707 226565926 230901073 232577591
5592 232577591 231286725 227541430 221208661 212943897 203632928 193515462 182976040 172096932
5584 172096932 161247046 150453123 139870210 129729602 120247630 111584697 103612464
5577 103612464 96114150 89144083 82927213 77426234 72380725 67695791 63492118 59573971
5569 59573971 56117092 53043647 50156422 47624972 45213995 42955274 40943093 39211364
5561 39211364 37543334 35974865 34524452 33204398 31995465 30852697 29679691 28645269
5553 28645269 27783270 26850951 25983721 25206861 24456806 23773363 23130446 22471977 21856957
$$ packed form
5608I4334175O601447P403342Q504683R254199J0111251J0688976J1043983J1445111
5600A69387167J1465959J1181107J0461538R482257Q144679O443219M335147J676518
5592B32577591j290866l745295o332769q264764r310969j0117466j0539422j0879108
5584A72096932j0849886j0793923j0582913j0140608r481972q662933p972233
5577A03612464p498314o970067o216870n500979n045509m684934m203673l918147
5569E9573971l456879l073445k887225k531450k410977k258721k012181j731729
5561C9211364j668030j568469j450413j320054j208933j142768j173006j034422
5553B8645269q61999r32319q67230p76860p50055o83443o42917o58469o15020
$$ plain form
5544 21856957 21308538 20680656 20146842 19730959 19324809 18758228 18337004 17998600 17737446
5535 17737446 17495645 17213943 17007850 16703699 16397820 16194392 15969772 15799773 15629343
5526 15629343 15504472 15276908 15033379 14841633 14666937 14448591 14230055 13982246 13708524
5517 13708524 13585518 13410482 13272035 13052121 12899396 12681125 12589893 12417308 12169883 12002440
5507 12002440 11937894 11788686 11674592 11564533 11404205 11173747 11119264 11093922 10949096 10761446
5497 10761446 10565194 10313727 10296778 10111956 9869399 9779676 9714127 9531137 9491903 9506364
5487 9506364 9381635 9240222 9155247 9201880 9038739 8991581 9035940 9008559 8959959 8907127 8821007
5476 8821007 8782988 8773642 8796223 8648353 8476096 8510876 8372530 8286807 8167787 8196731 8163638
$$ packed form
5544B1856957n48419o27882n33814m15883m06150n66581m21224l38404k61154
5535A7737446k41801k81702k06093l04151l05879k03428k24620j69999j70430
5526A5629343j24871k27564k43529j91746j74696k18346k18536k47809k73722
5517A3708524j23006j75036j38447k19914j52725k18271r1232j72585k47425j67443
5507A2002440o4546j49208j14094j10059j60328k30458n4483k5342j44826j87650
5497A0761446j96252k51467j6949j84822k42557q9723o5549j82990l9234J4461
5487I506364j24729j41413q4975M6633j63141m7158M4359k7381m8600n2832q6120
5476H821007l8019r346K2581j47870j72257L4780j38346q5723j19020K8944l3093
$$ plain form
5465 8163638 8067142 8068255 7928786 7927334 7950187 7939161 7992388 7965474 7958338 8104930 8041255 8006383
5453 8006383 7996647 7965682 8012603 8014472 8024539 8052303 8010009 7908270 7912888 7934309 7848667 7861683
5441 7861683 7766823 7660015 7668296 7708970 7824675 7780708 7616996 7614372 7561884 7569653 7638543
5430 7638543 7635554 7533196 7462502 7573437 7676150 7679209 7628426 7665856 7708517 7829760 7830633
5419 7830633 7728246 7848774 7884935 7937461 7990816 7913589 8001889 8224830 8446557 8631413
5409 8631413 8753387 8994531 9175068 9379532 9459447 9547088 9680142 9706936 9716880 9908107
5399 9908107 10152260 10413955 10639082 10907446 11237493 11775376 12283193 12795099 13408353 14360317
5389 14360317 15508416 16485728 17523477 18779402 19632988 20002755 19606936 17998236 16482599
$$ packed form
5465H163638r6496J113j39469j452K2853j1026N3227k6914p136J46592o3675l4872
5453H006383r736l0965M6921J869J0067K7764m2294j01739M618K1421q5642J3016
5441G861683r4860j06808Q281M0674J15705m3967j63712k624n2488P769O8890
5430G638543k989j02358p0694J10935J02713L059n0783L7430M2661J21243Q73
5419G830633j02387J20528L6161N2526N3355p7227Q8300K22941K21727J84856
5409H631413J21974K41144J80537K04464P9915Q7641J33054K6794R944J91227
5399I908107K44153K61695K25127K68364L30047N37883N07817N11906O13254R51964
5389A4360317J148099R77312J037749J255925Q53586L69767l95819j608700j515637
$$ plain form
5380 16482599 15185659 13910738 12989803 12290427 11686041 11138216 10698780 10230683 9715996
5371 9715996 9289917 9020961 8806751 8329087 8183026 8131035 7936242 7739496 7517505 7392216
5361 7392216 7327021 7217515 7181064 7164523 7102303 7056760 7036994 6969239 7006872 7031093 6961792
5350 6961792 7019018 7153791 7282264 7132772 6946038 6984461 7015666 6896155 6828151 6684329
5340 6684329 6541869 6405625 6312992 6400209 6252366 6014631 5956071 5841338 5734340 5744177
5330 5744177 5707071 5748476 5674690 5596712 5583924 5511480 5478578 5433810 5403756 5517613 5394334
5319 5394334 5381041 5322404 5389785 5444175 5459510 5413549 5398868 5428274 5468160 5563023 5527208
5308 5527208 5478507 5608175 5583708 5589314 5708079 5687501 5626457 5637073 5719829 5773719 5777419
$$ packed form
5380A6482599j296940j274921r20935o99376o04386n47825m39436m68097n14687
5371I715996m26079k68956k14210m77664j46061n1991j94793j96746k21991j25289
5361G392216o5195j09506l6451j6541o2220m5543j9766o7755L7633K4221o9301
5350F961792N7226J34773J28473j49492j86734L8423L1205j19511o8004j43822
5340F684329j42460j36244r2633Q7217j47843k37735n8560j14733j06998R837
5330E744177l7106M1405p3786p7978j2788p2444l2902m4768l0054J13857j23279
5319E394334j3293n8637O7381N4390J5335m5961j4681K9406L9886R4863l5815
5308E527208m8701J29668k4467N606J18765k0578o1044J0616Q2756N3890L700
$$ plain form
5297 5777419 5904253 5930755 5910390 5981213 6016040 6115146 6231912 6386030 6456177 6493713 6553831
5286 6553831 6633824 6553181 6570328 6546748 6542858 6583524 6472548 6287502 6338765 6312070 6220187
5275 6220187 6147915 6085841 5931467 5818325 5780585 5732172 5582690 5532287 5494845 5422669 5388272
5264 5388272 5324715 5276168 5261894 5304305 5318753 5248353 5324670 5398913 5347691 5278860 5345020
5253 5345020 5374636 5286025 5381504 5451772 5465578 5437871 5460851 5498120 5503140 5662626 5745204
5242 5745204 5711159 5748155 5812296 5878484 6060207 6093611 6181389 6307231 6526538 6810432 7011861
5231 7011861 7086708 7377722 7653797 7993729 8228599 8406814 8501997 8488847 8317998 8145850
5221 8145850 8109912 7793572 7741721 7715618 7576032 7480909 7444172 7469804 7506175 7460684 7407635
$$ packed form
5297E777419J26834K6502k0365P0823L4827R9106J16766J54118P0147L7536O0118
5286F553831P9993q0643J7147k3580l890M0666j10976j85046N1263k6695r1883
5275F220187p2272o2074j54374j13142l7740m8413j49482n0403l7442p2176l4397
5264E388272o3557m8547j4274M2411J4448p0400P6317P4243n1222o8831O6160
5253E345020K9616q8611R5479P0268J3806k7707K2980L7269N020J59486Q2578
5242E745204l4045L6996O4141O6188J81723L3404Q7778J25842K19307K83894K01429
5231G011861P4847K91014K76075L39932K34870J78215R5183j3150j70849j72148
5221H145850l5938l16340n1851k6103j39586r5123l6737K5632L6371m5491n3049
$$ plain form
5210 7407635 7468354 7481135 7475476 7546629 7676186 7662871 7657803 7877282 7997164 8094268 8286799
5199 8286799 8478502 8638772 8902410 9334392 9730985 10100526 10622262 11067408 11551016 12004806
5189 12004806 12409154 12868171 13259078 13389539 13576453 13769650 13849984 13912829 13923295 14008503
5179 14008503 14033080 14273252 14537191 14768830 15087314 15297981 15491895 15644485 15641990 15611118
5169 15611118 15608820 15459759 15387125 15241388 15111282 15019705 14965111 14918190 15152682 15335140
5159 15335140 15621422 15951898 16270744 16697532 17100597 17699220 18377998 19150797 19986664
5150 19986664 20874368 21823326 22615118 23380763 24126909 24935996 25558168 26051948 26577813
5141 26577813 27034524 27324850 27798132 28218161 28603642 29065062 29554938 29895151 30074712
$$ packed form
5210G407635O0719J2781n659P1153J29557j3315n068K19479J19882R7104J92531
5199H286799J91703J60270K63638M31982L96593L69541N21736M45146M83608M53790
5189A2004806M04348M59017L90907J30461J86914J93197Q0334O2845J0466Q5208
5179A4008503K4577K40172K63939K31639L18484K10667J93914J52590k495l0872
5169A5611118k298j49061p2634j45737j30106r1577n4594m6921K34492J82458
5159A5335140K86282L30476L18846M26788M03065N98623O78778P72799Q35867
5150A9986664Q87704R48958P91792P65645P46146Q09087O22172M93780N25865
5141B6577813M56711K90326M73282M20029L85481M61420M89876L40213J79561
$$ plain form
5132 30074712 30222486 30206291 30101458 29937432 29683396 29288708 29097077 28957947 29044450 29260671
5122 29260671 29481512 30158063 31005244 31946299 33028045 34370483 35914209 37653124 39592067
5113 39592067 41637729 43795941 46367916 49102410 52219995 55570871 59363292 63421528
5105 63421528 67990755 72897729 78457873 85263082 93863011 103922224 115675492 128752053
5097 128752053 144672194 162232150 177532711 193853558 208468713 217858561 219416567
5090 219416567 206967730 182686937 158771729 139548633 124192767 111306568 100215736
5083 100215736 90843050 82889056 76056377 69552257 63314398 58000873 53404324 49606687
5075 49606687 46375146 43473567 40947994 38540372 36288969 34167889 32405557 30759277
$$ packed form
5132C0074712J47774j6195j04833j64026k54036l94688j91631j39130Q6503K16221
5122B9260671K20841O76551Q47181R41055J081746J342438J543726J738915J938943
5113C9592067K045662K158212K571975K734494L117585L350876L792421M058236
5105F3421528M569227M906974N560144O805209Q599929J0059213J1753268J3076561
5097A28752053J5920141J7559956J5300561J6320847J4615155R389848J558006
5090B19416567j2448837k4280793k3915208j9223096j5355866j2886199j1090832
5083A00215736r372686p953994o832679o504120o237859n313525m596549l797637
5075D9606687l231541k901579k525573k407622k251403k121080j762332j646280
$$ plain form
5067 30759277 29225133 28036826 26900319 25867259 25037550 24198840 23449451 22709305 21994989
5058 21994989 21307087 20700853 20163778 19559367 18995449 18436597 18105609 17727932 17371346
5049 17371346 17104741 16695984 16487734 16194482 15942671 15790049 15539300 15380043 15335914 15229266
5039 15229266 15284732 15297946 15256104 15147729 15147563 15185414 15266133 15188496 15084269 14954377 14666627
5028 14666627 14273183 14119700 13961068 13940464 13910791 13847114 13822081 13815104 13828096 13877588 13893501
5017 13893501 14059010 14122412 14027264 14024112 13982711 14060558 14220063 14204084 14155797 14252622 14337368
5006 14337368 14407933 14362727 14390216 14441035 14553184 14647990 14724827 14756077 14864349 14938152 15020936
4995 15020936 15000950 15040154 15119497 15193715 15269418 15246904 15211923 15416721 15566617 15634948 15611039
$$ packed form
5067C0759277j534144j188307j136507j033060q29709q38710p49389p40146p14316
5058B1994989o87902o06234n37075o04411n63918n58852l30988l77677l56586
5049A7371346k66605m08757k08250k93252k51811j52622k50749j59257m4129j06648
5039A5229266N5466J3214m1842j08375j66L7851Q0719p7637j04227j29892k87750
5028A4666627l93444j53483j58632k0604k9673o3677k5033o977J2992M9492J5913
5017A3893501J65509O3402r5148l152m1401P7847J59505j5979m8287R6825Q4746
5006A4337368P0565m5206K7489N0819J12149R4806P6837L1250J08272P3803Q2784
4995A5020936j9986L9204P9343P4218P5703k2514l4981K04798J49896O8331k3909
$$ plain form
4984 15611039 15566484 15579805 15665786 15821735 15888819 15959969 15989954 16113020 16237396 16362296
4974 16362296 16573634 16607654 16776344 17209044 17561495 17994935 18436918 18860664 19273690 19778069
4964 19778069 20170753 20347300 20357907 20213272 19965497 19867491 19727348 19735396 19830500 19942890
4954 19942890 20094288 20419510 20637700 20894307 21243352 21604227 21912500 22507388 23010924
4945 23010924 23367749 23756030 24184739 24678814 25157665 25709439 26162377 26722345 27354883
4936 27354883 28046853 28806059 29412902 30072964 30815715 31475328 32205388 33065715 33859858
4927 33859858 34619942 35308508 36063018 37110895 38161542 39233868 40442077 41700003 43239924
4918 43239924 44948591 46807973 49099431 51696855 54650782 58050394 61722374 65821927
$$ packed form
4984A5611039m4555J3321Q5981J55949O7084P1150K9985J23066J24376J24900
4974A6362296K11338L4020J68690M32700L52451M33440M41983M23746M13026N04379
4964A9778069L92684J76547J0607j44635k47775r8006j40143Q048R5104J12390
4954A9942890J51398L25222K18190K56607L49045L60875L08273N94888N03536
4945B3010924L56825L88281M28709M94075M78851N51774M52938N59968O32538
4936B7354883O91970P59206O06843O60062P42751O59613P30060Q60327P94143
4927C3859858P60084O88566P54510J047877J050647J072326J208209J257926J539921
4918D3239924J708667J859382K291458K597424K953927L399612L671980M099553
$$ plain form
4910 65821927 70057297 74432181 79067553 83432755 87606743 91494904 94853921 97593140
4902 97593140 99537736 100616412 100984443 100372589 99085108 97092467 94574251 91876619
4894 91876619 88944123 85944921 83108802 80428874 78020620 75933351 73902852 72069215
4886 72069215 70284830 68507916 66725360 64743532 62623116 60385488 58145898 55872471
4878 55872471 53623090 51497672 49560061 47711672 46104596 44755401 43698426 42690310
4870 42690310 42064439 41447987 41064345 40782522 40565801 40480926 40409005 40449823 40589916 40929418
4860 40929418 41326119 41930610 42792447 43965432 45170047 46615473 48397208 50472919 52729366
4851 52729366 55252208 58136414 61340037 64919771 68809886 72762016 76531297 80251846
$$ packed form
4910F5821927M235370M374884M635372M365202M173988L888161L359017K739219
4902I7593140J944596J078676L68031o11854j287481j992641k518216k697632
4894I1876619k932496k999202k836119k679928k408254k087269k030499j833637
4886G2069215j784385j776914j782556j981828k120416k237628k239590k273427
4878E5872471k249381k125418j937611j848389j607076j349195j056975j008116
4870D2690310o25871o16452l83642k81823k16721q4875p1921M0818J40093L39502
4860D0929418L96701O04491Q61837J172985J204615J445426J781735K075711K256447
4851E2729366K522842K884206L203623L579734L890115L952130L769281L720549
$$ plain form
4843 80251846 83465580 86184182 88297554 89633839 90059086 89908897 89171324 87924623 86469887
4834 86469887 84931570 83543401 82305370 81454924 81064137 81017606 81463669 82623329 84174921
4825 84174921 86313009 88962040 92032422 95643409 99402924 103493279 107876454 112216770
4817 112216770 116251764 119775224 122437717 124364686 125264981 124835302 123068112 119917714
4809 119917714 115703838 110898254 106097080 101630695 97663469 94230649 91572405 89472225
4801 89472225 87894568 86975573 86488899 86639721 87303818 88446114 90104405 91963376 93944008
4792 93944008 95778006 97174666 98041196 98303863 97575882 95940632 93534296 90433609 86804678
4783 86804678 83013258 78862074 74759174 70865904 67105778 63538809 60384015 57489687
$$ packed form
4843H0251846L213734K718602K113372J336285M25247j50189p37573j246701j454736
4834H6469887j538317j388169j238031q50446l90787m6531M46063J159660J551592
4825H4174921K138088K649031L070382L610987L759515M090355M383175M340316
4817A12216770M034994L523460K662493J926969R00295m29679j767190l150398
4809A19917714m213876m805584m801174m466385l967226l432820k658244k100180
4801H9472225j577657r18995m86674J50822O64097J142296J658291J858971J980632
4792I3944008J833998J396660Q66530K62667p27981j635250k406336l100687l628931
4783H6804678l791420m151184m102900l893270l760126l566969l154794k894328
$$ plain form
4775 57489687 54832343 52354231 50135463 48030297 45995604 44164705 42399572 41003734
4767 41003734 39684824 38414865 37243588 36057085 35063368 34108846 33265070 32445558 31689007
4758 31689007 31057790 30497369 30008921 29455814 28932091 28669409 28406049 28298950 28142744
4749 28142744 27983384 27860131 27754421 27708232 27662491 27656181 27668324 27694070 27704204 27851873 28018802
4738 28018802 28129753 28359570 28699493 28974091 29183001 29703486 30141658 30662748 31144763
4729 31144763 31635565 32362390 32959926 33720913 34439141 35215635 36012191 36921832 37950812
4720 37950812 38999059 40220048 41640294 43025004 44498300 45972188 47598486 49503556
4712 49503556 51367716 53384319 55620698 58051624 60653825 63459476 66456487 69666497
$$ packed form
4775E7489687k657344k478112k218768k105166k034693j830899j765133j395838
4767D1003734j318910j269959j171277j186503r93717r54522q43776q19512p56551
4758C1689007o31217n60421m88448n53107n23723k62682k63360j07099j56206
4749B8142744j59360j23253j05710m6189m5741o310J2143K5746J0134J47669J66929
4738B8018802J10951K29817L39923K74598K08910N20485M38172N21090M82015
4729C1144763M90802P26825N97536P60987P18228P76494P96556R09641J028980
4720C7950812J048247J220989J420246J384710J473296J473888J626298J905070
4712D9503556J864160K016603K236379K430926K602201K805651K997011L210010
$$ plain form
4704 69666497 72970844 76329200 79755522 83274185 86868241 90404309 94038036 97503668
4696 97503668 100903006 104142460 107159219 110177446 112999450 115725828 118409328 120964306
4688 120964306 123642220 126488966 129534607 132828732 136676832 141261561 146861179 153457273
4680 153457273 161255458 170045301 179525827 188890603 198643978 207733137 215008735 219796273
4672 219796273 220482083 216892666 211555479 207753626 205270748 203374531 201912773 200536443
4664 200536443 198853999 196680368 193568666 189874299 185862969 181906151 178452842 175578755
4656 175578755 173476387 172451868 172494350 173388324 175339206 178485906 182750238 188229055
4648 188229055 195171953 203720170 213944092 225840550 239278633 253848017 269629383
$$ packed form
4704F9666497L304347L358356L426322L518663L594056L536068L633727L465632
4696I7503668L399338L239454L016759L018227K822004K726378K683500K554978
4688A20964306K677914K846746L045641L294125L848100M584729N599618O596094
4680A53457273P798185Q789843R480526R364776R753375R089159P275598M787538
4672B19796273O85810l589417n337187l801853k482878j896217j461758j376330
4664B00536443j682444k173631l111702l694367m011330l956818l453309k874087
4656A75578755k102368j024519M2482Q93974J950882L146700M264332N478817
4648A88229055O942898Q548217J0223922J1896458J3438083J4569384J5781366
$$ plain form
4641 269629383 286466655 304253824 322722702 341870126 361918037 382121508 401642443
4634 401642443 419820055 435816543 447170534 451058201 445523893 430427373 406842494
4627 406842494 377877185 348366901 321145640 296886696 275262274 256044581 238723874
4620 238723874 222685430 207541845 193326538 180051201 167858830 156482976 146088972
4613 146088972 136779561 128269989 120473313 113288452 106735900 100969368 95765626 91143704
4605 91143704 87131232 83458077 80051024 76883835 74150356 71466522 68930242 66538566
4597 66538566 64233738 62109902 60249541 58475221 56911284 55661838 54488021 53354163
4589 53354163 52355589 51446357 50567246 49688062 48899432 47919429 46789172 45710165 44705293
$$ packed form
4641B69629383J6837272J7787169J8468878J9147424K0047911K0203471J9520935
4634D01642443J8177612J5996488J1353991L887667n534308j5096520k3584879
4627D06842494k8965309k9510284k7221261k4258944k1624422j9217693j7320707
4620B38723874j6038444j5143585j4215307j3275337j2192371j1375854j0394004
4613A46088972r309411q509572p796676p184861o552552n766532n203742m621922
4605I1143704m012472l673155l407053l167189k733479k683834k536280k391676
4597F6538566k304828k123836j860361j774320j563937j249446j173817j133858
4589E3354163r98574r09232q79111q79184p88630r80003j130257j079007j004872
$$ plain form
4580 44705293 43838762 42955150 42187032 41445829 40768184 40304436 39960068 39674295 39560219
4571 39560219 39499979 39666953 39949618 40291629 40626633 41042885 41551294 41759942 41867062 41873395
4561 41873395 41688821 41187882 40338395 39315539 38288005 37173719 36098826 35206171 34543562
4552 34543562 34048462 33586150 33178978 32870897 32760312 32737856 32899764 33082650 33314089 33677891
4542 33677891 34039248 34365927 34595870 34975056 35418037 35840273 36417413 37101189 38039658
4533 38039658 39114613 40354660 41787239 43285133 44797322 46203964 47337710 48327275
4525 48327275 49128857 49668900 49972263 50057186 50073689 49936505 49556522 48987924 48260908 47226437
4515 47226437 46386598 45827263 45534876 45570276 45806814 46237844 46922933 47769253 48916269
$$ packed form
4580D4705293q66531q83612p68118p41203o77645m63748l44368k85773j14076
4571C9560219o0240J66974K82665L42011L35004M16252N08409K08648J07120O333
4561D1873395j84574n00939q49487j022856j027534j114286j074893q92655o62609
4552C4543562m95100m62312m07172l08081j10585k2456J61908J82886K31439L63802
4542C3677891L61357L26679K29943L79186M42981M22236N77140O83776R38469
4533C8039658J074955J240047J432579J497894J512189J406642J133746R89565
4525D8327275Q01582N40043L03363Q4923J6503j37184l79983n68598p27016j034471
4515D7226437q39839n59335k92387L5400K36538M31030O85089Q46320J147016
$$ plain form
4506 48916269 50382119 52152853 54346889 57097212 60434062 64359226 68903871 73985082
4498 73985082 79352942 85255400 91708262 98778529 106539808 115404881 125477484 136240783
4490 136240783 147027146 157226265 166531434 173447476 176191723 173718619 165868825 153193050
4482 153193050 138081763 123984489 111847640 101430132 92482116 84698764 77843617
4475 77843617 71727391 66123588 61200534 56763614 52878282 49492304 46574781 43795578
4467 43795578 41265368 39089156 37023099 35125342 33536275 32146007 30919114 29795069
4459 29795069 28904759 28202254 27652345 27257209 26961533 26777324 26797597 26965191 27256538 27700796
4449 27700796 28193463 28750321 29162951 29472802 29508750 29349678 28754270 28101901 27149084 26344314
$$ packed form
4506D8916269J465850J770734K194036K750323L336850L925164M544645N081211
4498G3985082N367860N902458O452862P070267P761279Q865073J0072603J0763299
4490A36240783J0786363J0199119R305169O916042K744247k473104p849794j2675775
4482A53193050j5111287j4097274j2136849j0417508q948016p783352o855147
4475G7843617o116226n603803m923054m436920l885332l385978k917523k779203
4467D3795578k530210k176212k066057j897757j589067j390268j226893j124045
4459B9795069q90310p02505n49909l95136k95676j84209K0273J67594K91347M44258
4449B7700796M92667N56858M12630L09851L5948j59072n95408o52369r52817q04770
$$ plain form
4439 26344314 25551098 24990976 24580017 24389304 24340786 24468837 24552604 24661769 24787243 24873379
4429 24873379 24694219 24261975 23458530 22428279 21398169 20441998 19610154 18831929 18131897
4420 18131897 17588012 17034193 16511496 16166201 15799569 15587750 15537850 15526277 15530236 15607123
4410 15607123 15782065 15989233 16231037 16475420 16671699 16899368 17009585 16919635 16753568 16459994
4400 16459994 16082106 15768932 15434480 15254995 15244489 15262265 15240980 15169180 15260511 15417158
4390 15417158 15472625 15446202 15196086 14875201 14403501 13892856 13275487 12861083 12485671 12041131
4380 12041131 11611471 11258016 11070261 10929556 10613946 10483806 10483630 10357543 10227876 10058445
4370 10058445 9814620 9621726 9542674 9528770 9305700 9206300 9139439 9088017 9202933 9226800
$$ packed form
4439B6344314p93216n60122m10959j90713m8518J28051Q3767J09165J25474Q6136
4429B4873379j79160m32244q03445j030251j030110r56171q31844p78225p00032
4420A8131897n43885n53819n22697l45295l66632k11819m9900j1573L959P6887
4410A5607123J74942K07168K41804K44383J96279K27669J10217q9950j66067k93574
4400A6459994l77888l13174l34452j79485j0506J7776k1285p1800R1331J56647
4390A5417158N5467k6423k50116l20885m71700n10645o17369m14404l75412m44540
4380A2041131m29660l53455j87755j40705l15610j30140j76j26087j29667j69431
4370A0058445k43825j92894p9052j3904k23070r9400o6861n1422J14916K3867
$$ plain form
4360 9226800 9242735 9316103 9313030 9465586 9392970 9364272 9399920 9352042 9276875 9183915 9160911
4349 9160911 9076733 8995556 8875777 8836876 8763141 8672073 8466909 8326009 8142312 7995278
4339 7995278 8021084 7938065 7982457 8108320 8086071 8120584 8177089 8298699 8407819 8385653 8402920
4328 8402920 8431294 8462401 8377858 8267174 8136528 7933071 7782112 7624778 7419268 7154417
4318 7154417 7038318 6926268 6868033 6654754 6675688 6690645 6541262 6435356 6353404 6284967
4308 6284967 6275527 6322969 6281944 6301309 6332791 6230452 6038988 5940685 5848488 5711766 5612307
4297 5612307 5532111 5408146 5405727 5334304 5271193 5199385 5151007 5126812 5112526 5001866 4953067
4286 4953067 4924241 4931021 4877914 4720119 4648118 4635226 4678254 4612304 4507569 4478417 4305737
$$ packed form
4360I226800J5935P3368l073J52556p2616k8698L5648m7878p5167r2960k3004
4349I160911q4178q1177j19779l8901p3735r1068k05164j40900j83697j47034
4339G995278K5806q3019M4392J25863k2249L4513N6505J21610J09120k2166J7267
4328H402920K8374L1107q4543j10684j30646k03457j50959j57334k05510k64851
4318G154417j16099j12050n8235k13279K0934J4957j49383j05906q1952o8437
4308F284967r440M7442m1025J9365L1482j02339j91464r8303r2197j36722r9459
4297E612307q0196j23965k419p1423o3111p1808m8378k4195j4286j10660m8799
4286D953067k8826O780n3107j57795p2001j2892M3028o5950j04735k9152j72680
$$ plain form
4275 4305737 4300744 4314424 4190310 4165208 4219271 4235480 4181722 4216522 4181459 4227449 4255943
4264 4255943 4251950 4243108 4162036 4148815 4109527 4055069 4128517 4157243 4084330 4092568 4189626 4114423
4252 4114423 4072292 4215974 4291713 4265340 4278656 4291332 4204811 4129497 4108410 4128338 4168535
4241 4168535 4162668 4075741 4115240 4188390 4167131 4200596 4212874 4307728 4304956 4316880 4236956 4262643
4229 4262643 4341004 4323817 4517098 4566981 4551303 4555989 4589302 4825638 4895501 4797107 4873008
4218 4873008 5110035 5185624 5276419 5384501 5512112 5718132 5844683 5856011 5926675 5997979
4208 5997979 6013869 6010990 5843277 5748751 5650067 5637679 5641881 5600082 5489351 5495472 5481964 5518895
4196 5518895 5604658 5537382 5528901 5605048 5650618 5783044 5997308 6120281 6228976 6477220 6646471
$$ packed form
4275D305737m993J3680j24114k5102N4063J6209n3758L4800l5063M5990K8494
4264D255943l993q842q1072j3221l9288n4458P3448K8726p2913Q238R7058p5203
4252D114423m2131J43682P5739k6373J3316J2676q6521p5314k1087J9928M0197
4241D168535n867q6927L9499P3150k1259L3465J2278R4854k772J1924p9924K5687
4229D262643P8361j7187J93281M9883j5678M686L3313K36336O9863r8394P5901
4218D873008K37027P5589R0795J08082J27611K06020J26551J1328P0664P1304
4208E997979J5890k879j67713r4526r8684j2388M202m1799j10731O121j3508L6931
4196E518895Q5763o7276q481P6147M5570J32426K14264J22973J08695K48244J69251
$$ plain form
4185 6646471 6815206 7106246 7370485 7645024 8027801 8331474 8656064 9091927 9360559 9771217
4175 9771217 10192003 10550628 10847432 11161063 11331077 11340828 11200507 10978801 10662245 10430442
4165 10430442 10184143 9981631 9782753 9509500 9461271 9455671 9489527 9610299 9730190 9946664
4155 9946664 10267274 10667339 11230596 11836621 12448541 13197215 14084907 15019947 15994052 16761367
4145 16761367 17406489 17905686 18178717 18178134 17916918 17418949 16773399 16096950 15346924 14599640
4135 14599640 13884713 13283088 12759261 12425122 12183689 11974312 11966827 12075174 12215656 12332145
4125 12332145 12534974 12827392 13035564 13321175 13469782 13534021 13630896 13467899 13423256 13410096
4115 13410096 13420193 13437303 13460510 13538266 13708679 13807201 13905670 13956671 14041022 13991582 13861922
$$ packed form
4185F646471J68735K91040K64239K74539L82777L03673L24590M35863K68632M10658
4175I771217M20786L58625K96804L13631J70014R751j40321k21706l16556k31803
4165A0430442k46299k02512j98878k73253m8229n600L3856J20772J19891K16474
4155I946664L20610M00065N63257O06025O11920P48674Q87692R35040R74105P67315
4145A6761367O45122M99197K73031n83k61216m97969o45550o76449p50026p47284
4135A4599640p14927o01625n23827l34139k41433k09377p485J08347J40482J16489
4125A2332145K02829K92418K08172K85611J48607O4239R6875j62997m4643j3160
4115A3410096J0097J7110K3207P7756J70413R8522R8469N1001Q4351m9440j29660
$$ plain form
4104 13861922 13571929 13296001 13090845 12747820 12531265 12441437 12495400 12455354 12409940 12489646
4094 12489646 12599658 12574096 12600111 12572367 12642748 12620400 12673474 12569358 12621075 12491848 12371989
4083 12371989 12326809 12046830 11731005 11295370 10854891 10349510 9946229 9546794 9119658 8809439
4073 8809439 8679959 8493338 8242752 8027962 7825181 7747982 7620663 7579596 7631485 7641302
4063 7641302 7731991 7832793 7830756 7905556 8043359 8174024 8540021 8741947 8984983 9202411
4053 9202411 9361884 9542471 9716656 9797384 9790126 9692743 9483800 9203322 9080709 8847029
4043 8847029 8681762 8347125 8003802 7694875 7490125 7456898 7302283 7275684 7238317 7090625
4033 7090625 7008841 6755001 6544082 6528101 6573286 6393570 6287375 6313820 6300313 6368893 6394958
$$ packed form
4104A3861922k89993k75928k05156l43025k16555q9828N3963m0046m5414P9706
4094A2489646J10012k5562K6015k7744P0381k2348N3074j04116N1717j29227j19859
4083A2371989m5180k79979l15825m35635m40479n05381m03281l99435m27136l10219
4073H809439j29480j86621k50586k14790k02781p7199j27319m1067N1889R817
4063G641302R0689J00802k037P4800J37803J30665L65997K01926K43036K17428
4053I202411J59473J80587J74185Q0728p258r7383k08943k80478j22613k33680
4043H847029j65267l34637l43323l08927k04750l3227j54615k6599l7367j47692
4033G090625q1784k53840k10919j5981M5185j79716j06195K6445j3507O8580K6065
$$ plain form
4022 6394958 6288215 6258601 6345703 6326295 6314697 6329412 6389535 6459752 6489929 6451333 6435617
4011 6435617 6487261 6601378 6764609 6867473 6833685 6968447 7054363 7066370 7038481 6857235
4001 6857235 6789363 6722800 6642986 6592071 6478003 6389650 6441636 6535411 6442288 6417737 6388963
3990 6388963 6394334 6407924 6342864 6306644 6240885 6263328 6342073 6234023 6204157 6236530 6235893 6169409
3978 6169409 6235971 6229459 6192520 6187322 6197359 6190765 6208007 6105170 6108582 6154270 6182844 6136082
3966 6136082 6211319 6183075 6103454 6200900 6224094 6369607 6308891 6255857 6157699 6082001 6136666
3955 6136666 6274176 6353522 6370487 6361747 6396233 6465224 6507276 6441642 6404746 6470507 6511187
3944 6511187 6500569 6555574 6636729 6723976 6766577 6814896 6793364 6776149 6835500 6832322 6894767 6997108
$$ packed form
4022F394958j06743k9614Q7102j9408j1598J4715O0123P0217L0177l8596j5716
4011F435617N1644J14117J63231J02864l3788J34762Q5916J2007k7889j81246
4001F857235o7872o6563p9814n0915j14068q8353N1986R3775r3123k4551k8774
3990F388963N371J3590o5060l6220o5759K2443P8745j08050k9866L2373o37o6484
3978F169409O6562o512l6939n198J0037o594J7242j02837L412M5688K8574m6762
3966F136082P5237k8244p9621R7446K3194J45513o0716n3034r8158p5698N4665
3955F136666J37510P9346J6965q740L4486O8991M2052o5634l6896O5761M0680
3944F511187j0618N5005Q1155Q7247M2601M8319k1532j7215N9351l178O2445J02341
$$ plain form
3932 6997108 7048769 6984782 7005215 7114360 7253056 7243168 7316042 7325879 7357439 7447420 7616642
3921 7616642 7686149 7676229 7681175 7790714 7932133 8120039 8142496 8158429 8298467 8419565 8412984
3910 8412984 8477172 8600524 8651997 8806214 8833186 8928878 9004995 9046766 9005330 9037697 9106846
3899 9106846 9313581 9433180 9450926 9521773 9557898 9644316 9661264 9607870 9626442 9740296 9846243
3888 9846243 9945448 10065941 10059306 10082772 10043713 10069595 10184486 10259902 10240648 10182963 10242201
3877 10242201 10249383 10381444 10498631 10546055 10484657 10474416 10640023 10787903 10741125 10787615 10844357
3866 10844357 10837488 10945960 11023391 11102511 11086919 11101589 11153035 11252148 11385721 11404768 11541971
3855 11541971 11704042 11731036 11847337 11922915 12044933 12228541 12302381 12248872 12274179 12232416
$$ packed form
3932F997108N1661o3987K0433J09145J38696r888P2874R837L1560Q9981J69222
3921G616642O9507r920M946J09539J41419J87906K2457J5933J40038J21098o581
3910H412984O4188J23352N1473J54217K6972R5692P6117M1771m1436L2367O9149
3899I106846K06735J19599J7746P0847L6125Q6418J6948n3394J8572J13854J05947
3888I846243R9205J20493o635K3466l9059K5882J14891P5416j9254n7685N9238
3877A0242201P182J32061J17187M7424o1398j0241J65607J47880m6778M6490N6742
3866A0844357o869J08472P7431P9120j5592J4670N1446R9113J33573J9047J37203
3855A1541971J62071K6994J16301P5578J22018J83608P3840n3509K5307m1763
$$ plain form
3845 12232416 12143048 11982583 11949223 12006090 12038577 11999542 12058315 12006482 12005151 11991813 11987338
3834 11987338 11978485 11944471 11998326 12005239 11972339 11960197 11979706 12041518 11986481 11960302 11913294 11982389
3822 11982389 11865898 11828008 11993555 11991091 12003583 11923667 11830715 11829131 11736258 11495835 11362867
3811 11362867 11247054 11182898 11130433 11043677 11041381 10871801 10695195 10584683 10472051 10382457
3801 10382457 10458569 10488155 10432572 10419760 10290375 10226617 10276508 10218692 10104617 10227522 10172028
3790 10172028 10049454 10052377 10117720 10090994 10063811 10118651 10190922 10197861 10229952 10357700 10371616
3779 10371616 10385623 10397307 10371421 10310099 10307692 10402915 10458417 10410289 10373831 10499572 10556147
3768 10556147 10597453 10546363 10606347 10582009 10654088 10664659 10653198 10593301 10569648 10602580 10670421
$$ packed form
3845A2232416q9368j60465l3360N6867L2487l9035N8773n1833j331j3338m475
3834A1987338q853l4014N3855O913l2900j2142J9509O1812n5037k6179m7008O9095
3822A1982389j16491l7890J65547k464J2492p9916r2952j584r2873k40423j32968
3811A1362867j15813o4156n2465q6756k296j69580j76606j10512j12632q9594
3801A0382457P6112K9586n5583j2812j29385o3758M9891n7816j14075J22905n5494
3790A0172028j22574K923O5343k6726k7183N4840P2271O939L2091J27748J3916
3779A0371616J4007J1684k5886o1322k407R5223N5502m8128l6458J25741N6575
3768A0556147M1306n1090N9984k4338P2079J0571j1461n9897k3653L2932O7841
$$ plain form
3757 10670421 10698828 10688034 10715510 10927644 11042581 11015577 11033499 11166850 11255295 11369018
3747 11369018 11352675 11506221 11463217 11549501 11610478 11566979 11705538 11808229 11839470 11887074 11805162
3736 11805162 11772599 11995904 12048032 12013292 11998258 12031642 12049201 12161091 12120016 12190747 12194082
3725 12194082 12057331 12039271 12123391 12212139 12328640 12382638 12397507 12424024 12362166 12378766 12580090
3714 12580090 12637655 12735614 12779169 12838455 12825728 12833212 12840562 12844608 12920085 12896432 12863527 12925143
3702 12925143 12912625 12864391 12853299 12784940 12774574 12779662 12781646 12839913 12871712 12951672 12847375
3691 12847375 12866617 12956147 13041038 13142438 13197678 13252622 13220355 13249574 13431836 13466404 13414077
3680 13414077 13491835 13524689 13694943 13796964 13779603 13760507 13680822 13758713 13806481 13758128 13702043
$$ packed form
3757A0670421K8407j0794K7476K12134J14937k7004J7922J33351Q8445J13723
3747A1369018j6343J53546m3004Q6284O0977m3499J38559J02691L1241M7604q1912
3736A1805162l2563K23305N2128l4740j5034L3384J7559J11890m1075P0731L335
3725A2194082j36751j8060Q4120Q8748J16501N3998J4869K6517o1858J6600K01324
3714A2580090N7565R7959M3555N9286j2727P484P350M046P5477k3653l2905O1616
3702A2925143j2518m8234j1092o8359j0366N088J984N8267L1799P9960j04297
3691A2847375J9242Q9530Q4891J01400N5240N4944l2267K9219J82262L4568n2327
3680A3414077P7758L2854J70254J02021j7361j9096p9685P7891M7768m8353n6085
$$ plain form
3669 13702043 13630344 13640234 13634554 13574848 13642668 13696465 13760315 13726441 13812141 13828825 13916104 13982806
3657 13982806 14010047 14079367 14159580 14125138 14123629 14247918 14251901 14293205 14298758 14340351 14312222 14317762
3645 14317762 14445838 14405504 14375879 14358885 14405782 14413546 14450796 14519520 14511501 14609783 14655557
3634 14655557 14797879 14932206 14920959 15012581 15179096 15147146 15192832 15296008 15498217 15642286
3624 15642286 15716413 15835627 16024586 16126658 16160976 16139215 16279848 16470976 16570987 16695411
3614 16695411 16939551 17104757 17116759 17209879 17281385 17485559 17609042 17720995 17794380 17830725
3604 17830725 18052742 18246207 18368067 18584855 18761970 18946803 19056313 19127560 19398994 19516970
3594 19516970 19676583 19823067 20009306 20255468 20417731 20523995 20622394 20746658 20989351 21279697
$$ packed form
3669A3702043p1699R890n680n9706O7820N3797O3850l3874Q5700J6684Q7279O6702
3657A3982806K7241O9320Q0213l4442j509J24289L983M1304N553M1593k8129N540
3645A4317762J28076m0334k9625j6994M6897P764L7250O8724q019R8282M5774
3634A4655557J42322J34327j1247R1622J66515l1950M5686J03176K02209J44069
3624A5642286P4127J19214J88959J02072L4318k1761J40633J91128J00011J24424
3614A6695411K44140J65206J2002R3120P1506K04174J23483J11953P3385L6345
3604A7830725K22017J93465J21860K16788J77115J84833J09510P1247K71434J17976
3594A9516970J59613J46484J86239K46162J62263J06264R8399J24264K42693K90346
$$ plain form
3584 21279697 21469811 21686215 21790470 21956930 22183486 22405271 22616441 22879101 23119494
3575 23119494 23306533 23555866 23822294 24090756 24347484 24721441 24954940 25157462 25331587
3566 25331587 25545972 26015139 26353976 26551548 26863997 27182969 27611677 28017744 28420232
3557 28420232 28767591 29197139 29595823 30028947 30559327 30906140 31398602 31781420 32139542
3548 32139542 32663910 33104799 33671164 34170727 34710227 35353794 35947673 36509186 37168845
3539 37168845 37737857 38459111 39200262 39818507 40601075 41380796 42203688 43018501 43824231
3530 43824231 44657732 45571932 46473041 47414352 48369732 49436018 50498251 51507535 52603833
3521 52603833 53716812 54830630 55980228 57075730 58206091 59382465 60607075 61867184
$$ packed form
3584B1279697J90114K16404J04255J66460K26556K21785K11170K62660K40393
3575B3119494J87039K49333K66428K68462K56728L73957K33499K02522J74125
3566B5331587K14385M69167L38837J97572L12449L18972M28708M06067M02488
3557B8420232L47359M29548L98684M33124N30380L46813M92462L82818L58122
3548C2139542N24368M40889N66365M99563N39500O43567N93879N61513O59659
3539C7168845N69012P21254P41151O18245P82568P79721Q22892Q14813Q05730
3530D3824231Q33501R14200R01109R41311R55380J066286J062233J009284J096298
3521E2603833J112979J113818J149598J095502J130361J176374J224610J260109
$$ plain form
3513 61867184 63196296 64455765 65782799 67138863 68642716 70220292 71881805 73666083
3505 73666083 75402509 77340055 79422805 81496708 83621629 85846443 88305980 90910294
3497 90910294 93665807 96655901 99802520 103107593 106891162 111005557 115305403 120011945
3489 120011945 125162157 130670395 136703034 143141414 150090106 157694778 165982706 174703032
3481 174703032 183865935 193573330 203736172 214216502 224646928 234882302 244380174
3474 244380174 252548564 258854082 263011732 264697901 263718408 260430169 255328379 248689043
3466 248689043 241090375 233087150 225081447 217167681 209587106 202365904 195577301 189237932
3458 189237932 183344687 177806602 172651630 167833595 163389545 159068294 154939287 151271055
$$ packed form
3513F1867184J329112J259469J327034J356064J503853J577576J661513J784278
3505G3666083J736426J937546K082750K073903K124921K224814K459537K604314
3497I0910294K755513K990094L146619L305073L783569M114395M299846M706542
3489A20011945N150212N508238O032639O438380O948692P604672Q287928Q720326
3481A74703032R162903R707395J0162842J0480330J0430426J0235374R497872
3474B44380174Q168390O305518M157650J686169r79493l288239n101790o639336
3466B48689043p598668q003225q005703p913766p580575p221202o788603o339369
3458A89237932n893245n538085n154972m818035m444050m321251m129007l668232
$$ plain form
3450 151271055 147738195 144322195 141215444 138225912 135362702 132714255 130130153 127754846
3442 127754846 125390849 123017400 120874328 118800426 116852907 114893354 112977227 111152022
3434 111152022 109323246 107530131 105732517 103501312 101078288 98458336 95519739 92639195
3426 92639195 90214653 87923783 85724596 83729631 81819156 80051681 78348230 76698841
3418 76698841 75212464 73941347 72618040 71653069 70716033 69694200 68755878 67935212 67239922
3409 67239922 66684186 66255401 66039136 65999626 66269883 66577714 66827971 67221541 67747648 67828551
3399 67828551 67511556 66473773 64503223 62154210 60104450 58485227 57085707 55850223
3391 55850223 54600900 53557898 52677482 51799364 50994181 50183833 49447039 48935536 48399250
$$ packed form
3450A51271055l532860l416000l106751k989532k863210k648447k584102k375307
3442A27754846k363997k373449k143072k073902j947519j959553j916127j825205
3434A11152022j828776j793115j797614k231205k423024k619952k938597k880544
3426I2639195k424542k290870k199187j994965j910475j767475j703451j649389
3418G6698841j486377j271117j323307r64971r37036j021833r38322q20666o95290
3409F7239922n55736m28785k16265l9510K70257L07831K50257L93570N26107Q0903
3399F7828551l16995j037783j970550k349013k049760j619223j399520j235484
3391E5850223j249323j043002q80416q78118q05183q10348p36794n11503n36286
$$ plain form
3382 48399250 47866524 47483280 47110142 46769331 46437061 46121417 45971531 45939798 45886429 45984736
3372 45984736 46112810 46224502 46364248 46468461 46498053 46173519 45521009 44458872 43190859
3363 43190859 42161825 41261031 40453989 39717837 39116626 38487617 37880004 37270583 36725321
3354 36725321 36329677 35830770 35441934 35053298 34572007 34156873 33835143 33416151 33121603
3345 33121603 32938230 32620281 32350975 32128735 31791340 31530184 31309177 31105551 30892609
3336 30892609 30663122 30437735 30264273 30060481 29941616 29794538 29621101 29395889 29313871 29167504
3326 29167504 29011706 28765802 28515735 28396422 28347041 28258694 28165274 28107641 27988967 27881989
3316 27881989 27814761 27695553 27473897 27348440 27268906 27142195 27013216 26907622 26834385 26738904
$$ packed form
3382D8399250n32726l83244l73138l40811l32270l15644j49886l1733n3369R8307
3372D5984736J28074J11692J39746J04213K9592l24534o52510j062137j268013
3363D3190859j029034r00794q07042p36152o01211o29009o07613o09421n45262
3354C6725321l95644m98907l88836l88636m81291m15134l21730m18992k94548
3345C3121603j83373l17949k69306k22240l37395k61156k21007k03626k12942
3336C0892609k29487k25387j73462k03792j18865j47078j73437k25212q2018j46367
3326B9167504j55798k45904k50067j19313m9381q8347r3420n7633j18674j06978
3316B7881989o7228j19208k21656j25457p9534j26711j28979j05594p3237r5481
$$ plain form
3306 26738904 26513447 26367303 26152947 26033245 25885014 25646601 25505304 25346808 25144012
3297 25144012 24937204 24767898 24488041 24268443 24119266 23859913 23756453 23548452 23275632
3288 23275632 23140547 23003692 22873491 22680437 22570150 22421617 22158842 22024978 21841441
3279 21841441 21807588 21666071 21574733 21478808 21384101 21273899 21034644 20755413 20501581 20413015
3269 20413015 20167968 20039603 19795201 19504329 19308658 19159290 18878293 18606132 18416019
3260 18416019 18270727 18158744 17993012 17939995 17710666 17683028 17643643 17495328 17381801 17236099
3250 17236099 17300523 17178756 16999397 16980694 16982545 16996486 17033778 16983000 16978072 16996910 16985987
3239 16985987 16897596 16838568 16878696 16819951 16775116 16737819 16680970 16758535 16656950 16547237 16686825
$$ packed form
3306B6738904k25457j46144k14356j19702j48231k38413j41297j58496k02796
3297B5144012k06808j69306k79857k19598j49177k59353j03460k08001k72820
3288B3275632j35085j36855j30201j93054j10287j48533k62775j33864j83537
3279B1841441l3853j41517r1338r5925r4707j10202k39255k79231k53832q8566
3269B0413015k45047j28365k44402k90872j95671j49368k80997k72161j90113
3260A8416019j45292j11983j65732n3017k29329k7638l9385j48315j13527j45702
3250A7236099O4424j21767j79359j8703J851J3941L7292n0778m928J8838j0923
3239A6985987q8391n9028M0128n8745m4835l7297n6849P7565j01585j09713J39588
$$ plain form
3228 16686825 16811847 16827612 16854883 16948803 17029854 17035373 17119621 17153213 17239166 17434518 17497262
3217 17497262 17592084 17792564 17853651 18031046 18213811 18334683 18543270 18639022 18901833 19227564
3207 19227564 19488833 19732026 20061236 20282148 20534612 20714215 20957639 21153177 21188148 21305228
3197 21305228 21384713 21601325 21765585 21955637 22154679 22320695 22514645 22607471 22807025 23047070
3187 23047070 23391665 23657094 24013815 24384205 24729646 25201564 25676164 26147455 26739268
3178 26739268 27327193 27894525 28520733 29243174 29983198 30728567 31492188 32457908 33441958
3169 33441958 34444726 35462610 36566858 37779430 38937567 40105168 41431560 42706380
3161 42706380 43813661 44987996 46312431 47503644 48593837 49638052 50584980 51530353
$$ packed form
3228A6686825J25022J5765K7271R3920Q1051N519Q4248L3592Q5953J95352O2744
3217A7497262R4822K00480O1087J77395J82765J20872K08587R5752K62811L25731
3207A9227564K61269K43193L29210K20912K52464J79603K43424J95538L4971J17080
3197B1305228P9485K16612J64260J90052J99042J66016J93950R2826J99554K40045
3187B3047070L44595K65429L56721L70390L45441M71918M74600M71291N91813
3178B6739268N87925N67332O26208P22441P40024P45369P63621R65720R84050
3169C3441958J002768J017884J104248J212572J158137J167601J326392J274820
3161D2706380J107281J174335J324435J191213J090193J044215R46928R45373
$$ plain form
3153 51530353 52363743 53128696 53948084 54882959 55805568 56920031 58108596 59400394 60873353
3144 60873353 62397574 64249988 66170438 68193166 70619896 73058653 75863643 78858438
3136 78858438 81958960 85246513 88673598 92008906 95154060 98006424 100290984 101910216
3128 101910216 102741664 102796906 102099672 100818811 99415022 97876591 96445969 95342508 94646489
3119 94646489 94196364 94250920 94550564 95340162 96408351 97735373 99366191 101060840 102957183
3110 102957183 104794586 106611544 108494508 110165792 111574140 112749059 113571051 113845569
3102 113845569 113596760 112878745 111885666 110296589 108297715 106058356 103488289 100986875
3094 100986875 98351354 95799583 93476416 91578395 89785487 88306327 87142221 86365567
$$ packed form
3153E1530353Q33390P64953Q19388R34875R22609J114463J188565J291798J472959
3144F0873353J524221J852414J920450K022728K426730K438757K804990K994795
3136G8858438L100522L287553L427085L335308L145154K852364K284560J619232
3128A01910216Q31448N5242o97234j280861j403789j538431j430622j103461o96019
3119I4646489m50125N4556K99644P89598J068189J327022J630818J694649J896343
3110A02957183J837403J816958J882964J671284J408348J174919Q21992K74518
3102A13845569k48809p18015r93079j589077j998874k239359k570067k501414
3094A00986875k635521k551771k323167j898021j792908j479160j164106p76654
$$ plain form
3086 86365567 85702363 85138253 84754815 84398538 83800258 83152638 82260568 81159236 79785918
3077 79785918 78091550 76203092 73958362 71623940 69021059 66339909 63715499 61127693
3069 61127693 58553917 56073695 53842992 51695895 49645745 47841528 46076065 44431038
3061 44431038 42977616 41657129 40311134 39194088 38160117 37116638 36120385 35200313
3053 35200313 34388946 33398470 32475692 31612139 30728045 29810847 28932844 28091911 27192996
3044 27192996 26413012 25667315 24797010 24123474 23485026 22934006 22344808 21673530 21132495
3035 21132495 20566957 19907490 19354067 18818005 18369515 17926863 17473144 17039950 16730108
3026 16730108 16457554 16090767 15795557 15492155 15285197 15048365 14846210 14588302 14363836
$$ packed form
3086H6365567o63204n64110l83438l56277n98280o47620q92070j101332j373318
3077G9785918j694368j888458k244730k334422k602881k681150k624410k587806
3069F1127693k573776k480222k230703k147097k050150j804217j765463j645027
3061D4431038j453422j320487j345995j117046j033971j043479r96253r20072
3053C5200313q11367r90476r22778q63553q84094r17198q78003q40933q98915
3044B7192996p79984p45697q70305o73536o38448n51020n89198o71278n41035
3035B1132495n65538o59467n53423n36062m48490m42652m53719m33194l09842
3026A6730108k72554l66787k95210l03402k06958k36832k02155k57908k24466
$$ plain form
3017 14363836 14113600 13923458 13698503 13430343 13315651 13162205 12978474 12680889 12383283
3008 12383283 12143373 11907328 11632173 11366979 11115115 10848567 10607119 10404005 10200248
2999 10200248 9992140 9829626 9601391 9380999 9378915 9276594 9078677 8952895 8949654 9008508
2989 9008508 8778346 8652202 8520792 8364627 8269949 8162933 8060502 7919236 7832879 7692273
2979 7692273 7438183 7206601 7138416 7026823 6932692 6818141 6610056 6423524 6316274 6262817
2969 6262817 6230965 6195659 5997620 5852528 5701541 5635297 5524353 5426453 5271056 5177039
2959 5177039 5117856 5047349 5008656 4917357 4840413 4642916 4503409 4515915 4414517 4389345 4448626
2948 4448626 4274054 4244234 4193047 4121855 4146689 4142265 4114585 4148625 4143173 3995361 3871748
$$ packed form
3017A4363836k50236j90142k24955k68160j14692j53446j83731k97585k97606
3008A2383283k39910k36045k75155k65194k51864k66548k41448k03114k03757
2999A0200248k08108j62514k28235k20392k084j02321j97917j25782l241N8854
2989I008508k30162j26144j31410j56165r4678j07016j02431j41266q6357j40606
2979G692273k54090k31582o8185j11593r4131j14551k08085j86532j07250n3457
2969F262817l1852l5306j98039j45092j50987o6244j10944r7900j55397r4017
2959E177039n9183p0507l8693r1299p6944j97497j39507J2506j01398k5172N9281
2948D448626j74572k9820n1187p1192K4834m424k7680L4040n452j47812j23613
$$ plain form
2937 3871748 3830865 3842197 3840837 3867154 3844554 3851169 3800951 3708779 3594101 3528161 3574473 3602838
2925 3602838 3531864 3488161 3496144 3452810 3449769 3305343 3340492 3375991 3358175 3333215 3228990
2914 3228990 3271239 3387376 3362764 3302824 3178727 3156673 3114751 3091774 3045566 3020455 3037124
2903 3037124 3035630 3028400 2933403 2915386 2848902 2947782 2985462 2927236 2904153 2809882 2829621 2902325
2891 2902325 2974681 2918407 2801670 2777899 2770911 2774597 2805491 2646843 2710875 2745678 2736046 2753162
2879 2753162 2635425 2803530 2754852 2732107 2673009 2740755 2710299 2605163 2653420 2675983 2639753
2868 2639753 2733418 2718569 2715061 2782795 2680231 2651414 2713364 2682537 2624881 2631818 2710846 2660196
2856 2660196 2577407 2627338 2532826 2542894 2617371 2673336 2640237 2627424 2660003 2692921 2674477
$$ packed form
2937C871748m0883J1332j360K6317k2600O615n0218r2172j14678o5940M6312K8365
2925C602838p0974m3703P983m3334l041j44426L5149L5499j7816k4960j04225
2914C228990M2249J16137k4612n9940j24097k2054m1922k2977m6208k5111J6669
2903C037124j494p230r4997j8017o6484R8880L7680n8226k3083r4271J9739P2704
2891B902325P2356n6274j16737k3771o988L686L0894j58648O4032L4803r632J7116
2879B753162j17737J68105m8678k2745n9098O7746l0456j05136M8257K2563l6230
2868B639753R3665j4849l508O7734j02564k8817O1950l0827n7656O937P9028n0650
2856B660196q2789M9931r4512J0068P4477N5965l3099j2813L2579L2918j8444
$$ plain form
2845 2674477 2720220 2642022 2683005 2610464 2552514 2600051 2566818 2470592 2497281 2549106 2625795
2834 2625795 2771483 2585119 2568515 2574064 2578180 2650160 2630867 2644173 2685569 2726704 2703227
2823 2703227 2764165 2724871 2688791 2764495 2762837 2736031 2685025 2591719 2480809 2452100 2518604
2812 2518604 2472950 2338350 2398165 2436033 2441733 2235701 2193096 2230635 2277363 2189510 2192035
2801 2192035 2236740 2151936 2206789 2191642 2149022 2161994 2079315 2058691 2102233 2023395 2052158
2790 2052158 2094275 2089595 2041306 2017875 2074351 2019011 1938659 1785300 1754823 1841682 1749216
2779 1749216 1719834 1730572 1782282 1717244 1729805 1597931 1629385 1616015 1508658 1601270 1621197
2768 1621197 1571598 1560148 1619280 1638922 1488940 1608239 1616743 1535097 1539674 1579371 1472821
$$ packed form
2845B674477M5743p8198M0983p2541n7950M7537l3233r6226K6689N1825P6689
2834B625795J45688j86364j6604N549M116P1980j9293J3306M1396M1135k3477
2823B703227O0938l9294l6080P5704j658k6806n1006r3306j10910k8709O6504
2812B518604m5654j34600N9815L7868N700k06032m2605L7539M6728q7853K525
2801B192035M4705q4804N4853j5147m2620J2972q2679k0624M3542p8838K8763
2790B052158M2117m680m8289k3431N6476n5340q0352j53359l0477Q6859r2466
2779A749216k9382J0738N1710o5038J2561j31874L1454j3370j07357R2612J9927
2768A621197m9599j1450N9132J9642j49982J19299Q504q1646M577L9697j06550
$$ plain form
2757 1472821 1512627 1543403 1429184 1428403 1402785 1435089 1449467 1453464 1471911 1395207 1331464 1256130
2745 1256130 1176456 1351304 1331379 1490870 1375810 1243328 1196875 1295745 1295883 1152785 1145110
2734 1145110 1154472 1143117 1129690 1102385 1100728 1147717 1120664 1165447 1146903 1115129 1063368 1101023
2722 1101023 1061526 1041594 1051754 1006932 1005309 1028890 1023586 950162 874423 876953 983498 1042362
2710 1042362 1052537 924905 897159 888687 892024 777471 859154 1013320 1005292 841376 909392
2699 909392 880885 904817 868837 758831 890511 912573 865629 855668 757125 716728 820086
2688 820086 822852 828325 736628 801272 792217 746940 793409 852781 810968 787599 685654 685975
2676 685975 739274 645932 669136 619342 595533 636918 588138 524140 496062 540117 463563 582247
$$ packed form
2757A472821L9806L0776j14219p81k5618L2304J4378L997J8447p6704o3743p5334
2745A256130p9674J74848j9925J59491j15060j32482m6453R8870J38j43098p675
2734A145110R362j1355j3427k7305j657M6989k7053M4783j8544l1774n1761L7655
2722A101023l9497j9932J0160m4822j623K3581n304p3424p5739K530J06545N8864
2710A042362J0175j27632k7746q472L337j14553Q1683J54166q028j63916O8016
2699I09392k8507K3932l5980j10006J31680K2062m6944r961r8543m0397J03358
2688H20086K766N473r1697O4644r055m5277M6469N9372m1813k3369j01945L21
2676F85975N3299r3342K3204m9794k3809M1385m8780o3998k8078M4055p6554J18684
$$ plain form
2664 582247 639830 611590 577055 510213 458025 472863 501984 490693 413009 452954 484639 447389
2652 447389 511805 651285 605439 566375 450570 455398 487582 540346 499655 536294 537254 463587
2640 463587 476793 474899 473973 454817 387282 340521 360122 333363 284650 295748 346086 309004
2628 309004 447100 404868 378520 392292 437454 309658 167406 333351 377325 355874 377114
2617 377114 404815 322651 278273 208784 212924 273373 217661 308006 278837 298469 212157 153725
2605 153725 215187 254152 292951 308812 191032 166114 188375 209557 286294 368505 396388
2594 396388 276005 281987 285374 297266 254281 249194 172324 132757 181384 159309 201636 133894
2582 133894 122681 54904 190700 201485 155183 127045 84191 109473 95879 139234 133050 147504
$$ packed form
2664E82247N7583k8240l4535o6842n2188J4838K9121j1291p7684L9945L1685l7250
2652D47389O4416J39480m5846l9064j15805M828L2184N2764m0691L6639R60p3667
2640D63587J3206j894r26j9156o7535m6761J9601k6759m8713J1098N0338l7082
2628C09004J38096m2232k6348J3772M5162j27796j42252J65945M3974k1451K1240
2617C77114K7701q2164m4378o9489M140O0449n5712R0345k9169J9632q6312n8432
2605A53725O1462L8965L8799J5861j17780k4918K2261K1182P6737Q2211K7883
2594C96388j20383N982L387J1892m2985n087p6870l9567M8627k2075M2327o7742
2582A33894j1213o7777J35796J0785m6302k8138m2854K5282j3594M3355o184J4454
$$ plain form
2570 147504 300376 280812 376476 295785 128250 142760 121431 115604 54987 55374 114619 176744
2558 176744 126224 107430 184506 240339 110981 26484 114288 60646 87960 109884 133403
2547 133403 91378 36205 25195 70529 139800 101337 109748 31350 19773 16965 97463 180760
2535 180760 180703 161167 141146 51003 -69956 51147 145205 137680 211652 81172 8800 91795
2523 91795 29035 120283 276696 84016 22916 121664 120165 82981 140568 22008 -38475
2512 -38475 -31601 21161 44047 15091 3585 89829 158637 151202 148853 94722 88735 25276 -10536
2499 -10536 28575 -20522 4795 27476 10331 -13995 69952 121046 26942 -71995 -61233 3738
2487 3738 56559 219263 149889 29458 -19297 8079 -473 -122055 22228 45073 130721
$$ packed form
2570A47504J52872j9564R5664q0691j67535J4510k1329n827o0617L87N9245O2125
2558A76744n0520j8794P7076N5833j29358q4497Q7804n3642K7314K1924K3519
2547A33403m2025n5173j1010M5334O9271l8463Q411p8398j1577k808Q0498Q3297
2535A80760n7j9536k0021r0143j20959J21103R4058p525P3972j30480p2372Q2995
2523I1795o2760R1248J56413j92680o1100R8748j499l7184N7587j18560o0483
2512c8475O874N2762K2886k8956j1506Q6244O8808p435k349n4131n987o3459l5812
2499a0536L9111m9097K5317K2681j7145k4326Q3947N1094r4104r8937J0762O4971
2487C738N2821J62704o9374j20431m8755K7376q552j21582J44283K2845Q5648
$$ plain form
2476 130721 115879 -66384 23211 55515 183029 216585 117577 147375 140358 68487 37166
2465 37166 17262 74779 90561 136967 101364 4094 14573 13930 -40406 -96500 -21211 37953
2453 37953 -36337 52417 117803 139878 103046 44196 28572 -4938 -21961 28537 76785 37284
2441 37284 113583 141646 52971 71690 99000 88917 96550 144850 120482 105189 196322 109634
2429 109634 -6202 135860 172736 81031 2147 -39894 -26904 -31201 35298 88313 48721
2418 48721 -16776 51089 179150 258801 143270 117187 69979 30359 54693 120522 164880
2407 164880 195330 251301 52637 17734 96014 88300 52981 158461 268732 311368 331151
2396 331151 181390 81013 154465 175429 223541 293300 316062 387255 421294 381012 345292
$$ packed form
2476A30721j4842j82263Q9595L2304J27514L3556r9008K9798p017p1871l1321
2465C7166j9904N7517J5782M6406l5603r7270J0479o43n4336n6094P5289N9164
2453C7953p4290Q8754O5386K2075l6832n8850j5624l3510j7023N0498M8248l9501
2441C7284P6299K8063q8675J8719K7310j0083P633M8300k4368j5293R1133q6688
2429A09634j15836J42062L6876r1705p8884m2041J2990m297O6499N3015l9592
2418D8721o5497O7865J28061P9651j15531k6083m7208l9620K4334O5829M4358
2407A64880L0450N5971j98664l4903P8280p714l5319J05480J10271M2636J9783
2396C31151j49761j00377P3452K0964M8112O9759K2762P1193L4039m0282l5720
$$ plain form
2385 345292 354662 388662 373186 383591 343258 307044 404545 409301 359598 374165 466401 464484
2373 464484 508180 479889 529518 552239 647424 672047 589356 617045 781306 891029 867389
2362 867389 866026 908794 1007792 1127739 1106216 1181642 1280842 1434948 1691911 1759015 1890982
2351 1890982 2040037 2295712 2510628 2786854 3127671 3508906 3779086 4116998 4516665 5034734
2341 5034734 5543048 6108997 6900698 7914644 9244711 10763258 12693434 14800852 17058349
2332 17058349 18768451 19468028 18767607 17581105 16920118 15083436 12643841 10930081 9701396
2323 9701396 8600542 7724888 6892646 6213320 5612872 5208202 4856694 4570486 4261125
2314 4261125 3978732 3709384 3401222 3107210 2852136 2678231 2443812 2231685 2130635 1886810
$$ packed form
2385C45292R370L4000j5476J0405m0333l6214R7501M756m9703J4567R2236j917
2373D64484M3696k8291M9629K2721R5185K4623q2691K7689J64261J09723k3640
2362H67389j363M2768R8998J19947k1523P5426R9200J54106K56963O7104J31967
2351A890982J49055K55675K14916K76226L40817L81235K70180L37912L99667N18069
2341E034734N08314N65949P91701J013946J330067J518547J930176K107418K257497
2332A7058349J710102O99577p00421j186502o60987j836682k439595j713760j228685
2323I701396j100854q75654q32242o79326o00448m04670l51508k86208l09361
2314D261125k82393k69348l08162k94012k55074j73905k34419k12127j01050k43825
$$ plain form
2304 1886810 1774180 1743285 1564543 1529950 1349720 1317311 1280780 1180436 1067653 1039272
2294 1039272 1102961 1053925 904559 826901 759419 752231 730965 544540 501524 533505 525022
2283 525022 553622 549328 538614 589112 516671 484509 578781 524793 454600 453218 404736 435540
2271 435540 363099 263158 342390 319547 340006 456670 408094 464247 419995 269447 308455
2260 308455 275301 321956 300900 274420 317032 211287 159460 231530 153670 249740 280238
2249 280238 168138 198398 175555 81070 133400 158152 108861 123983 256530 249789 262770
2238 262770 194271 142086 41155 25334 120452 205348 78107 100924 147319 183324 148882
2227 148882 123578 136494 37507 10970 13947 13720 70881 123357 118844 80770 119065 286942
$$ packed form
2304A886810j12630l0895j78742l4593j80230l2409l6531j00344j12783k8381
2294A039272O3689m9036j49366p7658o7482p188k1266j86425m3016L1981q483
2283E25022K8600m294j0714N0498p2441l2162R4272n3988p0193j382m8482L0804
2271D35540p2441r9941P9232k2843K0459J16664m8576N6153m4252j50548L9008
2260C08455l3154M6655k1056k6480M2612j05745n1827P2070p7860R6070L0498
2249B80238j12100L0260k2843r4485N2330K4752m9291J5122J32547o741J2981
2238B62770o8499n2185j00931j5821R5118Q4896j27241K2817M6395L6005l4442
2227A48882k5304J2916r8987k6537K977k27N7161N2476m513l8074L8295J67877
$$ plain form
2215 286942 261995 160805 77116 44621 98062 146282 53790 24771 31565 -5107 6569 42619
2203 42619 4076 49269 69484 49019 -36284 21338 115408 90078 -53225 -46000 7612 63924
2191 63924 172279 165319 36847 -5619 -7362 -323 -72756 -55733 -109342 -118555 -118256 -71527 -43895
2178 -43895 -51025 18749 -78159 -741 23875 -14444 61193 91570 121627 133399 60083 -9716
2166 -9716 42387 99128 43518 34769 143789 151697 177168 201345 156451 27779 7351 -59237
2154 -59237 -32478 -4968 -80740 -71076 -53569 -35117 24248 -25112 -86447 -14296 -54293 -74431
2142 -74431 -41414 30326 52339 95065 107807 -8010 -89750 -57430 -39801 -5112 61786 75353
2130 75353 112296 -1808 -77031 -83259 10101 46585 -111762 -92463 -65107 15039 57958 -59171
$$ packed form
2215B86942k4947j01190q3689l2495N3441M8220r2492k9019O794l6672J1676L6050
2203D2619l8543M5193K0215k0465q5303N7622R4070k5330j43303P225N3612N6312
2191F3924J08355o960j28472m2466j743P039p2433J7023n3609r213K99M6729K7632
2178d3895p130O9774r6908P7418K4616l8319P5637L0377L0057J1772p3316o9799
2166i716N2103N6741n5610q749J09020P908K5471K4177m4894j28672k0428o6588
2154e9237K6759K7510p5772R664J7507J8452N9365m9360o1335P2151l9997k0138
2142g4431L3017P1740K2013M2726J2742j15817q1740L2320J7629L4689O6898J3567
2130G5353L6943j14104p5223o228R3360L6484j58347J9299K7356Q0146M2919j17129
$$ plain form
2118 -59171 2301 135554 71517 -45983 46682 79117 113788 84976 49883 132289 60630
2107 60630 -52085 -10811 -10483 -119376 -127551 -64176 -37859 11661 4056 -49473 -103236 -117145
2095 -117145 39569 69849 26942 -40800 4758 46400 50742 71330 30380 -31072 -65897 84054
2083 84054 164357 66001 -48567 -124828 -142244 -17751 6684 -84215 22580 99948 79165
2072 79165 57676 132385 60255 16510 34491 104101 9662 15091 -57232 -54199 64626 104608
2060 104608 123363 102104 102662 -86000 -151024 -35331 30761 -8993 20343 180632 204474
2049 204474 85793 87990 49599 -65261 -104575 -106696 -28029 -29026 -48072 -112527 1345 22177
2037 22177 -17775 17320 16003 48859 -64421 -140884 -12848 5488 -67539 -19177 -85180 -97948
$$ packed form
2118e9171O1472J33253o4037j17500R2665L2435L4671k8812l5093Q2406p1659
2107F0630j12715M1274L28j08893q175O3375K6317M9520p605n3529n3763j3909
2095a17145J56714L0280m2907o7742M5558M1642M342K0588m0950o1452l4825J49951
2083H4054Q0303r8356j14568p6261j7416J24493K4435r0899J06795P7368k0783
2072G9165k1489P4709p2130m3745J7981O9610r4439N429p2323L033J18825L9982
2060A04608J8755k1259N58j88662o5024J15693O6092l9754K9336J60289K3842
2049B04474j18681K197l8391j14860l9314k121P8667r97j9046o4455J13872K0832
2037B2177l9952L5095j317L2856j13280p6463J28036J8336p3027M8362o6003j2768
$$ plain form
2025 -97948 -72095 -116746 -140665 -160834 -118414 -11514 -69089 -127692 -41872 -14490 57379 -8663
2013 -8663 -61183 59137 98322 45884 -93941 -34075 -74848 -70351 73615 71370 -17725 -70682
2001 -70682 -42097 -70430 -122 23302 106220 8597 -118657 -181019 -133714 -24379 -77846
1990 -77846 -70240 -4836 -24844 -115793 -42699 16540 11003 -44601 -63224 -22128 -52182 -125845
1978 -125845 -96670 -30702 -33742 -36283 69755 114307 90602 66892 116637 82297 45414 10627
1966 10627 -1165 -77813 -97690 -38461 3880 -117552 -93544 -117939 -133734 -145708 -79518 -50371
1954 -50371 -61387 -54025 -71794 -130552 -115616 -85729 -142213 -78620 -13874 -90209 -38154 -11237
1942 -11237 -79114 -99394 -337 -3585 -23015 -18104 2773 -39427 -117638 -144208 -64624 14244
$$ packed form
2025i7948K5853m4651k3919k0169M2420J06900n7575n8603Q5820K7382P1869o6042
2013h663n2520J20320L9185n2438j39825N9866m0773M497J43966k245q9095n2957
2001g0682K8585k8333P0308K3424Q2918r7623j27254o2362M7305J09335n3467
1990g7846P606O5404k0008r0949P3094N9239n537n5604j8623M1096l0054p3663
1978a25845K9175O5968l040k541J06038M4552k3705k3710M9745l4340l6883l4787
1966A0627j1792p6648j9877N9229M2341j21432K4008k4395j5795j1974O6190K9147
1954e0371j1016P362j7769n8758J4936K9887n6484O3593O4746p6335N2055K6917
1942a1237o7877k0280R9057l248j9430M911K0877m2200p8211k6570P9584P8868
$$ plain form
1930 14244 -66581 -37985 -67423 -78133 -45649 -71296 -156525 -141474 -84967 16025 -66393 -18872
1918 -18872 -9321 -104670 -110409 -75884 -147112 -149001 -41477 25757 51505 31707 -6352 -10479
1906 -10479 -37147 -84140 -75607 -49681 -105671 -62554 -86438 -78917 -69846 -63219 64955 151840
1894 151840 40190 -3213 40443 22139 19204 25900 21182 524 -21249 3401 -16854 -45582
1882 -45582 89840 53153 97931 74049 12384 -346 -109338 -19679 443 -47867 -108676
1871 -108676 -123642 -36718 -42839 -20898 31793 -112007 12157 -12024 -63403 -121914 -71062
1860 -71062 -981 -19643 14846 -20623 -139242 -155475 -32750 -159371 -72170 5596 -21174
1849 -21174 -18573 -74696 -62861 -119491 -48091 -15629 1714 -25761 -20568 49052 -25134 22727
$$ packed form
1930A4244q0825K8596k9438j0710L2484k5647q5229J5051N6507J00992q2418M7521
1918a8872R551r5349n739L4525p1228j889J07524O7234K5748j9798l8059m127
1906a0479k6668m6993Q533K5926n5990M3117k3884P521R071O627J28174Q6885
1894A51840j11650m3403M3656j8304k935O696m718k0658k1773K4650k0255k8728
1882d5582J35422l6687M4778k3882o1665j2730j08992Q9659K0122m8310o0809
1871a08676j4966Q6924o121K1941N2691j43800J24164k4181n1379n8511N0852
1860g1062P0081j8662L4489l5469j18619j6233J22725j26621Q7201P7766k6770
1849b1174K601n6123J1835n6630P1400L2462J7343k7475N193O9620p4186M7861
$$ plain form
1837 22727 146397 184203 149931 88186 -4486 48764 -16280 -55356 -139983 -122272 -42102 -3070
1825 -3070 64484 54408 -103551 -112239 -72637 -19032 16890 -80416 -70192 11822 47880 49845
1813 49845 120538 96076 33682 -47706 -41706 8666 -44862 -107035 -50085 77449 24907 16634
1801 16634 -54961 -78454 -20009 -18325 5031 -66706 -96608 -92607 3057 -31687 -153930 -130806
1789 -130806 -56250 -69972 -37092 94823 57159 65389 80414 78760 88876 70688 60465 24802
1777 24802 -48287 -98595 -141854 19348 127873 20864 36945 50736 51796 12584 2960 -10945
1765 -10945 13837 -29778 -48398 -12060 -44681 -68102 -28585 85733 151697 46090 -78331
1754 -78331 -67207 13028 41078 83659 -40282 -99695 -100770 -238581 -112237 -64088 62876
$$ packed form
1837B2727J23670L7806l4272o1745r2672N3250o5044l9076q4627J7711Q0170L9032
1825c070O7554j0076j57959q688L9602N3605L5922r7306J0224Q2014L6058J965
1813D9845P0693k4462o2394q1388O000N0372n3528o2173N6950J27534n2542q273
1801A6634p1595k3493N8445J684K3356p1737k9902M001R5664l4744j22243K3124
1789a30806P4556j3722L2880J31915l7664Q230J5025j654J0116j8188j0223l5663
1777B4802p3089n0308m3259J61202J08525j07009J6081J3791J060l9212r624j3905
1765a0945K4782m3615j8620L6338l2621k3421L9517J14318O5964j05607j24421
1754g8331J1124Q0235K8050M2581j23941n9413j075j37811J26344M8149J26964
$$ plain form
1743 62876 60889 11438 -3991 -71901 -113303 -68919 -22459 -45878 -144131 -119759 12615 -22814
1731 -22814 -56762 -37525 -68928 -26230 -39057 -54831 -17370 -98480 -139004 -90624 -65668 -31965
1719 -31965 -58008 -69301 -8601 -8974 -33737 -86641 -90325 -92054 -25072 16288 69647 65881 26371
1706 26371 25520 63474 -22209 -46721 43308 31739 -42286 -69480 -95405 -64924 -2029 48120
1694 48120 91388 87883 13610 -67593 62090 28093 87590 68487 -6100 -56901 32907 97740
1682 97740 69813 -23078 -84406 -6019 -74098 -1470 -36426 -106724 -123682 -69418 41972 49463
$$ packed form
1743F2876j987m9451j5429o7910m1402M4384M6460k3419r8253K4372J32374l5429
1731b2814l3948J9237l1403M2698j2827j5774L7461q1110m0524M8380K4956L3703
1719c1965k6043j1293O0700l73k4763n2904l684j729O6982M1360N3359l766l9510
1706B6371q51L7954q5683k4512R0029j1569p4025k7194k5925L0481O2895N0149
1694D8120M3268l505p4273q1203J29683l3997N9497j9103p4587n0801Q9808O4833
1682I7740k7927r2891o1328P8387o8079P2628l4956p0298j6958N4264J11390P491
$$ [...]
##END NTUPLES=NMR SPECTRUM
##END=
