##TITLE=1H_EC-3361(2)
 200.13MHz, CDCl3,
 8 sc
 
 3.9.2025
##JCAMPDX= 6.0         $$ Bruker NMR JCAMP-DX V2.0
##DATA TYPE= NMR SPECTRUM
##DATA CLASS= NTUPLES
##ORIGIN= UXNMR, Bruker Analytische Messtechnik GmbH
##OWNER= pz
$$ XWIN-NMR		Version 3.5
$$ Wed Sep  3 13:52:46 2025 Russian Standard Time (UT+4h)  she@DPX200
##.OBSERVE FREQUENCY= 200.1313
##.OBSERVE NUCLEUS= ^1H
##.ACQUISITION MODE= SIMULTANEOUS
##.ACQUISITION SCHEME= undefined
##.AVERAGES= 8
##.DIGITISER RES= 18
##SPECTROMETER/DATA SYSTEM= spect
##.PULSE SEQUENCE= zg30
##.SOLVENT NAME= CDCl3
##.SHIFT REFERENCE= (INTERNAL, CDCl3, 0, 15.5243)
##AUDIT TRAIL= $$ (NUMBER, WHEN, WHO, WHERE, WHAT)
$$ ##TITLE= Audit trail, XWIN-NMR		Version 3.5
$$ ##JCAMPDX= 5.01
$$ ##ORIGIN= Bruker BioSpin GmbH
$$ ##OWNER= she
$$ F:/spectra/data/she/nmr/H-C/1/pdata/1/auditp.txt
$$ ##AUDIT TRAIL=  $$ (NUMBER, WHEN, WHO, WHERE, WHAT)
(   1,<2025-09-03 13:51:28.10 +0400>,<she>,<DPX200>,
      <created by zg, POWCHK disabled, PULCHK disabled
       configuration hash MD5:
       00 E9 B6 7A A2 85 ED C7 34 08 36 98 17 FE 4E 26
       data hash MD5: 16K
       35 31 2A 39 03 44 2D 8E 8E 2D 83 9D F3 9B 92 3D>)
(   2,<2025-09-03 13:51:30.85 +0400>,<she>,<DPX200>,
      <Start of raw data processing
       efp BC_mod = 2 LB = 0.25 FT_mod = 6 PKNL = 1 PHC0 = -1562.611 PHC1 = 14.19228 SI = 16K 
       data hash MD5: 16K
       A4 84 8F BC BA 3D 85 BC 46 CC B0 58 82 FA EF FA>)
(   3,<2025-09-03 13:51:58.34 +0400>,<she>,<DPX200>,
      <pk PHC0 = 0.5519676 PHC1 = -3.2 
       data hash MD5: 16K
       2D D3 E9 E8 AF E7 ED F5 38 39 22 7A 0A 90 BE 76>)
$$ ##END=
$$ 
$$ hash MD5
$$ 8B 4F D5 54 9D 9E D3 84 16 B2 54 15 8B B8 41 8C
##$RELAX= 
##$RELAX= 
##$RELAX= 
##$RELAX= 
##$RELAX= 
##$RELAX= 
$$ Bruker specific parameters
$$ --------------------------
##$DU= <F:/spectra>
##$EXPNO= 1
##$NAME= <H-C>
##$PROCNO= 1
##$TYPE= <nmr>
##$USER= <she>
##$AMP= (0..31)
100 100 100 100 100 100 100 100 100 100 100 100 100 100 100 100 100 100 
100 100 100 100 100 100 100 100 100 100 100 100 100 100 
##$AQSEQ= 0
##$AQ_mod= 1
##$AUNM= <au_zg>
##$AUTOPOS= <>
##$BF1= 200.13
##$BF2= 200.13
##$BF3= 200.13
##$BF4= 200.13
##$BF5= 200.13
##$BF6= 200.13
##$BF7= 200.13
##$BF8= 200.13
##$BYTORDA= 1
##$CFDGTYP= 0
##$CFRGTYP= 5
##$CHEMSTR= <none>
##$CNST= (0..31)
1 1 145 1 1 1 1 1 1 1 1 1 1 1 1 1 1 1 1 1 1 1 1 1 1 1 1 1 1 1 1 1 
##$CPDPRG= <>
##$CPDPRG1= <>
##$CPDPRG2= <>
##$CPDPRG3= <>
##$CPDPRG4= <mlev>
##$CPDPRG5= <mlev>
##$CPDPRG6= <mlev>
##$CPDPRG7= <mlev>
##$CPDPRG8= <mlev>
##$CPDPRGB= <>
##$CPDPRGT= <>
##$D= (0..31)
0 0.7 0 0 0 0 0 0 0 0 0 0.03 0 0 0 0 0 0 0 0 0 0 0 0 0 0 0 0 0 0 0 0 
##$DATE= 1756893087
##$DBL= (0..7)
120 120 120 120 120 120 120 120 
##$DBP= (0..7)
150 150 150 150 150 150 150 150 
##$DBP07= 0
##$DBPNAM0= <>
##$DBPNAM1= <>
##$DBPNAM2= <>
##$DBPNAM3= <>
##$DBPNAM4= <>
##$DBPNAM5= <>
##$DBPNAM6= <>
##$DBPNAM7= <>
##$DBPOAL= (0..7)
0.5 0.5 0.5 0.5 0.5 0.5 0.5 0.5 
##$DBPOFFS= (0..7)
0 0 0 0 0 0 0 0 
##$DE= 6
##$DECBNUC= <off>
$$ [...]
##$SUBNAM2= <"">
##$SUBNAM3= <"">
##$SUBNAM4= <"">
##$SUBNAM5= <"">
##$SUBNAM6= <"">
##$SUBNAM7= <"">
##$SUBNAM8= <"">
##$SUBNAM9= <"">
##$SW= 18.0517328524113
##$SWIBOX= (0..15)
0 0 2 0 0 0 0 0 0 0 0 0 0 0 0 0 
##$SW_h= 3612.71676300578
##$TD= 16384
##$TD0= 1
##$TE= 0
##$TE2= 300
##$TE3= 300
##$TEG= 300
##$TL= (0..7)
0 120 120 120 120 120 120 120 
##$TP= (0..7)
150 150 150 150 150 150 150 150 
##$TP07= 0
##$TPNAME0= <>
##$TPNAME1= <>
##$TPNAME2= <>
##$TPNAME3= <>
##$TPNAME4= <>
##$TPNAME5= <>
##$TPNAME6= <>
##$TPNAME7= <>
##$TPOAL= (0..7)
0.5 0.5 0.5 0.5 0.5 0.5 0.5 0.5 
##$TPOFFS= (0..7)
0 0 0 0 0 0 0 0 
##$TUNHIN= 0
##$TUNHOUT= 0
##$TUNXOUT= 0
##$USERA1= <user>
##$USERA2= <user>
##$USERA3= <user>
##$USERA4= <user>
##$USERA5= <user>
##$V9= 5
##$VALIST= <valist>
##$VCLIST= <CCCCCCCCCCCCCCC>
##$VD= 0
##$VDLIST= <DDDDDDDDDDDDDDD>
##$VPLIST= <PPPPPPPPPPPPPPP>
##$VTLIST= <TTTTTTTTTTTTTTT>
##$WBST= 1024
##$WBSW= 4
##$XGAIN= (0..3)
0 0 0 0 
##$XL= 0
##$YL= 0
##$YMAX_a= 401014
##$YMIN_a= -622774
##$ZGOPTNS= <>
##$ZL1= 120
##$ZL2= 120
##$ZL3= 120
##$ZL4= 120
##$ABSF1= 0
##$ABSF2= 0
##$ABSG= 0
##$ABSL= 0
##$ALPHA= 0
##$AQORDER= 0
##$ASSFAC= 0
##$ASSFACI= 0
##$ASSFACX= 0
##$ASSWID= 0
##$AUNMP= <proc_1d>
##$AZFE= 0.1
##$AZFW= 0.1
##$BCFW= 0
##$BC_mod= 2
##$BYTORDP= 0
##$COROFFS= 0
##$CY= -3
##$DATMOD= 1
##$DC= 0
##$DFILT= <>
##$DTYPP= 0
##$F1P= 0
##$F2P= 0
##$FCOR= 1
##$FTSIZE= 16384
##$FT_mod= 6
##$GAMMA= 0
##$GB= 0
##$INTBC= 1
##$INTSCL= 3.241238e-09
##$ISEN= 128
##$LB= 0.25
##$LEV0= 0
##$LPBIN= 0
##$MAXI= 10000
##$MC2= 0
##$MEAN= 0
##$ME_mod= 0
##$MI= 1.114404
##$NCOEF= 0
##$NC_proc= -4
##$NLEV= 6
##$NOISF1= 3.799351
##$NOISF2= 2.8
##$NSP= 0
##$NTH_PI= 0
##$NZP= 0
##$OFFSET= 15.52433
##$PC= 1
##$PHC0= -1562.059
##$PHC1= 10.99228
##$PH_mod= 1
##$PKNL= yes
##$PPARMOD= 0
##$PSCAL= 0
##$PSIGN= 0
##$REVERSE= no
##$SF= 200.129999475364
##$SI= 16384
##$SIGF1= 3
##$SIGF2= 2
##$SINO= 0.751879
##$SIOLD= 32768
##$SREGLST= <19F.Aceton>
##$SSB= 0
##$STSI= 16384
##$STSR= 0
##$SW_p= 3612.71676300578
##$SYMM= 0
##$S_DEV= 0
##$TDeff= 16384
##$TDoff= 0
##$TI= <>
##$TILT= no
##$TM1= 0
##$TM2= 0
##$TOPLEV= 0
##$USERP1= <user>
##$USERP2= <user>
##$USERP3= <user>
##$USERP4= <user>
##$USERP5= <user>
##$WDW= 1
##$XDIM= 16384
##$YMAX_p= 269777461
##$YMIN_p= -241340
$$ End of Bruker specific parameters
$$ ---------------------------------
##NTUPLES= NMR SPECTRUM
##VAR_NAME=  FREQUENCY,     SPECTRUM/REAL,   SPECTRUM/IMAG
##SYMBOL=    X,             R,               I
##VAR_TYPE=  INDEPENDENT,   DEPENDENT,       DEPENDENT
##VAR_FORM=  AFFN,          ASDF,            ASDF
##VAR_DIM=   16384,         16384,           16384
##UNITS=     HZ,            ARBITRARY UNITS, ARBITRARY UNITS
##FACTOR=    0.220516191357247, 1,           1
##FIRST=     3106.8841826055, 0,             0
##LAST=      -505.832580400281, 0,           0
##MIN=       -505.832580400281, -241340,     0
##MAX=       3106.8841826055, 269777461,     0
$$ Real data points
##PAGE= N=1
##DATA TABLE= (X++(R..R)), XYDATA
$$ [...]
8446D388366j21529j03228p4484q3555m5167L7147O4953O0150M9045M0097m9934
8435D161861o8326m1537n4978p4277j02882k12005k48162k14146k02613j56023
8425B786912j73789j57820j79422j75038j52635r8705q6281r8225q2019o3668
8415A519310p3736n3389o1144n2482n9949m0170j3202k6681k7427k4907k5513
8404A060710j0948K6662J1822j5919l3213j9805p2408k0011k1048m9568j1802
8393H44472l3882j7353j4095m2071m0879o608o044k3942J2663P522l1366l8473
8381F09944J4658k9094j4572R504k632J512n923J7505j31J6322J865R413o49K1433
8367F49155J9242j0403m756j7364l8034k9585j2418l8650j5931J3104j1300j1889
$$ y = [4388366, 4266837, 4163609, 4089125, 4005570, 3960403, 3997550, 4062503, 4122653, 4171698, 4211795, 4161861, 4093535, 4051998, 3997020, 3922743, 3819861, 3607856, 3359694, 3145548, 2942935, 2786912, 2613123, 2455303, 2275881, 2100843, 1948208, 1849503, 1763222, 1664997, 1582978, 1519310, 1445574, 1392185, 1331041, 1278559, 1218610, 1178440, 1165238, 1138557, 1111130, 1086223, 1060710, 1049762, 1076424, 1088246, 1072327, 1039114, 1019309, 946901, 926890, 905842, 856274, 844472, 810590, 793237, 779142, 737071, 696192, 689584, 683540, 659598, 672261, 679783, 648417, 609944, 624602, 595508, 580936, 590440, 587808, 589320, 583397, 600902, 600771, 617093, 618958, 628371, 627722, 649155, 668397, 657994, 653238, 635874, 597840, 568255, 555837, 517187, 501256, 514360, 503060, 491171]
8355D91171j1306k1558L1892j0133k4610J2161J355O327M967K5204j0196M537
8343D99811L0766q412o934K583K1240p177j846l2652j0561k6309j9746k5135J902
8330D17530j8670m8711j0341K1357L507j4692L741L845J6170k5194l864R204j7594
8317C36288l233j9148K508k8419q654J9629r782l1725J7856J4385n302J3627j0376
8304B87654O847p256j0640r428P702J6753j8437j4431K3653J450o511p321o985
8291B63050l0295J1723m078j2855J2488K4412K1928k1506j4917K009r586q139
8279B34234j9628J5626K9828k1370j1043j0007k466r449l258L6307j0019m581
8267B24174j24J9694j3563P30k0214J346j4409K7565m1J2517P330k3099r919j829
$$ y = [491171, 479865, 458307, 490199, 480066, 455456, 467617, 468972, 475299, 480266, 505470, 495274, 499811, 530577, 522165, 515231, 517814, 539054, 531877, 530031, 497379, 486818, 460509, 440763, 415628, 417530, 398860, 350149, 339808, 361165, 364672, 349980, 353721, 357566, 373736, 348542, 344678, 353882, 336288, 333055, 313907, 316415, 287996, 279342, 298971, 289189, 257464, 275320, 289705, 284403, 298030, 287654, 294501, 287245, 276605, 267177, 274879, 291632, 273195, 258764, 282417, 283867, 277356, 270035, 263050, 232755, 244478, 240400, 227545, 240033, 264445, 286373, 264867, 249950, 251959, 242373, 234234, 214606, 230232, 260060, 238690, 227647, 217640, 215174, 205725, 202467, 238774, 228755, 224174, 224050, 243744, 230181, 230911, 210697, 212043, 197634, 225199, 225158, 237675, 245005, 221906, 211987, 210158]
8253B10158n04k985K5496Q658J1506L094N136j3227L913J7962L4823j8512J4825
8240C00343K1303K0969J523q288L0231J0324P305l3437j195K1962J557J9323l2257
8227C59663j5795j5627j3819j1780N829N953j3955k8119N701K0587J8682j1386
8215C05934j0282J1264R312K0652R251o612K7142L4772n691j3630R612j979J913
8202C91658j9433J8497k0156l649P379K716n281N685k1092J10097j2804k56641
8190A96976J0666j0448N047J6484j7164k7105k5456k0051J0609K5929P522j8668
8178A54341J8176N868l520P499k081j0476k1426N15J7359K82j9194J633N409J1748
8164A66133P152j5898k5087j2931Q020P177Q956j5756q627K8517J6082j1393P64
$$ y = [210158, 209654, 206669, 232165, 240823, 252329, 255423, 260559, 247332, 251245, 269207, 304030, 285518, 300343, 321646, 342615, 344138, 335850, 366081, 376405, 383710, 350273, 349078, 371040, 372597, 391920, 359663, 343868, 328241, 314422, 302642, 308471, 314424, 300469, 272350, 278051, 298638, 317320, 305934, 295652, 306916, 316228, 336880, 346131, 339519, 366661, 401433, 395742, 382112, 391724, 389745, 391658, 372225, 390722, 370566, 366917, 374296, 377012, 371731, 377416, 356324, 466421, 453617, 196976, 207642, 197194, 202241, 218725, 201561, 174456, 149000, 128949, 139558, 165487, 173009, 154341, 172517, 178385, 174865, 182364, 180283, 169807, 148381, 148896, 166255, 166537, 147343, 148976, 154385, 166133, 173285, 157387, 132300, 119369, 127389, 134566, 143522, 127766, 119139, 147656, 163738, 152345, 153109]
8151A53109Q822j4669j2702q239O016K0530M43m5590K9376J1486R929M079j6952
8138A45638Q975q473r806O238K52K496P949J8480o8j2667J365m152j3848J2613
8124A54992J3735j6052J2337O746j6513L706L727k553K6222J3028n725j4369j5449
8111A63832j467j6780j3011L5688j3586q992J881j7872K4179J3440j3776q308
8099A45228R027p313J2996m023p334P058J0887k2598J1243J3154o793O953M263
8086A72748j2273J0165J1756K3460K587j0994l6393l7335J9384J1126k405O142
8074A57968K0133q902j980J4106m069p896m934q899j55R920r529N745N13k1194
8060A40827L641r679K783K417M24J4653j7518J2775O449p736k3258L14L31J4529
$$ y = [153109, 161931, 147262, 134560, 126321, 132337, 152867, 153310, 107720, 137096, 148582, 158511, 162590, 145638, 154613, 146140, 136334, 142572, 142824, 145320, 153269, 171749, 171681, 159014, 160379, 156227, 142379, 154992, 168727, 152675, 165012, 171758, 155245, 158951, 162678, 160125, 186347, 199375, 193650, 179281, 163832, 162365, 145585, 132574, 168262, 154676, 145684, 147565, 129693, 153872, 167312, 153536, 145228, 154255, 146942, 159938, 155915, 148581, 155639, 166526, 143928, 155171, 168325, 161532, 168485, 172748, 160475, 170640, 182396, 205856, 208443, 197449, 161056, 123721, 143105, 154231, 151826, 157968, 178101, 169199, 167219, 181325, 177256, 169360, 164426, 155527, 155372, 165292, 155763, 161508, 162021, 140827, 144468, 134789, 137572, 139989, 140413, 155066, 137548, 150323, 156772, 149036, 125778, 126092, 126423, 140952]
8046A40952K447m5157J5481J6696J8327k4979R462L8819J2295j4360k3135l3040
8034A13808J2517j5142R106p917j3440J966K6730j3089J6449J0930O500l308J0747
8021A55857j381l2785N51R228o489k6587J1975N208M098j4827P511K29q273j3453
8007I0862K4349M395J2226l842q510r37P008K3318m336j1731k1768m872Q015j6843
7993I7334k332J4102J9083r275r498r010k0076j7470J7526J4230Q031L5115n104
7980A32656m415j0869n574R295r696q199O429K126o895J0063R394r481l5934K2539
7966A01439L509q748K519J1895M531l368j0436Q334n469o866L76j1208k713J9833
7952A03628K1771j8600J5957j4871K8909J9903K059j774J2785k0416O66J3774
$$ y = [140952, 143399, 98242, 113723, 130419, 148746, 123767, 133229, 172048, 184343, 169983, 146848, 113808, 126325, 111183, 120289, 112372, 98932, 100898, 127628, 114539, 130988, 141918, 148418, 145110, 155857, 154476, 121691, 122242, 131470, 124981, 98394, 110369, 115577, 119675, 104848, 112359, 112588, 104315, 90862, 115211, 119606, 131832, 127990, 119480, 118543, 125551, 148869, 144533, 132802, 111034, 106162, 114177, 97334, 95002, 109104, 128187, 118912, 109414, 100404, 80328, 62858, 80384, 94614, 102645, 137760, 132656, 128241, 117372, 111798, 121093, 111397, 103198, 109627, 111753, 104858, 114921, 124315, 114834, 78900, 101439, 104948, 96200, 98719, 110614, 115145, 111777, 101341, 109675, 104206, 97340, 97716, 86508, 83795, 103628, 125399, 106799, 122756, 107885, 136794, 156697, 158756, 156982, 169767, 149351, 150017, 163791]
7940A63791q340J0248Q211l507m843J8563l057R465P867k4971q91J052J1131N363
7926A90082j6528J2013k4264N731n451j2329J412o659O611k8037J1388q755r438
7913A15776O25J3912P126O348k0770K561O125p494l535q018K598k1097j5353K5715
7899A04519j780k0611L048j5061L5196o989l036j0538j070K032K3449j8499R952
7886A00612J2038oj6502k001l243K1395o822K192j192j6187L930J3452J7040j5918
7872A08788K389L804J0817R308l321j7819N597k3759k5396J6151J9269j622k350
7859A01856N099J1806j288j1417R653p362J9183r844R404K1484k2343k738J973
7846A25466J791l6494j0105N004Q451K0063q138j1406K915J37K2319L861m253
$$ y = [163791, 155451, 165699, 173910, 170403, 165560, 184123, 181066, 190531, 198398, 173427, 172536, 173588, 184719, 190082, 173554, 185567, 161303, 167034, 161583, 149254, 150666, 144007, 150618, 122581, 133969, 125214, 115776, 116401, 130313, 137439, 143787, 123017, 125578, 131703, 124209, 120674, 112656, 115254, 94157, 78804, 104519, 102739, 82128, 85176, 70115, 105311, 98322, 95286, 84748, 83678, 85710, 109159, 90660, 100612, 112650, 112644, 96142, 94141, 90898, 112293, 105471, 107663, 106471, 90284, 94214, 107666, 124706, 108788, 111177, 114981, 125798, 135106, 131785, 113966, 119563, 95804, 70408, 86559, 105828, 104206, 101856, 106955, 118761, 117473, 106056, 115709, 108347, 127530, 117686, 127090, 148574, 126231, 123493, 125466, 127257, 90763, 80658, 85662, 94113, 114176, 106038, 94632, 97547, 97684, 120003, 123864, 119611]
7833A19611j2787N139j1248k106p953K3716j3395l240k072j5357o311R010K6021
7820A09028K1809j3236O769J3157j5313K434J1382m896o920o590K0748P348P865
7807A53585p448k8258N572J10j6880J8702p89N662O215J6994l1894K768J2354
7794A36693n9221K7545o261L092j380J2023m752M905Q078j3382j561L153J800
7781A10732J3698k746J1215m324n844M3263k925k4595j3612r603K154K4289K81
7768A41983j4247K5217m47k3878q398R414J2310j7506m161R754K2994R692L815
7755A66542J3596J0092k795Q095M200j163J1799k4973L7123J3357r506r496q007
7742B08864j0954m909J5047j3310O062J5419j2221p078o06l4118m762J7142K752
$$ y = [119611, 106824, 111963, 100715, 98609, 90656, 114372, 100977, 97737, 95665, 80308, 73997, 83007, 109028, 130837, 117601, 124370, 137527, 122214, 124648, 136030, 131134, 124214, 117624, 138372, 145720, 153585, 146137, 117879, 123451, 123561, 106681, 125383, 124594, 130256, 136471, 153465, 121571, 124339, 136693, 77472, 105017, 98756, 101848, 100468, 112491, 107739, 112644, 120722, 107340, 105779, 108932, 110732, 124430, 121684, 132899, 128575, 122731, 165994, 163069, 138474, 124862, 115259, 117413, 141702, 141983, 127736, 152953, 152506, 128628, 120230, 129644, 141954, 124448, 120287, 130041, 153035, 162727, 166542, 180138, 190230, 187435, 195530, 199730, 198567, 210366, 185393, 222516, 235873, 226367, 216871, 208864, 197910, 193001, 208048, 194738, 200800, 216219, 203998, 196920, 196314, 162196, 157434, 174576, 177328]
7729A77328K4107N03k3714k4758K8209j1822N220J5578J0932K4846J7818k912
7717B41335j5234L538J229L0978k5721l7283Q424l593n67O314j3025j6072K1800
7704B02123o342Q094o370J3975M972m3667N500j7644q431r744J3187K8684k1058
7691A63279K04k218K7183L022J2621j6302l2870J4692l1736Q570m186j663j2203
7678A28393N582R043m804j0479R65j4144R317Q236k805o402K112R724L519m850
7664A33407q891K1969p526J5003n920j9635L593p514o03L2873R898k6592l5252
7651A04810J9198K6214l134L1563k5564l2077o58M134J6382J5920P832J1982r773
7638A66829l1909j1296J2705k78J946l648J1765k2578p06n58K2351j1250j3270
$$ y = [177328, 201435, 201938, 178224, 153466, 181675, 169853, 175073, 190651, 201583, 226429, 244247, 241335, 226101, 229639, 230868, 261846, 236125, 198842, 207266, 203673, 203106, 209420, 196395, 180323, 202123, 195781, 203875, 197505, 211480, 216452, 172785, 178285, 160641, 152210, 142466, 155653, 184337, 163279, 163483, 161265, 188448, 191470, 204091, 187789, 154919, 169611, 137875, 146445, 142259, 140596, 128393, 133975, 143018, 138214, 127735, 128700, 114556, 123873, 132109, 129304, 122902, 125014, 134738, 138257, 133407, 124516, 146485, 138959, 153962, 148042, 128407, 132000, 124486, 123883, 156756, 166654, 140062, 104810, 124008, 150222, 147088, 178651, 153087, 121010, 120352, 124486, 140868, 156788, 164620, 176602, 166829, 134920, 123624, 136329, 136051, 137997, 134349, 146114, 123536, 122830, 122272, 144623, 133373, 120103]
7625A20103J1592J5027n406K1429j4866m2569J2530o230J6969L9405M692j2858
7613A59818Q162k5067j0783J1065J5214l1853K825M757K6364j3034O237N816r115
7600A50406K1918o085k914n85m288J0881j9975K0612P517j6586j3862j822L1256
7587A76473M806j1260L2718P569l5676Q269J2068J652j4328p049P729R725M160
7574A96856j886k403M822o45J3918j096J7616j3351J553J4489K1793j1062k3985
7561B16619K8519L0231j5832n861j4678r310j5791J6083l013O154N624j8828K206
7548B22123K9628N292k5546j2639J9558J8576r042k6507j6368K3879J2301J774
7536B43029j3394n004k1052K1553K7707l37L729j6301j1467j8284K586L2932j8788
$$ y = [120103, 131695, 146722, 141316, 162745, 147879, 105310, 117840, 111610, 128579, 167984, 172676, 159818, 167980, 142913, 132130, 143195, 158409, 126556, 129381, 134138, 160502, 147468, 153705, 159521, 150406, 172324, 166239, 163325, 162740, 158452, 169333, 149358, 169970, 177487, 160901, 147039, 145217, 176473, 181279, 170019, 202737, 210306, 174630, 182899, 194967, 196619, 182291, 175242, 182971, 192696, 196856, 194970, 192567, 197389, 196744, 210662, 209566, 227182, 213831, 215384, 229873, 251666, 240604, 216619, 245138, 275369, 259537, 253676, 238998, 229688, 213897, 229980, 226967, 233121, 238745, 219917, 222123, 251751, 257043, 231497, 218858, 238416, 256992, 247950, 221443, 205075, 228954, 241255, 243029, 229635, 224631, 203579, 225132, 252839, 252502, 256231, 239930, 228463, 210179, 212765, 245697, 226909]
7523B26909J77o652K5985K117K32o725L1308Q745Q517m7882n464p85k0620J1163
7509B27025Q315L318Q376k7253k5015o958J2842R27L22Q424p317q983K4658j2333
7495B06348R364P715j0741L769j5068J0822r533j052K3758j2799j1670L5Q453
7482B09401K6637J0347n70q452k210j9798K3259m856Q386L344j0306q0J3827j2600
7468B36329M866q037j7817k3726l473n497K5068O868J3494J3446k4495K260K6081
7455B45367J6377q991j9161O484j7766J956j9071N371n625K474J6963M287k0558
7442B08107L0266R402k7804K3041j2820J5338k075j4882J769N543L0739j5167
7430B51457n823J227J9879J1339j929k3801j9056K3323J35j1885L540p27K1667
$$ y = [226909, 227086, 220434, 246419, 248536, 248768, 242043, 273351, 282096, 290613, 242731, 237267, 236482, 215862, 227025, 235340, 238658, 247034, 219781, 194766, 187808, 200650, 201577, 201899, 210323, 203006, 194023, 218681, 206348, 215712, 223427, 212686, 216455, 201387, 212209, 202676, 201624, 225382, 212583, 200913, 200948, 209401, 236038, 246385, 245815, 237363, 235153, 215355, 238614, 233758, 242144, 245488, 235182, 235102, 248929, 236329, 241195, 233158, 215341, 191615, 188142, 182645, 207713, 214581, 228075, 241521, 217026, 219286, 245367, 261744, 252753, 233592, 240076, 222310, 224266, 205195, 210566, 204941, 207415, 224378, 228665, 208107, 238373, 247775, 219971, 243012, 230192, 245530, 243455, 228573, 230342, 235885, 266624, 251457, 245634, 246861, 266740, 278079, 276150, 252349, 233293, 256616, 256751, 244866, 248406, 247679, 269346]
7417B69346K0291J2490L583J2435j7091n440K0902q960k1252j1231j0686O152
7405B70539J5708J2063J3046j488j026m911L091N732J1805j683J5786r382J8297
7392C47577J5682J9967n26K1703J3642l489j0198p335k2276K1765M873L0979N2567
7379D84931J9607K126p876j8613l463j181l993K1418J4117K4809J3824j998K3903
7366E67611l015K3130R39o264K1913J3477K8689K1513K0423M3899J0226J1622
7354G54163N603R747K7287L5058K4184K1474K8485J9405M7862M3507K6659M2541
7342A085975M5300K9264L8194M1538N7229N4895O6664P5611N7409Q0892Q7500
7331A720471Q3340R4658J20129R9292J11742J35302J39529J49910J34734J83688
$$ y = [269346, 289637, 302127, 305710, 318145, 301054, 295614, 316516, 307556, 286304, 275073, 264387, 270539, 286247, 298310, 311356, 309868, 308842, 303931, 307022, 312754, 324559, 322876, 338662, 329280, 347577, 363259, 383226, 382700, 404403, 418045, 414556, 404358, 397023, 374747, 396512, 401385, 432364, 484931, 504538, 506664, 498788, 480175, 476712, 475531, 471538, 492956, 507073, 531882, 545706, 543708, 567611, 564596, 587726, 588665, 582401, 604314, 617791, 646480, 667993, 688416, 732315, 742541, 754163, 759766, 769513, 796800, 831858, 856042, 877516, 906001, 925406, 973268, 1016775, 1043434, 1085975, 1131275, 1160539, 1198733, 1240271, 1297500, 1352395, 1419059, 1494670, 1552079, 1632971, 1720471, 1803811, 1898469, 2018598, 2117890, 2229632, 2364934, 2504463, 2654373, 2789107, 2972795]
7321B972795J72461J73877J73801K03098K22295K34457K58574K39545K25051K37575
7311E113529K53751K30324K03002J82916J12511J40690Q2764M765l6632m2695
7301F244925p7885j57107j50167j70626k23342k00829k12149k29758k33790k29917
7291D359355k11465j85337j92212j81668j75273j49672j69096j55353j20790j57830
7281B660659j18080j14931r7488j08027r1784q7933q2453q4527p8733o5135o3699
7270A667869m2845n6096o5161k9025n1889k7284o5383m1455l2397n3738k1461
7259A181135l9448k8629n1635m0590k3198j712k9851k2144n7432l4705K340r263
7247H44868j1589k7327k3232l1148k4863j6239q244k4848j828l281k6464j0181
$$ y = [2972795, 3145256, 3319133, 3492934, 3696032, 3918327, 4152784, 4411358, 4650903, 4875954, 5113529, 5367280, 5597604, 5800606, 5983522, 6096033, 6236723, 6319487, 6324252, 6287620, 6244925, 6167040, 6009933, 5859766, 5689140, 5465798, 5264969, 5052820, 4823062, 4589272, 4359355, 4147890, 3962553, 3770341, 3588673, 3413400, 3263728, 3094632, 2939279, 2818489, 2660659, 2542579, 2427648, 2330160, 2222133, 2130349, 2042416, 1959963, 1875436, 1796703, 1731568, 1667869, 1625024, 1568928, 1503767, 1474742, 1422853, 1395569, 1330186, 1288731, 1256334, 1202596, 1181135, 1141687, 1113058, 1061423, 1020833, 997635, 995923, 966072, 943928, 886496, 851791, 854131, 844868, 833279, 805952, 782720, 751572, 726709, 710470, 702226, 677378, 675550, 672269, 645805, 635624]
7235F35624j7421j945q766l4833o262l832j8216r468j1115j4952l576k5419q588
7222D71231J0962j7392k933O540K564q157j27l4050q468l374j6122Q232J694L956
7208D14556k6816m260m522k575r622J8201K739p857k2912o649R697J393M220j7154
7194C48439n487R57J1986J0146J412j5869j8508k0000K3861j8617J0233R657O246
7181C44456K494k020j6657k3239J4432L731p259J1310j0100L670J3961l7887n752
7168B91140J7946p694N51o753L0259P451K323j6215j9628j078n151o302J982r002
7154B79829j168J2580j2905j7238o544R453j2856J7719j1947p418L096K093j4920
7141B39774R219J3168M391J8023K187K210o981j816J3802n599k3336O542P532
$$ y = [635624, 618203, 616258, 607492, 572659, 566397, 562565, 544349, 534881, 523766, 508814, 505238, 479819, 471231, 482193, 464801, 461868, 468408, 470972, 462815, 462688, 428638, 420170, 416796, 400674, 408906, 410600, 414556, 387740, 383480, 378958, 376383, 366761, 384962, 387701, 379844, 356932, 350283, 359980, 361373, 365593, 348439, 342952, 343909, 355895, 366041, 367453, 351584, 333076, 313076, 336937, 318320, 328553, 338210, 344456, 346950, 344930, 328273, 305034, 319466, 323197, 315938, 327248, 317148, 320818, 334779, 296892, 291140, 309086, 301392, 301943, 295190, 325449, 332900, 335223, 319008, 299380, 298302, 293151, 286849, 288831, 279829, 278661, 291241, 278336, 261098, 254554, 264007, 251151, 268870, 256923, 249505, 252601, 254694, 239774, 248993, 262161, 266552, 284575, 286762, 288972, 281991, 280175, 293977, 288378, 265042, 271584, 279116]
7128B79116P870o836l6263P534J503J0103j5897R851J3028K2818k5701M985m328
7115B67783n456j0637m073K0934J183k926j750J3099m867j1975R215K077J3303
7102B85910J2801l611o231P595J0370J629L307n481r658o010k381J9445O860L657
7088C18202n592r252k3681k993L7261J6235J6222j2299K0215N362r761K3550m899
7075C68570O145p104j585N097j2533j4607k9336j7660K627J6279L429J621j1466
7062C09477l021j1494p177k2686M882O188k862m416q063j4676J4138K745j3014
7049B50021p272Q720m879j7748J9698J7173J2765j872l8240q979O330K5631j1908
7036B49440R239j30j9882l462O250k7038J1247Q917O775o37j9126J681P790k1786
$$ y = [279116, 286986, 280150, 243887, 251421, 252924, 263027, 247130, 256981, 270009, 292827, 267126, 272111, 267783, 262327, 251690, 247617, 268551, 269734, 266808, 265058, 278157, 273290, 261315, 270530, 272607, 285910, 298711, 295100, 288869, 296464, 306834, 308463, 311770, 306289, 296631, 290621, 288240, 307685, 314545, 318202, 312610, 303358, 279677, 276684, 313945, 330180, 346402, 334103, 354318, 359680, 349919, 373469, 368570, 374715, 367611, 366026, 371123, 358590, 343983, 314647, 296987, 299614, 315893, 319322, 320943, 309477, 306456, 294962, 287785, 265099, 269981, 276169, 273307, 268891, 260828, 246152, 260290, 263035, 250021, 242749, 251469, 246590, 228842, 248540, 265713, 278478, 276606, 238366, 229387, 235717, 261348, 249440, 258679, 258549, 238667, 235205, 241455, 214417, 225664, 234581, 241356, 240719, 221593, 223274, 231064, 209278]
7022B09278M773J3083P901J071J437j5815k78K0130m025j3065j106P143r668J2386
7008B33245k417J1237j8352M987K3894J0822J2286J0423O523j4045P376n021J1056
6995B92014k4220j9003J2748n13P210q914l945J3803K2977j485L694j3253K7564
6982C08677M515M291J1011l336K583J7832J4869J9001m781K5727J9822j80R650
6969D29681J895M7382M0640O255J2209K118o183n3449J2580N488j7699K789K3339
6956E07045R175J9164M2566j5133L289j6981m8392r261j0046r028j5019l4170
6944D23209k415q251k5961k1194n828k2112K838J1593o835K3502o462r669J5021
6931C67436m558j8747r359q125k4301J870K42K4893L1511l0814l3326J3323J6715
$$ y = [209278, 214051, 227134, 235035, 236106, 237543, 221728, 221450, 241580, 237555, 224490, 223384, 230527, 220859, 233245, 230828, 242065, 223713, 228700, 252594, 263416, 275702, 286125, 292648, 278603, 285979, 280958, 292014, 267794, 248791, 261539, 261026, 268236, 259322, 255377, 269180, 292157, 290672, 294366, 281113, 308677, 313192, 317483, 328494, 325158, 327741, 345573, 360442, 379443, 374662, 400389, 420211, 420031, 429681, 431576, 478958, 519598, 525853, 538062, 540180, 533997, 480548, 493128, 498616, 480917, 483706, 507045, 516220, 535384, 577950, 562817, 566106, 549125, 500733, 491472, 481426, 472398, 457379, 423209, 420794, 412543, 386582, 365388, 359560, 337448, 340286, 351879, 345044, 368546, 362084, 352415, 367436, 362878, 344131, 334772, 326647, 302346, 304216, 304458, 329351, 360862, 330048, 296722, 310045, 326760]
6918C26760p020K4066J0814p276l02Q067k347L0187L5151j1263J0000L4023L5365
6905D86225m451K1518L0500o080l4557P768Q06j6719M874R446K9451R158P750
6892E45689J7964l469j9998j5291k0114k9521l0355j0000p457R915J6755r694
6880D44424j0877n1257o736L1810K8596O408k6390k501k4040j4844j8936j5887
6868C39770l524J4127O397j3261O86k166j6218N24K141n781J102J4439K628j1638
6854C29226j1539r505L436k0628J719J6206k842J7596o306k7146J7287L687j0614
6841C00577o577q856J2864K2425M501j3808M572r454J2548K7172k8235R776J4798
6828C42303J3335P508L48J826j129N365L0895q507q102q1J4049L52K871J6485
$$ y = [326760, 319740, 343806, 354620, 347344, 347042, 355109, 352762, 382949, 418100, 406837, 416837, 450860, 486225, 481774, 503292, 533792, 527712, 493155, 500923, 501729, 485010, 489884, 499330, 528781, 537939, 545689, 563653, 560184, 540186, 524895, 504781, 475260, 444905, 434905, 427448, 437363, 454118, 444424, 433547, 382290, 375554, 407364, 435960, 442368, 415978, 413477, 389437, 374593, 355657, 339770, 336246, 350373, 356770, 343509, 344195, 342029, 325811, 326335, 328476, 322695, 323797, 338236, 340864, 329226, 317687, 308182, 311618, 290990, 292709, 308915, 306073, 323669, 317363, 290217, 307504, 311191, 300577, 294000, 285144, 298008, 320433, 324934, 311126, 315698, 306244, 318792, 345964, 317729, 327505, 342303, 355638, 363146, 363494, 365320, 364191, 369556, 400451, 391944, 383842, 383761, 397810, 398162, 401033, 417518]
6814D17518R152J0061j900j7656k1334l369j1611O788J50K876j2296r27J844j4484
6800C64812j0374m223k4484J8853K8100K808o380M738j9150J4183M533j2775N9
6787C60700J4008L029P41J6664J5384K738k9850J4679m5456K2792L6098m842J4030
6774D20715p546J8547K0366L724P758M891K7450j2320K638K1071k0060j6236j3538
6761D57460j611l622L2602J7821q880r0J5721j3444j6891N468O746M1889J5875
6748E49044m719N528L2722R356n011M264R577J1537j218L9694M1256J372J8730
6735G12132N124l288L1052L5133M4910K6076L6114J8398K0502P8651M3852K9029
6723A077685M5588O8701M3721J6865M823K936O129l2359l050N955L7685K1431
$$ y = [417518, 426670, 436731, 434831, 417175, 395841, 392472, 380861, 387649, 387799, 390675, 378379, 377452, 379296, 364812, 354438, 350215, 325731, 344584, 372684, 375492, 369112, 373850, 354700, 368883, 373416, 360641, 360700, 374708, 377737, 378478, 395142, 410526, 413264, 383414, 398093, 352637, 375429, 411527, 406685, 420715, 413169, 431716, 452082, 455806, 463564, 468455, 495905, 483585, 486223, 507294, 487234, 470998, 457460, 455849, 452227, 484829, 502650, 493770, 493680, 509401, 495957, 479066, 484534, 491280, 533169, 549044, 544325, 549853, 582575, 591931, 586920, 591184, 600761, 612298, 611080, 650774, 692030, 693402, 712132, 717256, 713968, 745020, 780153, 825063, 851139, 887253, 905651, 926153, 1004804, 1048656, 1077685, 1123273, 1191974, 1235695, 1252560, 1257383, 1260319, 1266448, 1234089, 1231039, 1236994, 1274679, 1296110]
6711A296110r39L7752M674J5396J6385L1389P991r50j86O678R746k7226j7962
6698A378858k4756K0003L0478K6058O33L4305K3429j1090k6508m1633k832J0285
6686A417230k6513J613K1658K2556R675p682j9804n1146o2642n7124l9546j2642
6674A195633l781l8623m1416j082j1729k1117j2810l2021o634l7018k4822k9075
6662I35505j9696M714J9516k6597l5613P758m697j0845l5769O327P745j2157j6713
6649H19478J3029N159j667j5446o761K0698j0230k957j811l151K5859m467l819
6636H33914j7046K4101K624M439J1300J6378j620j8079N5907J0148j1251K5401
6624I36216J3268L243m439K0661L139J6286K8731J2828O066J4118M7047J1008
$$ y = [1296110, 1295171, 1332923, 1337597, 1352993, 1369378, 1400767, 1408758, 1407808, 1407622, 1414300, 1424046, 1396820, 1378858, 1354102, 1374105, 1404583, 1430641, 1431274, 1465579, 1489008, 1477918, 1451410, 1409777, 1406945, 1417230, 1390717, 1392330, 1413988, 1436544, 1446219, 1438537, 1418733, 1367587, 1304945, 1247821, 1208275, 1195633, 1191852, 1153229, 1111813, 1110731, 1099002, 1077885, 1065075, 1033054, 1026420, 989402, 964580, 935505, 915809, 920523, 940039, 913442, 877829, 885587, 880890, 870045, 834276, 840603, 848348, 836191, 819478, 832507, 837666, 835999, 820553, 813792, 834490, 824260, 821303, 819492, 816341, 842200, 837733, 833914, 816868, 840969, 843593, 848032, 859332, 875710, 874090, 856011, 911918, 922066, 910815, 936216, 949484, 952727, 948288, 968949, 972088, 988374, 1017105, 1029933, 1035999, 1050117, 1097164, 1108172]
6612A108172R724N606R133k323l231K7793J4439O864K7218k8493k8529K0078M1365
6599A207816J4860O598N573r540L334J6204K19J0501J0732N52l1567M127j0779
6586A228630l971Q784j3570j5505n661M067j4575k1645j276j0779J779P341L557
6573A167176K0788j3582L973O141P362m612N952j7274J2267p588j6592J3128k044
6560A175095R529j7913J4906K3428J6066L643N105K550j4324K9618K3123m3909
6548A226917K4336J6003K1528j4981o862K9146P765Q82J2920K6002J1393L1740
6536A386789J2551J7447K9951L5794J3867L1603L4950N0383M7404J0591L1779
6525A703109N80j437l4862k9479l0775m2538m2909l3537p368J3043j7689k8517
$$ y = [1108172, 1117896, 1123502, 1132635, 1130312, 1127081, 1154874, 1169313, 1176177, 1203395, 1174902, 1146373, 1166451, 1207816, 1222676, 1229274, 1234847, 1225307, 1228641, 1244845, 1245064, 1255565, 1266297, 1266849, 1235282, 1239409, 1228630, 1224659, 1233443, 1219873, 1204368, 1198707, 1202774, 1188199, 1166554, 1165278, 1154499, 1156278, 1163619, 1167176, 1187964, 1174382, 1178355, 1184496, 1191858, 1187246, 1193198, 1175924, 1188191, 1180603, 1164011, 1177139, 1175095, 1184624, 1166711, 1181617, 1205045, 1221111, 1224754, 1229859, 1232409, 1218085, 1247703, 1270826, 1226917, 1251253, 1267256, 1288784, 1273803, 1266941, 1296087, 1303852, 1304734, 1317654, 1343656, 1355049, 1386789, 1399340, 1416787, 1446738, 1482532, 1496399, 1528002, 1562952, 1613335, 1660739, 1671330, 1703109, 1703689, 1702252, 1667390, 1637911, 1607136, 1564598, 1521689, 1488152, 1480784, 1493827, 1476138, 1447621]
6513A447621j4577j8186j6648j5099k7245j4239k3350j3726J7600k8330J7960
6502A311781M6761k9666j2426q3K9660N459J5231J2133l1273L1699O485J9817
6490A405578l781r829L9439K4296j4841N029J2941N736q837M31J3692L103j355
6477A471602M976j2672J9655J7945J5907N601K2123J2395J7655J7642p350O665
6465A592144J7261j1917L3270K7798R435J5037K5250N0883K3206K6942L3579J0575
6453A853463L6427N0025M7874N1934K2422L9831N4492N0005O5105L9074N6209
6442B366861N4639N8321N4434Q3271Q0517P6521Q0695N3803L6657Q4406Q3635
6431C113760O9036L8581N2291L5815M7182P1591J03679Q8167Q5887L5854O5480
$$ y = [1447621, 1433044, 1414858, 1398210, 1383111, 1355866, 1341627, 1318277, 1304551, 1322151, 1293821, 1311781, 1358542, 1328876, 1316450, 1316367, 1346027, 1351486, 1366717, 1378850, 1347577, 1379276, 1385761, 1405578, 1401797, 1391968, 1431407, 1455703, 1440862, 1445891, 1458832, 1464568, 1455731, 1456162, 1469854, 1472957, 1471602, 1476578, 1463906, 1483561, 1501506, 1517413, 1523014, 1545137, 1557532, 1575187, 1592829, 1585479, 1592144, 1609405, 1597488, 1630758, 1658556, 1667991, 1683028, 1708278, 1759161, 1782367, 1809309, 1842888, 1853463, 1889890, 1939915, 1987789, 2039723, 2062145, 2101976, 2156468, 2206473, 2271578, 2310652, 2366861, 2421500, 2479821, 2534255, 2617526, 2698043, 2774564, 2855259, 2909062, 2945719, 3030125, 3113760, 3182796, 3221377, 3273668, 3309483, 3356665, 3428256, 3531935, 3620102, 3705989, 3741843, 3807323]
6420C807323N2848O7366N2730J06269Q4370R6871J15868J11404J22057J12260
6410D729366J31124J67557J98454J82401J79561J98153K02870K01666K54558K53054
6400F698764K23998K85863K98012L42271M00429M11287M26569M39715M87354N32175
6390A0546437N41522O14216O72548P15282Q22539R05600R85819J080775J302108
6381A8186846J454327J687323J933744K245553K435609K687986K925915L226299
6373C6783602L547829M104818M794052N961963P659931J0340654J3803967J7294010
6365A04290826J7708077J7219114J6206428J1929390P084308K637337j0941373
6358A66134107k1131858j9213584j5567804j2632628j0406486q379244p419330
$$ y = [3807323, 3860171, 3927537, 3980267, 4086536, 4170906, 4267777, 4383645, 4495049, 4617106, 4729366, 4860490, 5028047, 5226501, 5408902, 5588463, 5786616, 5989486, 6191152, 6445710, 6698764, 6922762, 7208625, 7506637, 7848908, 8249337, 8660624, 9087193, 9526908, 10014262, 10546437, 11087959, 11702175, 12374723, 13090005, 13912544, 14818144, 15803963, 16884738, 18186846, 19641173, 21328496, 23262240, 25507793, 27943402, 30631388, 33557303, 36783602, 40331431, 44436249, 49230301, 55192264, 62852195, 73192849, 86996816, 104290826, 121998903, 139218017, 155424445, 167353835, 174438143, 177075480, 166134107, 145002249, 125788665, 110220861, 97588233, 87181747, 78802503, 71383173]
6351G1383173o402720n634389n046224n027841m543286l821827l182822k715860
6343C5008204k328813k130469k031850k009210j694817j486918j290008j196017
6335B0840102j072336r70513q36969p91430p19053o85498n86086n48324n03322
6326A4126571m82426m25618m32911l94508l45215k64282k48825j91937j99800
6317A1141049j73381k39798k58122l15030l50881l19623l43664k74765k09261
6308H656524k05002j63164j23932j12454q4787l4596p112J69j426k383L87p9201
6296G843023j14531j48032k16491k44500k71241k45849k53537k45388j79890j44864
6286E778700j16059j31778r7792q8286m0700k2571k2955J8239L5628O6209Q4968
$$ y = [71383173, 64980453, 59346064, 54299840, 49271999, 44728713, 40906886, 37724064, 35008204, 32679391, 30548922, 28517072, 26507862, 24813045, 23326127, 22036119, 20840102, 19767766, 18797253, 17960284, 17168854, 16449801, 15764303, 15178217, 14629893, 14126571, 13644145, 13218527, 12785616, 12391108, 12045893, 11781611, 11532786, 11340849, 11141049, 10967668, 10727870, 10469748, 10154718, 9803837, 9484214, 9140550, 8865785, 8656524, 8451522, 8288358, 8164426, 8051972, 7967185, 7932589, 7925477, 7925646, 7924220, 7921837, 7922224, 7843023, 7728492, 7580460, 7363969, 7119469, 6848228, 6602379, 6348842, 6103454, 5923564, 5778700, 5662641, 5530863, 5433071, 5344785, 5304085, 5281514, 5258559, 5276798, 5312426, 5378635, 5463603]
6275E463603J00147J24901Q8576N6827K0617j009j00501r9076j43083j43683j60676
6264E206643j62435j49877j06646j10414p2856n0849m657J2998j4053P5251Q2070
6253D705175L4723M3045K3374l7375r2482j57125j84460j77418j70809j36753
6243C849895j41752r1505o2005r0066r8661m8439p4572p1859o1662o2371o5102
6232B981901k4082l4365k9562n5646n8026n3861l2287n1044l6898l4169l5219
6221B536742n4136q192m829l3218j0156n950p0968m2532k6075n0299m4292n0115
6209B135980m3659l2013l6309l6524m1148m7843p399l7018m0929k5924j5636j2372
6197A759206j9708m2580m3847l1580k6818l5550l0535k0742j4084k5082j0445
$$ y = [5463603, 5563750, 5688651, 5777227, 5834054, 5854671, 5853662, 5753161, 5654085, 5511002, 5367319, 5206643, 5044208, 4894331, 4787685, 4677271, 4604415, 4553566, 4548909, 4561907, 4547854, 4623105, 4705175, 4739898, 4782943, 4806317, 4768942, 4676460, 4519335, 4334875, 4157457, 3986648, 3849895, 3708143, 3616638, 3554633, 3464567, 3365906, 3317467, 3242895, 3171036, 3109374, 3047003, 2981901, 2957819, 2923454, 2893892, 2838246, 2780220, 2726359, 2694072, 2643028, 2606130, 2571961, 2536742, 2482606, 2474414, 2469585, 2436367, 2426211, 2420261, 2349293, 2306761, 2280686, 2230387, 2186095, 2135980, 2092321, 2060308, 2023999, 1987475, 1946327, 1898484, 1891085, 1854067, 1813138, 1787214, 1771578, 1759206, 1739498, 1696918, 1653071, 1621491, 1594673, 1559123, 1528588, 1507846, 1493762, 1468680, 1458235]
6186A458235m0780k7378J6913n711k9548o916K500J5953K1199Q599q942R950K3695
6173A437769J6709L005Q517R020n672k9110k0598k9192m94k0561m783K8253J1261
6160A404124j7840j3547j623r377J178Q486j2535Q252J4673M268j8459r343j1040
6147A347217J0427R414l6185j4560J7793j4123K663j7332j3446P105o839j7272
6135A274862q890l5750n432j5589L181Q245l8957J0046l7627l5452J6938r578
6123A125997k8030N623k0861j7787j9373m1405r439n47k2546k8613j3103r803
6111I20113K211j3100L417j7578j8209j290N678M649m878M278o820k425N931J5819
6097H97796r875q549K3923K9768k4988l633O277j0571K51j5529K875j9228n736
$$ y = [1458235, 1417455, 1390077, 1406990, 1401279, 1371731, 1364815, 1367315, 1383268, 1404467, 1413066, 1404124, 1414074, 1437769, 1454478, 1457483, 1466000, 1475020, 1469348, 1440238, 1419640, 1390448, 1389954, 1369393, 1364610, 1392863, 1404124, 1386284, 1372737, 1371114, 1361737, 1362915, 1371401, 1358866, 1367118, 1381791, 1386059, 1367600, 1358257, 1347217, 1357644, 1367058, 1330873, 1316313, 1334106, 1319983, 1322646, 1305314, 1291868, 1298973, 1292134, 1274862, 1265972, 1230222, 1224790, 1209201, 1212382, 1220627, 1181670, 1191716, 1154089, 1118637, 1135575, 1125997, 1097967, 1103590, 1082729, 1064942, 1045569, 1004164, 994725, 994178, 971632, 943019, 929916, 920113, 922324, 909224, 912641, 895063, 876854, 875564, 881242, 885891, 881013, 885291, 878471, 876046, 881977, 897796, 887921, 879372, 903295, 933063, 908075, 904442, 910719, 900148, 900399, 884870, 887745, 868517, 862781]
6084H62781j9396k886K0181j0995k1352j721J8057K772n964k8156J2901J8518
6072H44740p21J2294K270j7899P081q447J3255k1079J9001J2308n448K4352l973
6059H77734j3768K0923k873k1308L9167K3192q197M0950K6252j43J8319J0141
6047A010389K5573O7278M0707L7188N672J2418M6401K2335L5876L3573K9213K4258
6035A390881J0239L7804O338j9725l3514j3369k710j3247M490k6438M2744R095
6023A392588k1170k352p787J8985P229J6271Q02K5033L9548P394m637K3734p004
6010A488634j0545j1915K9583J0798j2171j6376l5796K089l181r566N401K2571
5998A459526j7863o336M687L5015k4359j3933O84j0720l2065j5310q69L210n837
$$ y = [862781, 843385, 840499, 860680, 849685, 828333, 826612, 844669, 847441, 841477, 813321, 826222, 844740, 844019, 856313, 858583, 840684, 847765, 839318, 852573, 831494, 850495, 862803, 857355, 881707, 877734, 863966, 884889, 882016, 860708, 899875, 923067, 914870, 955820, 982072, 981929, 1000248, 1010389, 1035962, 1103240, 1143947, 1181135, 1186807, 1199225, 1245626, 1267961, 1303837, 1337410, 1366623, 1390881, 1401120, 1438924, 1445262, 1425537, 1392023, 1378654, 1375944, 1362697, 1367187, 1340749, 1383493, 1392588, 1371418, 1369066, 1361279, 1380264, 1387493, 1403764, 1404566, 1429599, 1469147, 1476541, 1471904, 1495638, 1488634, 1478089, 1466174, 1495757, 1506555, 1494384, 1478008, 1442212, 1444301, 1441120, 1431554, 1436955, 1459526, 1441663, 1435327, 1440014, 1475029, 1450670, 1436737, 1437421, 1426701, 1394636, 1379326, 1378457, 1381667, 1375830]
5985A375830K8242j1720j5531j6555N161K6350m085j6567m180K3085o938j8937
5973A364155m919n970M065j5147M183L6148j2029J5959J4797K2497Q042K1011
5961A452792L6846N407j411l634J2666k3139k1484O805m901q961Q614N952J7702
5948A483254J9934j4774J8461J4526J1015L4910K0386O532L5009L6575M7078J6203
5936A729109J4642J2391j0261m2377l2187l4107n9914n0547j7205n3091j0588
5925A445865k8570l1147L018k5997k3627j9331k7138q622R107j0484q659l8843
5913A235572j4384j0826k6415m6930l314j0691k8469m532k1182k2312K3930Q175
5901A078622k0657j0049j2523o074k1144L649J3539Q19j1411K0049P252r983q997
$$ y = [1375830, 1404072, 1392352, 1376821, 1360266, 1365427, 1391777, 1387692, 1371125, 1366945, 1390030, 1383092, 1364155, 1359236, 1353266, 1357331, 1342184, 1346367, 1382515, 1370486, 1386445, 1401242, 1423739, 1431781, 1452792, 1489638, 1495045, 1493634, 1490000, 1502666, 1479527, 1458043, 1464848, 1459947, 1450986, 1459600, 1465552, 1483254, 1503188, 1488414, 1506875, 1521401, 1532416, 1567326, 1587712, 1594244, 1629253, 1665828, 1712906, 1729109, 1743751, 1756142, 1745881, 1703504, 1671317, 1637210, 1577296, 1526749, 1509544, 1456453, 1445865, 1417295, 1386148, 1389166, 1363169, 1339542, 1320211, 1293073, 1284451, 1293558, 1283074, 1274415, 1235572, 1221188, 1210362, 1183947, 1137017, 1133703, 1123012, 1094543, 1090011, 1068829, 1046517, 1070447, 1078622, 1057965, 1047916, 1035393, 1029319, 1008175, 1011824, 1025363, 1026182, 1014771, 1034820, 1042072, 1032089, 1023092]
5888A023092j5158j799p99j8599r721K3361j0922M867o118j70j8265k8094K3369
5875I65044J3869m032k1132n204K0318j9528j35J1432p080j1452K5658L0495J3752
5862A012005j2971j9332J4554p408J3540j43j9782n976j6490P558k6443j3267
5850I25845K6383P341k8307J7842l155k5468K8034K2885L792k0600n75J69J1827
5837I66013K6541q527l7797k4600J4895K2754k3823o108m633k2593J3300p020
5825I08402P004j1163j3382K0607M1005L161l1627j189J597q587J4129J5791J0064
5812I55812j1125J5469L5708k0666M730j1738P479N36j142P225P674J4839J1280
5799A016081O665Q168n575J3240K5458k746k279L786K214l993k2247k3900P017
$$ y = [1023092, 1007934, 1006135, 1005336, 986737, 977016, 1000377, 989455, 994322, 988204, 988034, 969769, 941675, 965044, 978913, 974881, 953749, 948545, 968863, 949335, 949200, 960632, 953552, 942100, 967758, 998253, 1012005, 999034, 979702, 994256, 986848, 1000388, 1000245, 980463, 974487, 957997, 965555, 939112, 925845, 952228, 959569, 931262, 949104, 945949, 920481, 948515, 971400, 975192, 954592, 954017, 954186, 966013, 992554, 984027, 946230, 921630, 936525, 959279, 935456, 929348, 924715, 902122, 915422, 908402, 915406, 904243, 890861, 911468, 952473, 955634, 924007, 922818, 924415, 915828, 929957, 945748, 955812, 944687, 960156, 995864, 975198, 979928, 968190, 975669, 976205, 975063, 982288, 989962, 1004801, 1016081, 1022746, 1030914, 1025339, 1038579, 1064037, 1061291, 1059012, 1062798, 1065012, 1061019, 1038772, 1014872, 1021889]
5786A021889P281l5031q885P286k4935m744j485l3475L185j5922q691K669r878
5773H99264m477j4839J8842j3438k9834K3140p348j9494k0581J1005K4935j4397
5761H52778N570K5279K5445j10J5320j7394O796K210M829J1708k8267J9611R410
5748I33185J392m335J7163O290j103R246J8456l880J04k3147J8492L465J1602
5735I86930l4762j4059J1941J7247o09k5285J6237j5156K0529P852L1633L375
5723A005873j4988k8350O600j0954n352J3323J2016k4802l2179j7410p04P836
5711I10909j183o863j3905p144r87R584m593k287J3665J1995R244j1139R858K0417
5697I37571N127K1467L0651j416j0110L6494K5727j7479l526N47P833J7442J5892
$$ y = [1021889, 1029170, 994139, 985254, 992540, 967605, 962861, 961376, 927901, 931086, 915164, 906473, 909142, 899264, 894787, 879948, 898790, 885352, 855518, 878658, 871310, 851816, 831235, 842240, 867175, 852778, 858348, 883627, 909072, 908962, 924282, 906888, 913684, 915894, 920723, 932431, 904164, 923775, 933185, 934577, 930242, 947405, 953695, 952592, 961838, 980294, 976414, 976518, 953371, 971863, 975328, 986930, 952168, 938109, 950050, 967297, 966688, 941403, 957640, 942484, 963013, 970865, 1002498, 1005873, 990885, 962535, 969135, 958181, 952829, 966152, 978168, 953366, 921187, 903777, 903073, 910909, 909726, 902863, 888958, 881814, 880827, 890411, 885818, 883531, 897196, 909191, 918435, 907296, 917154, 937571, 942698, 964165, 994816, 993400, 983290, 1019784, 1045511, 1028032, 1024506, 1025053, 1032886, 1050328, 1066220]
5684A066220k5616q259K2993K5934M426J3616J9181P316K871L1947L4343N852
5672A200824K6672K6142N774L2152L6470L1599L0817K6843K2120M0978M61K0962
5660A501814J8631j0682k9912k2636k1398L573L342j0849k285Q353k744j6532
5648A418675j6764J5825K2205k5107n631r107L458R91J4540n675J5076j6084Q628
5635A421030L4810K4494K8725M5838L6684Q892J7922k2302k9891j157N868j1991
5623A558922m619J1828j0318n109P871K5984m7493O713R478O865K7159J3985J4513
5610A615779P085j5187L1352K1103L0211M1276j8932L8535M3009M2264M743P210
5598A848448L5453J7976J182J6449R838J6660J8845J5297L9338J6953N4647L3522
$$ y = [1066220, 1040604, 1032345, 1055338, 1081272, 1085698, 1099314, 1118495, 1125811, 1128682, 1160629, 1194972, 1200824, 1227496, 1253638, 1259412, 1291564, 1328034, 1359633, 1390450, 1417293, 1439413, 1480391, 1480852, 1501814, 1520445, 1509763, 1479851, 1457215, 1435817, 1439390, 1442732, 1431883, 1429598, 1437951, 1435207, 1418675, 1401911, 1417736, 1439941, 1414834, 1409203, 1400096, 1403554, 1404545, 1419085, 1413410, 1428486, 1412402, 1421030, 1455840, 1480334, 1509059, 1554897, 1591581, 1600473, 1618395, 1596093, 1566202, 1565045, 1570913, 1558922, 1554303, 1566131, 1555813, 1550704, 1558575, 1584559, 1537066, 1543779, 1553257, 1560122, 1587281, 1601266, 1615779, 1622864, 1607677, 1639029, 1660132, 1690343, 1731619, 1712687, 1751222, 1794231, 1836495, 1841238, 1848448, 1883901, 1901877, 1903059, 1919508, 1929346, 1946006, 1964851, 1980148, 2019486, 2036439, 2091086, 2124608]
5586B124608K6239N5573Q0779N0646N6881Q4965R3909Q9853J11021J58561J48901
5575C081936J76092J79484J76873J98054K02259K31335K52549K29932K20304K47899
5565E196717K28986K38197K41089K11385J86207J29430R3655J6456o3008j21517
5555F357597j46179j78475j78921j99449j87553k00585k27911j87330j84443j63329
5545D503422j56110r6759j02883j10492o9380n7905l7665n8235m6369m3494l9476
5534C684654l3327p4352o9142m1045m1439p3206o3713k2544Q279o908n3329n7159
5522C156769m6257l0323o1574m2373k1210n5853m2199m8172l4259j3283m8783
5511B712483p0938n7281o7113r8939o9168q3075m4233k1214m5668p2159n5123
$$ y = [2124608, 2150847, 2206420, 2287199, 2337845, 2394726, 2479691, 2573600, 2663453, 2774474, 2933035, 3081936, 3258028, 3437512, 3614385, 3812439, 4014698, 4246033, 4498582, 4728514, 4948818, 5196717, 5425703, 5663900, 5904989, 6116374, 6302581, 6432011, 6525666, 6542122, 6479114, 6357597, 6211418, 6032943, 5854022, 5654573, 5467020, 5266435, 5038524, 4851194, 4666751, 4503422, 4347312, 4250553, 4147670, 4037178, 3967798, 3909893, 3872228, 3813993, 3767624, 3724130, 3684654, 3651327, 3576975, 3507833, 3466788, 3425349, 3352143, 3288430, 3265886, 3274165, 3267257, 3213928, 3156769, 3110512, 3080189, 3018615, 2976242, 2955032, 2899179, 2856980, 2808808, 2774549, 2761266, 2712483, 2641545, 2584264, 2517151, 2418212, 2349044, 2265969, 2221736, 2200522, 2154854, 2082695, 2027572]
5500B027572p9094n8872m8128n6674n6788n3036m5965n0920l3390k9043k9044
5489A486618n8471P444j5352k8855k2166k425r731l1657o696p863K0090j1719
5477A319217j387R210j3367k0093m645q63K3551q89L465r647J4784o242o496p426
5463A299172k7049K64M009J9379l530j0854k7047J0170J1516N383j4782l954O366
5450A269043k6597J43m128j0361J5214J4799J6478L1391P713j0203L3599L573
5438A340664K4498n401K0586O1382M7861L7899N3652O4661Q9603R6646J32583
5427A964634J72524J27916J36139J09444N5175L1790p2363j87550j36014j25234
5417B076461q6575n7029j9958m9317k1729n8248l0758r10L2735k253l7874M390
$$ y = [2027572, 1948478, 1889606, 1841478, 1784804, 1728016, 1674980, 1629015, 1578095, 1544705, 1515662, 1486618, 1428147, 1435591, 1420239, 1391384, 1369218, 1366793, 1357062, 1325405, 1318709, 1310846, 1330936, 1319217, 1317830, 1327040, 1313673, 1293580, 1288935, 1288072, 1311623, 1310734, 1314199, 1304552, 1319336, 1313094, 1306598, 1299172, 1272123, 1272387, 1276396, 1295775, 1292245, 1281391, 1254344, 1264514, 1276030, 1281413, 1266631, 1262677, 1269043, 1242446, 1242589, 1238461, 1228100, 1243314, 1258113, 1274591, 1305982, 1313695, 1303492, 1337091, 1340664, 1365162, 1359761, 1380347, 1441729, 1489590, 1527489, 1581141, 1645802, 1735405, 1832051, 1964634, 2137158, 2265074, 2401213, 2510657, 2565832, 2597622, 2525259, 2337709, 2201695, 2076461, 1989886, 1932857, 1912899, 1863582, 1841853, 1783605, 1752847, 1751937, 1784672, 1782419, 1744545, 1748935]
5405A748935L670K5005J4862J6202J4604O4790O0449N1640N3163P8558J13441
5394B245319Q4017J18446Q9846J20153J70020J46525J05885O8155R1411N9621
5384C299398M431j9937n3034n2784q0649j33194j24241j03770n4968n6762p8563
5373B545927m7578O262k750Q52k3786k8599L239m4434o311o1311m9245j167j01872
5360B189227n5293o4449o3214m0301n6489m4275k7276m4904m3776j6916l0461
5349A701873m9421q145l1331k0033m8847P430k9210l4141r788o153m847l2309
5337A435078l1856j3264r757j0205j5920P30j8266K632n851J2788Q736K2434J6438
5324A393717R690J2692p272j5971K1388J3911m59Q188j494J3166J1199K8231m732
$$ y = [1748935, 1752605, 1777610, 1792472, 1808674, 1823278, 1888068, 1948517, 2000157, 2053320, 2131878, 2245319, 2329336, 2447782, 2537628, 2657781, 2827801, 2974326, 3080211, 3148366, 3239777, 3299398, 3303829, 3283892, 3230858, 3178074, 3097425, 2964231, 2839990, 2736220, 2681252, 2624490, 2545927, 2498349, 2504611, 2501861, 2502713, 2478927, 2450328, 2453567, 2409133, 2402822, 2341511, 2292266, 2291099, 2189227, 2133934, 2069485, 2006271, 1965970, 1909481, 1865206, 1837930, 1793026, 1749250, 1732334, 1701873, 1652452, 1644307, 1612976, 1592943, 1544096, 1551526, 1522316, 1488175, 1478387, 1472234, 1467387, 1435078, 1403222, 1389958, 1380201, 1369996, 1354076, 1354806, 1336540, 1339172, 1333321, 1346109, 1354845, 1377279, 1393717, 1403407, 1416099, 1408827, 1392856, 1414244, 1428155, 1427696, 1435884, 1434390, 1447556, 1458755, 1486986, 1482254]
5311A482254j2688l805O027M4528M820J1147N060J3106J2014k1757J755K5356
5299A567817r423J0257Q974j519M2999K4092O244L1885M9032J9825q417p555J4851
5286A749062L0364K3876M0250K1816j1883O666m188P484k2551l937O292j896l531
5273A837824M657m0644k0425K1792K869k3190n020P924j7656j5631k950L6423
5261A785973J3585N580J9789j9675L838J3339K8077j2558j287M6266M4050K3225
5249A950202L0203N627J6615J2307M1176J2783l414J9094K4758k7811J6269L3698
5237B131507K5265M0471N0944P947K7878J4595M6528K1745L5155J4422O9379N4005
5225B539841K948J0428L6482J9160l540l1213M5465K6027J6027J1410N9046O084
$$ y = [1482254, 1469566, 1465761, 1471788, 1516316, 1521136, 1532283, 1537343, 1550449, 1562463, 1540706, 1542461, 1567817, 1558394, 1568651, 1577625, 1576106, 1619105, 1643197, 1649441, 1681326, 1730358, 1750183, 1741766, 1734211, 1749062, 1779426, 1803302, 1843552, 1865368, 1853485, 1860151, 1855963, 1863447, 1840896, 1836959, 1843251, 1841355, 1837824, 1842481, 1801837, 1781412, 1803204, 1806073, 1782883, 1777863, 1785787, 1768131, 1752500, 1749550, 1785973, 1799558, 1805138, 1824927, 1805252, 1809090, 1822429, 1850506, 1837948, 1836661, 1882927, 1926977, 1950202, 1980405, 1986032, 2002647, 2014954, 2056130, 2068913, 2065499, 2084593, 2109351, 2081540, 2097809, 2131507, 2156772, 2197243, 2248187, 2256134, 2284012, 2298607, 2345135, 2366880, 2402035, 2416457, 2485836, 2539841, 2542789, 2553217, 2589699, 2608859, 2605319, 2574106, 2619571, 2645598, 2661625, 2673035, 2732081, 2738165]
5213B738165J3206J8872M2298L0986L5517M7885O9741P7930R0559N3516R5426
5202C314101Q4506N6154R2771P7169Q0993Q7016R8503J02737R6248Q5485J52512
5191D328195J36487J52012J28668J44558J96181K03277K15189K72539K61952K80523
5181F319581K97501L26454L53032L33615L56407L89989L30995K62600J98477J75019
5171I343670Q7415M6395L8282N4537o909L1195O2448J46124J76189J76746J67761
5160A0323853J88412J48420R7277R7143M1754J7703N6481O7999J52795J73384
5150A1365221K27399K56465L54650L66139M63916N28842O79921O98823Q30462
5141A5771838Q63646R72073J004779J086741J103303J175781J191340J282958
$$ y = [2738165, 2751371, 2770243, 2812541, 2843527, 2879044, 2926929, 2996670, 3074600, 3165159, 3218675, 3314101, 3398607, 3454761, 3547532, 3624701, 3705694, 3792710, 3891213, 3993950, 4090198, 4175683, 4328195, 4464682, 4616694, 4745362, 4889920, 5086101, 5289378, 5504567, 5777106, 6039058, 6319581, 6617082, 6943536, 7296568, 7630183, 7986590, 8376579, 8707574, 8970174, 9168651, 9343670, 9431085, 9477480, 9515762, 9570299, 9563390, 9594585, 9657033, 9803157, 9979346, 10156092, 10323853, 10512265, 10660685, 10757962, 10855105, 10896859, 10914562, 10971043, 11039042, 11191837, 11365221, 11592620, 11849085, 12203735, 12569874, 13033790, 13562632, 14242553, 14941376, 15771838, 16635484, 17607557, 18612336, 19699077, 20802380, 21978161, 23169501, 24452459]
5133B4452459J308107J450657J552003J812759K060342K462789K786909L330214
5125D1216239L701189M089897M379781M839907N222318N981577O768456Q281166
5117H4480530J0412568J4045643J8871191K4778607K6540420K5711457K5466744
5110B30307160K0285198J2021721P163382r918579l0550554l0470456k4337658
5103A74500214j9509580j6190445j2860917j1382828j0273368r076202p993652
5096H7213222p890083p390851o182581n170508m455626l850836l433428l277125
5088D5562184l280506k953406k535567k194299k005257j762530j610967j517638
5080B7702014j377162j250418j146891j062032r59741r15131q61143q11484p86357
$$ y = [24452459, 25760566, 27211223, 28763226, 30575985, 32636327, 35099116, 37886025, 41216239, 44917428, 49007325, 53387106, 58227013, 63449331, 69430908, 76199364, 84480530, 94893098, 108938741, 127809932, 152588539, 179128959, 204840416, 230307160, 250592358, 262614079, 269777461, 259858882, 229308328, 198837872, 174500214, 154990634, 138800189, 125939272, 114556444, 104283076, 95206874, 87213222, 79323139, 71932288, 65749707, 60579199, 56123573, 52272737, 48839309, 45562184, 42281678, 39328272, 36792705, 34598406, 32593149, 30830619, 29219652, 27702014, 26324852, 25074434, 23927543, 22865511, 21905770, 20990639, 20129496, 19318012, 18531655]
5071A8531655q38705q26911p67639o91986o62882n73366n21837m40748m45746
5062A2761835m27625l58271l47049l26309l04005l00030k95824k67627k27041
5053I908054k67825j97741k04432k05555k12992j95789j87320j86351j79156j64112
5043G906781j46729j23650j38390j26077j24424r4431j16693j02826j13732q4350
5033F735479j44588j02620j17243j13797p3685p4572j07158p7809n7238n8254
5023E808515o9411n1378n7816l3405n2154l4713k4125l3175n5016l3828k0898
5012E342596l3112m0012j896o5247j8129l3446m3451l9325k4045o1927J3477M825
5000E000308j3298m488J0393n048l823q9751n4815k2072l2445k9220p838L435
$$ y = [18531655, 17692950, 16866039, 16098400, 15406414, 14743532, 14170166, 13648329, 13207581, 12761835, 12334210, 11975939, 11628890, 11302581, 10998576, 10698546, 10402722, 10135095, 9908054, 9640229, 9442488, 9238056, 9032501, 8819509, 8623720, 8436400, 8250049, 8070893, 7906781, 7760052, 7636402, 7498012, 7371935, 7247511, 7153080, 7036387, 6933561, 6819829, 6735479, 6590891, 6488271, 6371028, 6257231, 6183546, 6108974, 6001816, 5924007, 5866769, 5808515, 5739104, 5687726, 5629910, 5596505, 5544351, 5509638, 5485513, 5452338, 5397322, 5363494, 5342596, 5309484, 5269472, 5267576, 5202329, 5184200, 5150754, 5107303, 5067978, 5043933, 4982006, 4995483, 5000308, 4987010, 4982522, 4992915, 4987867, 4984044, 4894293, 4839478, 4817406, 4784961, 4755741, 4747903, 4751338]
4988D751338K497R316P968J8460P7784L4225O1994O8323J5885K7581K7582k0710
4976E082243p175m5907j1502j8517l1015o3765n4923n1845m9213l0127k4523k9207
4964D664524j4819o917k2366l9072q790J7961o158k3784J3524K5961r778K6170
4952D616456J5665K1441J5908M2523K0249L6121J9458J1877L8677L0476J8554
4941D887405K5056N303L1514J8096M2838J5351K850L8366M5078K4719L7367M8523
4929E222466O3180O0849J07827Q8404Q7351J26796J57088Q9317J12555J57113
4919F272946J52238J57714K11618K08179K54960K85200K48076K51214K22475K10284
4909H474904J97664J70757J27421J43311J59176J98616K67237K47076L01125L07256
$$ y = [4751338, 4753835, 4763151, 4771119, 4789579, 4867363, 4901588, 4963582, 5031905, 5047790, 5075371, 5102953, 5082243, 5075068, 5029161, 5017659, 4999142, 4968127, 4904362, 4849439, 4797594, 4748381, 4718254, 4693731, 4664524, 4649705, 4642788, 4620422, 4581350, 4572560, 4590521, 4584363, 4560579, 4574103, 4600064, 4590286, 4616456, 4632121, 4653562, 4669470, 4711993, 4732242, 4768363, 4787821, 4799698, 4838375, 4868851, 4887405, 4912461, 4917764, 4949278, 4967374, 5010212, 5025563, 5028413, 5066779, 5111857, 5136576, 5173943, 5222466, 5285646, 5346495, 5454322, 5542726, 5630077, 5756873, 5913961, 6003278, 6115833, 6272946, 6425184, 6582898, 6794516, 7002695, 7257655, 7542855, 7790931, 8042145, 8264620, 8474904, 8672568, 8843325, 8970746, 9114057, 9273233, 9471849, 9739086, 9986162, 10287287, 10594543]
4899A0594543L43802L44856L34923L36237L16411K86568K10453J61163Q4657L4529
4889A3048142l6939m9341n4494q2631m1502J5721M7747O8067J37515J28233J13807
4878A3294325N5101O141p0967j28784j69752k35489k97840l55986l90612m30410
4868A1275727m60915m19375m14118l92392l77315l03202k79829k23464k07740
4859H197377j69656j56007j90866j20786j25857j22182j03681p8355o0699p5309
4849F993979l6031J7828K884J3030N2598Q4390J49081J70957J98490K48830L64571
4838H260607L80075M14706M41719M35779M03285L50077K49818J75676M6302j00828
4828A1057216k36450l10530l64800m28300m49106m62712m28906m27451l90435
$$ y = [10594543, 10938345, 11283201, 11618124, 11954361, 12270772, 12557340, 12767793, 12928956, 13013613, 13048142, 13011203, 12961862, 12907368, 12824737, 12783235, 12798956, 12846703, 12914770, 13052285, 13180518, 13294325, 13349426, 13355567, 13284600, 13155816, 12986064, 12750575, 12452735, 12096749, 11706137, 11275727, 10814812, 10395437, 9981319, 9588927, 9211612, 8908410, 8628581, 8405117, 8197377, 8027721, 7871714, 7680848, 7560062, 7434205, 7312023, 7208342, 7129987, 7069288, 6993979, 6957948, 6975776, 6978660, 6991690, 7044288, 7128678, 7277759, 7448716, 7647206, 7896036, 8260607, 8640682, 9055388, 9497107, 9932886, 10336171, 10686248, 10936066, 11111742, 11158044, 11057216, 10820766, 10510236, 10145436, 9717136, 9268030, 8805318, 8376412, 7948961, 7558526]
4819G558526l42575k69434k29493j99950j62578j23150j52507j59590j33358j10525
4809E675366j13806j01093j22652p9151o3919o5462n5880j7935J534K2537L2969
4798E112508O9090R4448J45482J86842K15233K19875J97306J52684J76972R5267
4788F665707K6338Q9852J83936K65935L10341L22050K85975J72305P2191p4319
4778H320311l44432m92501m69424m07058l48689k89038k56835k11529j95550j93109
4768E112146j67310j70627j46135j67406j40998j44628j10724j14527j02533p2918
4758C774340p4991r6686n5603l8250o8810l4837k6295l3375j4556k0433l1635
4747C278869o981k3407k108P416k3114j6454J028L337j7394J794q24M92k4735
$$ y = [7558526, 7215951, 6946517, 6717024, 6517074, 6354496, 6231346, 6078839, 5919249, 5785891, 5675366, 5561560, 5460467, 5337815, 5258664, 5194745, 5129283, 5073403, 5055468, 5057002, 5079539, 5112508, 5181598, 5276046, 5421528, 5608370, 5823603, 6043478, 6240784, 6393468, 6570440, 6665707, 6692045, 6781897, 6965833, 7231768, 7542109, 7864159, 8150134, 8322439, 8394630, 8320311, 7975879, 7483378, 7013954, 6606896, 6258207, 5969169, 5712334, 5500805, 5305255, 5112146, 4944836, 4774209, 4628074, 4460668, 4319670, 4175042, 4064318, 3949791, 3847258, 3774340, 3699349, 3602663, 3547060, 3508810, 3440000, 3405163, 3378868, 3345493, 3330937, 3310504, 3278869, 3271888, 3248481, 3246373, 3253789, 3230675, 3214221, 3215249, 3218586, 3201192, 3202986, 3202162, 3202654, 3177919]
4734C177919O41m761J3494q689j1789J3598J6585L292K8394L9805M0125L9383
4722C347997M7820N3468P5225J07692J06660J20389J31692J80214J94109K11621
4712D576887K36445K62600L23132N02752O40988Q77940R83592R39767R87329Q63736
4702A1195168N18365K99179j85817j005177j190334r25736p29588o21710m98722
4693F855628m00265l71616l07081k62096k40723k17503j77158j11707j02136m5822
4683D619521m937o6298j2418L090L7795K1841P248Q726m9938n2420o252k7768
4671D478190l5061l9867l4291j8999j014l474O592J0220P324L7754M7286M5094
4659D499754M9131M4049P6564Q3189R5267P9587J57685J64275J90877K36199K26510
$$ y = [3177919, 3178560, 3173799, 3187293, 3178604, 3166815, 3180413, 3196998, 3200290, 3228684, 3268489, 3308614, 3347997, 3395817, 3449285, 3524510, 3632202, 3738862, 3859251, 3990943, 4171157, 4365266, 4576887, 4813332, 5075932, 5399064, 5901816, 6542804, 7420744, 8404336, 9344103, 10331432, 11195168, 11713533, 12012712, 11826895, 10821718, 9631384, 8705648, 7976060, 7354350, 6855628, 6455363, 6083747, 5776666, 5514570, 5273847, 5056344, 4879186, 4767479, 4665343, 4619521, 4614584, 4548286, 4535868, 4538958, 4576753, 4598594, 4605842, 4614568, 4564630, 4512210, 4505958, 4478190, 4443129, 4403262, 4368971, 4349972, 4348958, 4345484, 4352076, 4362296, 4369620, 4407374, 4454660, 4499754, 4548885, 4592934, 4669498, 4752687, 4847954, 4927541, 5085226, 5249501, 5440378, 5676577, 5903087]
4648E903087K64944K90219L31628L78214M32219N35102O49537P11756P45762P71832
4638A1014300O66716N42027L24134J8762k78761m56406n75491n66926m85228l54698
4628I848429k68153j67667o2297k5617N1474J03577J78369K45921L09007M10430
4618A0623473M52619N16256O06726P18458Q28715Q53521Q47179Q10132O82966
4609A6940045M46151J51029k04756n54037p06639o81691n60084m68739l19921
4600A4041358j91199r4679l431N6457P8824N9358J6861o6881k32751m18809n16063
4589A2729045n90142n61553n16514m05281l51853l24633l42303l61201l76203
4580H899362l72911l81522l76625l72604l36488k96622k24994j98405j85950j71659
$$ y = [5903087, 6168031, 6458250, 6789878, 7168092, 7600311, 8135413, 8784950, 9496706, 10242468, 11014300, 11681016, 12223043, 12547177, 12565939, 12287178, 11830772, 11255281, 10688355, 10203127, 9848429, 9580276, 9412609, 9350312, 9324695, 9376169, 9479746, 9658115, 9904036, 10213043, 10623473, 11076092, 11592348, 12199074, 12917532, 13746247, 14599768, 15446947, 16257079, 16940045, 17386196, 17537225, 17332469, 16778432, 16071793, 15390102, 14830018, 14361279, 14041358, 13850159, 13755480, 13752049, 13808506, 13887330, 13946688, 13963549, 13896668, 13663917, 13245108, 12729045, 12138903, 11577350, 11060836, 10655555, 10303702, 9979069, 9636766, 9275565, 8899362, 8526451, 8144929, 7768304, 7395700, 7059212, 6762590, 6537596, 6339191, 6153241, 5981582]
4570E981582j42088j11426r5379p2983l8502M327M3624M9049N3816P1585J06117
4559E849722J00035O7685Q0280N7833N2028Q6579J03464J35483J56350K00406
4549F889865J57797J39116J20962J10123N5509j4003p9693j56242k40122k79146
4539F704166l25226l15574k58879k19242k01291j22678j26961j01829r6154j12211
4529D824121q0366l6916p469J9153J9636M6190P7117O7166J16843J31349J72109
4518E348933K19995K22027K94476L50352L50311M14213M36018L76447L77920L38746
4508H729438K72846J91550Q8316J9408n2364k6972p7067r5887j02739p3432k7953
4497H845144J7615P9232J20319J60892J87326K25129K82619L38202L98799M62957
$$ y = [5981582, 5839494, 5728068, 5632689, 5559706, 5521204, 5525531, 5569155, 5618204, 5672020, 5743605, 5849722, 5949757, 6017442, 6097722, 6155555, 6207583, 6294162, 6397626, 6533109, 6689459, 6889865, 7047662, 7186778, 7307740, 7417863, 7473372, 7459369, 7379676, 7223434, 6983312, 6704166, 6378940, 6063366, 5804487, 5585245, 5383954, 5261276, 5134315, 5032486, 4936332, 4824121, 4743755, 4706839, 4699370, 4718523, 4738159, 4784349, 4861466, 4928632, 5045475, 5176824, 5348933, 5568928, 5790955, 6085431, 6435783, 6786094, 7200307, 7636325, 8012772, 8390692, 8729438, 9002284, 9193834, 9282150, 9301558, 9249194, 9222222, 9145155, 9049268, 8946529, 8873097, 8845144, 8862759, 8941991, 9062310, 9223202, 9410528, 9635657, 9918276, 10256478, 10655277, 11118234]
4487A1118234N48755O20677P10063Q40905R70793J121646J293285J538860J821867
4478B0585085K163695K630981L189982L775544M058430L949466L544849K834110
4470D6732142J797424O29768j015870l078886m187320m069669l568935l087639
4462C0151015k693627k372847k116612j869917j710404j566640j459717j296206
4454A5065045j133172j010530q62588p52986p10024o60415n93172n00493m44387
4445H397278l71400l54956k94914k70429k55873j80802j86834j90085j27467j00805
4435F063713p9865r7744p9848k8723l0671q211K3750J12292J56188J78643K36034
4424F445558K28521J95945J34842O6783k3259j13114j99607k49992j94762j78955
$$ y = [11118234, 11666989, 12287666, 12997729, 13838634, 14809427, 15931073, 17224358, 18763218, 20585085, 22748780, 25379761, 28569743, 32345287, 36403717, 40353183, 43898032, 46732142, 48529566, 49159334, 48143464, 45064578, 40877258, 36807589, 33238654, 30151015, 27457388, 25084541, 22967929, 21098012, 19387608, 17820968, 16361251, 15065045, 13931873, 12921343, 12058755, 11305769, 10595745, 9935330, 9342158, 8841665, 8397278, 8025878, 7670922, 7376008, 7105579, 6849706, 6668904, 6482070, 6291985, 6164518, 6063713, 5983848, 5886104, 5806256, 5777533, 5746862, 5738651, 5762401, 5874693, 6030881, 6209524, 6445558, 6674079, 6870024, 7004866, 7071649, 7048390, 6935276, 6735669, 6485677, 6290915, 6111960]
4414F111960r8958o2860k6604M8489N2607J15844R8545M0889N23n0451j52856
4403F077128k21215k64066k83279k75554k69404k28461j86778j76682j24629j14118
4393C932942j07247o9929p9580l5954l7075j210J6369M9512O2994Q4700R0796
4382C906318P5136M2187j1876l9987p4193j47819j36555q9827q8574m0136j1389
4371C383285N9343P6739Q4027L9603P6200R7811j0308j7984p6579j39530j54140
4360C418467j51901j51258j29920j28021j28490j05935o2989o8952p0037o2972
4350B357992n3839m8701m9440l7366n6702m4364m0262m4363p778n366j3107m4853
4338A911851n2463l0378m6149m3282m6930k1937m2499l1784j3268k0218k5833
$$ y = [6111960, 6013002, 5950142, 5923538, 5972027, 6024634, 6140478, 6239023, 6279912, 6280435, 6229984, 6077128, 5855913, 5591847, 5308568, 5033014, 4763610, 4535149, 4348371, 4171689, 4047060, 3932942, 3825695, 3755766, 3676186, 3640232, 3603157, 3601947, 3618316, 3667828, 3730822, 3815522, 3906318, 3981454, 4023641, 4011765, 3971778, 3897585, 3749766, 3613211, 3523384, 3434810, 3394674, 3383285, 3442628, 3519367, 3603394, 3642997, 3719197, 3817008, 3806700, 3788716, 3712137, 3572607, 3418467, 3266566, 3115308, 2985388, 2857367, 2728877, 2622942, 2559953, 2491001, 2420964, 2357992, 2304153, 2255452, 2206012, 2168646, 2111944, 2067580, 2027318, 1982955, 1975177, 1969811, 1956704, 1911851, 1859388, 1829010, 1782861, 1739579, 1692649, 1670712, 1628213, 1596429, 1583161, 1562943, 1537110]
4327A537110J7169M851l5341k3978j8593k6906m4966n1952n4095j2338k5189l9470
4315A226302j5224r867p727P399m4714m165j75j6195j0987k0028q420k5240j6202
4302A054757k8247M698k3368l0912l0500j6888J7256k3811P521k2449k7234l203
4290H77620J2211k638j0945P028q489j16j1611J748q549r058J7515N325K316j5167
4276H57190k294k8878J5930j0565p916r055J5725J633J9832q786R440K7462k610
4263H77108J2278J2929m447L006j0129k7499R331O689l1224k8279Q214l3053k064
4250G92860k5145j8663N943m624L611n294j8969k8285j9784J7721J4735m662Q110
4237G17554j7484N867Q588j5468j8901J5293P716p776m35L740J6474K442J8994
$$ y = [1537110, 1554279, 1559130, 1523789, 1499811, 1481218, 1454312, 1409346, 1357394, 1303299, 1290961, 1265772, 1226302, 1211078, 1201211, 1193484, 1200883, 1156169, 1152004, 1151829, 1135634, 1124647, 1104619, 1096199, 1070959, 1054757, 1026510, 1031208, 1007840, 976928, 946428, 929540, 946796, 922985, 930506, 908057, 880823, 877620, 889831, 887193, 876248, 883276, 874787, 874671, 863060, 864808, 856259, 847201, 864716, 870041, 872357, 857190, 854896, 826018, 841948, 831383, 823467, 814412, 830137, 831770, 851602, 842816, 852256, 879718, 877108, 889386, 902315, 897868, 900874, 890745, 863246, 872577, 879266, 848042, 819763, 827977, 794924, 792860, 767715, 749052, 754995, 750371, 753982, 748688, 729719, 701434, 681650, 699371, 714106, 709444, 717554, 700070, 705937, 714525, 699057, 680156, 695449, 703165, 695389, 694954, 698694, 715168, 717610, 736604]
4224G36604n898J8615R30J8817J7665J6922K1393K2453K7350N7994K0772K1103
4212I74720K5731L9292j4680k3342j2787l491k9646k4695o08j1225n170k3376
4200H90723l2601j0637J239P485l696l3687J5514J4202O501M6508K1411K7610
4188I50572K4665J0150k889O3437M3819K8991N0757P6944Q5370P0134J10933J22668
4176A635551J42468J48899J50375J61262J35909J53130R6312J8161K9729J842
4166B673638m2060o5804j00276j35917j03099o5418o4226n5235l3497j6024l1585
4155A960497n252J4438N4378Q0541R2079R1934J15891J63256J98280K50733K78868
4144C295643L04573K68887K36028J88653J23242N6748j8578r4499j44568k12171
$$ y = [736604, 730706, 749321, 750251, 769068, 786733, 803655, 825048, 847501, 874851, 932845, 953617, 974720, 1000451, 1039743, 1025063, 1001721, 988934, 985443, 955797, 931102, 930494, 919269, 914099, 890723, 858122, 847485, 848724, 856209, 852513, 818826, 834340, 848542, 855043, 901551, 922962, 950572, 975237, 985387, 982498, 1045935, 1089754, 1118745, 1169502, 1246446, 1331816, 1401950, 1512883, 1635551, 1778019, 1926918, 2077293, 2238555, 2374464, 2527594, 2623906, 2642067, 2671796, 2673638, 2631578, 2565774, 2465498, 2329581, 2226482, 2161064, 2096838, 2041603, 2008106, 1992082, 1960497, 1955245, 1969683, 2024061, 2104602, 2196681, 2288615, 2404506, 2567762, 2766042, 3016775, 3295643, 3600216, 3869103, 4105131, 4293784, 4417026, 4473774, 4455196, 4360697, 4216129, 4003958]
4134D003958k07248k59814k20833j77052j47235j58849j09810p6904m8767J1562
4124B609008K4857L911L7799P9686Q7659N9489O1940M6897K4314k1519m9821k5862
4112B938358k0193r691J1658M6482K5948O0852O7678L0747J2792q915o0932p3313
4100C021471p6845q8192q9654j03860p2420j6513l86K1097K9361P0309N3958L6511
4088B784837M1135L8329M5745M2830K4272L8l0246j5039l2860r9936q3897q4153
4076B631055j25501j11540j43858j39883j45719j35225q5078p8026p5717q8272
4066A502236n1147q0000k4716j7777m3163j4734J3151l8125j5273Q767J6705K5581
4054A281505M1455M2887O6602M4993O0521R0992Q7972Q5516N6467j7047j9473
$$ y = [4003958, 3796710, 3536896, 3316063, 3139011, 2991776, 2832927, 2723117, 2646213, 2597446, 2609008, 2633865, 2637776, 2675575, 2755261, 2842920, 2902409, 2964349, 3011246, 3035560, 3014041, 2964220, 2938358, 2918165, 2908474, 2920132, 2966614, 2992562, 3053414, 3121092, 3151839, 3164631, 3155716, 3094784, 3021471, 2944626, 2856434, 2766780, 2662920, 2590500, 2573987, 2573601, 2594698, 2624059, 2694368, 2748326, 2784837, 2825972, 2864301, 2910046, 2952876, 2977148, 2977186, 2946940, 2931901, 2899041, 2799105, 2715208, 2631055, 2505554, 2394014, 2250156, 2110273, 1964554, 1829329, 1744251, 1666225, 1590508, 1502236, 1451089, 1371089, 1346373, 1328596, 1285433, 1270699, 1283850, 1245725, 1230452, 1239219, 1255924, 1281505, 1322960, 1365847, 1432449, 1477442, 1537963, 1628955, 1716927, 1802443, 1858910, 1841863, 1822390]
4043A822390k7903p9265p6773r8181q3287o9801j20958q0090n3155o5845m5977
4032A021155n9867k2416o713k7507l4636n8762l8372m348k5263l6533l1112q561
4020F67065k5244o9520l300K8194k8807j6857p268J2564j1024K051L0181K8334
4008F06369j4250k2362l1741p403j1540j2089l1269J8374J1138k0481q080K2398
3996D99064q435o60N229r120N101J8106Q038J066k3224L31M1479k0559j0234O216
3982E12398l525O931R004q201R387K5996r411k0607k1128J452J4314j571j6938
3969D98101j4380J7583N158k2461M126N147j1842n654Q359k0774O071j4022j8014
3956D37398K7713J1572l176k8875j5115j2748K5939J3092J9170j903j8747j1525
$$ y = [1822390, 1794487, 1715222, 1638449, 1540268, 1456981, 1387180, 1266222, 1186132, 1132977, 1067132, 1021155, 961288, 938872, 932159, 904652, 870016, 811254, 772882, 768534, 743271, 706738, 675626, 667065, 641821, 572301, 569001, 597195, 568388, 551531, 544263, 556827, 545803, 547854, 578035, 606369, 592119, 569757, 538016, 530613, 519073, 506984, 475715, 494089, 505227, 484746, 476666, 499064, 490629, 489969, 495198, 486078, 491179, 509285, 517323, 518389, 495165, 495496, 536975, 516416, 506182, 512398, 508873, 515804, 524808, 516607, 525994, 551990, 542579, 521972, 500844, 502296, 516610, 515039, 498101, 483721, 501304, 506462, 484001, 488127, 493274, 481432, 475778, 484137, 463363, 469434, 455412, 437398, 465111, 476683, 473507, 444632, 429517, 416769, 442708, 455800, 474970, 473067, 454320, 442795]
3944D42795k9826J5092q341j3279r61P174o439j7344K897Q840r606k7685l2076
3931C31241J7912K2622r13Q779J8535K709j5994l6652P967l695k4561K0058O957
3918C54965j282j970q865Q889j690J0743J3907k1537n827J8221J9905j8304r79
3905C66176r125O898M560j676J806P489j0360J3163K2756K7549L976j9497j9370
3892C94345J9028J0931J7135J6640j428j2802J3267J4345n05R03o557L4899L367
3879E03568J3015Q839j0252k287k8790k4817L2499m816j2179j4132r979O725J967
3866D59361j973o208J3886K1559L572K9123K0584N576J1376n880R49q638p435
3853E35852K0822R247l1209j160o974k027K3348j4143L954J3084j1614j787j332
$$ y = [442795, 412969, 428061, 419720, 406441, 405480, 412654, 406215, 388871, 391768, 400608, 391002, 363317, 331241, 349153, 371775, 370862, 379641, 398176, 400885, 384891, 348239, 356206, 352511, 327950, 348008, 354965, 353683, 351713, 342848, 351737, 350047, 360790, 374697, 353160, 347333, 365554, 385459, 367155, 366176, 357051, 363949, 368509, 366833, 368639, 376128, 365768, 378931, 401687, 429236, 433212, 413715, 394345, 413373, 424304, 441439, 458079, 456651, 443849, 457116, 471461, 470956, 471859, 465302, 500201, 503568, 516583, 525422, 515170, 512883, 484093, 459276, 491775, 486959, 474780, 460648, 450669, 457394, 459361, 457388, 451180, 465066, 486625, 490197, 519320, 539904, 545480, 556856, 550976, 551925, 543287, 535852, 556674, 565921, 534712, 533552, 526578, 524551, 547899, 533756, 537710, 550794, 539180, 537393, 536061]
3840E36061j8306k7395Q700k4114o862n92O936J0601P351k744J229q460j2499
3827D69906k9357Q66n88J9301j6118j5296j7677K1525K4253j146K660j9191l148
3814D35990J3299J6499N1k2970p548R906j157n798R499n928l3788K7409m876m542
3800D26046j2911J5213n887p419J5021k4861o154J0502K850j7549r439J6537R202
3787D11151j7349j3652m014m257K1766K2525l205r636Q30J2427J1855j1870m551
3774D12020j6277R672K640J7488j1367n945J1375k420l291l3750J0282j5397R338
3761C84368N377k4426O30L158L956r554j0357j5631K7883Q415p48J1518n551J463
3747C80501Q829j946Q881N197J3915O56m286j7945l9060L2221L4546n671J4500
$$ y = [536061, 517755, 490360, 499060, 474946, 468084, 467492, 474428, 485029, 492380, 489636, 490865, 482405, 469906, 440549, 441415, 440827, 460128, 444010, 428714, 411037, 432562, 456815, 455669, 458329, 439138, 435990, 449289, 465788, 465839, 442869, 435321, 445227, 444070, 438272, 447771, 441843, 408055, 435464, 430588, 426046, 413135, 428348, 422461, 415042, 430063, 405202, 399048, 409550, 412400, 394851, 385412, 401949, 411151, 393802, 380150, 376136, 371879, 393645, 416170, 412965, 403329, 404159, 416586, 428441, 416571, 412020, 395743, 405415, 408055, 425543, 414176, 408231, 419606, 417186, 413895, 380145, 390427, 375030, 384368, 389745, 365319, 365949, 369107, 373063, 363509, 353152, 337521, 365404, 373819, 373071, 384589, 379038, 380501, 389330, 387384, 396265, 401462, 415377, 416033, 411747, 393802, 354742, 386963, 421509, 415838, 430338]
3734D30338k5092j0094j7197K7238j7881N692j3405j524j7838j1282J2724K4824
3722C86503K050l63J7684n321J656j5486K8411J431q424J514k4099J5425K612
3709D03593O974L5942j4218j6902J860J2092r777j7319j9765L9047J8571j2145
3697D27953j7258K3234q311j9869j5797K7314L3591n0314L350J5296m608j7431
3685C97150m826j5181K2124J1542j0694J690j7527j446j282J1807K5584J8934
3673D37875r424M227J820K216q303K1453k7887l551j0139r088J3008r278J0770
3660D13699J2123q770j4303K1976J3743n971j197o658o964R036l168q535j953
3647D13058p982J8104n306M878j8475J8913Q696k7461j6159J3099J4070K2488
$$ y = [430338, 405246, 395152, 377955, 405193, 387312, 393004, 379599, 378075, 360237, 348955, 361679, 386503, 388553, 388190, 405874, 400553, 402209, 386723, 415134, 416565, 408141, 409655, 385556, 400981, 403593, 410567, 446509, 432291, 415389, 417249, 429341, 419564, 402245, 382480, 421527, 440098, 427953, 410695, 433929, 425618, 405749, 389952, 417266, 450857, 400543, 403893, 419189, 414581, 397150, 392324, 377143, 399267, 410809, 400115, 401805, 384278, 382832, 381550, 393357, 418941, 437875, 428451, 432678, 434498, 436714, 428411, 449864, 421977, 418426, 408287, 399199, 412207, 402929, 413699, 425822, 417052, 402749, 424725, 438468, 432497, 431300, 424642, 417678, 426714, 423546, 415011, 413058, 405076, 423180, 417874, 422752, 404277, 423190, 431886, 404425, 388266, 401365, 415435, 437923]
3635D37923P885j8966q586J1686j4794m673J7201J9819M445q197m559q953j6430
3622D13801k5315j1955L354L7433K5596K4506r695j2234m148n105M988Q650J0961
3609D60837l0728m783K8225m882j9711l865K7518L6223l31J308j3765j1466J687
3596D66267J4883J5084j6083p357J7059k1410K2378J9255k2849j4552N04p00L1140
3583E03619J7056j1628l552j038L249k5405L0141J6826J9277J2254j6430l4365
3571E10004m548L7579L9234p054P438r536J5437P730l888O184J2032Q803o378
3558F13037K0203K9632j3011M552j0242N268Q924J0019J093j8201L6971K0281
3546G08526k0499k1380J8068L2384k893J152K018m571J0835J3884K0184K1009
$$ y = [437923, 445808, 426842, 418256, 429942, 415148, 410475, 427676, 447495, 451940, 443743, 439184, 430231, 413801, 388486, 376531, 379885, 417318, 442914, 467420, 457725, 445491, 441343, 436238, 441226, 449876, 460837, 430109, 425326, 453551, 448669, 428958, 425093, 452611, 488834, 488503, 489811, 476046, 464580, 466267, 481150, 496234, 480151, 472794, 489853, 468443, 490821, 510076, 487227, 472675, 473179, 472479, 503619, 520675, 509047, 505495, 504457, 507706, 482301, 512442, 529268, 548545, 560799, 544369, 510004, 505456, 543035, 582269, 575215, 582653, 573117, 588554, 596284, 592396, 598580, 610612, 619415, 613037, 633240, 662872, 649861, 654413, 644171, 649439, 658363, 668382, 669475, 651274, 688245, 708526, 688027, 666647, 684715, 717099, 714206, 715358, 717376, 712805, 723640, 737524, 757708, 778717]
3534G78717p262k951J2593j663j1471M3501J2013P068L885J708J0055K9913L6319
3521I12425K4456O302j1474J6341J7846K6211J2670J0754K0965q908K470j1402
3509A018656L3958L9621L876K3615K5347L3459L3132l730K9536K1916L5523J9942
3497A314851o588L3661K0379L7605K8093K1131K5327K8872N9449K5560K5724K4440
3485A638504K7881M6312J7861N6084J9343J9842K9961L6864J4915M4636N3398
3474B005601N8476L0896M1058O9489M5890N0468P5385M6834L7797L9282P8863
3463B580039N1142P4128R2704P2522O2946J19030J15667J24673J03102J49866
3453C545819J74125J59188J97833J96815K06609K25920K71999K56987K73602L03364
$$ y = [778717, 771455, 768504, 781097, 779434, 767963, 811464, 823477, 830545, 834430, 836138, 846193, 876106, 912425, 936881, 943183, 931709, 948050, 965896, 992107, 1004777, 1015531, 1036496, 1027588, 1030058, 1018656, 1052614, 1092235, 1096111, 1119726, 1145073, 1178532, 1211664, 1207934, 1237470, 1259386, 1294909, 1314851, 1308263, 1341924, 1362303, 1399908, 1428001, 1449132, 1474459, 1503331, 1562780, 1588340, 1614064, 1638504, 1666385, 1712697, 1730558, 1786642, 1805985, 1825827, 1855788, 1892652, 1907567, 1952203, 2005601, 2064077, 2094973, 2136031, 2205520, 2251410, 2301878, 2377263, 2424097, 2461894, 2501176, 2580039, 2631181, 2705309, 2798013, 2870535, 2933481, 3052511, 3168178, 3292851, 3395953, 3545819, 3719944, 3879132, 4076965, 4273780, 4480389, 4706309, 4978308, 5235295, 5508897, 5812261]
3443E812261L48376L42717L31192K92522L00782K70896K06946J14388M9249m1832
3433H027497j09157j66697k15720k09609k26412k67815k55336j78817k10891k34586
3423E952457j95590j68885j83183j52803j28633j37011j08662j21788q9309q2591
3413D584002r8608n8339p5604m7120l7852n4477p7999o1344q3546r4817j05539
3402C788757q6760j00855r0917p2860q0855r3160q0310n6596o6583o7456j00007
3391B892398o5474p4363n4138l6399n8059l4516n9539n1420j8665o6429k3411
3380B349985l3142m1364l9656l0593K118k0646m5119l1148n3387n0116l0616n1420
3368A924896m0788l4737p2876l6209n70k9909l9802q658l2381k2177j6124k8792
$$ y = [5812261, 6160637, 6503354, 6834546, 7127068, 7427850, 7698746, 7905692, 8020080, 8069329, 8027497, 7918340, 7751643, 7535923, 7326314, 7099902, 6832087, 6576751, 6397934, 6187043, 5952457, 5756867, 5587982, 5404799, 5251996, 5123363, 4986352, 4877690, 4755902, 4666593, 4584002, 4485394, 4427055, 4351451, 4304331, 4266479, 4212002, 4134003, 4072659, 3989113, 3894296, 3788757, 3701997, 3601142, 3510225, 3437365, 3356510, 3263350, 3183040, 3126444, 3059861, 2992405, 2892398, 2826924, 2752561, 2698423, 2662024, 2603965, 2569449, 2509910, 2458490, 2439825, 2373396, 2349985, 2316843, 2275479, 2235823, 2205230, 2207348, 2186702, 2141583, 2110435, 2057048, 2006932, 1976316, 1924896, 1884108, 1849371, 1776495, 1740286, 1739716, 1709807, 1670005, 1661347, 1628966, 1606789, 1590665, 1561873]
3356A561873r579l4373m3625k6757k8365l259K5204O364k8717l3136j9450l1888
3344A334292L055j5167j342j8394l9858n14j399j4365k8840j0992J544k127j8299
3331A187594o859j7113O23j8865J736l1069j6480J0158j8781j0089k0553o221
3319A054081q578O629j5552k4560o9r909m34K056k5676j7883k309q38m9928K3790
3305I30820j4709k0468r709j1083M119j4221Q741j3726J8851M742Q63j9045k2385
3292H42790j995N528n594k6171J7510j6838l9055P463J7393j5634r532R520K69
3279G85654k5821J4191q791j7245K1011o502K454o521J0377j2278k0746m422j0029
3266G21332J2049K876J146k1718j6174p907k4316Q244J1608q567j0257O432k4648
$$ y = [1561873, 1552294, 1517921, 1474296, 1447539, 1419174, 1415915, 1441119, 1447483, 1418766, 1385630, 1366180, 1334292, 1337347, 1322180, 1320838, 1302444, 1262586, 1262072, 1260673, 1246308, 1217468, 1206476, 1208020, 1205893, 1187594, 1180735, 1163622, 1164245, 1145380, 1147116, 1116047, 1099567, 1109725, 1090944, 1080855, 1060302, 1054081, 1045503, 1052132, 1036580, 1012020, 1011951, 1002042, 1001608, 1003664, 977988, 960105, 957796, 956958, 907030, 930820, 916111, 895643, 885934, 874851, 878970, 864749, 873490, 859764, 878615, 883357, 884220, 865175, 842790, 840795, 846323, 840729, 814558, 832068, 815230, 776175, 783638, 801031, 785397, 775865, 785385, 785654, 759833, 774024, 765233, 747988, 768999, 762497, 764951, 758430, 768807, 756529, 735783, 731361, 721332, 733381, 736257, 737403, 715685, 699511, 691604, 667288, 675532, 687140, 678573, 668316, 674748, 650100]
3253F50100r814n661j162K907L952O923j4407q745O654k545p315j7045J0361l0817
3239E83386O114L1733q745j0553o47k3229m251r191k0497M882J440l562k2135
3226E24745M96o519j5999M212J5924k0448o919k194R039O832j6987L573k2420
3213D73335j2729K8191m101j2579j52j1441N248j886J5657J587k3652N627N253
3200D68358r574M191L0220q263j1278p296J6025j4044J4197J756o541J3606j1556
3187D79801L708j263l522j3575r262J4720K7193j1913k2191J1378J1538K0220
3175E06832k2891K12K7542L0706N486J0204Q611N845M1519j9008l3654J904K7047
3162E90355L0455m578J0723J304k1773K8530j5744K6448L3177k3785J6360l313
$$ y = [650100, 640286, 634625, 633463, 636370, 640322, 647245, 632838, 624093, 630747, 628202, 620887, 603842, 614203, 583386, 589500, 621233, 612488, 601935, 601288, 578059, 573808, 564617, 544120, 549002, 550442, 546880, 524745, 525241, 518722, 502723, 506935, 522859, 502411, 495492, 493298, 502337, 509169, 492182, 495755, 473335, 460606, 488797, 484696, 472117, 471965, 460524, 465772, 463886, 479543, 481130, 457478, 463105, 468358, 458784, 462975, 493195, 484932, 473654, 466358, 482383, 468339, 482536, 484292, 477751, 491357, 479801, 483509, 482246, 478724, 465149, 455887, 470607, 497800, 485887, 463696, 475074, 486612, 506832, 483941, 484153, 511695, 542401, 547887, 558091, 566702, 572547, 614066, 595058, 561404, 563308, 590355, 620810, 616232, 626955, 628259, 606486, 635016, 619272, 645720, 678897, 655112, 671472, 668159]
3150F68159k54j5646J2621K3943M0336J5668j5692L9838L3687K9291R342j1193
3138H30100J6390L1371J6831K753L6765M2094K1349L9375J7440K4608N3196J9663
3126A151935N3211M5288R853M5454K9471K8996J9728K4543K8959P855L8419K0354
3114A504066L9324K2231L1378K8201M0109N5254M3710L0562L2478N4700N4596
3103A936609Q2120P2120Q4649J08518J15964Q8788R0581Q3357P2234P1126M3108
3092B849174k3415l810j1502m8230m5985n5442k4256o644l6877j7038n990L481
3080B573466o17J9720M4410M5013L3801P1912N0928P4624N4936P1617N0939M8239
3068C138988Q405L301O330o589Q62o8331q4812p0219o3611p0235o5023q5523j01313
$$ y = [668159, 667905, 652259, 664880, 688823, 729159, 744827, 729135, 768973, 802660, 831951, 841293, 830100, 846490, 877861, 894692, 897445, 934210, 976304, 997653, 1037028, 1054468, 1079076, 1132272, 1151935, 1205146, 1250434, 1260287, 1305741, 1335212, 1364208, 1383936, 1408479, 1437438, 1445293, 1483712, 1504066, 1543390, 1565621, 1596999, 1625200, 1665309, 1720563, 1764273, 1794835, 1827313, 1882013, 1936609, 2018729, 2090849, 2175498, 2284016, 2399980, 2488768, 2579349, 2662706, 2734940, 2806066, 2849174, 2825759, 2821949, 2810447, 2762217, 2716232, 2660790, 2636534, 2629890, 2593013, 2575975, 2569985, 2573466, 2572849, 2592569, 2636979, 2681992, 2715793, 2787705, 2838633, 2913257, 2968193, 3039810, 3090749, 3138988, 3147393, 3150694, 3157024, 3150435, 3151297, 3082966, 2998154, 2927935, 2864324, 2794089, 2729066, 2643543, 2542230]
3055B542230n6553k4333l5111m7484p607j2059j7190j5929j3173J3181k2923l1364
3043B271685k7242k3789k7550n6760o1456p0780p0439m8943q7104p3317o7432
3032A656873o9646n8621n0699n9544m1696o7359l3169n0506l6589m5878j7267
3021A125899l9495k7128l1023m6912l8215j8877M238k4008l9420k5874m7539k4042
3009G67604j1268l8269O049j8781m0702l9586j2239J0106n562m5417n542J2475
2997E78868m6929l6844j0537N279j2758k2734Q515P065m3026l1053o340j91L797
2984C93112j9388K425J2453r503k4317J2695q234k7597j5762o923J1855M683j132
2971C24367p452M227j0802j0024Q999k3863j5156l3904L1218j7550m953j1624
$$ y = [2542230, 2485677, 2461344, 2426233, 2378749, 2371142, 2359083, 2341893, 2325964, 2312791, 2325972, 2303049, 2271685, 2244443, 2220654, 2193104, 2136344, 2074888, 2004108, 1933669, 1884726, 1797622, 1724305, 1656873, 1587227, 1528606, 1477907, 1418363, 1376667, 1309308, 1276139, 1225633, 1189044, 1143166, 1125899, 1086404, 1059276, 1028253, 981341, 943126, 924249, 928487, 904479, 865059, 839185, 791646, 767604, 756336, 718067, 724116, 705335, 664633, 625047, 612808, 622914, 617352, 571935, 566393, 578868, 531939, 495095, 484558, 489837, 477079, 454345, 462860, 469925, 426899, 395846, 389506, 389315, 393112, 373724, 376149, 388602, 379099, 354782, 367477, 359243, 331646, 315884, 308961, 320816, 325499, 324367, 316915, 321142, 310340, 300316, 309315, 285452, 270296, 236392, 267610, 250060, 245107, 233483]
2959B33483j2912P487k1527J3338j4568J3668R686j2763N136p595q837K1856J8186
2946B44638j6845k5257L879K480j2938j1352l656j1309q018Q826j0334j4669k71
2933A45174R2O894O851k0215k1728L286j6417J1951K720p133j5430n90p854P257
2919I4858n678k2211P212r851Q047J8168r259p134J0872K2489Q514k7118j3806
2906G5103L650p17k0565L4138k1068k8333K0505P792O2p162n6j264L53P82l285
2891E9935J074J9599k3595P97q28j8726q672J096j1204K8916j947j8903m653P791
2877C0680L343J6304O128o082J6021K709k3435j4275K2037Q165l691k0866l1053
2864E985Q702K3023J7260j7042J3839P014k4847m957m531o861j0015J8853j7402
$$ y = [233483, 220571, 228058, 206531, 219869, 205301, 218969, 228655, 215892, 221028, 213433, 204596, 226452, 244638, 227793, 202536, 206415, 208895, 195957, 184605, 180949, 169640, 161622, 170448, 160114, 145445, 145174, 145266, 152160, 159011, 138796, 117068, 120354, 103937, 115888, 118608, 111475, 96045, 95455, 87601, 94858, 89180, 66969, 74181, 64330, 72377, 90545, 81286, 74152, 85024, 107513, 116027, 88909, 75103, 78753, 78036, 57471, 91609, 70541, 42208, 62713, 70505, 70567, 63405, 63349, 62085, 62438, 63220, 59935, 61009, 80608, 57013, 57810, 56982, 38256, 29584, 30680, 19476, 48392, 46445, 27542, 22889, 30680, 34023, 50327, 56455, 50373, 66394, 69103, 45668, 31393, 53430, 61595, 57904, 37038, 5985, 14687, 37710, 54970, 37928, 51767, 58781, 33934, 28977, 24446, 17585, 7570, 26423, 9021]
2851I021O79R369P514J3298k304k6929K1800j8275P957J5175K656l702o280R278
2837C9257K1632l3745j8037j632j8937K472K0186K0915J0886J827R829j2732j8063
2824B3858J1220k327j1295l234m250Q773P00N146J715Q50K230j1564j0983K834
2810A3673J4007j4394K7656N905k945l977l3673j6795J3045J0188J5626L690K0780
2797E2786P29q904m0036J1286J7908k017K756j7079l454N81J1801J103q622M117
2783B2955k641R908j2025l0148K1587K2271J5483l293m0151j1087J6633J6623
2771B6115J3487j4686J914J4779j9412j8044p10J313j0851K2257j7364o941r337
2758a7480R720P415k5971m524J5085K9940k373K14j5032k8829R088K7965l771
$$ y = [9021, 9700, 19069, 26583, 39881, 37577, 10648, 32448, 14173, 22130, 37305, 39961, 36259, 29979, 39257, 60889, 27144, 9107, 7475, -11462, -8990, 11196, 32111, 42997, 44824, 54653, 41921, 23858, 35078, 32751, 21456, 18222, 13972, 22745, 23445, 28591, 30306, 31156, 33386, 21822, 10839, 13673, 27680, 13286, 40942, 46847, 43902, 39925, 6252, -10543, 2502, 12690, 28316, 32006, 52786, 53515, 44611, 4575, 15861, 33769, 31752, 34508, 17429, 13975, 14556, 26357, 27460, 18838, 22955, 20314, 30222, 18197, -11951, 9636, 31907, 47390, 44097, 3946, -7141, 9492, 26115, 39602, 24916, 26830, 41609, 22197, 4153, 3443, 4756, -6095, 16162, -1202, -8143, -17480, -7760, -345, -26316, -30840, -15755, 14185, 11812, 12026, -3006, -31835, -22747, 5218, 1447]
2745A447N298j2572L591R766j972k207p927j0830j2909j4447P733J098J1427m83
2731b2987M064N416j2662J7885J5887p955j0911N073K3336k2471J9063L0208k1949
2718B1997k8609j7264l760j5002K4205j2122j0731L2305M693k835o553q80j7439
2705c1995Q748J3694L828N597j1373j5572k2106J2467L433L6238q05k3912O493
2692a5265K3854j8953k7324M736m849J6170o079J4833R326k5708j2300K4265j7532
2679c4826P721k913J785k4968M3J9210M053R735J798J0070j0689j6693r87J748
2665c4913j0558O351M420Q576J5450j5321j3163M1036M563k0603j6594J2569j4942
2652c3129J8457k1311n418J6906J1644q571j5236r108m076Q684R411j7084O724
$$ y = [1447, 6745, -5827, -2236, 7530, 5558, 3351, -4576, -15406, -28315, -42762, -35029, -33931, -22504, -22987, -18923, -13507, -26169, -8284, 7603, -352, -11263, -6190, 17146, -5325, 13738, 43946, 21997, -6612, -23876, -27636, -42638, -18433, -30555, -41286, -8981, -4288, -7123, -13676, -14556, -31995, -23247, -9553, -5725, -128, -11501, -27073, -49179, -36712, -33279, 2959, 2154, -21758, -15265, 8589, -10364, -37688, -32952, -37801, -21631, -27710, -12877, -3551, -29259, -41559, -17294, -34826, -27105, -30018, -28233, -53201, -53158, -33948, -29895, -20160, -18362, -8292, -18981, -35674, -36661, -34913, -45471, -39120, -34700, -26124, -10674, -25995, -39158, 1878, 6441, -14162, -30756, -18187, -33129, -14672, -35983, -41401, -24495, -12851, -21422, -36658, -45766, -49842, -41158, -31747, -48831, -42107]
2639d2107K6350n695m465j8227l105m206k6436J7928L058l987Q364J7097o803
2626d2234K1807J310j7612J2495k8711K3250N779n832n511j6150M416Q068n101
2613d4026k704k9855J4404N453p990J2275k2928k846p798K0787K0324p410j8192
2600g0506l078J3514J6185O666O368Q498q824L17k1060o904k0394j54J7540J1709
2586e0123K4695j0357q90j283q671r780J9052K283j1924J9380j3141J8040Q767
2573a3952m613J677j1906k2892J5119P566K0563j7361J2573k935J1421j5865k686
2560b3291l042j8145R503k01j2676m619J669L472o93p914J819p190L1004K954
2546b7350o351l0022m380J1841Q665J2112K551j575k225n298p24J8197q492k742
$$ y = [-42107, -15757, -21452, -25917, -44144, -47249, -51455, -77891, -59963, -56905, -60892, -52528, -35431, -42234, -20427, -19117, -36729, -24234, -52945, -29695, -23916, -29748, -35259, -51409, -46993, -38925, -44026, -46730, -76585, -62181, -56728, -64718, -52443, -75371, -78217, -86015, -65228, -44904, -52314, -70506, -73584, -60070, -43885, -37219, -30851, -22353, -31177, -30860, -51920, -58824, -79218, -79372, -61832, -50123, -25428, -35785, -36675, -37958, -46629, -56409, -37357, -35074, -46998, -27618, -40759, -22719, -13952, -18565, -16888, -28794, -51686, -36567, -29001, -8438, -25799, -13226, -16161, -4740, -20605, -23291, -26333, -44478, -34975, -35176, -47852, -52471, -50802, -47330, -48023, -55937, -54118, -61308, -30304, -27350, -33701, -63723, -68103, -56262, -47597, -35485, -32934, -34509, -36734, -42032, -42756, -24559, -33051, -35793]
2532c5793J0649j8581m119J1993M462N590M778j891j4604j5396P098O007L650
2519c6157j7411P629L9926j4066k1160k8890p538M168l17K5646J3795k9820p695
2506g1890K324k645J1199N560J0488k148L194l200j5577J0569K534J6247R325
2493b4020p739q11p538J9355p12J3579k2628m128Q317j4483P954K6858j7215k4411
2479d7622m957M201q51J869l0826J1558K4621L840n497p643O445L527j417o157
2465d8909j6774L788j3395L279K3206P065r726M068J2667j4921j0647P388J1297
2452d1614K4871k1892J7647j9994k1047L3530j1815K356k5325r014P818J0051
2440e4428o852R430J3096k2829R017j4211K3316K190j1564o083n220L6310n320
$$ y = [-35793, -25144, -43725, -47844, -35851, -31389, -25799, -21021, -22912, -37516, -52912, -45814, -39807, -36157, -53568, -45939, -6013, -20079, -41239, -70129, -77667, -73499, -73816, -48170, -34375, -64195, -71890, -69566, -72211, -61012, -55452, -44964, -47112, -43918, -47118, -62695, -52126, -49592, -33345, -24020, -31759, -32570, -40108, -20753, -21465, -7886, -30514, -34642, -26325, -40808, -32854, -5996, -23211, -47622, -52579, -48378, -49229, -47360, -78186, -66628, -42007, -38167, -43664, -51307, -44862, -41335, -42752, -48909, -65683, -61895, -75290, -72011, -48805, -41740, -51466, -47398, -34731, -49652, -60299, -52911, -41614, -16743, -38635, -20988, -40982, -62029, -28499, -40314, -37958, -63283, -72297, -64479, -54428, -61280, -51850, -38754, -61583, -52566, -66777, -43461, -41271, -52835, -58918, -64138, -27828, -33148]
2427c3148j1318J6016Q617j253K6090k8875l4996J1452J7840r226l159J1968j8058
2414d8050J1454J7894q381r313j9035O406J6593J0620l4719o699Q28N821J9407
2401c7174K1778q223l453J6135k784o491J1085L795l835k300p15j5086L20J384
2387b5564J0891K240j5049n699J7158J1089o245r309m611K387K4390n8j0568p667
2373a6615K7584j5171R265O418L152J0776n660p872m837k12Q602j7200k5091P394
2359a9467J6845M06J3249k472J127J8820k865J3218J8120K304m105M207k6416
2346C2971j2648M1258J1359j2529J7660r286j4011k420K9023k906K8716J4151
2334A21338j8747k889K2129n440J5887L6861l640J8710K2859J4398M1842J8069
$$ y = [-33148, -44466, -28450, -19833, -21086, 5004, -23871, -58867, -47415, -29575, -38801, -41960, -29992, -48050, -36596, -18702, -27083, -36396, -55431, -49025, -32432, -21812, -56531, -63230, -62402, -56581, -37174, -15396, -23619, -27072, -10937, -13721, -20212, -9127, -5332, -9167, -11467, -12182, -27268, -26948, -25564, -14673, -12433, -27482, -33181, -16023, -4934, -11179, -20488, -25099, -22712, 1678, 1620, -8948, -16615, 10969, -4202, 5063, 11481, 14633, 25409, 19749, 11877, 7040, 6828, 15430, -1770, -26861, -19467, -2622, -2216, 11033, 8561, 9688, 28508, 25643, 38861, 56981, 59285, 55180, 59387, 32971, 20323, 61581, 72940, 60411, 78071, 68785, 54774, 52354, 81377, 78471, 107187, 121338, 102591, 99702, 121831, 116391, 132278, 169139, 165499, 184209, 207068, 221466, 263308, 281377]
2322B81377Q084K663L4072Q665L1237O1326K4716N5498N7640Q1822P4852P1229
2310G93181P8449J13456P0439P8584J37270J30726J52777K11503L36472M56923
2300B559780N16952N05882N26814M73713L27676K22470L7202m98787p13258n69266
2290C389178m34022l46692k62712k02093k02437j84482j38606j45833j56640r3400
2280A222261r3545o9605p4158p3749p5004r0705q0790m1270n4883l9849j3821
2269E14882m2261k4708m7101j1129m2752j9368n20p838l0188K498k7573k3805
2257B40137R757l4405J577m601j5583k2891j6049j8814J7263l530k5188Q531j5923
2244A20281m6J9261j0553l0984J0834j31Q463k4471j9359m927k7985Q116K649
$$ y = [281377, 289461, 292124, 326196, 334861, 366098, 427424, 452140, 507638, 565278, 647100, 721952, 793181, 871630, 985086, 1055525, 1134109, 1271379, 1402105, 1554882, 1766385, 2102857, 2559780, 3076732, 3582614, 4109428, 4583141, 4910817, 5133287, 5170489, 4671702, 3958444, 3389178, 2955156, 2608464, 2345752, 2143659, 1941222, 1756740, 1618134, 1472301, 1315661, 1222261, 1128716, 1059111, 984953, 911204, 836200, 745495, 664705, 623435, 568552, 528703, 514882, 472621, 447913, 400812, 389683, 346931, 327563, 327043, 319205, 289017, 291515, 263942, 240137, 249894, 215489, 217066, 212465, 196882, 173991, 157942, 139128, 156391, 152861, 127673, 136204, 120281, 120235, 139496, 128943, 97959, 108793, 108662, 117125, 92654, 73295, 68368, 40383, 48499, 51148]
2231E1148j4908N43J9442j0133J7262j1057J937j4239m367j356J8664o265J3625
2218F0296j3728j4989J6772k9602l954K2922k1518K168P509O753m017l8693Q872
2205a209J3256r482k7408J469K5509n941R009M717o276m088j9375P281J0378j9262
2191b1422J2951R772j3968K385L914N564J0649j063q189j7041K7251J1842k4363
2178a718l2188J2139J1273q524J9529j0253j0697j1168J5767k17j112J7682j3271
2165a2758l6663J3624K4084j9207q226Q712K7288k9088P044J3875l371k9388K3952
2152b0122J4579m275m364k7493K1000j9217j335O321j1275R576J7534j0951J0465
2139a9557Q021o704J1238k9644Q055J0417j1867J1520j5435l764Q19R864K952
$$ y = [51148, 36240, 36783, 56225, 46092, 63354, 52297, 54234, 39995, 35628, 34272, 52936, 46671, 60296, 46568, 31579, 48351, 18749, 14795, 37717, 16199, 18367, 25876, 32629, 28612, -10081, -1209, 12047, 2565, -24843, -23374, 2135, -3806, 5203, 9920, 3644, -444, -19819, -12538, -2160, -21422, -8471, 1301, -12667, -10282, -6368, -804, 9845, 8782, 593, -16448, 10803, 22645, -1718, -33906, -21767, -10494, -19018, 511, -9742, -20439, -31607, -15840, -16057, -17169, 513, -12758, -49421, -35797, -11713, -30920, -39146, -30434, -3146, -32234, -25190, -11315, -14686, -44074, -20122, -5543, -9818, -14182, -41675, -20675, -39892, -41227, -34906, -46181, -36605, -19071, -30022, -19557, -11536, -18240, -7002, -36646, -28591, -18174, -30041, -18521, -33956, -37720, -36901, -27037, -24085]
2126b4085J2639j2548o474m461J948J457o69j6191o221k276J0464l755p72K881
2112d8063J472j6587O348k823M203k0298o12L7197j87j0080P595J1337j0902j5267
2098e6667j0219L3645J6832k2630k7733r349L2210K8250m617j5531l0295K1372
2086d4732J0370l4409J6944K3931k996j7353J115j915J3610j7027q896O345j8120
2073g3133k550K4528J8116o977k0567j0809K0290L7553m441j3816r785j1908p283
2060f0782J1679j4825n766M5556n45p01j6345L887k347K01j473l997k2705J4963
2046e3200K2511j686j142k386q669P792N88k7091m910N555J9549K0825l434r452
2032c5150r196n609N137J6950J223r142J7921l371p991K0770k2948n022l6624
$$ y = [-24085, -11446, -23994, -30468, -34929, -32981, -31524, -32193, -48384, -54605, -56881, -46417, -50172, -50944, -48063, -46591, -63178, -56830, -59653, -55450, -75748, -76360, -39163, -39350, -49430, -41835, -30498, -41400, -56667, -66886, -33241, -16409, -39039, -66772, -76121, -43911, -15661, -20278, -35809, -66104, -44732, -34362, -68771, -51827, -27896, -30892, -48245, -47130, -49045, -35435, -52462, -61358, -55013, -73133, -75683, -51155, -33039, -40016, -60583, -71392, -51102, -13549, -17990, -31806, -41591, -53499, -60782, -49103, -63928, -69694, -24138, -24683, -25384, -41729, -37842, -40189, -39988, -41461, -45458, -68163, -53200, -30689, -32375, -33517, -35903, -44572, -36780, -36192, -63283, -68193, -62638, -43089, -22264, -25698, -35150, -44346, -49955, -44818, -27868, -26645, -35787, -17866, -21237, -29228, -8458, -31406, -36428, -73052]
2019g3052J1707N165l931J6007N737J8327J6629j7907j1353R010j3807j8816m655
2006f0939J3240J0579P19r045R323j4197n074J3727j1688p641J1508j5814m127
1993f9429J6606q900K5916o491l488o65J7858J1043k7572K2500l1041m67J5037
1980c9093j8961N68L778J6963r285j5364j3900R593J8424J5992Q202P553m2152
1967e7682o918J20j1616O455K419J0604k1618J2605j0718J0723q168J2624K5020
1954c6150J0968l089o884l594J5173n884j5391j1195J4597o007o215J5582j035
1941c9124p724L1928r561j6768o396n194J8073P294L599J7274k4530k4122P055
1928d8196K0124n684Q669j6829l1530J9505J1363j1031M611j0245N577J8920j2991
$$ y = [-73052, -61345, -56180, -60111, -44104, -38367, -20040, -3411, -21318, -32671, -23661, -37468, -56284, -60939, -47699, -37120, -36401, -45446, -36123, -50320, -55394, -41667, -53355, -60996, -49488, -65302, -69429, -52823, -61723, -35807, -42298, -45786, -46451, -28593, -17550, -45122, -22622, -53663, -54130, -39093, -58054, -57486, -53708, -36745, -46030, -61394, -75294, -65701, -47277, -31285, -23083, -15530, -57682, -64600, -64480, -76096, -69641, -67222, -56618, -78236, -65631, -76349, -65626, -73794, -61170, -36150, -25182, -28271, -35155, -38749, -23576, -29460, -44851, -56046, -41449, -47456, -53671, -38089, -39124, -46848, -14920, -24481, -41249, -47645, -52839, -34766, -27472, -23873, -6599, -31129, -55251, -48196, -28072, -33756, -25087, -41916, -73446, -53941, -42578, -53609, -48998, -59243, -53666, -34746, -47737]
1915d7737j9844l378R939j21J1427J7408M786k4219K0028Q89q294p650p260O28
1901e3398J0852L311J8074K645j8674p704o17K6338M213j1006j6531k1200n118
1888f8815Q723n990J0944R86m584K2926j4933K069R654N670J487k3899J0717J345
1874d3700j2113k1835q573L8748o170Q929n454N759n112J0055J8545J1189l3412
1861d3144k7504J2443n749j622K828n207Q333K659J8068k0401J148J5028Q198
1848c4922j0534k1418k5144J4519K3039O86k3531J5822K1492J2710j4309q468
1836e0058J6914k3128n966R213M233J4159o673J508J2789l7996j7004K0128k787
1823f4668k0937p858P252K9635p016N381O782M2216k564n391l0418j3735J5654
$$ y = [-47737, -67581, -70959, -61020, -61141, -49714, -32306, -27520, -51739, -31711, -30822, -39116, -46766, -54026, -53398, -42546, -39235, -21161, -18516, -37190, -44894, -45511, -19173, -14960, -25966, -42497, -63697, -68815, -60092, -66082, -55138, -54152, -58736, -35810, -50743, -48674, -39020, -33350, -31863, -55762, -45045, -43700, -55813, -77648, -86221, -47473, -53643, -44714, -50168, -44409, -49521, -39466, -20921, -9732, -43144, -70648, -58205, -63954, -65576, -62748, -67955, -59622, -56963, -38895, -59296, -58148, -43120, -34922, -45456, -66874, -92018, -77499, -54460, -53774, -77305, -61483, -39991, -27281, -41590, -50058, -33144, -56272, -62238, -53025, -48792, -34633, -41306, -39798, -27009, -65005, -82009, -61881, -64668, -85605, -93463, -86211, -56576, -63592, -58211, -51429, -9213, -11777, -17168, -47586, -61321, -45667]
$$ [...]
##END NTUPLES=NMR SPECTRUM
##END=
