##TITLE=1H_EC-3360
 200.13MHz, CDCl3,
 8 sc
 
 28.8.2025
##JCAMPDX= 6.0         $$ Bruker NMR JCAMP-DX V2.0
##DATA TYPE= NMR SPECTRUM
##DATA CLASS= NTUPLES
##ORIGIN= UXNMR, Bruker Analytische Messtechnik GmbH
##OWNER= pz
$$ XWIN-NMR		Version 3.5
$$ Thu Aug 28 13:54:35 2025 Russian Standard Time (UT+4h)  she@DPX200
##.OBSERVE FREQUENCY= 200.1313
##.OBSERVE NUCLEUS= ^1H
##.ACQUISITION MODE= SIMULTANEOUS
##.ACQUISITION SCHEME= undefined
##.AVERAGES= 8
##.DIGITISER RES= 18
##SPECTROMETER/DATA SYSTEM= spect
##.PULSE SEQUENCE= zg30
##.SOLVENT NAME= D2O
##.SHIFT REFERENCE= (INTERNAL, D2O, 0, 15.4703)
##AUDIT TRAIL= $$ (NUMBER, WHEN, WHO, WHERE, WHAT)
$$ ##TITLE= Audit trail, XWIN-NMR		Version 3.5
$$ ##JCAMPDX= 5.01
$$ ##ORIGIN= Bruker BioSpin GmbH
$$ ##OWNER= she
$$ F:/spectra/data/she/nmr/H-C/1/pdata/1/auditp.txt
$$ ##AUDIT TRAIL=  $$ (NUMBER, WHEN, WHO, WHERE, WHAT)
(   1,<2025-08-28 13:53:27.53 +0400>,<she>,<DPX200>,
      <created by zg, POWCHK disabled, PULCHK disabled
       configuration hash MD5:
       00 E9 B6 7A A2 85 ED C7 34 08 36 98 17 FE 4E 26
       data hash MD5: 16K
       E3 26 D4 D6 F2 3B 15 4F 48 93 46 59 22 04 51 99>)
(   2,<2025-08-28 13:53:30.26 +0400>,<she>,<DPX200>,
      <Start of raw data processing
       efp BC_mod = 2 LB = 0.25 FT_mod = 6 PKNL = 1 PHC0 = -1558.62 PHC1 = 10.39228 SI = 16K 
       data hash MD5: 16K
       2A 07 12 73 EB 51 E3 3C 23 1F 0F 7B 07 77 43 51>)
(   3,<2025-08-28 13:53:50.00 +0400>,<she>,<DPX200>,
      <pk PHC0 = -1.035677 PHC1 = 0.6000001 
       data hash MD5: 16K
       84 7B F1 A2 98 6A 44 A1 41 AA FC 18 07 BB 90 50>)
(   4,<2025-08-28 13:53:53.92 +0400>,<she>,<DPX200>,
      <abs ABSG = 5 
       data hash MD5: 16K
       50 C1 6B 72 B0 D5 2B 7F 1D 0D BF 4A 5B C9 78 64>)
$$ ##END=
$$ 
$$ hash MD5
$$ 73 DB A6 9F 79 C2 6B 28 75 46 97 58 E7 6D 41 CA
##$RELAX= 
##$RELAX= 
##$RELAX= 
##$RELAX= 
##$RELAX= 
##$RELAX= 
$$ Bruker specific parameters
$$ --------------------------
##$DU= <F:/spectra>
##$EXPNO= 1
##$NAME= <H-C>
##$PROCNO= 1
##$TYPE= <nmr>
##$USER= <she>
##$AMP= (0..31)
100 100 100 100 100 100 100 100 100 100 100 100 100 100 100 100 100 100 
100 100 100 100 100 100 100 100 100 100 100 100 100 100 
##$AQSEQ= 0
##$AQ_mod= 1
##$AUNM= <au_zg>
##$AUTOPOS= <>
##$BF1= 200.13
##$BF2= 200.13
##$BF3= 200.13
##$BF4= 200.13
##$BF5= 200.13
##$BF6= 200.13
##$BF7= 200.13
##$BF8= 200.13
##$BYTORDA= 1
##$CFDGTYP= 0
##$CFRGTYP= 5
##$CHEMSTR= <none>
##$CNST= (0..31)
1 1 145 1 1 1 1 1 1 1 1 1 1 1 1 1 1 1 1 1 1 1 1 1 1 1 1 1 1 1 1 1 
##$CPDPRG= <>
##$CPDPRG1= <>
##$CPDPRG2= <>
##$CPDPRG3= <>
##$CPDPRG4= <mlev>
##$CPDPRG5= <mlev>
##$CPDPRG6= <mlev>
##$CPDPRG7= <mlev>
##$CPDPRG8= <mlev>
##$CPDPRGB= <>
##$CPDPRGT= <>
##$D= (0..31)
0 0.7 0 0 0 0 0 0 0 0 0 0.03 0 0 0 0 0 0 0 0 0 0 0 0 0 0 0 0 0 0 0 0 
##$DATE= 1756374806
##$DBL= (0..7)
120 120 120 120 120 120 120 120 
##$DBP= (0..7)
150 150 150 150 150 150 150 150 
##$DBP07= 0
##$DBPNAM0= <>
##$DBPNAM1= <>
##$DBPNAM2= <>
##$DBPNAM3= <>
##$DBPNAM4= <>
$$ [...]
##$SUBNAM3= <"">
##$SUBNAM4= <"">
##$SUBNAM5= <"">
##$SUBNAM6= <"">
##$SUBNAM7= <"">
##$SUBNAM8= <"">
##$SUBNAM9= <"">
##$SW= 18.0517328524113
##$SWIBOX= (0..15)
0 0 2 0 0 0 0 0 0 0 0 0 0 0 0 0 
##$SW_h= 3612.71676300578
##$TD= 16384
##$TD0= 1
##$TE= 0
##$TE2= 300
##$TE3= 300
##$TEG= 300
##$TL= (0..7)
0 120 120 120 120 120 120 120 
##$TP= (0..7)
150 150 150 150 150 150 150 150 
##$TP07= 0
##$TPNAME0= <>
##$TPNAME1= <>
##$TPNAME2= <>
##$TPNAME3= <>
##$TPNAME4= <>
##$TPNAME5= <>
##$TPNAME6= <>
##$TPNAME7= <>
##$TPOAL= (0..7)
0.5 0.5 0.5 0.5 0.5 0.5 0.5 0.5 
##$TPOFFS= (0..7)
0 0 0 0 0 0 0 0 
##$TUNHIN= 0
##$TUNHOUT= 0
##$TUNXOUT= 0
##$USERA1= <user>
##$USERA2= <user>
##$USERA3= <user>
##$USERA4= <user>
##$USERA5= <user>
##$V9= 5
##$VALIST= <valist>
##$VCLIST= <CCCCCCCCCCCCCCC>
##$VD= 0
##$VDLIST= <DDDDDDDDDDDDDDD>
##$VPLIST= <PPPPPPPPPPPPPPP>
##$VTLIST= <TTTTTTTTTTTTTTT>
##$WBST= 1024
##$WBSW= 4
##$XGAIN= (0..3)
0 0 0 0 
##$XL= 0
##$YL= 0
##$YMAX_a= 124076
##$YMIN_a= -220618
##$ZGOPTNS= <>
##$ZL1= 120
##$ZL2= 120
##$ZL3= 120
##$ZL4= 120
##$ABSF1= 15.41304
##$ABSF2= -2.638807
##$ABSG= 5
##$ABSL= 3
##$ALPHA= 0
##$AQORDER= 0
##$ASSFAC= 0
##$ASSFACI= 0
##$ASSFACX= 0
##$ASSWID= 0
##$AUNMP= <proc_1d>
##$AZFE= 0.1
##$AZFW= 0.1
##$BCFW= 0
##$BC_mod= 2
##$BYTORDP= 0
##$COROFFS= 0
##$CY= -3
##$DATMOD= 1
##$DC= 0
##$DFILT= <>
##$DTYPP= 0
##$F1P= 0
##$F2P= 0
##$FCOR= 1
##$FTSIZE= 16384
##$FT_mod= 6
##$GAMMA= 0
##$GB= 0
##$INTBC= 1
##$INTSCL= 3.241238e-09
##$ISEN= 128
##$LB= 0.25
##$LEV0= 0
##$LPBIN= 0
##$MAXI= 10000
##$MC2= 0
##$MEAN= 0
##$ME_mod= 0
##$MI= 1.114404
##$NCOEF= 0
##$NC_proc= -8
##$NLEV= 6
##$NOISF1= 3.799351
##$NOISF2= 2.8
##$NSP= 0
##$NTH_PI= 0
##$NZP= 0
##$OFFSET= 15.47034
##$PC= 1
##$PHC0= -1559.656
##$PHC1= 10.99228
##$PH_mod= 1
##$PKNL= yes
##$PPARMOD= 0
##$PSCAL= 0
##$PSIGN= 0
##$REVERSE= no
##$SF= 200.130010278863
##$SI= 16384
##$SIGF1= 3
##$SIGF2= 2
##$SINO= 0.751879
##$SIOLD= 32768
##$SREGLST= <19F.Aceton>
##$SSB= 0
##$STSI= 16384
##$STSR= 0
##$SW_p= 3612.71676300578
##$SYMM= 0
##$S_DEV= 0
##$TDeff= 16384
##$TDoff= 0
##$TI= <>
##$TILT= no
##$TM1= 0
##$TM2= 0
##$TOPLEV= 0
##$USERP1= <user>
##$USERP2= <user>
##$USERP3= <user>
##$USERP4= <user>
##$USERP5= <user>
##$WDW= 1
##$XDIM= 16384
##$YMAX_p= 299110438
##$YMIN_p= -1741145
$$ End of Bruker specific parameters
$$ ---------------------------------
##NTUPLES= NMR SPECTRUM
##VAR_NAME=  FREQUENCY,     SPECTRUM/REAL,   SPECTRUM/IMAG
##SYMBOL=    X,             R,               I
##VAR_TYPE=  INDEPENDENT,   DEPENDENT,       DEPENDENT
##VAR_FORM=  AFFN,          ASDF,            ASDF
##VAR_DIM=   16384,         16384,           16384
##UNITS=     HZ,            ARBITRARY UNITS, ARBITRARY UNITS
##FACTOR=    0.220516191357247, 1,           1
##FIRST=     3096.07925820535, 0,            0
##LAST=      -516.637504800426, 0,           0
##MIN=       -516.637504800426, -1741145,    0
##MAX=       3096.07925820535, 299110438,    0
$$ Real data points
##PAGE= N=1
##DATA TABLE= (X++(R..R)), XYDATA
$$ [...]
7219D921028J65467K09963j35021k7685l43207K78297J43213l64878K58082J90380
7209E295639k81389L85183O03316k65183l57802n81848M88524O15967K55651k0454
7199F137604k71574L50846j41366p14215R46799Q63256k02341l39067o3499O89888
7189G256331p7498q6927J7497L46312J68926J44075Q7529k11807O58193Q55847
7179I158478J30717l33919L11669N35414n76497q2928L37557N27880K65709R6661
7169A0370741P98388N01904K45857J76009L6476Q40358P1925N64369Q69769k51251
7159A4224545K57829N25515J159583l21074J160459P52968J37559L99036R80479
7150A9276899O83310P69371P72959N11837J294791R53861J366583J267868J529311
$$ y = [4921028, 5086495, 5296458, 5161437, 5133752, 4790545, 5068842, 5212055, 4847177, 5105259, 5295639, 5014250, 5399433, 6002749, 5737566, 5379764, 4797916, 5286440, 5902407, 6158058, 6137604, 5866030, 6216876, 6075510, 5361295, 6308094, 7171350, 6969009, 6629942, 6566443, 7256331, 7178833, 7091906, 7109403, 7455715, 7624641, 7768716, 7856245, 7644438, 8302631, 9158478, 9289195, 8955276, 9266945, 9802359, 9225862, 9142934, 9480491, 10008371, 10274080, 10370741, 11169129, 11671033, 11916890, 12092899, 12129375, 12969733, 13041658, 13606027, 14475796, 14224545, 14482374, 15007889, 16167472, 15846398, 17006857, 17759825, 17897384, 18296420, 19276899, 19960209, 20729580, 21502539, 22014376, 23309167, 24263028, 25629611, 26897479, 28426790]
7141B8426790O25158J099507J141751K336751K477039J882632J663402K250924
7133D1903954K811243K100801K358650K457158K916986L434989L511717M728561
7125F6224059L781649M385104N316324M669609O303182P257463N730689P173972
7117A10842051O671220O777441Q202468P326696O654079N739128N903297M653031
7109A62769411K558349J458613k74790j507087k745466m742828n707548o505300
7101A45303354o767693o894902o586665o355226o418148n360704n822252o331350
7093I4766414m955102n235088m657532m366954l958510l699775l404583l380925
7085F1107945k452445k931340l001004k381980k683485j685744j672500k521911
$$ y = [28426790, 29051948, 30151455, 31293206, 33629957, 36106996, 37989628, 39653030, 41903954, 44715197, 46815998, 49174648, 51631806, 54548792, 57983781, 61495498, 66224059, 70005708, 74390812, 79707136, 84376745, 90679927, 97937390, 103668079, 110842051, 117513271, 124290712, 132493180, 139819876, 146473955, 152213083, 158116380, 162769411, 165327760, 166786373, 166511583, 165004496, 162259030, 157516202, 151808654, 145303354, 138535661, 131640759, 125054094, 118698868, 112280720, 106920016, 101097764, 94766414, 89811312, 84576224, 79918692, 75551738, 71593228, 67893453, 64488870, 61107945, 58655500, 55724160, 52723156, 50341176, 47657691, 45971947, 44299447, 41777536]
7077D1777536j490183j756040j373898j648711k115750j059111j518077j577602
7069B9238164j18106j010772p54804p40026j200141j263229p61497n25872q17142
7060B2046575n68382n69062q58715r88843o74665l51214o94209o95839j52424
7051A6493222j75183j238062m6873l41206j60327j94217o0813l75043l46575Q8000
7041A3642923j247093l23835q30633m24028k11309p8652K53099L083K03060R3031
7031A1079646n47837n64551p85011m19113j54990L01765l19224K70196m60056
7022H400825l51045k20836n81649p18062P86782l18776r28445j62309L9818r9633
7012E846670P56082J56672l06844j64808j4611n39521n23944L6872j88301L42963
$$ y = [41777536, 40287353, 38531313, 37157415, 35508704, 33392954, 32333843, 30815766, 29238164, 29120058, 28109286, 27354482, 26614456, 25414315, 24151086, 23389589, 22863717, 22046575, 21478193, 20909131, 20050416, 19061573, 18386908, 18035694, 17341485, 16645646, 16493222, 16318039, 15079977, 15033104, 14691898, 14531571, 14337354, 14276541, 13901498, 13554923, 13642923, 12395830, 12071995, 11241362, 10817334, 10606025, 10527373, 10780472, 10783555, 10986615, 11079646, 10531809, 9967258, 9182247, 8763134, 8608144, 8909909, 8590685, 8860881, 8400825, 8049780, 7828944, 7247295, 6529233, 7316015, 6997239, 6068794, 5906485, 5946303, 5846670, 6602752, 6759424, 6452580, 6287772, 6273161, 5733640, 5209696, 5246568, 5058267, 5401230]
7002E401230K78194K69552p59070j37251J12786l01948k37707J70919k26670k13667
6992D356368m31201L41949j49236o29847O59664n64475K19111K86773J75571o17795
6982C646882L69768J73370k64518k65260l24217m86594r55104L98144O90117M87498
6972C470086m00002L60092l62896J98586P509N53919l17483m57873O44657K6948
6962C723543K73429o60466j27853k01285L5849K82034n71178Q7351M37241k60565
6952C018100O14233K77507m86625k46989p57832m23911O16790O31696k78410k42140
6942B722419J76893m71175K56703J31222o50624L42722M46671n14362l17064n1625
6932B071780R5596r932J55154j61342q1591N09671j00302j96521l84920k87822
$$ y = [5401230, 5679424, 5948976, 5189906, 5052655, 5165441, 4863493, 4625786, 4796705, 4570035, 4356368, 3925167, 4267116, 4117880, 3488033, 4147697, 3583222, 3802333, 4089106, 4264677, 3646882, 4016650, 4190020, 3925502, 3660242, 3336025, 2849431, 1894327, 2292471, 2982588, 3470086, 3070084, 3430176, 3067280, 3265866, 3273375, 3827294, 3509811, 3051938, 3696595, 3723543, 3996972, 3336506, 3208653, 3007368, 3043217, 3325251, 2754073, 2841424, 3278665, 3018100, 3632333, 3909840, 3423215, 3176226, 2418394, 1994483, 2611273, 3242969, 2964559, 2722419, 2899312, 2428137, 2684840, 2816062, 2165438, 2508160, 2954831, 2440469, 2123405, 2071780, 2167376, 2157444, 2312598, 2151256, 2069665, 2579336, 2479034, 2282513, 1897593, 1609771]
6922A609771j95680K32001j513M86883J11393J67394R562o3755n36417J27421
6912A947060k38381L60864K39391j36528M85535K00634n58051Q08164K86138k20899
6902C173927N22146q98736k18755O23828m01883m47761K77035j2391p7261j11353
6892B428796k43580J78715p51886k12668N47960n76560m03707k13540L9178O9948
6882H62656j2431P3425J11155K71184k52628o57567M53232M06185j53347K44931
6872A346795K89418l64334q87076o7593O0372L24761k0461Q7022l7876j21168
6862F09860M9091M55073j73195Q2868k89463n93255N36487K46939l14944p12348
6852a02887k98525N47906m0269P67115l21723p62091n6929R19921l33402p01284
$$ y = [1609771, 1414091, 1646092, 1644579, 2131462, 2242855, 2410249, 2419811, 2356056, 1819639, 1947060, 1708679, 2069543, 2308934, 2172406, 2657941, 2858575, 2300524, 3108688, 3394826, 3173927, 3696073, 2797337, 2578582, 3202410, 2800527, 2352766, 2629801, 2617410, 2540149, 2428796, 2185216, 2363931, 1612045, 1399377, 1947337, 1370777, 967070, 753530, 792708, 862656, 850225, 923650, 1034805, 1305989, 1053361, 395794, 849026, 1255211, 1101864, 1346795, 1636213, 1271879, 384803, 317210, 377582, 702343, 681882, 768904, 731028, 609860, 658951, 1114024, 940829, 1023697, 734234, 140979, 677466, 924405, 609461, -102887, -401412, 146494, 106225, 873340, 551617, -210474, -267403, 652518, 319116, -382168]
6842c82168K67736n86891P30472k67169K83548P552N77389J35828K89942o99352
6832C56887n2254j98097O02833j00240L8450j88283L52922j6925p1324K86626
6822A010595L59239k4243j85258J2289j23694k1515k14030n6215l91126K36225
6812F02267M75646J70296J78555P5674n91258l6263N25270l00473J04903M4658
6802A249275j62819J86629m44916k0759M08951j4147L95883R8989J65972k68927
6792A594131m48467M20954j62261m62633n11332O41734n32706R8910J83748n354
6782H16724o99275J77168Q6233M36754L41130o1967o3092m22608k58054L18987
6772F72000l98421m03404K73906l64J37271m06668M31613Q28849J71691k25357
$$ y = [-382168, -114432, -701323, 29149, -238020, 45528, 53080, 630469, 766297, 1056239, 356887, 304633, 106536, 709369, 609129, 647579, 459296, 812218, 795293, 723969, 1010595, 1369834, 1345591, 1160333, 1172622, 1048928, 1027413, 813383, 757168, 366042, 602267, 1077913, 1248209, 1426764, 1502438, 911180, 874917, 1400187, 1099714, 1204617, 1249275, 1086456, 1273085, 828169, 807410, 1216361, 1202214, 1598097, 1697086, 1863058, 1594131, 1145664, 1566618, 1404357, 941724, 430392, 1072126, 539420, 638330, 822078, 816724, 117449, 294617, 380850, 817604, 1158734, 1096767, 1033675, 611067, 353013, 672000, 273579, -129825, 144081, 143717, 280988, -125680, 305933, 1134782, 1306473, 1081116]
6762A081116l80232l98195j51235J68560J7088l92590O90564m60609l8596O14391
6752G50262J83064l6637o67452o42199K68024n0802J81537M07562N2757k74781
6742A71335l77860m89227L84482O47365l06662M91837L12948k10411L8200j23788
6732E38219m26053k50292l66508L49561N05326L25411r3326j82864m67700j40762
6722b08988Q1713K4681M12532L25594j2520p86355J96254j18673j32199Q60027
6712F42066j94117J42686l15078J1472m49772K32198o41613m51047M55845J22378
6702d44982P6070L36879j52224L04676k08765j77989K78960L94877j06862r9508
6692B01132n41961o3926R64719N01600o34586q71023O40326L65366m2760j27081
$$ y = [1081116, 700884, 302689, 151454, 320014, 337102, -55488, 635076, 174467, 135871, 750262, 933326, 896689, 229237, -412962, -144938, -195740, -14203, 393359, 446116, 171335, -206525, -695752, -311270, 336095, 29433, 521270, 834218, 623807, 662007, 538219, 112166, -138126, -504634, -155073, 350253, 675664, 582338, 399474, -68226, -208988, -127275, -102594, 309938, 635532, 623012, -163343, 32911, -85762, -217961, 642066, 447949, 590635, 275557, 287029, -162743, 69455, -572158, -1023205, -567360, -444982, -368912, -32033, -184257, 120419, -88346, -266335, 12625, 407502, 300640, 201132, -340829, -404755, 559964, 1061564, 426978, -444045, 196281, 561647, 518887, 391806]
6682C91806J64560j05880l82143n38628J52324J78831O1853P3374n058j00412
6672a09373J16869l4569K63331J23372J28045l40786n02167n20384K52267Q73736
6662B50341M10884n17302k16637k24587m77508j07978L98481N59580k8708j53988
6652a07422K12850J36798o5834j20547L23504k40020N84941k14535o28141K61955
6642A43549K51531L33194k73539J84886R5515o6370L36976M25092N61967q03140
6632A189661k02045K03436j45288k50295k53788k06239L33418K01129n7224j97584
6622F15181m5610M92225N82035K14163j54390o34157l07719O7990K57040L15040
6612A401798j48081n18112n32521P12386j08657j51655j56594l08988l7618J50337
$$ y = [391806, 556366, 450486, 68343, -470285, -317961, -139130, -77277, -3903, -8961, -109373, 7496, -27073, 236258, 359630, 487675, 146889, -355278, -875662, -623395, 250341, 661225, 143923, -72714, -297301, -774809, -882787, -484306, 75274, 46566, -107422, 105428, 242226, 176392, 55845, 379349, 139329, 724270, 509735, -118406, 143549, 395080, 728274, 454735, 639621, 735136, 668766, 1005742, 1430834, 1992801, 1189661, 987616, 1191052, 1045764, 795469, 541681, 335442, 668860, 869989, 812765, 615181, 569571, 1061796, 1643831, 1857994, 1703604, 1069447, 761728, 829718, 1086758, 1401798, 1253717, 735605, 203084, 915470, 806813, 655158, 498564, 189576, 151958, 302295]
6602C02295J31997P5575Q33938k48816j182734p44245k36783J088688O95132j22514
6592E92533j81608R9674L17425m22083n85331m67191k76617J018106J68850j55758
6582A08000K36683J49246j42091m46893k13773j35513J24519M96194j50791J23370
6572A48951l66489P5723K67095j39461j58403K77763j33117p56406M12813L39853
6562c1678J74591R5238k86045J8637K14463m17315K34304M51357L35633k4522
6552G64663J2920j92945o23750Q12326p04287R21O31457L18178k54248l50818
6542D14417J72629l81536j1019l44711J25471k36220k74662p4848L18868l25021
6532f16632O97316M92754o95377j71256K25649q32942l26992J052598N2176l76362
$$ y = [302295, 434292, 509867, 1343805, 1094989, -87745, -831990, -1068773, 19915, 715047, 592533, 410925, 510599, 828024, 405941, -179390, -646581, -923198, 94908, 263758, 108000, 344683, 493929, 351838, -95055, -308828, -444341, -319822, 176372, 25581, 148951, -217538, -141815, 125280, -14181, -172584, 105179, -27938, -784344, -371531, -31678, 142913, 238151, -47894, -29257, 185206, -232109, 2195, 453552, 789185, 764663, 777583, 584638, -39112, 773214, 68927, 69848, 701305, 1019483, 765235, 414417, 587046, 205510, 194491, -150220, -24749, -260969, -535631, -610479, -291611, -616632, 80684, 573438, -121939, -293195, -67546, -900488, -1227480, -174882, -122706, -499068]
6522d99068l62604J86538N23767N16776L24096m12063k12395J22054n7704J89165
6512C18562k5200k34460k68560L12211J5497j64172J13166N11065L41434K34405
6502A153948L2236l77269j92962r5546k45484Q4253O5428l28606J02497k51268
6492e2773J27478j9981L88522r2001r6057N1029N00437J8706J27224L40309n73637
6481G19256P8503O2030l47064k66804k49180J46659J52586J16390M15684O6264
6471H94324j76140l20576K70794j6822M39464N36140r57838o73637J33948n95007
6461d65350m04972Q77902r6341L30186J02273N29534J91744n88439J04750j24654
6451D56633K59273J5929R0999K99978j42720l69040l47275l50218L69111L25829
$$ y = [-499068, -861672, -675134, -151367, 365409, 689505, 277442, 65047, 187101, 129397, 318562, 293362, 58902, -209658, 102553, 118050, -46122, 67044, 578109, 919543, 1153948, 1186184, 808915, 615953, 520407, 274923, 359176, 424604, 95998, 198495, -52773, 74705, 54724, 443246, 351245, 255188, 306217, 806654, 825360, 952584, 1292893, 719256, 797759, 859789, 512725, 245921, -3259, 143400, 295986, 412376, 828060, 894324, 718184, 397608, 668402, 651580, 1091044, 1627184, 669346, -4291, 129657, -465350, -870322, 7580, -88761, 241425, 343698, 873232, 1064976, 476537, 581287, 456633, 715906, 731835, 822834, 1122812, 980092, 611052, 263777, -86441, 282670, 608499]
6441F08499J88899k52495K55282p73365m65535L83552k60092J7606P12257N90248
6431A004856l53177k94475o4407N9102q5147l8279M72793n13338L37196j49502
6421C75622k70053j23239N97102L22050p7032J95727p92388K96848l4865p41999
6411b52227K10685j38647K82560L52680j43638N94176L77129o5776j45971q2568
6401I88403o39185J74504o7770k51323k58278P99069K17152r96692K63934K01146
6391D30960L49052J24855l8422k75427K54067M21782l3127m29965p234N796j53620
6380F48717R3183k48287K54865K34214j00911m75479L43350k27366K7884J05800
6370F55970l27433L89880N11329n81068K19272P5856m28742N30928j95703l72524
$$ y = [608499, 797398, 544903, 800185, 26820, -438715, -55163, -315255, -297649, 414608, 1004856, 651679, 357204, 292797, 351899, 266752, 228473, 701266, 187928, 525124, 375622, 105569, -17670, 579432, 901482, 824450, 1020177, 227789, 524637, 489772, -252227, -41542, -180189, 102371, 455051, 311413, 905589, 1282718, 1216942, 1070971, 988403, 349218, 523722, 455952, 204629, -53649, 745420, 962572, -34120, 229814, 430960, 780012, 904867, 866445, 591018, 845085, 1266867, 1233740, 803775, 796541, 802337, 648717, 741900, 493613, 748478, 982692, 881781, 406302, 749652, 522286, 550170, 655970, 328537, 718417, 1229746, 648678, 867950, 943806, 515064, 1045992, 850289, 477765]
6360D77765p8220L21683L19840J38691L47513l88894o57140O28980L56738o46639
6350H20317L91261N8382o18088P30352N26884j86083J26177l53033j93515k98467
6340A004187j17411P39466J92273k85225p0879N3405Q9847p849J36261N824k74673
6329A465226k78070M0314j72890j22429m68035Q81904l5577m09609L59511m6921
6319A213424K83422J34401n69939J20167p9803k70563P6989J1176Q56681l14574
6309A461381o56576j96885J17406M78001L45729l7953J59152o4093k38172J19516
6299A487506M52180k67342l64256k48276L26684j82455k34627o3887L45472M5164
6289A296163k3362n5616k94170R5347j1386L92698l27285K40021J14806m44177
$$ y = [477765, 399545, 721228, 1041068, 1179759, 1527272, 1138378, 481238, 1110218, 1466956, 820317, 1211578, 1269960, 651872, 1382224, 1909108, 1723025, 1849202, 1496169, 1302654, 1004187, 886776, 1626242, 1818515, 1533290, 1462411, 1515816, 1605663, 1597814, 1734075, 1739899, 1465226, 1187156, 1227470, 1054580, 932151, 464116, 1346020, 1310443, 900834, 1260345, 1213424, 1496846, 1631247, 1061308, 1181475, 1101672, 831109, 908098, 919274, 1775955, 1461381, 804805, 607920, 725326, 1203327, 1549056, 1511103, 1670255, 1606162, 1367990, 1487506, 1939686, 1672344, 1308088, 1059812, 1386496, 1204041, 969414, 905527, 1250999, 1296163, 1272801, 1217185, 923015, 1018362, 1006976, 1399674, 1072389, 1312410, 1427216, 983039]
6279I83039J3447J42260j8924K23291J84507n10802L8784r1648O41721P9006k86885
6268A397796K90475P03713m10368j222249K19179L60256K19233J08083K5112J98812
6258A890042K09490O03452q76445k60711K53421L08295K15084J89092J81737n65412
6248B148045J83516J21236L75248j24458l45935k73426j25876O80425M67555j68842
6238B937488j60028o49872j28807Q44635n9662l39683O78668j14739N567K53114
6228C266681L70970M93473l72930k44637k47057K3253J96895o99k2435J33021
6218C596535l07785R9287K51431M80352M92613n01018m67983N68927L59387k84726
6208D287020J25777k58030O16294m88803k92072Q5073K93270n59746k84467J93861
$$ y = [983039, 996486, 1138746, 1119822, 1343113, 1527620, 1016818, 1055602, 963954, 1605675, 1684681, 1397796, 1688271, 2391984, 1981616, 759367, 978546, 1338802, 1558035, 1666118, 1691230, 1890042, 2099532, 2702984, 1826539, 1565828, 1819249, 2127544, 2342628, 2531720, 2713457, 2148045, 2331561, 2452797, 2828045, 2703587, 2357652, 2084226, 1958350, 2638775, 3106330, 2937488, 2777460, 2127588, 1998781, 2843416, 2783754, 2444071, 3122739, 3008000, 3013567, 3266681, 3637651, 4131124, 3758194, 3513557, 3266500, 3289753, 3486648, 3485949, 3463514, 3596535, 3288750, 3388037, 3639468, 4119820, 4612433, 4111415, 3643432, 4212359, 4571746, 4287020, 4412797, 4154767, 4771061, 4282258, 3990186, 4075259, 4368529, 3808783, 3524316, 3718177]
6198C718177L60956L79490L43210M77221q53056j96033K55695R2901l50532J19288
6188D347317L00123m55697J41302K69709p7361l01457k29161l95743J24952N09969
6178D233953q3633K40981P6010K5719P1050P3120l15420N9687O67055J83919k36611
6167D995830J55323r2645l88694n927N11961L50461M65896n99593o21665j502
6157D769445P41904M30069j95949n98661K7050K24550q8912r004J58977n5281
6147E404188O31010j08305j10920M14043K97953p62779K63798L40368l16152J48740
6137F201944O7729j83378l52700R50770L68670j24480k97102j17028J48785L88527
6127G051737j28336N8928j6788J83341M26699j30384n71682J41863L08788Q12183
$$ y = [3718177, 4079133, 4458623, 4801833, 5279054, 4425998, 4229965, 4485660, 4578561, 4228029, 4347317, 4647440, 4191743, 4333045, 4602754, 4525393, 4223936, 3994775, 3599032, 3723984, 4233953, 4150320, 4391301, 4467311, 4493030, 4564080, 4637200, 4321780, 4381467, 5048522, 5232441, 4995830, 5151153, 5058508, 4669814, 4663887, 5175848, 5526309, 5992205, 5392612, 4770947, 4769445, 5511349, 5941418, 5745469, 5146808, 5173858, 5398408, 5309496, 5300492, 5459469, 5404188, 6035198, 5926893, 5815973, 6230016, 6527969, 5765190, 6028988, 6369356, 6053204, 6201944, 6269673, 6086295, 5733595, 6684365, 7053035, 6928555, 6631453, 6514425, 6663210, 7051737, 6923401, 6982329, 6965541, 7148882, 7575581, 7445197, 6873515, 7015378, 7324166, 8136349]
6117H136349O43390J23019k89899M41098n8810L65337Q3024J11900O27562R54376
6107A1137346n42892N51489J025617K47448m5561q10250K48773R39039N70715
6098A3321724N52096N30695O47543K0066K53683J085913L52244J083963J010643
6089A8858570L10803L31616P25993P94332J018650J269349M39511J085885M67971
6080B5302680J779762J672646J296934J202283J592603K380946K071832K352970
6072C9652656K070185K955689J982059K174983L254516L954036K903839K953206
6064F1901169L059250K586895J922733K584682K264519J581992J248284J214941
6056G8364465J008661O85066J091000J061501J141246J248145J163553J829631
$$ y = [8136349, 8779739, 8902758, 8612859, 9053957, 8995147, 9360484, 9443508, 9555408, 10182970, 11137346, 10594454, 11145943, 12171560, 12419008, 12373447, 11563197, 11811970, 12751009, 13321724, 13873820, 14404515, 15052058, 15072124, 15325807, 16411720, 16763964, 17847927, 18858570, 19169373, 19500989, 20226982, 21021314, 22039964, 23309313, 23748824, 24834709, 25302680, 27082442, 28755088, 30052022, 31254305, 32846908, 35227854, 37299686, 39652656, 41722841, 44678530, 46660589, 48835572, 52090088, 56044124, 58947963, 61901169, 64960419, 67547314, 69470047, 72054729, 74319248, 75901240, 77149524, 78364465, 79373126, 80058192, 81149192, 82210693, 83351939, 84600084, 85763637, 87593268]
6048H7593268K154586L142233K719803K809308K821100L405691L938174L241398
6040A11825561K806139J541213J505286O79593k71126q70143j552982j935635
6032A13727906k298069k280003l327582k415027k632477k531827j900523j454728
6024I4887670j230611j153482p81625j67389M36060k97589n76397p3888k42876
6015I0799873j096407k093901j026229k763080k937921k843332l061360l590099
6007G1387544k758336k961626l672789k256852l011799k783486k528967j967359
5999D9446330k619909j680922j590553j673334j937030j092854j199861j795587
5991C5856280j217564k5257r29816j046806j227882k63453p51875q55562p84301
$$ y = [87593268, 89747854, 92890087, 95609890, 98419198, 101240298, 104645989, 108584163, 111825561, 114631700, 116172913, 117678199, 118357792, 118086666, 117216523, 115663541, 113727906, 111429837, 109149834, 105822252, 103407225, 100774748, 98242921, 96342398, 94887670, 93657059, 92503577, 91721952, 91554563, 91990623, 91693034, 91116637, 91042749, 90799873, 89703466, 87609565, 86583336, 83820256, 80882335, 78039003, 74977643, 71387544, 68629208, 65667582, 61994793, 59737941, 56726142, 53942656, 51413689, 49446330, 46826421, 45145499, 43554946, 41881612, 39944582, 38851728, 37651867, 35856280, 34638716, 34613459, 33683643, 32636837, 31408955, 31145502, 30393627, 29538065, 28753764]
5982B8753764q96913J4909k08245k38139l23054K76967J36844q79554j6909J124293
5972B7743963r73204n63261J47877N04550Q3881j34329P80137k5000P95123P30326
5962B9090063m0757P53594J624328P98062L33581R38288N35420J314848J079747
5953C6427174J290351J903844J606545J867493J600882K075549K268232J895603
5945E0935673K308939L044499L188690K142128K886591L726089L337150J783502
5937G3353261K734829K809421J675532J903111K249487J338573Q14707P54122
5929H7633043P49265J872601J365209J918031K215761K921051K179665L063589
5921A03918215M105295L238815M570911L804909L947821M475064L808099K992692
$$ y = [28753764, 27856851, 27871760, 27663515, 27425376, 27102322, 27379289, 27516133, 26636579, 26619670, 27743963, 26770759, 26207498, 26355375, 26859925, 26943806, 26809477, 27589614, 27564614, 28359737, 29090063, 29049306, 29802900, 31427228, 32225290, 32558871, 33497159, 34032579, 35347427, 36427174, 37717525, 39621369, 41227914, 43095407, 44696289, 46771838, 49040070, 50935673, 53244612, 56289111, 59477801, 61619929, 64506520, 68232609, 71569759, 73353261, 76088090, 78897511, 80573043, 82476154, 84725641, 86064214, 86878921, 87633043, 88382308, 90254909, 91620118, 93538149, 95753910, 98674961, 100854626, 103918215, 108023510, 111262325, 115833236, 119638145, 123585966, 128061030, 131869129, 134861821]
5913A34861821K419827J918869K67840K03144j107373j510441k353132k972045
5905A31728510l004495j949477j858947j600243j406061j340337m90541m018O5281
5896A20139672n79744J294796K126064N76852N6811J62365R2088j063921j831071
5887A20973912k598073k947780l397012l424423m239462m372681m059228l922874
5879I2012379l521478l262458l317820k633318l355147l830507j414745k390743
5871F8286163k250819j605338j549181k057799k109781j043456j657642k302446
5863E3709701k132490j885618k010867k195362j846696j629137k356792j277441
5855C8375298j607447j792745j664101j783786q52903j148374j252145j257393
$$ y = [134861821, 137281648, 139200517, 139468357, 139671501, 138564128, 137053687, 134700555, 131728510, 128724015, 126774538, 124915591, 123315348, 121909287, 120568950, 120078409, 120074391, 120139672, 119559928, 120854724, 122980788, 123557640, 123614451, 123776816, 123868904, 122804983, 120973912, 118375839, 115428059, 112031047, 108606624, 104367162, 99994481, 95935253, 92012379, 88490901, 85228443, 81910623, 79277305, 75922158, 72091651, 70676906, 68286163, 66035344, 64430006, 62880825, 60823026, 58713245, 57669789, 56012147, 53709701, 51577211, 49691593, 47680726, 45485364, 43638668, 42009531, 39652739, 38375298, 36767851, 34975106, 33311005, 31527219, 30674316, 29525942, 28273797, 27016404]
5847B7016404r03210q59552n98865j077526j053892r97346k04450j11681o87768
5838B0522114r69469O7460p41725p06542o95057r04041l53078l87631l49423J11208
5828A5593816q3757n12420o04182P35131k44894r45149n62960m99177n16034P2903
5818A2433277M58295J65286j068643l58292L05864m21290J81304R213J0598o89844
5808A1025768l5917o32982k33814l15074L21021J06604p5580R5303m99283r46334
5798H809712M9601N72484n37623k05542n3356K92419n03567k57913J39260l87764
5788G917711l03064n8843j78299o95257J63157K44654o50687K9952O4948J45168
5778F679440R2458K89567L84574l95166j86272k22691j38323J51762L46254L1960
$$ y = [27016404, 26113194, 25253642, 24654777, 23577251, 22523359, 21526013, 21321563, 21209882, 20522114, 19552645, 19620105, 18878380, 18171838, 17476781, 16572740, 16219662, 15832031, 15482608, 15593816, 15510059, 14997639, 14393457, 15128588, 14883694, 13938545, 13375585, 12876408, 12360374, 12433277, 12891572, 13056858, 11988215, 11629923, 11935787, 11514497, 11695801, 11705014, 11715612, 11025768, 10989851, 10356869, 10123055, 9807981, 10129002, 10235606, 10160026, 10255329, 9756046, 8809712, 8859313, 9431797, 8894174, 8688632, 8635276, 8927695, 8424128, 8166215, 8305475, 7917711, 7614647, 7555804, 7377505, 6682248, 6845405, 7090059, 6439372, 6469324, 6534272, 6679440, 6771898, 7061465, 7446039, 7050873, 6864601, 6641910, 6503587, 6655349, 7001603, 7033563]
5768G033563l85989l84475k57643q1847p4593l0103m74593j02600M08805R4962
5758E745487l7384m51886q4331K91906r6638o34107P73702p4423l68980O44026
5748E707372M28751k06992n9932M38877n33886l51643J22730J47627n35946j55059
5738E001899o50612N13517J42358l5194J88926L40244m9503n95041l48290p9178
5728D429126O33692O8752n00366L08985k58934j80612j17435m17234O36530j51279
5718D451225M35768l26700K49880K67k90976J61464N32322L02826p58426l19695
5708D437955K54077k85329R6350J01508J94084p07255K34913R32132M2557n67210
5698D733782j13569K63643j03015L45967j57749L4717L19029K50835o27235o10877
$$ y = [7033563, 6647574, 6263099, 6005456, 5923609, 5849016, 5818913, 5344320, 5241720, 5650525, 5745487, 5708103, 5256217, 5171886, 5463792, 5367154, 4733047, 5506749, 5432326, 5063346, 5707372, 6136123, 5929131, 5869199, 6308076, 5774190, 5422547, 5545277, 5692904, 5156958, 5001899, 4351287, 4864804, 5007162, 4971968, 5160894, 5501138, 5451635, 4856594, 4508304, 4429126, 5062818, 5131570, 4631204, 4940189, 4681255, 4500643, 4383208, 3965974, 4602504, 4451225, 4886993, 4560293, 4810173, 4810440, 4519464, 4680928, 5213250, 5516076, 4757650, 4437955, 4692032, 4406703, 4503053, 4604561, 4798645, 4091390, 4326303, 5258435, 5300992, 4733782, 4620213, 4883856, 4780841, 5126808, 4969059, 5003776, 5322805, 5573640, 4946405, 4335528]
5688D335528l49385P40612L41143l0839M56895j38953k97412m94065j56214N182
5678D412492O75227K32990l60156k80142M3478J99824r6021j15854j19490p03677
5668C888671J36804K74384O52409K48794j96424m79001N27714J49288l22487k7316
5658D852836J009316N47224m30497r11642K53782N51809k67237O38173o44022
5649E599742j58741l25616M62538L12250o88368J63386N11528l51490K51623o01359
5639E175493O39764M68983n58884j07738M14664M61512l81819J0092P48867p86355
5629F084579k30699P93642l09506k32451l38896M90996P8810j24396P19666j368
5619F930377K66164K77205K71373m00114j35926L09740l1860k21736K48884J61339
$$ y = [4335528, 3986143, 4726755, 5067898, 5037059, 5493954, 5355001, 5057589, 4563524, 4407310, 4412492, 5087719, 5320709, 4960553, 4680411, 4723889, 4923713, 4827692, 4711838, 4592348, 3888671, 4025475, 4299859, 4952268, 5201062, 5004638, 4525637, 5053351, 5202639, 4880152, 4852836, 5862152, 6409376, 5978879, 5067237, 5321019, 5872828, 5605591, 6243764, 5599742, 5441001, 5115385, 5577923, 5890173, 5201805, 5365191, 5876719, 5525229, 5776852, 5175493, 5815257, 6284240, 5725356, 5617618, 6032282, 6493794, 6111975, 6122067, 6870934, 6084579, 5853880, 6647522, 6338016, 6105565, 5766669, 6257665, 6336475, 6212079, 6931745, 6930377, 7196541, 7473746, 7745119, 7345005, 7209079, 7518819, 7486959, 7265223, 7514107, 7675446]
5609G675446n39951L41781m9964J05761j70586O78312O25893M48569K40892q1475
5599I274678K13770m32819k23583N70633j95744P2417R02825k30648j58173N55232
5589A0348588L52805q44367l44087P48411P28058L32737n11632j56194J25399
5580A0779718n57031K02167M02020R52510n01105K29003M62163M53083J95658
5571A2618186M41548L78734l15168M68241K70188j72879M0535L220P24124N92951
5561A5049680J89541q047L91760j4071l8552J59451P45876N36292Q18910O64027
5551A8494867m00285Q58407l4887Q07090K70470J067318R67452l49441J33247
5542B1814238P79925K61631N51640P78272O34993P99359K35123Q91540R86556
$$ y = [7675446, 7135495, 7477276, 7427312, 7533073, 7362487, 8040799, 8666692, 9115261, 9356153, 9274678, 9488448, 9055629, 8832046, 9402679, 9206935, 9279352, 10182177, 9951529, 9793356, 10348588, 10701393, 9857026, 9512939, 10261350, 10989408, 11322145, 10810513, 10654319, 10779718, 10222687, 10424854, 10826874, 11779384, 11278279, 11507282, 11969445, 12422528, 12618186, 13059734, 13438468, 13123300, 13591541, 13861729, 13688850, 13729385, 13732605, 14456729, 15049680, 15239221, 15231174, 15622934, 15608863, 15570311, 15729762, 16475638, 17011930, 17830840, 18494867, 18094582, 18952989, 18918102, 19725192, 19995662, 21062980, 22030432, 21680991, 21814238, 22594163, 22855794, 23407434, 24185706, 24820699, 25620058, 25855181, 26746721, 27733277]
5533B7733277J071779J317386J062382J434289J355804L52880J207854J381377
5525C6917028J740834K409664J596766J263254J923626K458104K283987K544202
5517E3137465K376022L072927L372639L273827L167191M065760M195795M517950
5509H1179576L557718L638053L939040L710736L385675L198191K264952K576283
5501A07450224K029839J599105J543239J457558K496591K257955L202656L740876
5493A25778043L668025M131210M567458N601163N733782O139317O008735N668364
5485A67296097O045304O139391N905306L460825K734442K108128J35664m93680
5477A93331477j309204k205741k555317k765523k480070k421131j925032n60344
$$ y = [27733277, 28805056, 30122442, 31184824, 32619113, 33974917, 34327797, 35535651, 36917028, 38657862, 41067526, 42664292, 43927546, 45851172, 48309276, 50593263, 53137465, 55513487, 58586414, 61959053, 65232880, 68400071, 72465831, 76661626, 81179576, 84737294, 88375347, 92314387, 96025123, 99410798, 102608989, 104873941, 107450224, 109480063, 111079168, 112622407, 114079965, 116576556, 118834511, 122037167, 125778043, 129446068, 133577278, 138144736, 143745899, 149479681, 155618998, 161627733, 167296097, 173341401, 179480792, 185386098, 188846923, 191581365, 193689493, 193825157, 193331477, 192022273, 189816532, 187261215, 184495692, 182015622, 179594491, 177669459, 177109115]
5469A77109115q04963o12278P19255K355280J190768J818987J899109K743414
5461A86418687L017040K621309J541798J074321j4890k286241k364724l510124
5453A86497176m496538n498522n421994n555733n098568n583173m321854m552759
5445A45968035l524257l431449l389047k059215j699474j663801j104788j113478
5437A27982526r97289q2836p33681j283868j182200j658655k689022l497603l282077
5428A12575295l518060l798378l352396k844683l164426l286959k674226k791879
5420H7144288k184082j260845q79912j054538j620392r41859o02176r09044j590435
5411G6101005q83783j311089j665744k157636k374787j744006j544865j990669
$$ y = [177109115, 176304152, 175691874, 176411129, 178766409, 179957177, 181776164, 183675273, 186418687, 189435727, 192057036, 193598834, 194673155, 194658265, 192372024, 190007300, 186497176, 182000638, 176502116, 171080122, 165524389, 160425821, 154842648, 150520794, 145968035, 142443778, 139012329, 135623282, 133564067, 131864593, 130200792, 129096004, 127982526, 126985237, 126902401, 126168720, 124884852, 123702652, 122043997, 119354975, 115857372, 112575295, 109057235, 105258857, 101906461, 99061778, 95897352, 92610393, 89936167, 87144288, 84960206, 83699361, 82819449, 81764911, 80144519, 79202660, 78600484, 77691440, 76101005, 75217222, 73906133, 72240389, 70082753, 67707966, 65963960, 64419095, 62428426]
5403F2428426j422749j395804k131537j519623j267603j332508j592094r61314
5395E0805194j335380r04406j039454p43622j517727l09171m07687j304237l58373
5386D2885137j106151j582261j023761m90922j648457j864900k026586j143698
5378C1998401j365633j164900n76782r06166j381333q80066m23983o02254j101669
5369B3595615j154277j085475o32932j335292m28010K45340p33411k03896o31090
5360A7636572o18820r07843m01447o38091k52177j10173n63155l78918j74972
5351A3590976o62158p08361Q8470J60783L01500n12528p51522j90479l06540j154129
5341I856012k91521P00557n6464m89445M09781K85243l29145r42339M11208l66323
$$ y = [62428426, 61005677, 59609873, 57478336, 55958713, 54691110, 53358602, 51766508, 50805194, 49469814, 48565408, 47525954, 46782332, 45264605, 44955434, 44547747, 43243510, 42885137, 41778986, 40196725, 39172964, 38682042, 37033585, 35168685, 33142099, 31998401, 30632768, 29467868, 28891086, 27984920, 26603587, 25723521, 25299538, 24697284, 23595615, 22441338, 21355863, 20722931, 19387639, 18959629, 19204969, 18471558, 18267662, 17636572, 17017752, 16109909, 15708462, 15070371, 14818194, 14708021, 14144866, 13765948, 13590976, 12928818, 12220457, 12308927, 12469710, 12771210, 12258682, 11507160, 11316681, 11010141, 9856012, 9564491, 10265048, 10208584, 9719139, 10128920, 10414163, 10085018, 9142679, 9553887, 9187564]
5331I187564r30012n69824O45606J50542k45139n75990p06609M66155k64113l91480
5321F766700j35348K8387N88332J142p79136J61850k65745n72423r1221L79268
5311F081806j86613L05733m38318m60393m70771L87889N53725j18884l25379K04521
5301E533316M7542L80192q31774m48501K000M78781j95660M42931m22933j74882
5291D811012Q28514p12675m83380R718Q0543J99671j89618k70027m42828L83339
5281D214269Q2618l47102L80589j72017J67992J72641l20394Q9343J17588L5925
5271D421452k14442l68443l654k99137N49397J29132J59304M86066r20233l02717
5261C636725k66974m8181o4309j53474N60401k76873j90456m55141l98612N78132
$$ y = [9187564, 8257552, 7687728, 8333334, 8483876, 8238737, 7662747, 6956138, 7422293, 7158180, 6766700, 6631352, 6659739, 7248071, 7249213, 6470077, 6631927, 6366182, 5793759, 5702538, 6081806, 5895193, 6200926, 5762608, 5302215, 4831444, 5219333, 5773058, 5654174, 5328795, 5533316, 5580858, 5961050, 5129276, 4680775, 4682775, 5161556, 4965896, 5408827, 4985894, 4811012, 5639526, 4926851, 4443471, 4453189, 4533732, 4733403, 4543785, 4273758, 3830930, 4214269, 4296887, 3949785, 4330374, 4158357, 4326349, 4498990, 4178596, 4267939, 4385527, 4421452, 4207010, 3838567, 3834913, 3535776, 4085173, 4214305, 4373609, 4859675, 3939442, 3636725, 3369751, 3321570, 3257261, 3103787, 3664188, 3387315, 3196859, 2741718, 2343106, 2921238]
5251B921238J1657j57267L84400l07123P36439L17220m57081o41344J45040k4382
5241B928797l7135R8366j09903n17797p7J54771K7982L55167l65643o45172N4801
5230A944157J97240M20422m59537j23365J55758L72802J75302J19457P9198m57868
5220B423566o0438k06919l92967M22637M60076J29145n56772N81436k90566p54355
5210A754843L30533O66848l35118J2755J73426J39081O689k4571o9118n168J69191
5199B819391m45134m26651o08811M56832P18181j34518O5131l93K3607L74458
5189B842093l62509j53874m09664k72212J36851N28004M01030j90751l50151K0536
5179B189353m01752K82828j42020L10103L03846L49200o36479O9254K41975o4868
$$ y = [2921238, 2932895, 2775628, 3160028, 2852905, 3589344, 3906564, 3449483, 2808139, 2953179, 2928797, 2891662, 2990028, 2880125, 2362328, 2362251, 2517022, 2545004, 2900171, 2534528, 1889356, 1944157, 2141397, 2561819, 2102282, 1978917, 2134675, 2507477, 2682779, 2802236, 2881434, 2423566, 2363128, 2156209, 1763242, 2185879, 2645955, 2775100, 2218328, 2799764, 2509198, 1754843, 2085376, 2752224, 2417106, 2429861, 2603287, 2742368, 2749057, 2724486, 2655368, 2650200, 2819391, 2374257, 1947606, 1338795, 1795627, 2513808, 2379290, 2444421, 2444028, 2467635, 2842093, 2479584, 2325710, 1916046, 1643834, 1780685, 2308689, 2709719, 2518968, 2168817, 2189353, 1787601, 2070429, 1928409, 2238512, 2542358, 2891558, 2255079, 2324333, 2566308, 2501440]
5169B501440N4812p9233J28777K80853p040l80387m06494m2955j58921O98884
5159B589736l19630J87175l35242P2743O07922n00489M77768l96247J3020J6303
5149B413059L59013j32825j21505M56564j41605J62491m5887k86782L54473m3530
5139B973466L04427o33907j3240J72967Q58377m44577k67817R8649j9328K59641
5129C288658m36486J21092j14717J02999l10286L07735l45507J46037k10665N03572
5119C052432K33597j55503k95697M3226k98472k90496J41509N69239J84604j38710
5109C045729j00563l38386j9006m7850M14712q6571n3778O91778K66379m15099
5099C357345j02505m21690n42982K27894J86654q51690M26172l81793K13821O39877
$$ y = [2501440, 2556252, 2477019, 2605796, 2886649, 2879609, 2499222, 2092728, 2049773, 1890852, 2589736, 2270106, 2457281, 2122039, 2194782, 2802704, 2302215, 2779983, 2383736, 2396756, 2413059, 2772072, 2639247, 2517742, 2974306, 2832701, 2995192, 2949305, 2662523, 3016996, 2973466, 3277893, 2643986, 2630746, 2803713, 3662090, 3217513, 2949696, 3048345, 3029017, 3288658, 2852172, 2973264, 2858547, 2961546, 2651260, 2958995, 2613488, 2759525, 2548860, 3052432, 3286029, 3130526, 2834829, 2878055, 2579583, 2289087, 2430596, 2999835, 3184439, 3045729, 2945166, 2606780, 2587774, 2539924, 2954636, 2868065, 2814287, 3506065, 3772444, 3357345, 3254840, 2833150, 2290168, 2518062, 2704716, 1853026, 2279198, 1897405, 2111226, 2751103]
5089B751103J41507L02487l79736p09114J92319n79273J84780O60819p683k85710
5079B271499o7581L45131j61598R2997l26717m82502l59447M36966J172023j330998
5069A589773J86254J6575K97490r5707m2516O49809o36642j85616j18669N92369
5059B253120K37570J10399j03825k55653L64508K0448j73858o63703M93667k10030
5049B072643k38114L76702K1059l0076m44344Q89575J15729j82505o85148Q9927
5039A985448o916j81848M40014r619L66626M85663m60556J31668K15075L66428
5029C331983l62936m92075K29850N8915m84361K0516k49970l18050L66250k75618
5019A824504K5796L52384m9136O22321j27297o47636l6134M26943P7355J38332
$$ y = [2751103, 2892610, 3195097, 2815361, 2106247, 2298566, 1719293, 1904073, 2564892, 2557209, 2271499, 2203918, 2549049, 2387451, 2480448, 2153731, 1671229, 1311782, 1748748, 2920771, 1589773, 1776027, 1792602, 2090092, 1994385, 1951869, 2601678, 1965036, 1779420, 1660751, 2253120, 2490690, 2601089, 2497264, 2241611, 2606119, 2626567, 2452709, 1789006, 2282673, 2072643, 1834529, 2211231, 2232290, 2202214, 1757870, 2647445, 2763174, 2580669, 1895521, 1985448, 1978532, 1796684, 2236698, 2227079, 2593705, 3079368, 2618812, 2750480, 2965555, 3331983, 2969047, 2476972, 2706822, 2765737, 2281376, 2301892, 2051922, 1733872, 2100122, 1824504, 1850300, 2202684, 2153548, 2775869, 2648572, 2000936, 1964802, 2391745, 2469100, 2607432]
5009B607432k36268j83968M17761M62795j78283m16487P4165k55187O96746j39001
4999B849705k46461K57979p56644k00333N32836R43728j51030l00008L56659m88496
4989B797935k80564L37546m41612o1054J79563K50576l99035q8924j62481P45136
4979B877086q42307N0050L92201Q43109j59962n35582P26997K83385j82240n83833
4969B868904M39920O2329J51903k31393r9107N37465M24013m55626j81936n83152
4959B933320K5621O44901k84928J66782k28571k68697J133192K06357K13434j09531
4949D431880n43149n03816P43633n96169j38284K98034L57247N84678L70315l22820
4939D681549k9982l42212l12621m12784P43176O62865l39998R5348q6847M35231
$$ y = [2607432, 2371164, 2187196, 2604957, 3067752, 2889469, 2472982, 2547147, 2291960, 2988706, 2849705, 2603244, 2861223, 2104579, 1904246, 2437082, 3380810, 3229780, 2929772, 3286431, 2797935, 2517371, 2854917, 2413305, 2352251, 2531814, 2782390, 2383355, 2294431, 2131950, 2877086, 2034779, 2084829, 2477030, 3320139, 3160177, 2624595, 3351592, 3634977, 3452737, 2868904, 3308824, 3371153, 3523056, 3291663, 3192556, 3730021, 4154034, 3698408, 3516472, 2933320, 2958941, 3603842, 3318914, 3485696, 3257125, 2988428, 4121620, 4327977, 4541411, 4431880, 3888731, 3384915, 4128548, 3532379, 3394095, 3692129, 4049376, 4634054, 5004369, 4681549, 4651567, 4309355, 3996734, 3583950, 4327126, 4989991, 4649993, 4745341, 4658494, 5093725]
4929E093725J52608K69360m54524N2468J38824k82016M50600r0567L35029K20841
4919E886348j56296M36884L89194J57938K77167K69689n94816l03826O11237M59638
4909G433157k37119M40126N86164l8785n2587J1550J87506q7365n1971M04701
4899H595377L07615k75338q6449P57878r5157l1197J335789J18302J91290K50918
4889A1069028M4750Q84645K50520l96258J157992M68886L27457M35696L85325
4880A4628041K36028N7874J189820O22760Q73531L39962N0878P18375J79899N63440
4870A9460608J336594J007244J258123Q78706R75372J361853J344378R65230J820676
4861C0408784J785799J133713J708343J579888J863773K099300J975387K001168
$$ y = [5093725, 5246333, 5515693, 5061169, 5113637, 5252461, 4970445, 5421045, 5330478, 5665507, 5886348, 5730052, 6166936, 6556130, 6714068, 6991235, 7260924, 6666108, 6362282, 6973519, 7433157, 7196038, 7636164, 8222328, 8183543, 8130956, 8142506, 8330012, 8242647, 8190676, 8595377, 8902992, 8627654, 8541205, 9299083, 9203926, 9172729, 10508518, 10626820, 10818110, 11069028, 11113778, 11998423, 12248943, 11852685, 13010677, 13479563, 13807020, 14242716, 14628041, 14864069, 14921943, 16111763, 16734523, 17608054, 17948016, 17998894, 18717269, 18897168, 19460608, 20797202, 21804446, 23062569, 23941275, 24916647, 26278500, 27622878, 28588108, 30408784, 32194583, 33328296, 35036639, 36616527, 38480300, 40579600, 42554987, 44556155]
4853D4556155J967383K443793K567247J593378K539478J650746J887093K399715
4845F1604988K338764J599541J445460J544328J566099J236644R05210J476591
4837G3717625J948807J980468J364897J548821J108474K152638J808181J542240
4829H7172151K767161K279722K348358K525472K222565K424053J408051K149899
4821A05297432J885845M66732L99937Q66194j38049M94766j168954N7613j039143
4812A07122373j694499j675290j862678j486218j468047j475316j377083j575090
4804I4508152o47037m31195p25871n50910k62658M0158r91039O6883K72937k38838
4794I1040582n83249o11691j9247Q20455J61211k59545o61797k5993k09324r51962
$$ y = [44556155, 46523538, 48967331, 51534578, 53127956, 55667434, 57318180, 59205273, 61604988, 63943752, 65543293, 66988753, 68533081, 70099180, 71335824, 72241034, 73717625, 75666432, 77646900, 79011797, 80560618, 81669092, 83821730, 85629911, 87172151, 89939312, 92219034, 94567392, 97092864, 99315429, 101739482, 103147533, 105297432, 107183277, 107650009, 108049946, 108916140, 108778091, 109272857, 108103903, 108161516, 107122373, 105427874, 103752584, 101889906, 100403688, 98935641, 97460325, 96083242, 94508152, 93861115, 93429920, 92704049, 92153139, 91890481, 91930639, 90939600, 91006483, 91279420, 91040582, 90457333, 89845642, 89826395, 90646850, 90808061, 90548516, 89886719, 89860726, 89651402, 88699440]
4784H8699440m90043P5243L43095K32370l46446K83349J0123L31953j38810j25420
4774H8874854K72379o4370K95102O52173J65097n74413J23819Q3025L34227J48156
4764I0310049K97019Q43005K1418l01013M15300J921433J419575M72634J742848
4755I7142268J187075J598443J632722J557295J628558K316808K781742J798116
4747A11643027R19615K085747J033956M12507P96450j9188l57427j279673q78229
4738A14356785j801963j428793j145959k055096j913961k357620k166312j183024
4730A00304057j720832j780323j360300j796018j104147o37420j421037j375927
4722H9108053j597312r83586j713284j377919j487639j515071k455826j272333
$$ y = [88699440, 88209397, 88284640, 88627735, 88860105, 88513659, 88797008, 88807131, 89139084, 89000274, 88874854, 89147233, 89082863, 89377965, 90030138, 90195235, 89620822, 89744641, 89827666, 90161893, 90310049, 90607068, 91450073, 91471491, 91170478, 91585778, 93507211, 94926786, 95399420, 97142268, 98329343, 99927786, 101560508, 103117803, 104746361, 107063169, 109844911, 111643027, 112562642, 114648389, 115682345, 116094852, 116891302, 116872114, 116514687, 115235014, 114356785, 112554822, 111126029, 109980070, 107924974, 106011013, 103653393, 101487081, 100304057, 98583225, 96802902, 95442602, 93646584, 92542437, 91905017, 90483980, 89108053, 87510741, 86527155, 84813871, 83435952, 81948313, 80433242, 77977416, 76705083]
4714G6705083k201951k665480k414863k573465k834325k377790k077732k291356
4706E7268121k779886k822315k303875k235897j554100k290799k130393q30602
4698D0320254j863104j478537j540232j088586j563422j697590n80967j165987
4690B9341829j152066r94164L9679j278043q80549n09717j052400j027047j018748
4681B1468774p43331j059324n08628L63259p76329o96183n37062m93638k04134
4672A6813404n35187n18389N2227K62919j41307j037541l98430K49891q4415k63838
4662A4399334p13347l42458j58377o92989L17169l9456o72998o47360j16344J99135
4652A1532309m73077j07206p5673L24965n21337l05666M31366l06342J23292K51138
$$ y = [76705083, 74503132, 71837652, 69422789, 66849324, 64014999, 61637209, 59559477, 57268121, 54488235, 51665920, 49362045, 47126148, 45572048, 43281249, 41150856, 40320254, 38457150, 36978613, 35438381, 34349795, 32786373, 31088783, 30507816, 29341829, 28189763, 27195599, 27235278, 25957235, 25076686, 24566969, 23514569, 22487522, 21468774, 20725443, 19666119, 19157491, 19520750, 18744421, 18048238, 17511176, 17017538, 16813404, 16278217, 15759828, 15812055, 16074974, 15933667, 14896126, 14497696, 14747587, 14663172, 14399334, 13685987, 13343529, 13185152, 12492163, 12809332, 12769876, 12096878, 11449518, 11333174, 11532309, 11059232, 10952026, 10876353, 11201318, 10679981, 10374315, 10805681, 10499339, 10622631, 10873769]
4642A0873769L53280l51674m85417p19310p41631L1252L69575M36915p3642l0008
4632I663109P20129j85367m74310J570q9838N4797n27623j38298j58343M60956
4622I326782K25587P7950o2363j6412l5824o78621K72826n7412k2358L39440M6784
4611I416379j28943k72173O7432J45682L1943K07085r34530O64558N37236n2664
4601I682005K32655p91158J98898O91117l53321l96263r07582K86696m39108N04495
4591H708434N17946K16539L48505p43397L2796J12472j45966k49863m2810M33193
4581I187849p4064L4164l8285n2427N92844j84572M20002K36552j53852O09511
4571A0577722N65388M64434J13042q65931M29993M36604o61021P04886N83834
$$ y = [10873769, 11227049, 10875375, 10389958, 9670648, 8929017, 8960269, 9329844, 9766759, 9693117, 9663109, 10383238, 10197871, 9723561, 9725131, 9635293, 9690090, 9162467, 9024169, 8865826, 9326782, 9552369, 9630319, 9567956, 9551544, 9515720, 8837099, 9109925, 9052513, 9030155, 9369595, 9416379, 9287436, 9015263, 9082695, 9228377, 9260320, 9467405, 8532875, 9197433, 9734669, 9682005, 9914660, 9123502, 9322400, 10013517, 9660196, 9263933, 8356351, 8643047, 8203939, 8708434, 9226380, 9442919, 9791424, 9048027, 9080823, 9193295, 9047329, 8797466, 8754656, 9187849, 9113785, 9147949, 9109664, 9057237, 9650081, 9465509, 9885511, 10122063, 9968211, 10577722, 11143110, 11607544, 11720586, 10854655, 11284648, 11721252, 11060231, 11765117, 12348951]
4562A2348951p01827K02332Q78178j66084l94121M03859L69290j53876k82414
4553A2504288J77638l71087M61144J15150q05527N65304N64953K92446o34956
4544A2869353K66473Q1739j94704k11529K07690P56476k83898O25325K58999j77065
4534A4198859n90600j06370M21347Q36714M63332J86029l5430N885P82166Q25976
4524A6987908o25359J209871Q56854j35730L27191L95448O45243J35030J158415
4515B0954871M59509K77181P64316N16134O14948J118466N64910N40708P06310
4506B6517353L78726K037474P81598J165603J592430J713480R75217Q84580J855606
4497C7902067J505315J548435K688872K619342J891019K432714K693629K678980
$$ y = [12348951, 11647124, 11849456, 12727634, 12561550, 12167429, 12571288, 12940578, 12786702, 12504288, 12681926, 12310839, 12771983, 12887133, 12081606, 12646910, 13211863, 13504309, 12869353, 13135826, 13217565, 13022861, 12811332, 13019022, 13775498, 13491600, 14116925, 14375924, 14198859, 13608259, 13501889, 13923236, 14759950, 15223282, 15409311, 15373881, 15379766, 16161932, 16987908, 16362549, 17572420, 18429274, 18293544, 18620735, 19016183, 19661426, 19796456, 20954871, 21414380, 21691561, 22455877, 22972011, 23586959, 24705425, 25270335, 25811043, 26517353, 26896079, 28933553, 29715151, 30880754, 32473184, 34186664, 35161881, 36046461, 37902067, 39407382, 40955817, 43644689, 46264031, 48155050, 50587764, 53281393, 55960373]
4489E5960373L339706L751394M053959M422970L818990M671798O057299O669064
4481I2745553O585013P900655Q163115Q999391R503165J0130520J1786138J2591057
4473A68404607J3314711J3780844J5803302J5787779J5527487J4970208J3991278
4466B71580216J1682824Q684117N771127J392154l174026o858309r247110j2571695
4458B67259298j3727706j4328409j4714639j5090776j3142197j2410443j2357534
4451A71487594j1442557j0809066j0348185q956842p747003p660047p143960o252890
4443A01127044n550133m582146m962228m857376m107188l536221m066221l356004
4435F6109527l209364m100008k289903k208741k157718k724933k095163k311837
$$ y = [55960373, 59300079, 63051473, 67105432, 71528402, 75347392, 80019190, 86076489, 92745553, 99330566, 107231221, 115394336, 124393727, 133896892, 144027412, 155813550, 168404607, 181719318, 195500162, 211303464, 227091243, 242618730, 257588938, 271580216, 283263040, 291947157, 297718284, 299110438, 295936412, 289078103, 279830993, 267259298, 253531592, 239203183, 224488544, 209397768, 196255571, 183845128, 171487594, 160045037, 149235971, 138887786, 129930944, 122183941, 114523894, 107379934, 101127044, 95576911, 90994765, 86032537, 81175161, 77067973, 73531752, 69465531, 66109527, 62900163, 58800155, 56510252, 54301511, 52143793, 49418860, 47323697, 45011860]
4427D5011860j072542k099537k241093j468793j654089j682311j226776p85398
4419C2781321j139910j316729j713939n50987m14237p69829j602121j35100j180952
4410B3957517r50932k96369m53073q00181o91434j130896o78991j03813K13530
4401A9065358l50027n94724l20446j427411m97696p8718p99218p7809K24376n95003
4391A4548682l39149K083o23017M59466j82282r70210M29433j3708n72252o94098
4381A2044948l67480O8951J15885R742M90610j76918o12586n91718N48280j44657
4371A1385057l55988m58015J03820K15388p09470l43162l00330j35554L57006
4362I758752m4113p41367J06410l42486m61821K58205J02553L46585j68340l92562
$$ y = [45011860, 43939318, 41839781, 39598688, 38129895, 36475806, 34793495, 33566719, 32781321, 31641411, 30324682, 28610743, 28059756, 27645519, 26875690, 25273569, 25138469, 23957517, 23006585, 22710216, 22257143, 21456962, 20765528, 19634632, 18955641, 18851828, 19065358, 18715331, 18120607, 17800161, 16372750, 15875054, 15796336, 14997118, 14919309, 15143685, 14548682, 14209533, 14211616, 13588599, 14048065, 13865783, 12895573, 13325006, 13311298, 12739046, 12044948, 11677468, 11746419, 11862304, 11872046, 12362656, 12185738, 11573152, 10981434, 11529714, 11385057, 11029069, 10571054, 10674874, 10890262, 10180792, 9837630, 9537300, 9401746, 9758752, 9714639, 8973272, 9079682, 8737196, 8275375, 8533580, 8636133, 8982718, 8814378, 8421816]
4352H421816m07818l90487Q3590M69040L56299m07578L34282k98421m14080M78541
4342H225184r77963l82748N99604r46455l430M49486l04170m4788J85616J96343
4332F996679l64429m00076p2257P7803n3615L14961K39772l05169N63414K53541
4322G250624j237644k06230N98709n04594j19508O69776l76499k48984L71356
4313F197006k04544j56886j00618Q7891K56287l72067j99162L63474k0348j055
4303E849978K1943o89401j63823K68126m41122M22634J53208k30440k47531l10203
4293D633369O2218J204371o07836j121718N75641j6754m10031K92807O83772j59769
4283E136070N06221k82146K35885O283o1381J1551o29958m95079k70016K19631
$$ y = [8421816, 8013998, 7623511, 7707101, 8176141, 8532440, 8124862, 8459144, 8160723, 7746643, 8225184, 7247221, 6864473, 7464077, 6517622, 6514192, 6963678, 6659508, 6614720, 6800336, 6996679, 6632250, 6232174, 6159917, 6237720, 6184105, 6499066, 6738838, 6433669, 6997083, 7250624, 6012980, 5806750, 6405459, 5900865, 5781357, 6451133, 6074634, 5825650, 6197006, 5992462, 5835576, 5734958, 5822849, 6079136, 5707069, 5507907, 5871381, 5851033, 5849978, 5871921, 5182520, 5018697, 5286823, 4845701, 5268335, 5421543, 5191103, 4943572, 4633369, 4695587, 5899958, 5292122, 4170404, 4746045, 4729291, 4319260, 4612067, 5295839, 5136070, 5642291, 5360145, 5596030, 5602313, 5540932, 5552483, 4922525, 4427446, 4157430, 4377061]
4273D377061K91231K27857R0657O6656k216o00654K51672j80862L22364K08989
4263E052755l59003k4314k326k27655L8578J61540m56650J135J66095K08913K02865
4252D761933M58682L04302n36130p07398P89758N46940q61392j9389K74865j73311
4242D838860L82743K56874k2682k40453n53686L2620k02145K88435N21135l75047
4232D926654k20650P730r7674n664J94712J78510L0628m69263M52756J4497k08197
4221D804039J18911J53364l65939J59268Q9373j25423O08957O1048M76621j67733
4211E812486j55452Q88180q98013p45353N89563L02967j74261J87688P6019k28806
4201E655018j36435M24126m32897N79967J1710l6119J49625l6042K22118M4978
$$ y = [4377061, 4668292, 4896149, 4986806, 5053462, 5051246, 4450592, 4702264, 4521402, 4843766, 5052755, 4693752, 4669438, 4667112, 4439457, 4478035, 4639575, 4182925, 4184060, 4350155, 4559068, 4761933, 5220615, 5524917, 4988787, 4281389, 5071147, 5618087, 4756695, 4737306, 5012171, 4838860, 5221603, 5478477, 5455795, 5215342, 4661656, 4694276, 4492131, 4780566, 5301701, 4926654, 4706004, 4713734, 4616060, 4610396, 4805108, 4983618, 5014246, 4544983, 4997739, 5012236, 4804039, 4922950, 5076314, 4710375, 4869643, 4959016, 4833593, 5442550, 5503598, 5980219, 5812486, 5657034, 6545214, 5647201, 4901848, 5491411, 5794378, 5620117, 5807805, 5883824, 5655018, 5518583, 5942709, 5509812, 6089779, 6101489, 6065370, 6214995, 6178953, 6401071, 6446049]
4191F446049k20444p4339M99933r59199N68695K18934M62573L03611k1593M54719
4181G678939n80035Q22673R7293p45847P03002K97328k24615J61333j72029l08555
4171G729487J81631k20199O34412M06861P3145O0702j21948j87542N17381o65197
4161H408733j03245N79988K3764q12036P32238P21115l76091J6873M76299j28065
4151I539573n51390N38520M3559L02119M29775K22326L00997k00819N96704L51203
4141A1572567j35297K19500j37386M59052Q9541L90473N01530O85605M28229O54666
4131A4728480N97856J20450L87667N62160J301889Q45651j12237n4634O08056
4122A8985338J609536N71907J120656R27925R02147M09983P58229O01694N43089
$$ y = [6446049, 6225605, 6151266, 6651199, 5692000, 6260695, 6479629, 6942202, 7245813, 7224220, 7678939, 7098904, 7921577, 8018870, 7273023, 7976025, 8273353, 8048738, 8210071, 8038042, 7729487, 7911118, 7690919, 8325331, 8732192, 8805337, 8866039, 8744091, 8556549, 9073930, 8408733, 8305488, 8885476, 8909240, 8097204, 8829442, 9550557, 9174466, 9191339, 9667638, 9539573, 8988183, 9526703, 9570262, 9872381, 10302156, 10524482, 10825479, 10624660, 11221364, 11572567, 11437270, 11656770, 11519384, 11978436, 12067977, 12458450, 12959980, 13645585, 14073814, 14728480, 15326336, 15446786, 15834453, 16396613, 17698502, 18544153, 18431916, 18377282, 18985338, 20594874, 21166781, 22287437, 23215362, 24117509, 24527492, 25285721, 25887415, 26430504]
4113B6430504O92175R75152M54501O52584J495150J264648L7492J869905Q70413
4104C4742524M67680Q66481J441178P81028P92078J355435J158769J406052Q98145
4095D3909370J006865O96983J869850Q14533J638727K60510J437510O73036J308938
4086E3616322K144450J276024M60480J064514J697599J218404J037183J361654
4078F3876630J728018J423761J256906J362683J427667Q19090J222340J293915
4070G4411010J015249P57069Q57228J264427N80818Q26723J567355M7296N44374
4061H1871549Q36517R80607J387423J005419J059006M23788R89313Q99926Q37902
4052I0291450J857747J258816O57145J535251R73190J789893J492228J512629
$$ y = [26430504, 27122679, 28097831, 28552332, 29204916, 30700066, 31964714, 32002206, 33872111, 34742524, 35210204, 36076685, 37517863, 38298891, 39090969, 40446404, 41605173, 43011225, 43909370, 44916235, 45613218, 47483068, 48297601, 49936328, 50196838, 51634348, 52307384, 53616322, 55760772, 57036796, 57497276, 58561790, 60259389, 61477793, 62514976, 63876630, 65604648, 67028409, 68285315, 69647998, 71075665, 71894755, 73117095, 74411010, 75426259, 76183328, 77040556, 78304983, 78885801, 79712524, 81279879, 81327175, 81871549, 82708066, 83688673, 85076096, 86081515, 87140521, 87564309, 88553622, 89453548, 90291450, 92149197, 93408013, 94065158, 95600409, 96573599, 98363492, 99855720, 101368349]
4044A01368349Q60254J103803K046458N52190J104996L19447J51660J474569J200357
4035A10182083M64251O22239Q39256J50972K95331O0665j43358J043484J454418
4026A14969341N22881K09112L06406L58493J251860Q07358J46373K32805N21621
4017A19326250M73783j70243k59792K55876K19475p65235R6074l2355p92242O2123
4007A18413714j124191Q1393P00511O60976p76062j17811p76211p02344j63922
3998A16196053m41281m5111m34205q05155j316026m51836r80913n83195r64838
3989A10173493j708214j764831j098823q64984q04691j534676j015907k00440
3981A01180927o27826j211473p00373j117432p88200k33626q29182j42776l93212
$$ y = [101368349, 102228603, 103332406, 105378864, 105931054, 107036050, 107355497, 107507157, 108981726, 110182083, 110646334, 111268573, 112107829, 112258801, 112554132, 112614797, 112471439, 113514923, 114969341, 115492222, 115701334, 116007740, 116366233, 117618093, 118425451, 118571824, 118804629, 119326250, 119800033, 119629790, 119369998, 119625874, 119845349, 119080114, 119176188, 119143833, 118351591, 118413714, 117289523, 117370916, 118071427, 118732403, 117956341, 117838530, 117062319, 116359975, 116196053, 115754772, 115709661, 115275456, 114470301, 113154275, 112702439, 111721526, 111138331, 110173493, 108465279, 106700448, 105601625, 104736641, 103931950, 102397274, 101381367, 101180927, 100553101, 99341628, 98641255, 97523823, 96735623, 96501997, 95672815, 95530039, 95136827]
3972I5136827l57453q11028n54974p15782o96030p74739k16298j279889j071400
3963H8659234j35168j161767j481299p74240l28986q11493j339252j410301q95867
3954H0320861r10514m59600j687540o30239j201069j019534q74826j092878q03933
3945G1640728n98438r35020j492844n29793o07032j092640l43151j078731j019952
3936F3943127j847287o57492q38472j331787j097478j026436j95830o68041p53419
3927E5526885j335326q44298p24707l94822r79575q02139j563746l36234n58267
3918D7987771r74836o24767r41987r26355q33354r75392o99147j320942q24826
3909C9866165k17708j204582o48005j37573m26971j078725p14811l35369r01674
$$ y = [95136827, 94779374, 93968346, 93413372, 92697590, 92001560, 91226821, 91010523, 89730634, 88659234, 88524066, 87362299, 85881000, 85106760, 84777774, 83966281, 82627029, 81216728, 80320861, 79410347, 78950747, 77263207, 76632968, 75431899, 74412365, 73537539, 72444661, 71640728, 71042290, 70107270, 68614426, 68084633, 67477601, 66384961, 66041810, 64963079, 63943127, 62095840, 61438348, 60599876, 59268089, 58170611, 57144175, 56948345, 56280304, 55526885, 54191559, 53347261, 52622554, 52227732, 51248157, 50446018, 48882272, 48546038, 47987771, 47012935, 46388168, 45446181, 44519826, 43686472, 42711080, 42011933, 40690991, 39866165, 39648457, 38443875, 37795870, 37658297, 37231326, 36152601, 35437790, 35102421, 34200747]
3900C4200747n66234m91524k35467j082381k92243q53601j106323k36091p48692
3891B8588191k64668p07442k92129l30809p16699k6192q0096l45864r77324j183991
3881B3662977q24373j91607o2283r5194o60160p4007K85564n22644l36483m47597
3871B0734193o65880q85655j58471m12976J44107j18633o82920m6002k52149n6325
3861A7599289J09378o41232p90123p73818J81694q4651j83141o03946k59700L36440
3851A4890190J29122n00939o54464J04459k90534n9859q81125k73227O42292k6504
3841A3079411j7213j62930l65360k49073o44096n32669J42198k39442N80740m62398
3831A1129168k19095N7310p8868J31033l34691j84449q33204Q3422L21841l48668
$$ y = [34200747, 33634513, 33142989, 32907522, 31825141, 31532898, 30679297, 29572974, 29336883, 28588191, 28323523, 27616081, 27323952, 26993143, 26276444, 26250252, 26170156, 25824292, 24846968, 23662977, 22838604, 22646997, 22584714, 22489520, 21829360, 21755353, 22040917, 21518273, 21181790, 20734193, 20068313, 19182658, 19024187, 18611211, 18755318, 18636685, 17953765, 17907763, 17655614, 17599289, 17708667, 17067435, 16277312, 15503494, 15685188, 15600537, 15417396, 14813450, 14553750, 14890190, 15019312, 14518373, 13863909, 13968368, 13677834, 13617975, 12736850, 12463623, 13105915, 13079411, 13062198, 12899268, 12533908, 12284835, 11640739, 11108070, 11250268, 11010826, 11591566, 11129168, 10910073, 10967383, 10888515, 11019548, 10684857, 10500408, 9667204, 9750626, 10072467, 9723799]
3821I723799o58239J43899q10656M29053O95108j08843n53935q3723M2709j55881
3811H663291j08812k81918k53177N6066j78349l26703O08167j10718q87316N8660
3801G239191N91965j94807J27591p3812p0057J20288l84045j00774l6327j61879
3791G057334n4111k42930j45727k7837o04277J83177R54512r95474k6065k89089
3781E809513M83402k51429k33980N3145Q9762k19467o23098K49559m8281j36860
3771E172266M70123j54965q8596L68475j173119K05240P30802m52051q29226L92826
3761D641775K22188j48633O69750L99782J07833l81535p29646J76513j77378P6020
3751D856669j65485j20876k15173j24559L62811J18006j92659m19758q46197M71552
$$ y = [9723799, 9065560, 9209459, 8398803, 8827856, 9522964, 9414121, 8860186, 8776463, 8819172, 8663291, 8554479, 8272561, 8019384, 8075450, 7897101, 7570398, 8178565, 8067847, 7180531, 7239191, 7831156, 7636349, 7763940, 7690128, 7620071, 7740359, 7356314, 7255540, 7219213, 7057334, 7003223, 6760293, 6614566, 6586729, 5982452, 6165629, 7120141, 6124667, 6098602, 5809513, 6292915, 6041486, 5807506, 5860651, 5950413, 5730946, 5107848, 5357407, 5309126, 5172266, 5642389, 5487424, 5398828, 5767303, 4594184, 4799424, 5530226, 5078175, 4248949, 4641775, 4863963, 4715330, 5385080, 5784862, 5892695, 5511160, 4781514, 4958027, 4780649, 4856669, 4691184, 4570308, 4355135, 4230576, 4593387, 4711393, 4518734, 4098976, 3252779, 3724331]
3741C724331M41157p91618j20860K09127J016809l94061l78074J41987q7685N78662
3731D339775l24657o08540M69632m137j52408l22239o82335Q31066K86866n17264
3721C315759j2112J08609L29830Q5173k54441r11080m4342Q27654j39289l70911
3711B934850M67882j26973p21168j88241O44598M2760l00921j2738J07191j59334
3701B687906J0995K69735J13520j39308r7298J1970j45744J66772j26435j81685
3691B570428R1481K68461J23755l05047M35107o80710q08853O20107k36645k7092
3681B050992K34943l36843O2278k20611N4228J51845r1626j67843j12276O83477
3671B308564M04181k92159J75496l33095l26536Q6639J73387K71126n46507K52036
$$ y = [3724331, 4165488, 3373870, 3253010, 3462137, 4478946, 4084885, 3706811, 3848798, 3761113, 4339775, 4015118, 3406578, 3876210, 3872073, 3719665, 3397426, 2715091, 3546157, 3833023, 3315759, 3303647, 3412256, 3742086, 3827259, 3572818, 2661738, 2617396, 3445050, 3305761, 2934850, 3402732, 3275759, 2554591, 2366350, 3010948, 3053708, 2752787, 2740049, 2847240, 2687906, 2698901, 2968636, 3082156, 2942848, 2845550, 2857520, 2711776, 2878548, 2752113, 2570428, 2661909, 2930370, 3054125, 2749078, 3184185, 2503475, 1694622, 2314729, 2078084, 2050992, 2285935, 1949092, 2011370, 1790759, 1844987, 1996832, 1905206, 1737363, 1625087, 2308564, 2712745, 2420586, 2596082, 2262987, 1936451, 2023090, 2196477, 2467603, 1921096, 2173132]
3661B173132n42640k24181M97261J2295m51821L79805O82024l68057m29195M22686
3651B151309k45057j51074p3471k24754k10111j1541J96346P05430k51480K80014
3641B165611K37687q07734k80150N58745M05283k44713n69047Q0638p36308l88263
3631D21749L68492O32620j09322l00539O00108K12693L39594q2461l28687n24443
3621A229804n2831N01705M83232j88212J64659j41174k93974k15554p8554M02941
3611A812042k2000L0928n8341j79466K33439L67171m09212k4244J45020O3804
3601A959141n84609J10914P40897n2731j25507j432918M23692j19003O33868N84138
3591B137882n19398K41248J41437N42015k1189m96648l52470n32072l26960M31970
$$ y = [2173132, 1630492, 1406311, 1903572, 1915867, 1464046, 1843851, 2525875, 2157818, 1728623, 2151309, 1906252, 1755178, 1681707, 1456953, 1246842, 1235301, 1431647, 2137077, 1885597, 2165611, 2403298, 1595564, 1315414, 1874159, 2279442, 2034729, 1465682, 1546320, 810012, 421749, 790241, 1422861, 1313539, 1013000, 1613108, 1825801, 2165395, 2082934, 1754247, 1229804, 1176973, 1678678, 2161910, 1973698, 2138357, 1997183, 1703209, 1487655, 1409101, 1812042, 1790042, 1820970, 1762629, 1583163, 1816602, 2183773, 1774561, 1750317, 1895337, 1959141, 1374532, 1485446, 2226343, 2173612, 2048105, 615187, 1038879, 919876, 1553744, 2137882, 1618484, 1859732, 2001169, 2543184, 2521995, 2025347, 1672877, 1140805, 813845, 1245815]
3581A245815L00431j10338L38580P25561n90042l62308N62992k84702J518k04804
3571A622703O36762O62160K00801n26663M5554J54911q9336m15638K11767J90808
3561B693829l70976L81162n89514l52548J010822l53852k50662J18881p5182k77439
3551A934521L57476P68926l28379m72782J30758L98304K24998J77042n03165K42251
3541B929950k67377K26677M96118N10355l48656M5035N47259J07546l4266K11139
3531D423780m92209N01875M60822k45961M7950p54605J34847M13340K81640L85448
3521E156927p3403M57773Q13906m07725m23857j95531j33539K61800N45020K03755
3511F205126J75401l62005P17423M03460J99791J19534N62585N15975L19437R3420
$$ y = [1245815, 1546246, 1435908, 1774488, 2500049, 1910007, 1547699, 2110691, 1825989, 1827507, 1622703, 2259465, 2921625, 3122426, 2595763, 2641317, 2796228, 2706892, 2291254, 2503021, 2693829, 2322853, 2704015, 2114501, 1761953, 2772775, 2418923, 2168261, 2287142, 2211960, 1934521, 2291997, 3060923, 2732544, 2259762, 2390520, 2788824, 3013822, 3190864, 2687699, 2929950, 2662573, 2889250, 3385368, 3895723, 3547067, 3592102, 4139361, 4246907, 4212641, 4423780, 3931571, 4433446, 4894268, 4648307, 4696257, 3941652, 4076499, 4489839, 4771479, 5156927, 5083524, 5541297, 6355203, 5947478, 5523621, 5328090, 5194551, 5456351, 6001371, 6205126, 6380527, 6018522, 6735945, 7139405, 7339196, 7458730, 8021315, 8537290, 8856727, 8950147]
3501H950147Q04370k06276K54122J108462l9872j06814q6868K60005N82637N36565
3491A2056478j18893M41652r88845j80716N39586q4341N72969n50655k71928M58987
3481A1874294j79412o10365o67505l08240p05750l35953l99097K57562J27980
3472I053514p55159n38939m58998r6091n93937p96573n9855K24377j56341J0398
3462E832396K59158n50722j86638p06920J05797o1065p35657l76057P3038m06005
3452C247325k99914P29111p3404p13694k11171M80342n939j32192n04338j76889
3442B339237K29544o26805K49763L09407l65348L1889K31769q12751K65124M37519
3432B289348k06637o12472j0536P15515j97531N7124j5865m01023j62440p92608
$$ y = [8950147, 9754517, 9548241, 9802363, 10910825, 10870953, 10764139, 10677271, 10937276, 11519913, 12056478, 11937585, 12379237, 11390392, 11209676, 11749262, 11664921, 12237890, 11687235, 11415307, 11874294, 11694882, 11084517, 10417012, 10108772, 9403022, 9067069, 8667972, 8925534, 9053514, 8298355, 7759416, 7300418, 7204327, 6610390, 5813817, 5753962, 5978339, 5821998, 5832396, 6091554, 5540832, 5354194, 4647274, 4753071, 4692006, 3956349, 3580292, 3653330, 3247325, 2947411, 3676522, 3603118, 2889424, 2678253, 3158595, 3152656, 3020464, 2516126, 2339237, 2568781, 1941976, 2191739, 2501146, 2135798, 2167687, 2399456, 1586705, 1851829, 2289348, 2082711, 1470239, 1459703, 2175218, 1977687, 2034811, 2018946, 1617923, 1455483, 662875]
3422F62875M79492P46488L47005J06311m43649M6056j10211r28050J10972K53338
3412A270627K33041m0375m24051l43002j0646k58902M0441m7194j31820M30583
3402G18702j45697N69163n5547n8926K29184K78646l87099k85185l83028n317
3392D74896R60786l85073p82746N58369O1023n8899m33526N93479k08243q8305
3382F91761L72070j44041k05665k94729P42808J12774o63183l34836M31513k69139
3372D39333K94247n43726j26162j06079q3984J47310j30278K00280l17724M2467
3362a84316K86299K17611p3244P9825K00696K91065l84904R5284J04909l97784
3352B35441k64227J57440L27479N8833k10237k98574N266O64499J94557m18410
$$ y = [662875, 1142367, 1888855, 2235860, 2342171, 1898522, 1944578, 1834367, 906317, 1017289, 1270627, 1503668, 1463293, 1039242, 696240, 685594, 426692, 467133, 419939, 288119, 718702, 573005, 1142168, 1086621, 1027695, 1256879, 1535525, 1148426, 863241, 480213, 474896, 1435682, 1050609, 267863, 826232, 887255, 828356, 394830, 988309, 780066, 691761, 1063831, 919790, 714125, 419396, 1162204, 1274978, 611795, 276959, 708472, 439333, 733580, 189854, 63692, -42387, -126371, 20939, -109339, 90941, -226783, -184316, 101983, 319594, 246350, 326175, 526871, 817936, 433032, 528316, 633225, 235441, -28786, 128654, 456133, 514966, 304729, 6155, 11421, 675920, 870477, 452067]
3342D52067J25834l73550l25938J71562N43342m47660o0562K84228o05532M24942
3332A88733M84989l11259M45145M1338k53992m46292j56724Q54293q3171n1463
3322G11597K76870k21443p5010k03485k51733K11293p8486L20504p34497R3395
3312D9005j80074K23845K26425P2972m08484O32508m59307K39226p9733J79058
3302D95441k01146l82741k91895j46861l01718L5040L48349M86940O6236J84165
3292B91810K58786j40933j0143k22727J96176L9563j07939J65180L08614l79135
3282C99252J8544k68161p4708P13870M8785o63711M7144l62592K45630j19541
3272a5488k85485R4830J59275J67449M70742J80963j39764k74496N10720q1121
$$ y = [452067, 577901, 204351, -121587, 49975, 593317, 145657, 85095, 369323, -236209, 188733, 673722, 362463, 807608, 848946, 594954, 148662, -8062, 846231, 763060, 711597, 988467, 767024, 692014, 488529, 236796, 448089, 369603, 690107, -44390, 49005, -131069, 92776, 319201, 392173, -16311, 616197, 156890, 396116, 316383, 495441, 294295, -88446, -380341, -527202, -828920, -793880, -445531, 41409, 107645, 291810, 550596, 409663, 399520, 176793, 372969, 412532, 304593, 469773, 778387, 399252, 417796, 149635, 74927, 788797, 837582, 173871, 221015, -141577, 104053, -15488, -300973, -206143, -46868, 120581, 591323, 772286, 632522, 358026, 868746, 787625]
3262G87625n7692l37502m59421R825M94131K12757O9545p33601M2481j57816P44125
3251F14457q410K56287R5168n95559o73220j44277K42551r6196R2382P13679N8952
3240E55814n34467L05746n12016N91553k85226p87357O74571l96324K37003L33053
3230A82350L68564J39324k83303l66994J64526q273n4975M82456Q02982p31703
3220F94954p6819J30046p5638O34516p84202r6904L02372O3567k52597L0720N33924
3209A103939n35260M44695q2600k88777j75847M37297O56597k13092m19157j53827
3199G73968l28231N76083M28148M41222k60983q99079J81147L37078L58956J70073
3189A778382m22407M86120L73964o54573O203k09859N48316L6343R5264K73522
$$ y = [787625, 729933, 392431, -66990, -57165, 436966, 649723, 719268, -14333, 28148, -129668, 614457, 606047, 862334, 957502, 361943, -311277, -455554, -213003, -309199, -216817, 496862, 555814, 21347, 327093, -184923, 406630, 121404, -665953, 8618, -387706, -150703, 182350, 550914, 690238, 406935, 39941, 204467, 196194, 141219, 623675, 1426657, 694954, 618135, 748181, 672543, 1307059, 522857, 425953, 728325, 791892, 539295, 570015, 1103939, 568679, 1013374, 930774, 641997, 466150, 903447, 1560044, 1346952, 927795, 773968, 445737, 1021820, 1449968, 1891190, 1630207, 731128, 912275, 1249353, 1608309, 1778382, 1355975, 1842095, 2216059, 1561486, 1567689, 1357830, 1906146, 1942489, 2037753, 2311275]
3179B311275Q49223N3184J60676m5112k96575K52356o59170n24307L19377L12784
3169B733711j73973J52050N24614m57813j28821M86969N53331J00717K29814Q1067
3159D101666K4346k8963q04986J52376P59088k20312P69705J90000m57398K08757
3149D694279R05534P19141R0148o14112m2057n41800k03716k48838M47711M6840
3139E253130j67303m18823L04509j37180r16962l0261l08670j66318M67584m05556
3129C474150P0849r2645p6808j60427L04986R350l73134n87987L82250N2587L48892
3118C352063O3791j95945o16990o3130j5298l01479O04856K6978J66777p2566
3108B949057j77293o53619n1787K81690o48283j42095j33698M01043K21262m54538
$$ y = [2311275, 3160498, 3213682, 3374358, 3329246, 3032671, 3285027, 2625857, 2101550, 2420927, 2733711, 2559738, 2711788, 3236402, 2778589, 2649768, 3136737, 3690068, 3790785, 4020599, 4101666, 4126012, 4097049, 3292063, 3444439, 4203527, 3983215, 4752920, 4942920, 4485522, 4694279, 5599813, 6318954, 6409102, 5794990, 5752933, 5211133, 5007417, 4758579, 5206290, 5253130, 5085827, 4667004, 4971513, 4834333, 3917371, 3887110, 3578440, 3412122, 3879706, 3474150, 3544999, 3452354, 3375546, 3215119, 3520105, 3529455, 3156321, 2568334, 2950584, 3003171, 3352063, 3415854, 3219909, 2602919, 2539789, 2524491, 2223012, 2827868, 2854846, 3021623, 2949057, 2771764, 2118145, 2066358, 2348048, 1699765, 1557670, 1423972, 1825015, 2046277, 1591739]
3098A591739j8624o13087k23248l6341N15521N16676l38340l89228K71998j62519
3088A114547O231K12502P8047m02047j59380p41279L85614N60771L11413k48611
3078A117808j258000K09798J82889M65774M42785n35370p6117l90928N31911m67145
3068B23405L80684n96310k65198L09062J64144k08729K17952l2564J65667m13746
3058e5633Q5355P86138l8107j72740k66816M09723j29888k09248P5004k32568
3048B51220J53066K95046k20622p64518l72707O1971Q2042O44656J61588k81232
3038A0510l0846N6716l92184K08867J73074p2358M85241p26830J25570L68672
3028B06432N27069l54894p01127l6590j92713k2524N59440J48471J4622L44397
$$ y = [1591739, 1573115, 960028, 736780, 700439, 1215960, 1732636, 1394296, 1005068, 1277066, 1114547, 1120778, 1333280, 1411327, 1009280, 849900, 108621, 494235, 1055006, 1366419, 1117808, -140192, 69606, 252495, 718269, 1161054, 625684, 549567, 158639, 690550, 223405, 604089, 7779, -257419, 51643, 215787, 7058, 225010, 192446, 358113, -55633, 29722, 815860, 777753, 605013, 338197, 747920, 618032, 408784, 483788, 251220, 404286, 699332, 478710, -285808, -658515, -596544, -514502, 130154, 291742, 10510, -20336, 36380, -355804, -146937, 26137, -46221, 439020, -287810, -162240, 206432, 733501, 378607, -322520, -359110, -551823, -574347, -14907, 133564, 148186, 492583]
3018D92583m76833o06915K26659Q7204K36047k75179l17621M36003k58013J25392
3008c30673J17628K4157M4820q4931m72435j555J76971L28527M14940J43855r87324
2997f26020o55722M2541M38395M03006L32816K32510M97336L79449n71644m58057
2987A4610k86117J68396M55285m35937k90527O22114j94450p1511J82403L16639
2977D80905m60606O5628l58601K04288p5337k67750O5846Q6848M94108Q7832J9412
2966C42573j27473n47191k29071J021727J57955j25304p42972J99629k74157j85306
2956e09590k99503L51860Q32120j015737j20354O08545L47408L80898n19735L86894
2946D42806l23582p03502j58186K11238j63262M0347j14945P46293J94869J35405
$$ y = [492583, 15750, -591165, -364506, -277302, -41255, -316434, -634055, -198052, -456065, -330673, -213045, -188888, -144068, -228999, -701434, -702989, -526018, -197491, 217449, 361304, -626020, -1281742, -1239201, -800806, -397800, -64984, 167526, 664862, 1044311, 472667, 14610, -271507, -103111, 352174, -83763, -374290, 247824, 53374, -18137, 164266, 480905, 20299, 85927, -272674, -68386, -143723, -411473, -345627, -258779, 235329, 323161, 342573, 215100, -332091, -561162, 460565, 618520, 493216, -249756, -50127, -324284, -509590, -809093, -457233, 374887, -640850, -761204, -152659, 194749, 575647, 55912, 442806, 119224, -584278, -742464, -531226, -694488, -654141, -769086, -22793, 172076, 307481]
2936C07481M15799n91265n96253M8117K62436J45673M45351m6135k84229O00452
2926G07427m99459l72479L59880K40240n42197J77365k31527l888m49363r22288
2916a536289J92243L91776M9575l7866n7138M71982P2186n4533J37654J4958m3573
2905c99025K44488j22201k0585Q3220K81358l46065J9149N17200l2377K2434k57473
2894i877L85820O6546J85523p64256n31411N66688M05321l64106M83621k52367
2884A71502M74111J09983o74627l7700k53415j23199Q3574K52025J52303j14751
2874C9806l18179l15263k79935K60357M97690M05823J42500l24172m83209J82732
2864a91850K64982l60891l25910l87149P90905Q0753J18755m23295Q6459L31272
$$ y = [307481, 723280, 132015, -464238, -416121, -153685, -8012, 437339, 391204, 106975, 707427, 207968, -164511, 195369, 435609, -106588, 70777, -160750, -164638, -614001, -1536289, -1344046, -952270, -902695, -940561, -997699, -525717, -453531, -508064, -370410, -355452, -399025, -154537, -276738, -297323, -214103, 67255, -278810, -259661, 257539, 225162, 247596, -9877, 375943, 442489, 628012, -136244, -667655, -100967, 304354, -59752, 423869, 171502, 645613, 755596, 80969, 43269, -210146, -333345, -249771, 2254, 154557, 39806, -278373, -593636, -873571, -613214, -115524, 290299, 432799, 108627, -374582, -191850, 73132, -287759, -613669, -1000818, -209913, -129160, -10405, -433700, -347241, -15969]
2854a5969l90460n93130R35635k82192l3129J59405j7004n38212j6077l19716
2844a110849R5195P59737K19025k54316j69823n28288L63231N03998j85448K4030
2834b83508k88578K86287l81688r6656J90622j70590L87561K38319L4270R6165
2824A2204k56090o24980k7790K20221l78734J30093N93962L46488K3811L4738
2814G3923m72485l73436M56406p1237M45471P3147l39518j70633P0277M77034
2804A68949m96524J6760M44384J5814m35154k80794L46920k34853K37999m90263
2794g06762m13366P18056O66200O64119p55527k63129l4108N97546n58703M74510
2784C88836R7088N99634o49930j97419p02546N68308M26359p40130q7388K61404
$$ y = [-15969, -406429, -999559, -63924, -346116, -379245, -219840, -236844, -775056, -791133, -1110849, -1015654, -255917, -36892, -291208, -461031, -989319, -626088, -122090, -307538, -283508, -572086, -285799, -667487, -764143, -573521, -744111, -356550, -118231, -83961, 12204, -243886, -868866, -896656, -676435, -1055169, -925076, -331114, 15374, 39185, 73923, -398562, -771998, -315592, -386829, 58642, 131789, -207729, -378362, -308085, 168949, -327575, -310815, 133569, 149383, -285771, -566565, -219645, -454498, -216499, -706762, -1120128, -402072, 264128, 928247, 172720, -90409, -124517, 473029, -85674, 388836, 485924, 1085558, 435628, 238209, -464337, 103971, 530330, -209800, -297188, -35784]
2774c5784o9884j35246K95507o23186J43342j81024M93077l75369j74986K29165
2764d34388l83188R61932l67050q1548k22814K05573o493r3660M80366k31315
2754a72585N34927n57576j087257R09531O31618k20576M99645l40986k48216l29811
2744c81286O09760j01100o46827j36548O5144k22649N31273J37327l60491j2665
2734e18062R0172k13028N73217L53225O5383p39440K03394L09638p76515l54963
2724a006979q5837K63611O54130N78512k51172J89169q35612j10937q6396N8315
2714f33196K31571j48644k47181M00934K73464l3486j38180l22889N54231Q230
2704e5146m44859j23599r90124K2912R59603N99882j67534j70327J27095p0419
$$ y = [-35784, -105668, -240914, 54593, -568593, -425251, -606275, -113198, -488567, -663553, -434388, -817576, 144356, -222694, -304242, -527056, -321483, -327976, -421636, 58730, -172585, 362342, -195234, -1282491, -372960, 258658, 38082, 537727, 196741, -51475, -381286, 228474, 127374, -519453, -656001, -590857, -813506, -282233, -144906, -505397, -518062, -427890, -640918, -67701, 285524, 350907, -388533, -185139, 124499, -652016, -1006979, -1092816, -829205, -175075, 403437, 152265, 341434, -494178, -605115, -691511, -633196, -401625, -550269, -797450, -396516, -123052, -156538, -294718, -617607, -63376, -55146, -500005, -623604, -1613728, -1590816, -631213, -31331, -198865, -369192, -242097, -312516]
2694c12516M2152M55410J01647m27023p6952L77608J91700k17547L1435q1201
2684H4713l52N0764l03084N61167J028971k20184l67992p40478o90994n23454
2674a120923L78761O74429K30210j38358o82672J91606N02182K85007M6934j350981
2664i83805K34355O39468K96767M12041p77174m50217L57720j7243N42874J70729
2654D25515k32431n96206J28793K64504L89317m88009l6648O852m09287j38971
2644f86571J49113K24822l70997J60907J91180N14320K12018n18605n9739n2930
2634b36482J26112N773j81191l0880j8815k91041J55650N67408k22786J24953
2624a299J06676N22493l1750K67321j109154M2871L21357j73428K18949L05424
$$ y = [-312516, -270364, 185046, 286693, -140330, -217282, 160326, 352026, 134479, 165914, 84713, 84361, 135125, -167959, 393208, 1422179, 1201995, 834003, 93525, -597469, -1120923, -742162, -67733, 162477, 24119, -658553, -466947, 35235, 320242, 367176, -983805, -749450, -109982, 186785, 598826, -178348, -628565, -270845, -288088, 254786, 425515, 193084, -403122, -274329, -9825, 379492, -108517, -145165, -138313, -547600, -686571, -537458, -312636, -683633, -522726, -331546, 182774, 394792, -123813, -183552, -236482, -110370, -104597, -285788, -316668, -335483, -626524, -470874, 96534, -126252, -1299, 105377, 627870, 596120, 863441, -245713, -202842, 118515, -54913, 164036, 469460]
2614D69460L03714k58254K30242L9919p07408j45507J16350n92260J49770K83131
2604a10843k64022L44213J63116L74804k85445k90675M49171k64788J57189L09755
2594E82475K39038k19611l37788j66425p7548J41176m43621J70655L44382J16257
2584C48990K9550k0756L6716j88296k49572j67460P7603o4445l84402L2675M3626
2573e05771j61360O46212J71391k80705l94904L38871l83674N6237J74215q0348
2563d19836K39776K82800n3258j75399M1667Q524O95853j73210K56162k28465
2553D74614k00115l53767j86137l26125Q21802K20039j80793j81721n30845P25182
2543B82134L03611m03728j337M02676m16825O33217k39650l48964O8534K7715
$$ y = [469460, 773174, 514920, 745162, 785081, 77673, -67834, 48516, -543744, -393974, -110843, -374865, -30652, 132464, 507268, 221823, -68852, 380319, 115531, 272720, 582475, 821513, 601902, 264114, 97689, 20141, 161317, -282304, -111649, 232733, 348990, 378540, 357784, 394500, 206204, -43368, -210828, -133225, -197670, -582072, -549397, -505771, -667131, -20919, 150472, -130233, -525137, -186266, -569940, -513703, -339488, -419836, -180060, 102740, 49482, -125917, -84250, -75726, 620127, 446917, 703079, 474614, 274499, -79268, -265405, -591530, 230272, 450311, 269518, 87797, -443048, 282134, 585745, 182017, 180680, 583356, 166531, 799748, 560098, 211134, 279668, 307383]
2533C07383j67021N91379N2209n37218M15761j8792l9047L00939j98740K20491
2523I27344L7548k72996j65630J54079m04568n64267L78539P2086L56483J86191
2513G04809K64284j61651l24698O20585k14650o51982J14639M13117k36200J99838
2503G28091J91300j92775j00847J11580M076J08501K24912j60010j75969L19295
2493A058154L34695J32779n79810k46781R1283j95593K78624q8973L88827k51879
2483I21326j86664k04288m38188K59819P29939o3362M6109K5805o1770m81139
2473E47587K24357n3802n26507P40403l12518j29546p0249M58055J689j95025
2463F84444L17621R1272J82610q35115P54607L99206J10145J97054k84940O52409
$$ y = [307383, 140362, 731741, 783950, 246732, 662493, 643701, 604654, 905593, 706853, 927344, 964892, 691896, 526266, 680345, 275777, -288490, 90049, 162135, 518618, 704809, 969093, 807442, 482744, 1103329, 888679, 236697, 351336, 764453, 528253, 728091, 919391, 726616, 625769, 737349, 741425, 849926, 1074838, 914828, 738859, 1058154, 1392849, 1525628, 945818, 699037, 790320, 594727, 873351, 784378, 1173205, 921326, 734662, 530374, 92186, 352005, 1081944, 1018582, 1064691, 1090496, 1028726, 547587, 771944, 718142, 191635, 932038, 619520, 489974, 419725, 877780, 879469, 684444, 1002065, 1093337, 1275947, 440832, 1195439, 1594645, 1704790, 1901844, 1616904, 2269313]
2453B269313p71006l43378L12721j68170P37911J54028m76815K2259k9572j6267
2443A691024k26700k76435k67161O9254J96092K47521m55403J29752M46043j79683
2433A374304L24707j30665k60354l35547M15262M36479M64152L28489p02674m02753
2423A511400K17254l0122L10858m36604J031335L27564o26649K4635K57035n32
2413B586174K59603L36038m97527M97905J43781L18663L85064o65560J62198P5695
2403C602034L39196N44847k76044L30406R86840N8587o11258n6032K22393N03192
2393E644161o5211J467926J41768k02467M25034P7191K11845M46309K556J71936
2383H321048K71191M57469L74855M70454O10265O69739J186298Q93267J564209
$$ y = [2269313, 1498307, 1154929, 1467650, 1299480, 2037391, 2191419, 1714604, 1736863, 1707291, 1691024, 1464324, 1187889, 920728, 989982, 1186074, 1433595, 978192, 1107944, 1553987, 1374304, 1699011, 1568346, 1307992, 972445, 1387707, 1824186, 2288338, 2616827, 1914153, 1511400, 1728654, 1698532, 2009390, 1572786, 2604121, 2931685, 2305036, 2329671, 2586706, 2586174, 2845777, 3181815, 2684288, 3182193, 3325974, 3644637, 4029701, 3364141, 3526339, 3602034, 3941230, 4486077, 4210033, 4540439, 5527279, 5585866, 4974608, 4918576, 5140969, 5644161, 5578950, 7046876, 7188644, 6986177, 7411211, 7488402, 7700247, 8146556, 8149112, 8321048, 8592239, 9049708, 9424563, 9895017, 10505282, 11175021, 12361319, 13254586, 14818795]
2374A4818795P82383L33221L93596M03802O80490J697737J267707J249167J941854
2365B3568752J566628K415354K656779K332577K445016K766445L282310L473891
2357D4507752L264927L777429M192972N270422O033339N996463O641659O888224
2349H6573187P021864O762382N291154M270973K430433l79727k945626m277340
2341A04747300n903242o331955o229792n502495o276629n293802m740532m289738
2333F0179115m575610m507843k941540k961162l705639k969598j532043j898734
2325C5086946k224100j657147j903209j641874n97217j418851j443282j691171
2317B2510095j717777j096420j014424o75595m78186j135502n18092j510237j409283
$$ y = [14818795, 15601178, 15934399, 16327995, 16731797, 17412287, 19110024, 20377731, 21626898, 23568752, 25135380, 27550734, 30207513, 32540090, 34985106, 37751551, 41033861, 44507752, 47772679, 51550108, 55743080, 61013502, 67046841, 73043304, 79684963, 86573187, 93595051, 100357433, 105648587, 109919560, 112349993, 111970266, 109024640, 104747300, 98844058, 92512103, 86282311, 80779816, 74503187, 69209385, 64468853, 60179115, 55603505, 51095662, 48154122, 45192960, 41487321, 38517723, 36985680, 35086946, 32862846, 31205699, 29302490, 27660616, 27063399, 25644548, 24201266, 22510095, 20792318, 19695898, 18681474, 18005879, 17527693, 16392191, 15874099, 14363862, 12954579]
2308A2954579n4591O5236m96383j51953j057765n88174p97585j19607m78765l77837
2298H897155j97399m74678o34824n09404K24890j64310j21968K65215k09737n84012
2288F490928n57918L24214l83605l46257m36317K93440M39391p72369n19630l97362
2278D134515L3075K1394J60691q27319L22612N87273k30682m0162j00757l8458
2268D022182q418l62454K71777p65992J2083M89534l31609M0213J59139k45623
2258C280832k67592J13561M31617K35855k75441K63849L77773o19027q13528l84165
2248B343734K74150k89974L79483p27286j64625P29240q41514o49113k52057K12764
2238A014802L75156m77758O64540M12962l08207J10303j87491L40144j99942k38680
$$ y = [12954579, 12899988, 12965224, 12468841, 12316888, 11259123, 10670949, 9873364, 9753757, 9274992, 8897155, 8699756, 8225078, 7590254, 7080850, 7305740, 7141430, 7019462, 7284677, 7074940, 6490928, 5933010, 6257224, 5873619, 5527362, 5091045, 5384485, 5823876, 5051507, 4531877, 4134515, 4167590, 4188984, 4349675, 3522356, 3844968, 4432241, 4201559, 4161397, 4060640, 4022182, 4013764, 3651310, 3923087, 3157095, 3169178, 3658712, 3327103, 3367316, 3526455, 3280832, 3013240, 3126801, 3558418, 3794273, 3518832, 3782681, 4160454, 3541427, 2727899, 2343734, 2617884, 2327910, 2707393, 1980107, 1815482, 2544722, 1703208, 1054095, 802038, 1014802, 1389958, 912200, 1576740, 1989702, 1681495, 1791798, 1604307, 1944451, 1744509, 1505829]
2228A505829K15426L12373l70512N02098l18781k70812M2650k71374M7350L09416
2218A703663j093147o29667J241648M35236j63715j01439K21557J58089l95834
2209A376391l57656J56071J72340m24951K89915k23919k60345L74899j24198m78363
2199E00184K34139k59235J66945N79045j45902N22234J40243r64632J58039l282
2189I27778l88936j16092j81476L23388q0329Q13834K12219p78549o46305M7699
2179A33231K78003K21280j46586l1767K77332N47221r30564J92786J97498k88218
2169D50216j82078K91082K47024j11737l79803K40603j28224m39496r1202Q03706
2159G00091j00074m05364K20991k01904P7712l83595K97207k57067L48880M43361
$$ y = [1505829, 1721255, 2033628, 1663116, 2165214, 1846433, 1575621, 1618271, 1346897, 1394247, 1703663, 610516, -19151, 1222497, 1657733, 1494018, 1392579, 1614136, 1772225, 1376391, 1018735, 1174806, 1347146, 922195, 1212110, 988191, 727846, 1102745, 978547, 500184, 734323, 475088, 642033, 1221078, 1075176, 1597410, 1737653, 773021, 931060, 927778, 538842, 422750, 241274, 564662, 484333, 1298167, 1510386, 731837, 85532, 133231, 411234, 632514, 485928, 454161, 731493, 1278714, 348150, 540936, 738434, 450216, 268138, 559220, 806244, 694507, 314704, 555307, 427083, -12413, -103615, 700091, 600017, 194653, 415644, 213740, 291452, -92143, 205064, -52003, 296877, 740238]
2149G40238k63852J23483j751k34447L17641m8337O0762j01569L5216m16088n71990
2138c60694Q1187P35889L8020L32443J65029K06256o25473M41972j07387r11637
2128d395L35657P7530k3702m7324k64141J9051j76165m40471Q8007Q7242K17946
2117a30765P13502k16524p68354R94026l1428q61328k70974L39556N45001R6619
2107D09331m69451J47316L73084K21862L04118l4539n01093l78761K13301P8297
2097C63465l01250K57993L01773M0281l37775J00220l07631k4506o7908P0308
2087I4970m39238N49403P34079l80028J56811o16738j47148K12258K84204J61497
2077F10070K63654j07792j72349J97933n23505n8376O24168m67359l75838J54680
$$ y = [740238, 476386, 599869, 598118, 363671, 681312, 632975, 693737, 592168, 627384, 211296, -360694, -279507, 456382, 494402, 826845, 991874, 1198130, 572657, 1014629, 907242, -4395, 331262, 408792, 385090, 337766, 73625, 92676, -83489, -523960, -435953, -348711, -130765, 582737, 366213, -402141, 591885, 560457, -300871, -571845, -232289, 312712, 409331, -60120, 87196, 460280, 682142, 986260, 951721, 450628, 71867, 285168, 363465, 62215, 320208, 621981, 662262, 324487, 424707, 117076, 92570, 24662, 94970, -344268, 205135, 939214, 559186, 715997, 99259, -47889, 164369, 448573, 610070, 873724, 765932, 593583, 791516, 268011, 209635, 833803, 366444, -9394, 145286]
2067A45286K75055J69601L55778M93680m10712n25662m24183L45994k09618K78440
2057D93659M4547m37976j037415k93990Q96713q59j16099j16771M35479J78327
2047D5615k75880K42014O12106r15282j09856P93512j37912k83928J53740j2897
2037A11232M7503l8988L79850n9746j87111j69295K25426k19292p55329L86151
2027b79599J98301q3685k1540J7337L28327J31436J39235o4177J30459k99050
2017A97044m42675J89387P34757j59073k48359l59484j47924L23616M86941K64279
2007H38509q09465J01466K23676k6310k64425K98624p64985k96020L58967M53029
1997A13066M17726K53665k47585m58625m44848j68346J97459l50376k9828K83269
$$ y = [145286, 420341, 589942, 945720, 1439400, 1028688, 503026, 78843, 424837, 215219, 493659, 538206, 100230, -937185, -1231175, -334462, -335321, -451420, -568191, -132712, 45615, -230265, 11749, 623855, -291427, -401283, 392229, 254317, -29611, 124129, 111232, 158735, 119747, 499597, 439851, 252740, 83445, 308871, 89579, -665750, -279599, -81298, -164983, -186523, -169186, 159141, 290577, 429812, 365635, 496094, 197044, -245631, -56244, 678513, 519440, 271081, -88403, -236327, 87289, 574230, 838509, 29044, 130510, 354186, 327876, 63451, 362075, -402910, -698930, -339963, 113066, 530792, 784457, 536872, 78247, -366601, -534947, -337488, -687864, -717692, -434423]
1987d34423j08980l42650P91664j52252k70369J09855l3378J53550M79322n9086
1977A33253j77909l2271k1114K57677k04538n00750l81713k75213O58403R00205
1967C56030q2156j20446k34298j74367L57556P837M78111L43908p06287k35107
1957i219O00342l19439o21574K67456L69569r20870q0323L18630l17303M79409
1947b33322Q864l5699K50963j20184l05208L384K78322n56126o495L92785j63129
1936d85845N58935k68426j61275L6119K53210M39611K61591k00714J49299n70353
1926A2152r0225j76472J67526J791j65107l4535L84422K37725k30857J30807J05167
1915C42394l00171m43638J84998l87736j30314M98109r105L03470l16084j38863
$$ y = [-434423, -543403, -886053, -94389, -246641, -517010, -407155, -440533, -286983, 192339, 133253, -44656, -76927, -98041, 159636, -44902, -545652, -927365, -1202578, -544175, 356030, 273874, 153428, -80870, -255237, 102319, 110156, 588267, 932175, 225888, -9219, 591123, 271684, -349890, -82434, 287135, -633735, -714058, -395428, -712731, -233322, -224458, -260157, -9194, -129378, -434586, -431202, -152880, -709006, -715501, -322716, -485845, 73090, -195336, -356611, -320492, -67282, 372329, 633920, 433206, 582505, 12152, -78073, -254545, -87019, -85228, -250335, -284870, 99552, 337277, 106420, 237227, 342394, 42223, -401415, -216417, -604153, -734467, -236358, -245463, 58007, -258077, -396940]
1905c96940K98403J74393k34721m9645k28248j30485J62544L21681m5566l66982
1895d95566L22993r4668K50037M02025J0440p60509L32658J13396l7827m96685
1885d53706l13595P95434K13783m43518J7541J21436l98457j31687N90310K71515
1875B69056n17097m46367R84679j3996q02565M1588M24035k76429k15891Q19308
1865B66321n26635n02866J74749n8679O26463Q32321j741o09131j77231L54992
1855C78563K5110k19894m83936n50610O85517j05016L8728k23862L44444K63794
1845A52838j00312m94112j71992M03529K28775k89427n16584K68933k49209J57942
1835f09619l18199J92014P93311P6002L49120N1611m50266n86730M46046k61321
$$ y = [-396940, -98537, 75856, -158865, -208510, -436758, -567243, -404699, -83018, -128584, -495566, -172573, -267241, -17204, 384821, 395261, -365248, -32590, 80806, 42979, -453706, -767301, 28133, 241916, -201602, -184061, -62625, -461082, -592769, -2459, 269056, -248041, -694408, 290271, 276275, -526290, -484702, -60667, -337096, -552987, 266321, -260314, -763180, -588431, -647110, -20647, 811674, 809933, 200802, 23571, 378563, 403673, 183779, -300157, -850767, -165250, -270266, -231538, -455400, -110956, 152838, 52526, -441586, -613578, -210049, 18726, -270701, -787285, -518352, -767561, -609619, -927818, -735804, 57507, 133509, 482629, 534240, 83974, -502756, -56710, -318031]
1825c18031k15113Q05097O1137l70143k96605M804K98235R30191l60545l02175
1815B36852m33445k56483M17753j7752l75448k7734k41780K11708m17571M5937
1805h57963K51320L57389p2342J12325J7051O6810K51481q16224O53953N03992
1795D67792m96467L36835R9158r5839J33377O4187m089r8055q02339J7195N6039
1784c22206N95415j96494p14872J000038l89556n5086L04823K36305L87252k67260
1774E78359l11932o92695n81345N45608K09955j53696m84608L05138M02517Q5816
1764i6883L49954n1225m08885R04646o01191m32160K75014l30313p41403M30165
1754g02281N33999J25229K86480R33n39264M6887k69897j17974L78722M7851J69884
$$ y = [-318031, -533144, 271953, 333090, -37053, -333658, -328854, -30619, 899572, 539027, 236852, -196593, -453076, -35323, -53075, -428523, -456257, -698037, -486329, -903900, -857963, -606643, -249254, -321596, -209271, -192220, -125410, 126071, -690153, -36200, 467792, -28675, 308160, 407318, 311479, 444856, 509043, 504954, 406899, -395440, -378245, -322206, 273209, 76715, -638157, 361881, -27675, -82761, 222062, 458367, 845619, 578359, 266427, -426268, -1007613, -462005, -252050, -405746, -890354, -585216, -182699, -96883, 253071, 201846, -207039, 697607, 96416, -335744, -60730, -391043, -1132446, -702281, -168282, -43053, 243427, 244360, -294904, -248017, -517914, -635888, -257166, -209315, -39431]
1743c9431J05634J35886m9773N10984m7751m21268o14860L68358q8272J04266
1733c6227j69606j66777R2722Q3693j59055Q7109J4097M3520m03703n6359M61129
1722b09457M80767n76277j56602L67746J9468k4977L30586l30893L274M59327
1712C62962m21084M3364k94553K69729p30546K00233P38090O6862q51342m35946
1702a052231J083687K9169o10175K89427m7896M24731J18207n09880j68572K08662
1692b34871N06216j45962k62943k74129L94568K85795n02825j98537L70487o5491
1682a27692m670q60708L83074P3661O7813m3748k43994O0624L17120K96140K28115
1671A45735k88654k77133L55606N10522K73200l03379n17519p54328o4950K59114
$$ y = [-39431, 66203, 202089, 152316, 663300, 615549, 194281, -420579, -52221, -140493, -36227, -205833, -372610, -279888, -196195, -355250, -268141, -254044, -210524, -614227, -670586, -209457, 271310, -304967, -461569, -93823, -74355, -99332, 231254, -99639, -96365, 362962, -58122, -14758, -309311, -39582, -770128, -569895, 168195, 235057, -616285, -1052231, 31456, 60625, -549550, -260123, -308019, 116712, 234919, -274961, -443533, -234871, 271345, 125383, -137560, -411689, -17121, 268674, -234151, -432688, -62201, -127692, -132362, -993070, -609996, -536335, -468522, -512270, -756264, -695640, -378520, -82380, 145735, -142919, -420052, -64446, 446076, 719276, 415897, -101622, -855950, -920900, -661786]
1661f61786O51872P57110l53710n70867L9618l82569K95089m50233L08940J47445
1651b19091R929m24489j42512N20468k55806j11386O35536P5005n87362l43630
1641h43338J62143J96515L26140J05256j93692k69303p25488J89304M85620K88037
1631b78806j5804m51283o3065P0447N90395K84806k40105q1091J7721Q7591j39953
1620b19147O17130j67286m64648m00207K08144N32128k84337J04104m59R3704
1610A9126j8511K28931k70847m05642j40802J35037j88945k45994P46348L56691
1600B15392m61251o1826l43854L5535q7708J53600J20990j89304k96034R5663
1590h18797J05212K30403L80967n9659K13442l53178K24266j58210k87131O0919
$$ y = [-661786, -9914, 747196, 393486, -177381, -137763, -520332, -225243, -675476, -366536, -219091, -209162, -633651, -776163, -255695, -511501, -622887, 12649, 87654, -499708, -843338, -681195, -484680, -158540, -53284, -246976, -516279, -1241767, -1052463, -566843, -278806, -294610, -745893, -808958, -738511, -148116, 136690, -103415, -184506, -166785, -79194, -219147, 397983, 230697, -233951, -634158, -426014, 106114, -178223, -74119, -74578, 19126, 615, 229546, -41301, -446943, -587745, -452708, -641653, -887647, -141299, 215392, -245859, -307685, -651539, -616004, -703712, -550112, -429122, -618426, -914460, -818797, -713585, -483182, -102215, -161874, 51568, -301610, -77344, -235554, -522685, -461766]
$$ [...]
##END NTUPLES=NMR SPECTRUM
##END=
