##TITLE=1H_EC-3359(21)
 200.13MHz, CDCl3,
 8 sc
 
 28.8.2025
##JCAMPDX= 6.0         $$ Bruker NMR JCAMP-DX V2.0
##DATA TYPE= NMR SPECTRUM
##DATA CLASS= NTUPLES
##ORIGIN= UXNMR, Bruker Analytische Messtechnik GmbH
##OWNER= pz
$$ XWIN-NMR		Version 3.5
$$ Thu Aug 28 13:47:42 2025 Russian Standard Time (UT+4h)  she@DPX200
##.OBSERVE FREQUENCY= 200.1313
##.OBSERVE NUCLEUS= ^1H
##.ACQUISITION MODE= SIMULTANEOUS
##.ACQUISITION SCHEME= undefined
##.AVERAGES= 8
##.DIGITISER RES= 18
##SPECTROMETER/DATA SYSTEM= spect
##.PULSE SEQUENCE= zg30
##.SOLVENT NAME= D2O
##.SHIFT REFERENCE= (INTERNAL, D2O, 0, 15.413)
##AUDIT TRAIL= $$ (NUMBER, WHEN, WHO, WHERE, WHAT)
$$ ##TITLE= Audit trail, XWIN-NMR		Version 3.5
$$ ##JCAMPDX= 5.01
$$ ##ORIGIN= Bruker BioSpin GmbH
$$ ##OWNER= she
$$ F:/spectra/data/she/nmr/H-C/1/pdata/1/auditp.txt
$$ ##AUDIT TRAIL=  $$ (NUMBER, WHEN, WHO, WHERE, WHAT)
(   1,<2025-08-28 13:46:12.60 +0400>,<she>,<DPX200>,
      <created by zg, POWCHK disabled, PULCHK disabled
       configuration hash MD5:
       00 E9 B6 7A A2 85 ED C7 34 08 36 98 17 FE 4E 26
       data hash MD5: 16K
       49 95 B5 1A 10 4A EC 62 73 55 78 16 23 0A 46 7D>)
(   2,<2025-08-28 13:46:14.81 +0400>,<she>,<DPX200>,
      <Start of raw data processing
       efp BC_mod = 2 LB = 0.25 FT_mod = 6 PKNL = 1 PHC0 = -1558.425 PHC1 = 4.592278 SI = 16K 
       data hash MD5: 16K
       ED 36 C0 6E E9 39 EC 61 42 2C 64 43 A3 2F 57 F4>)
(   3,<2025-08-28 13:46:39.98 +0400>,<she>,<DPX200>,
      <pk PHC0 = -0.1944969 PHC1 = 5.8 
       data hash MD5: 16K
       2E 0D 3C C1 CD 3C 99 42 F7 0A 18 18 C3 35 A5 D0>)
(   4,<2025-08-28 13:46:44.01 +0400>,<she>,<DPX200>,
      <abs ABSG = 5 
       data hash MD5: 16K
       5C 32 08 BC 42 AC BA 4A 76 9E AF 36 D5 3D 99 1E>)
$$ ##END=
$$ 
$$ hash MD5
$$ BB 12 6F 3E CB 34 66 95 AC 82 53 F7 3A CE AD FB
##$RELAX= 
##$RELAX= 
##$RELAX= 
##$RELAX= 
##$RELAX= 
##$RELAX= 
$$ Bruker specific parameters
$$ --------------------------
##$DU= <F:/spectra>
##$EXPNO= 1
##$NAME= <H-C>
##$PROCNO= 1
##$TYPE= <nmr>
##$USER= <she>
##$AMP= (0..31)
100 100 100 100 100 100 100 100 100 100 100 100 100 100 100 100 100 100 
100 100 100 100 100 100 100 100 100 100 100 100 100 100 
##$AQSEQ= 0
##$AQ_mod= 1
##$AUNM= <au_zg>
##$AUTOPOS= <>
##$BF1= 200.13
##$BF2= 200.13
##$BF3= 200.13
##$BF4= 200.13
##$BF5= 200.13
##$BF6= 200.13
##$BF7= 200.13
##$BF8= 200.13
##$BYTORDA= 1
##$CFDGTYP= 0
##$CFRGTYP= 5
##$CHEMSTR= <none>
##$CNST= (0..31)
1 1 145 1 1 1 1 1 1 1 1 1 1 1 1 1 1 1 1 1 1 1 1 1 1 1 1 1 1 1 1 1 
##$CPDPRG= <>
##$CPDPRG1= <>
##$CPDPRG2= <>
##$CPDPRG3= <>
##$CPDPRG4= <mlev>
##$CPDPRG5= <mlev>
##$CPDPRG6= <mlev>
##$CPDPRG7= <mlev>
##$CPDPRG8= <mlev>
##$CPDPRGB= <>
##$CPDPRGT= <>
##$D= (0..31)
0 0.7 0 0 0 0 0 0 0 0 0 0.03 0 0 0 0 0 0 0 0 0 0 0 0 0 0 0 0 0 0 0 0 
##$DATE= 1756374371
##$DBL= (0..7)
120 120 120 120 120 120 120 120 
##$DBP= (0..7)
150 150 150 150 150 150 150 150 
##$DBP07= 0
##$DBPNAM0= <>
##$DBPNAM1= <>
##$DBPNAM2= <>
##$DBPNAM3= <>
##$DBPNAM4= <>
$$ [...]
##$SUBNAM3= <"">
##$SUBNAM4= <"">
##$SUBNAM5= <"">
##$SUBNAM6= <"">
##$SUBNAM7= <"">
##$SUBNAM8= <"">
##$SUBNAM9= <"">
##$SW= 18.0517328524113
##$SWIBOX= (0..15)
0 0 2 0 0 0 0 0 0 0 0 0 0 0 0 0 
##$SW_h= 3612.71676300578
##$TD= 16384
##$TD0= 1
##$TE= 0
##$TE2= 300
##$TE3= 300
##$TEG= 300
##$TL= (0..7)
0 120 120 120 120 120 120 120 
##$TP= (0..7)
150 150 150 150 150 150 150 150 
##$TP07= 0
##$TPNAME0= <>
##$TPNAME1= <>
##$TPNAME2= <>
##$TPNAME3= <>
##$TPNAME4= <>
##$TPNAME5= <>
##$TPNAME6= <>
##$TPNAME7= <>
##$TPOAL= (0..7)
0.5 0.5 0.5 0.5 0.5 0.5 0.5 0.5 
##$TPOFFS= (0..7)
0 0 0 0 0 0 0 0 
##$TUNHIN= 0
##$TUNHOUT= 0
##$TUNXOUT= 0
##$USERA1= <user>
##$USERA2= <user>
##$USERA3= <user>
##$USERA4= <user>
##$USERA5= <user>
##$V9= 5
##$VALIST= <valist>
##$VCLIST= <CCCCCCCCCCCCCCC>
##$VD= 0
##$VDLIST= <DDDDDDDDDDDDDDD>
##$VPLIST= <PPPPPPPPPPPPPPP>
##$VTLIST= <TTTTTTTTTTTTTTT>
##$WBST= 1024
##$WBSW= 4
##$XGAIN= (0..3)
0 0 0 0 
##$XL= 0
##$YL= 0
##$YMAX_a= 544732
##$YMIN_a= -707375
##$ZGOPTNS= <>
##$ZL1= 120
##$ZL2= 120
##$ZL3= 120
##$ZL4= 120
##$ABSF1= 15.48246
##$ABSF2= -2.569389
##$ABSG= 5
##$ABSL= 3
##$ALPHA= 0
##$AQORDER= 0
##$ASSFAC= 0
##$ASSFACI= 0
##$ASSFACX= 0
##$ASSWID= 0
##$AUNMP= <proc_1d>
##$AZFE= 0.1
##$AZFW= 0.1
##$BCFW= 0
##$BC_mod= 2
##$BYTORDP= 0
##$COROFFS= 0
##$CY= -3
##$DATMOD= 1
##$DC= 0
##$DFILT= <>
##$DTYPP= 0
##$F1P= 0
##$F2P= 0
##$FCOR= 1
##$FTSIZE= 16384
##$FT_mod= 6
##$GAMMA= 0
##$GB= 0
##$INTBC= 1
##$INTSCL= 3.241238e-09
##$ISEN= 128
##$LB= 0.25
##$LEV0= 0
##$LPBIN= 0
##$MAXI= 10000
##$MC2= 0
##$MEAN= 0
##$ME_mod= 0
##$MI= 1.114404
##$NCOEF= 0
##$NC_proc= -5
##$NLEV= 6
##$NOISF1= 3.799351
##$NOISF2= 2.8
##$NSP= 0
##$NTH_PI= 0
##$NZP= 0
##$OFFSET= 15.41304
##$PC= 1
##$PHC0= -1558.62
##$PHC1= 10.39228
##$PH_mod= 1
##$PKNL= yes
##$PPARMOD= 0
##$PSCAL= 0
##$PSIGN= 0
##$REVERSE= no
##$SF= 200.130021745662
##$SI= 16384
##$SIGF1= 3
##$SIGF2= 2
##$SINO= 0.751879
##$SIOLD= 32768
##$SREGLST= <19F.Aceton>
##$SSB= 0
##$STSI= 16384
##$STSR= 0
##$SW_p= 3612.71676300578
##$SYMM= 0
##$S_DEV= 0
##$TDeff= 16384
##$TDoff= 0
##$TI= <>
##$TILT= no
##$TM1= 0
##$TM2= 0
##$TOPLEV= 0
##$USERP1= <user>
##$USERP2= <user>
##$USERP3= <user>
##$USERP4= <user>
##$USERP5= <user>
##$WDW= 1
##$XDIM= 16384
##$YMAX_p= 282511177
##$YMIN_p= -254814
$$ End of Bruker specific parameters
$$ ---------------------------------
##NTUPLES= NMR SPECTRUM
##VAR_NAME=  FREQUENCY,     SPECTRUM/REAL,   SPECTRUM/IMAG
##SYMBOL=    X,             R,               I
##VAR_TYPE=  INDEPENDENT,   DEPENDENT,       DEPENDENT
##VAR_FORM=  AFFN,          ASDF,            ASDF
##VAR_DIM=   16384,         16384,           16384
##UNITS=     HZ,            ARBITRARY UNITS, ARBITRARY UNITS
##FACTOR=    0.220516191357247, 1,           1
##FIRST=     3084.61206261427, 0,            0
##LAST=      -528.104700391509, 0,           0
##MIN=       -528.104700391509, -254814,     0
##MAX=       3084.61206261427, 282511177,    0
$$ Real data points
##PAGE= N=1
##DATA TABLE= (X++(R..R)), XYDATA
$$ [...]
$$ plain form
7878 -9641 -37913 -73193 -129503 -95936 -32221 40535 32027 -33036 -84185 -164981 -125290 -72864
7866 -72864 -16410 49632 44494 -12445 29651 -44218 -69514 -46218 -28064 -104200 -54244 -43411
7854 -43411 -9491 -69934 -72058 -65490 -48767 -47118 -48074 -126345 -96449 -8331 -29767 -52598 -70596
7841 -70596 -50199 -5744 -55968 -104059 -29474 -130835 -169614 -134574 -144354 -117768 -100022 -83849
7829 -83849 -46095 -50089 -79888 -66557 -96057 -116848 -58572 -77070 -81551 -92699 -119438 -7068
7817 -7068 64849 -33581 -122657 -89264 -79946 -100967 -122413 -128864 -80569 -61911 -77724 -49755
7805 -49755 16887 -33777 -59541 -81458 -51422 -45072 -28251 -104563 -95874 -102251 -72515 -27283
7793 -27283 -55720 -28378 25668 6621 -27299 -95126 -40140 -41769 -73039 -60783 22635 1908
$$ packed form
7878i641k8272l5280n6310L3567O3715P2756q508o5063n1149q0796L9691N2426
7866g2864N6454O6042n138n6939M2096p3869k5296K3296J8154p6136M9956J0833
7854d3411L3920o0443k124O568J6723J649r56p8271K9896Q8118k1436k2831j7998
7841g0596K0397M4455n0224m8091P4585j01361l8779L5040r780K6586J7746J6173
7829h3849L7754l994k9799J3331k9500k0791N8276j8498m481j1148k6739J12370
7817g068P1917r8430q9076L3393R318k1021k1446o451M8295J8658j5813K7969
7805d9755O6642n0664k5764k1917L0036O350J6821p6312Q689o377K9736M5232
7793b7283k8437K7342N4046j9047l3920o7827N4986j629l1270J2256Q3418k0727
$$ plain form
7781 1908 -123083 -124925 -63039 -25444 8547 4703 -60297 -7171 43530 78951 24011 -82699
7769 -82699 1208 39793 -11439 -7236 21944 -4652 -8240 -18554 -74568 -40330 -41215 -29635 -99838
7756 -99838 -51533 -63278 -101121 -122999 -99141 -39999 -53538 -17015 9625 -55776 -10668 -19235
7744 -19235 -84511 -35003 6881 5056 -36434 4036 -84947 -165801 -183549 -134896 -79497 -66157
7732 -66157 -96278 -165275 -133716 -91870 -175479 -159774 -49377 -39280 -86304 21717 22722 9034
7720 9034 68786 35779 54294 29102 -2426 694 39174 -5406 57440 74631 56106 -73522
7708 -73522 -91892 -133193 -62624 -37198 -66852 -51830 -30270 -52772 -79745 -47081 -110817 -79505
7696 -79505 -107836 -189469 -104215 -80569 -61687 -113287 -122661 -81780 -53171 -96231 -141679 -92824
$$ packed form
7781A908j24991j842O1886L7595L3991l844o5000N3126N0701L5421n4940j06710
7769h2699Q3907L8585n1232M203K9180k6596l588j0314n6014L4238q85J1580p0203
7756i9838M8305j1745l7843k1878K3858N9142j3539L6523K6640o5401M5108q567
7744a9235o5276M9508M1884j825m1490M0470q8983q0854j7748M8653N5399J3340
7732f6157l0121o8997L1559M1846q3609J5705J10397J0097m7024J08021J005j3688
7720I034N9752l3007J8515k5192l1528L120L8480m4580O2846J7191j8525j29628
7708g3522j8370m1301P0569K5426k9654J5022K1560k2502k6973L2664o3736L1312
7696g9505k8331q1633Q5254K3646J8882n1600r374M0881K8609m3060m5448M8855
$$ plain form
7684 -92824 -125328 -151795 -94305 -50878 -127296 -74062 2255 -127717 -128354 -30270 -106256 -107338
7672 -107338 -97948 -118091 -58250 -60194 -114271 -59127 42093 -32108 -29929 45935 -21524 -39352
7660 -39352 -33123 -65779 -71336 -34358 -76780 -55720 15957 -18140 -28387 11827 -10373 38036
7648 38036 42315 52332 -11853 -90486 -99768 -113545 -38622 -69344 -139533 -101226 -113763 -55332
7636 -55332 -93805 -129954 -177101 -113804 -111574 -148817 -171466 -142884 -115176 -105286 -34063 12531
7624 12531 -45033 -56601 -83227 -84876 -72586 -36730 -71692 -121082 -130635 -97183 -138671 -123114
7612 -123114 -86101 -90775 -42288 -71740 -125476 -82452 -49349 -46967 -2319 -41042 -36448 -77865
7600 -77865 -106929 -56472 6658 3885 -90469 -97004 -44821 -96433 -89651 -42450 -20466 -57182
$$ packed form
7684i2824l2504k6467N7490M3427p6418N3234P6317j29972o37R8084p5986j082
7672a07338R390k0143N9841j944n4077N5144J01220p4201K179P5864o7459j7828
7660c9352O229l2656n557L6978m2422K1060P1677l4097j0247M0214k2200M8409
7648C8036M279J0017o4185p8633r282j3777P4923l0722p0189L8307j2537N8431
7636e5332l8473l6149m7147O3297K230l7243k2649K8582K7708R890P1223M6594
7624A2531n7564j1568k6626j649J2290L5856l4962m9390r553L3452m1488J5557
7612a23114L7013m674M8487k9452n3736M3024L3103K382M4648l8723M594m1417
7600g7865k9064N0457O3130k773r4354o535N2183n1612O782M7201K1984l6716
$$ plain form
7588 -57182 581 -57502 -113092 -166993 -186445 -73213 -56704 -87263 -125848 -183964 -168260 -96029
7576 -96029 6602 -60380 -113173 -33705 22524 -29408 -28243 43131 25235 -16456 -63827 -90428
7564 -90428 -58336 -79818 -145232 -100557 -112312 -118485 -79114 -114025 -108966 -107183 -64499 -114119
7552 -114119 -136518 -139723 -123035 -114147 -107848 -74546 -94425 -116907 2338 -62012 -131091 -47761
7540 -47761 -41798 -26723 -57517 -26637 -24577 -112299 -96836 -118466 -177323 -127567 -68691 -28056
7528 -28056 -47603 -101547 -84928 -1083 -25080 34012 44570 -67247 -32720 -25414 -92293 -23401
7516 -23401 -4066 24902 80238 -22798 -1052 -86887 -138087 -47232 -33451 -68021 29509 23873
7504 23873 -19158 -24517 -12664 -50195 -49278 12142 -31306 -36141 -27950 38508 -10964 -72007 -83832
$$ packed form
7588e7182N7763n8083n5590n3901j9452J13232J6509l0559l8585n8116J5704P2231
7576i6029J02631o6982n2793P9468N6229n1932J165P1374j7896m1691m7371k6601
7564i0428L2092k1482o5414M4675j1755o173L9371l4911N059J783M2684m9620
7552a14119k2399l205J6688Q888O299L3302j9879k2482J19245o4350o9079Q3330
7540d7761N963J5075l0794L0880K060q7722J5463k1630n8857M9756N8876M0635
7528b8056j9547n3944J6619Q3845k3997N9092J0558j11817L4527P306o6879O8892
7516b3401J9335K8968N5336j03036K1746q5835n1200R0855J3781l4570R7530n636
7504B3873m3031n359J1853l7531R17O1420m3448m835Q191O6458m9472o1043j1825
$$ plain form
7491 -83832 -19339 -69445 -69492 -26234 -14857 29580 -12633 -655 70211 75251 52625 71277 86356
7478 86356 37941 56236 100521 51552 49703 94067 59476 -7627 -21329 -9912 -58934 -35295
7466 -35295 -44419 -68749 -14162 -56910 -73920 -78155 -57798 -41019 -42915 -6850 11956 7784 25103
7453 25103 11566 -49918 -64790 -16836 -49040 35355 -36335 -37804 70579 100784 88915 31914
7441 31914 46704 3694 -15842 -4382 84284 82938 65524 37663 27346 1908 -26299 -119291
7429 -119291 -57235 -19150 28185 89179 106464 99589 38509 5964 -21123 -3003 -17764 -41030
7417 -41030 47208 -16175 -73693 -33029 -49278 -60793 -18831 16305 121479 150992 154112 95944
7405 95944 26584 -17368 42922 74267 15657 18512 49635 -4042 -8790 83233 89935 52904
$$ packed form
7491h3832O4493n0106m7M3258J1377M4437m2213J1978P0866N040k2626J8652J5079
7478H6356m8415J8295M4285m8969j849M4364l4591o7103j3702J1417m9022K3639
7466c5295r124k4330N4587m2748j7010m235K0357J6779j896L6065J8806m172J7319
7453B5103j3537o1484j4872M7954l2204Q4395p1690j469J08383L0205j1869n7001
7441C1914J4790m3010j9536J1460Q8666j346j7414k7861j0317k5438k8207r2992
7429a19291O2056L8085M7335O0994J7285o875o1080l2545k7087J8120j4761k3266
7417d1030Q8238o3383n7518M0664j6249j1515M1962L5136J05174K9513L120n8168
7405I5944o9360m3952O0290L1345n8610K855L1123n3677m748R2023O702l7031
$$ plain form
7393 52904 48263 66838 75598 20175 -36363 -49665 -60404 -30440 6272 -23170 -50897 -35413
7381 -35413 -11455 11644 -10280 -1021 -3347 58339 39459 25354 40915 3381 -79871 -127755
7369 -127755 -71593 35045 -36594 33924 -42050 -137022 -28528 -21849 -124976 -84486 -55539
7358 -55539 -78646 -42896 -70026 -70254 -74138 -104100 -138197 -183741 -125278 -131494 -158089 -151912 -254814
7345 -254814 -245393 -208954 -161318 -143412 -126681 -138223 -138426 -110151 -145028 -139789 -188996 -156645
7333 -156645 -104120 -76283 -76665 -107190 -149164 -121000 -70912 -28430 -2155 13860 -44265 -38259
7321 -38259 -106850 -127309 -124881 -64900 -56445 -88638 -39416 -35213 -12502 -14483 13129 36848 14449
7308 14449 -1036 -76261 -151547 -68641 -100270 -136866 -61976 -67518 -98251 -110762 -64780 -52474
$$ packed form
7393E2904m641J8575Q760n5423n6538j3302j0739K9964L6712k9442k7727J5484
7381c5413K3958K3099k1924R259k326O1686j8880j4105J5561l7534q3252m7884
7369a27755N6162J06638p1639P0518p5974r4972J08494O679j03127M0490K8947
7358e5539k3107L5750k7130k28l884k9962l4097m5544N8463o216k6595O177j02902
7345b54814R421L6439M7636J7906J6731j1542k03K8275l4877N239m9207L2351
7333a56645N2525K7837l82l0525m1974K8164N0088M2482K6275J6015n8125O006
7321c8259o8591k0459K428N9981Q455l2193M9222M203K2711j981K7612K3719k2399
7308A4449j5485p5225p5286Q2906l1629l6596P4890n542l0733j2511M5982J2306
$$ plain form
7296 -52474 -92283 -162952 -178289 -192988 -165519 -122751 -94420 -120371 -134102 -2585 -16082 -24994
7284 -24994 -87197 -109459 -144186 -74946 -43956 -33324 -11041 -8509 -44756 -33348 -13517 -28035
7272 -28035 59863 -19503 -135968 -133705 -173392 -180142 -75777 -39563 -57022 3455 3947 -57569
7260 -57569 -61898 -86468 -53033 7762 -44227 -49599 -72523 -63874 16745 77977 2272 -33716
7248 -33716 -13569 63870 54876 55465 19469 -3509 -14130 -62051 11628 -50797 -66250 11858
7236 11858 4882 -17016 12878 -10277 7037 20278 -35145 -21382 -62641 -74919 -49786 2020
7224 2020 -1718 -22204 -1250 -84039 -15205 2553 41031 60191 5937 25607 -18358 -103524
7212 -103524 -74103 -63044 -147014 -59362 -73600 -68225 -9281 -16305 -100525 -87120 -64848 -117574
$$ packed form
7296e2474l9809p0669j5337j4699K7469M2768K8331k5951j3731J31517j3497q912
7284b4994o2203k2262l4727O9240L0990J0632K2283K532l6247J1408J9831j4518
7272b8035Q7898p9366j16465K263l9687o750J04365L6214j7459O0477M92o1516
7260e7569m329k4570L3435O0795n1989n372k2924Q649Q0619O1232p5705l5988
7248c3716K0147P7439q994N89l5996k2978j0621m7921P3679o2425j5453P8108
7236A1858o976k1898K9894k3155J7314J3241n5423J3763m1259j2278K5133N1806
7224B020l738k0486K0954q2789O8834J7758L8478J9160n4254J9670m3965q5166
7212a03524K9421J1059q3970Q7652j4238N375N8944p024q4220J3405K2272n2726
$$ plain form
7200 -117574 -84723 -7962 55004 -88886 -116557 -52855 -8097 -58218 -155275 -159758 -77240 -25516
7188 -25516 -13313 47879 43878 66775 49149 -5700 -25014 -25989 -20957 33262 -5999 11986 67260
7175 67260 33123 9577 54378 48292 34161 124189 48377 17186 59553 52789 14727 -4737
7163 -4737 68436 68517 8884 31842 46796 100110 77469 3386 107358 127643 19418 21141
7151 21141 12791 -22436 -19274 -44833 -34848 -27813 -115407 -127542 -32166 -40855 47345 27400 -8295
7138 -8295 -18995 -65177 2029 -100052 -72013 -34875 -116364 -109961 -67449 -89245 -34493 -15365
7126 -15365 57136 -85678 -85013 -7534 -89784 -63127 21496 -66120 -107440 -145279 -158364 -167348
7114 -167348 -92039 -10341 -81938 -28418 -34032 -68289 -64841 23453 37323 327 -77836 -80091
$$ packed form
7200a17574L2851P6761O2966j43890k7671O3702M4758n0121r7057m483Q2518N1724
7188b5516J2203O1192m001K2897j7626n4849j9314r75N032N4219l9261J7985N5274
7175F7260l4137k3546M4801o086j4131R0028p5812l1191M2367o764l8062j9464
7163d737P3173Q1n9633K2958J4954N3314k2641p4083J03972K0285j08225J723
7151B1141q350l5227L162k5559R985P035q7594j2135R5376q689Q8200j9945l5695
7138h295j0700m6182O7206j02081K8039L7138q1489O403M2512k1796N4752J9128
7126a5365P2501j42814O65P7479q2250K6657Q4623q7616m1320l7839j3085q984
7114a67348P5309Q1698p1597N3520n614l4257L448Q8294J3870l6996p8163k255
$$ plain form
7102 -80091 -85905 -78056 -88876 -113313 -96069 -110376 -54569 -53322 -64222 -64758 -110634 -23428 46719
7089 46719 15310 10757 42382 -78169 -105852 -64354 -36666 5154 -12261 4132 9711 -14197
7077 -14197 -32694 -16201 -48271 -1060 -56968 -197837 -140705 -15162 1028 -98362 -82261
7066 -82261 -9788 62723 11719 -47037 -55087 -79744 -69498 -39383 -16782 -92589 -110587 26188
7054 26188 48018 -4360 -178 18109 -14256 -21374 -20306 32189 1354 -28901 -79270 -7021
7042 -7021 33045 -224 -13350 -76657 -96029 -43433 1600 -5101 12917 -12102 28309 86303
7030 86303 80374 86587 48311 4772 104881 87434 86142 127443 118707 98000 45294 -3968
7018 -3968 -58476 -102212 -48682 -9280 449 2140 -1373 20272 -72109 -28572 61096 34251 74950
$$ packed form
7102h0091n814P849j0820k4437J7244j4307N5807J247j0900n36m5876Q7206P0147
7089D6719l1409m553L1625j20551k7683M1498K7688M1820j7415J6393N579k3908
7077a4197j8497J6493l2070M7211n5908j40869N7132J25543J6190r9390J6101
7066h2261P2473P2511n1004n8756q050k4657J0246L0115K2601p5807j7998J36775
7054B6188K1830n2378M182J8287l2365p118J068N2495l0835l0255n0369P2249
7042g021M0066l3269j3126o3307j9372N2596M5033o701J8018k5019M0411N7994
7030H6303n929O213l8276m3539J00109j7447j292M1301q736k0707n2706m9262
7018c968n4508m3736N3530L9402R729J691l513K1645r2381M3537Q9668k6845M0699
$$ plain form
7005 74950 124973 76094 50064 55157 34705 26495 -64621 -3322 -5750 -5200 73320 -701 -63362
6992 -63362 35256 109016 132578 70316 67302 73712 103331 38430 115486 194158 240584 276068
6980 276068 327692 390251 440067 489874 499398 613487 623766 623541 670915 635806 551428 608906
6968 608906 594316 611614 616964 690483 697177 652460 679952 720511 730134 642058 540238 471240
6956 471240 382175 416922 405490 341676 320060 228687 186640 206784 237257 212507 142215 138857
6944 138857 119917 168685 262072 249923 224112 176053 165369 237275 178576 188456 193956 199780
6932 199780 189390 92162 63655 49523 32634 88594 112250 114263 92832 94199 119259 171611
6920 171611 159376 110647 193873 188644 180226 130561 127495 123211 202212 193202 205760 208259 168471
$$ packed form
7005G4950N0023m8879k6030N093k0452q210r1116O1299k428N50P8520p4021o2661
6992f3362R8618P3760K3562o2262l014O410K9619o4901P7056P8672M6426L5484
6980B76068N1624O2559M9816M9807R524J14089J0279k25M7374l5109q4378N7478
6968F08906j4590J7298N350P3519O694m4717K7492M0559R623q8076j01820o8998
6956D71240q9065L4747j1432o3814k1616r1373m2047K0144L0473k4750p0292l358
6944A38857j8940M8768R3387j2149k5811m8059j0684P1906n8699R880N500N824
6932A99780j0390r7228k8507j4132j6889N5960K3656K013k1431J367K5060N2352
6920A71611j2235m8729Q3226n229q418m9665l066m284P9001r010J2558K499l9788
$$ plain form
6907 168471 232273 324847 396961 384468 447370 389272 353953 418026 438625 469947 574643
6896 574643 546029 529435 532505 502477 451824 449414 494536 534250 541842 490140 451279 461523
6884 461523 456049 458429 439741 480518 443547 393147 362020 345799 351393 319888 309463 425199
6872 425199 467721 365115 396299 351382 382277 366586 327951 313351 283208 299231 375313
6861 375313 389051 485248 514429 475667 450330 424537 366610 382753 509296 457324 399241
6850 399241 415449 348285 425216 430673 376690 326584 430737 462597 475393 428691 463355 533229
6838 533229 542380 504141 425882 434984 452617 487189 495932 548144 495445 458601 549097 540440
6826 540440 598192 589744 570098 614740 550586 573022 636398 655795 622229 646018 595150 509256
$$ packed form
6907A68471O3802R2574P2114j2493O2902n8098l5319O4073K0599L1322J04696
6896E74643k8614j6594L070l0028n0653k410M5122L9714P592n1702l8861J0244
6884D61523n474K380j8688M0777l6971n0400l1127j6221N594l1505j0425J15736
6872D25199M2522j02606L1184m4917L0895j5691l8635j4600l0143J6023P6082
6861C75313J3738R6197K9181l8762k5337k5793n7927J6143J26543n1972n8083
6850C99241J6208o7164P6931N457n3983n0106J04153L1860J2796m6702L4664O9874
6838E33229R151l8239p8259R102J7633L4572Q743N2212n2699l6844R0496q657
6826E40440N7752q448j9646M4642o4154K2436O3376J9397l3566K3789n0868q5894
$$ plain form
6814 509256 459398 554681 564250 480228 484595 502402 557184 597108 595233 575849 523800 487211
6802 487211 485226 448374 482846 585386 516362 500591 451562 546086 531326 431007 473483
6791 473483 566633 598147 580095 540077 617588 695703 658938 673810 726632 750290 712821 628188
6779 628188 732433 759746 767652 793260 725751 733770 840894 872576 856296 884941 908157 902334
6767 902334 907525 925430 951149 892164 936709 976696 949132 958880 889983 1008141 1034321 1100993
6755 1100993 1169242 1128652 1095382 1085596 1060576 1120447 1157455 1173727 1279300 1297557 1242388
6744 1242388 1294067 1366482 1407603 1465181 1592024 1587666 1617473 1736061 1816981 1831028 1861220
6733 1861220 1906704 1942043 1992404 2012570 2113414 2217978 2281624 2369195 2375595 2357004 2390847
$$ packed form
6814E09256m9858R5283R569q4022M367J7807N4782L9924j875j9384n2049l6589
6802D87211j985l6852L4472J02540o9024j5771m9029R4524j4760j00319M2476
6791D73483R3150L1514j8052m0018P7511P8115l6765J4872N2822K3658l7469q4633
6779F28188J04245K7313P906K5608o7509Q019J07124L1682j6280K8645K3216n823
6767I02334N191J7905K5719n8985M4545L9987k7564R748o8897J18158K6180O6672
6755A100993O8249m0590l3270r786k5020N9871L7008J6272J05573J8257n5169
6744A242388N1679P2415M1121N7578J26843m358K9807J18588Q0920J4047L0192
6733A861220M5484L5339N0361K0166J00844J04564O3646Q7571O400j8591L3843
$$ plain form
6722 2390847 2462748 2536085 2578301 2555360 2651365 2711906 2667066 2710115 2774679 2818890 2865592
6711 2865592 2902691 2987068 3067678 3134838 3217344 3285430 3387383 3490211 3608559 3677424 3852550
6700 3852550 4020270 4098670 4282907 4508361 4679691 4844440 5016814 5199680 5398032 5613866
6690 5613866 5783503 5994131 6311842 6586575 6955165 7492387 7846078 8248105 8724971 9286659
6680 9286659 9854025 10544218 11340082 12132655 13081328 14196480 15499052 16858193 18261536
6671 18261536 19881475 21792336 23918212 26273260 29031092 32274014 36191047 40782923
6663 40782923 46289392 53152215 61429788 70865018 80672112 90767604 101532180 112211761
6655 112211761 121042377 126202342 125783521 121169403 116291254 114025193 114601643 116866350
$$ packed form
6722B390847P1901P3337M2216k2941R6005O0541m4840M3049O4564M4211M6702
6711B865592L7099Q4377Q0610O7160Q2506O8086J01953J02828J18348O8865J75126
6700C852550J67720P8400J84237K25454J71330J64749J72374J82866J98352K15834
6690E613866J69637K10628L17711K74733L68590N37222L53691M02027M76866N61688
6680I286659N67366O90193P95864P92573R48673J115152J302572J359141J403343
6671A8261536J619939J910861K125876K355048K757832L242922L917033M591876
6663D0782923N506469O862823Q277573R435230R807094J0095492J0764576J0679581
6655A12211761Q830616N159965m18821m614118m878149k266061N76450K264707
$$ plain form
6647 116866350 120372358 124818648 129863514 133937883 134695377 129993091 119641385 106891431
6639 106891431 95197567 85371287 77058820 70040377 64095940 58858701 54039540 49611060
6631 49611060 45527449 41883707 38611060 35739052 33267230 31032368 28944817 27051693
6623 27051693 25375063 23862507 22441530 21076269 19827745 18754993 17800600 16913069
6615 16913069 16055799 15380509 14640584 13935698 13342842 12688775 12128921 11577932 11076335
6606 11076335 10639723 10220920 9764697 9384061 9081441 8772001 8435349 8154763 7841960
6597 7841960 7599282 7290276 7061746 6801139 6582817 6344868 6127721 5895618 5674542 5522386
6587 5522386 5375358 5357915 5159747 4927527 4740020 4630553 4529274 4398988 4264118 4209925
$$ packed form
6647A16866350L506008M446290N044866M074369P57494m702286j0351706j2749954
6639A06891431j1693864r826280q312467p018443n944437n237239m819161m428480
6631D9611060m083611l643742l272647k872008k471822k234862k087551j893124
6623B7051693j676630j512556j420977j365261j248524j072752r54393q87531
6615A6913069q57270o75290p39925p04886n92856o54067n59854n50989n01597
6606A1076335m36612m18803m56223l80636l02620l09440l36652k80586l12803
6597G841960k42678l09006k28530k60607k18322k37949k17147k32103k21076j52156
6587E522386j47028j7443j98168k32220j87507j09467j01279j30286j34870n4193
$$ plain form
6577 4209925 4039299 3955546 3937746 3842486 3676963 3570230 3506370 3460180 3317409 3218053 3188797
6566 3188797 3082876 3092362 2999516 2984938 2917168 2771825 2663812 2630294 2613604 2578456 2557748
6555 2557748 2453420 2342592 2285027 2271360 2241353 2275948 2299750 2314227 2219740 2207076 2119420
6544 2119420 2019253 2010531 1914797 1879235 1933301 1915684 1901552 1911054 1794318 1661305 1681387
6533 1681387 1704220 1651285 1592832 1629980 1631034 1528554 1523170 1562596 1507359 1524933 1469811 1437918
6521 1437918 1453719 1348135 1291594 1265803 1284688 1283628 1252714 1193608 1194899 1255027 1286380 1304609
6509 1304609 1308566 1273056 1241474 1239957 1298631 1233448 1186648 1113274 1176505 1234576 1197797 1180383
6497 1180383 1172489 1152037 1062978 1086546 1140010 1089091 1070703 1037726 1002884 914661 993091 965420
$$ packed form
6577D209925j70626q3753j7800r5260j65523j06733o3860m6190j42771r9356k9256
6566C188797j05921R486r2846j4578o7770j45343j08013l3518j6690l5148k0708
6555B557748j04328j10828n7565j3667l0007L4595K3802J4477r4487j2664q7656
6544B119420j00167q722r5734l5562N4066j7617j4132R502j16736j33013K0082
6533A681387K2833n2935n8453L7148J054j02480n384L9426n5237J7574n5122l1893
6521A437918J5801j05584n6541k5791J8885j060l0914n9106J291O0128L1353J8229
6509A304609L957l5510l1582j517N8674o5183m6800p3374O3231N8071l6779j7414
6497A180383p894k0452q9059K3568N3464n0919j8388l2977l4842q8223P8430k7671
$$ plain form
6485 965420 995253 948564 867126 807238 828644 845317 741013 738961 735687 720836 680970 690716
6473 690716 711893 684478 667293 703398 687755 663289 642575 616577 681484 693450 626335 575820
6461 575820 551785 621456 554657 537903 502531 469523 515983 582946 533952 582968 551009 591354
6449 591354 647621 608015 612930 597646 571051 563690 641470 609358 545436 525529 619975 648101
6437 648101 580029 529250 518676 618215 608684 574224 610026 639918 664900 629954 614284 613590
6425 613590 662109 692840 751353 814922 826799 864802 870625 848346 882573 869896 850956 908904
6413 908904 947503 922978 903060 885195 921673 937748 948199 986343 908047 898201 915776 873928
6401 873928 907665 948587 944886 930436 923835 922806 901743 941993 871625 837905 865626 862789
$$ packed form
6485I65420K9833m6689q1438n9888K1406J6673j04304k052l274j4851l9866R746
6473F90716K1177k7415j7185L6105j5643k4466k0714k5998O4907J1966o7115n0515
6461E75820k4035O9671o6799j6754l5372l3008M6460O6963m8994M9016l1959M0345
6449E91354N6267l9606M915j5284k6595p361P7780l2112o3922j9907R4446K8126
6437F48101o8072n0779j0574R9539r531l4460L5802K9892K4982l4946j5670o94
6425F13590M8519L0731N8513O3569J1877L8003N823k2279L4227j2677j8940N7948
6413I08904L8599k4525j9918j7865L6478J6075J0451L8144p8296r846J7575m1848
6401H73928L3737M0922l701j4450o601j029k1063M0250p0368l3720K7721k837
$$ plain form
6389 862789 865870 865162 838126 837950 859608 801107 788131 738477 698809 671509 615438 605333 532088
6376 532088 538056 510762 526443 493748 520409 482951 351055 288172 327887 284379 316455 394407
6364 394407 378425 343380 369816 299268 274474 262055 320888 402590 369022 332118 329278 313121
6352 313121 281735 265479 284820 235027 255126 271394 211150 316973 304071 359182 284291
6341 284291 302042 350767 375176 371534 484891 596050 603745 691600 723837 733176 735913 744405
6329 744405 753128 670667 633975 680360 755538 698459 728317 728108 880569 898854 834129 839604
6317 839604 760324 715625 592947 587265 567873 474488 514115 517404 478411 455805 379289 352671
6305 352671 400557 433622 383255 384761 363955 313496 296755 202774 111485 220689 323316
$$ packed form
6389H62789L081p08k7036j76K1658n8501j2976m9654l9668k7300n6071j0105p3245
6376E32088N968k7294J5681l2695K6661l7458j31896o2883L9715m3508L2076P7952
6364C94407j5982l5045K6436p0548k4794j2419N8833Q1702l3568l6904k840j6157
6352C13121l1386j6256J9341m9793K0099J6268o0244J05823j2902N5111p4891
6341B84291J7751M8725K4409l642J13357J11159P695Q7855L2237R339K737Q492
6329G44405Q723q2461l6692M6385P5178n7079K9858k09J52461J8285o4725N475
6317H39604p9280m4699j22678n682j9392r3385L9627L289l8993k2606p6516k6618
6305C52671M7886L3065n0367J506k0806n0459j6741r3981r1289J09204J02627
$$ plain form
6294 323316 261424 227450 190856 219645 237064 198776 155467 129194 103976 65946 110638 99851
6282 99851 108358 126312 176215 193702 113956 133340 169475 226720 149420 48256 66135 34561
6270 34561 51083 114132 187916 135849 147783 205325 225250 208142 212298 199979 191302 167538
6258 167538 145410 138082 185748 231005 153902 177491 149339 145680 -1800 8346 -7590 -2378
6246 -2378 135128 120844 94112 109251 63871 87510 123844 112382 42052 8306 36778 83257
6234 83257 135640 169724 135019 82331 71691 9672 62610 107623 61131 65923 114401 56209
6222 56209 71725 113688 120971 81486 124576 133700 114060 66464 66074 85046 87447 150107 206024
6209 206024 206524 88724 88944 84621 97257 178508 142550 153741 55657 118188 253959 186913
$$ packed form
6294C23316o1892l3974l6594K8789J7419l8288m3309k6273k5218l8030M4692j0787
6282I9851Q507J7954M9903J7487p9746J9384L6135N7245p7300j01164J7879l1574
6270C4561J6522O3049P3784n2067J1934N7542J9925j7108M156j2319q677k3764
6258A67538k2128p328M7666M5257p7103K3589k8152l659j47480J0146j5936N212
6246b378J37506j4284k6732J5139m5380K3639L6334j1462p0330l3746K8472M6479
6234H3257N2383L4084l4705n2688j0640o2019N2938M5013m6492M792M8478n8192
6222E6209J5516M1963P283l9485M3090R124j9640m7596l90J8972K401O2660N5917
6209B06024N00j17800K20m323J2636Q1251l5958J1191r8084O2531J35771o7046
$$ plain form
6197 186913 166090 125748 146520 146320 122067 115804 53461 104004 67194 91277 32156 -28413
6185 -28413 56848 105812 -70638 -5276 41486 39381 68959 147923 68319 58467 43504 109997
6173 109997 166794 143197 58019 98615 170355 73696 147903 63736 44265 -8667 -492 49784
6161 49784 111148 22138 95280 102963 91778 105607 126331 195702 196070 164693 198646 183565
6149 183565 192416 184953 116360 151440 94063 134401 217252 160265 157528 157296 150798 102591 119390
6136 119390 143757 135109 69967 44308 14614 25080 27202 68270 95371 31270 41096 43124
6124 43124 47116 52297 118239 76650 41005 135546 112344 108639 117392 17731 -52686 -26700 23350
6111 23350 -32306 -14178 7134 89205 103444 56085 -33699 -34921 42876 20561 72217 177087
$$ packed form
6197A86913k0823m0342K0772k00k4253o263o2343N0543l6810K4083n9121o0569
6185b8413Q5261M8964j76450O5362M6762k105K9578P8964p9604r852j4963O6493
6173A09997N6797k3597q5178M0596P1740r6659P4207q4167j9471n2932Q175N0276
6161D9784O1364q9010P3142P683j1185J3829K0724O9371L68l1377L3953j5081
6149A83565Q851p463o8593L5080n7377M0338Q2851n6987k737k32o498m8207J6799
6136A19390K4367q648o5142k5659k9694J0466K122M1068K7101o4101R826K028
6124D3124L992N181O5942m1589l5645R4541k3202l705Q753r9661p0417K5986N0050
6111B3350n5656J8128K1312Q2071J4239m7359q9784j222P7797k2315N1656J04870
$$ plain form
6099 177087 125354 46254 31372 47030 21788 26361 107674 -1104 -80437 -57176 8897 57015
6087 57015 96646 -3761 37703 77197 57710 -11708 -26966 -30663 -92820 -70149 -2341 -96677
6075 -96677 30721 68131 10984 62501 38790 -2370 -36181 -66154 5745 16542 -60416 -30950
6063 -30950 32843 94399 23482 -45976 -28954 -21956 35906 -3259 -101073 -98157 -34571 47569
6051 47569 50985 91376 -46068 -8135 32695 5104 -74841 -53801 -22336 87459 114722 107012
6039 107012 -15829 -26841 -2587 43558 39059 49874 877 -3676 89675 106300 100681 -17172
6027 -17172 -40256 -6458 50903 98454 98704 33998 -1411 -82078 2121 109746 87780 78900
6015 78900 86575 125738 126334 45779 28868 48751 43657 71625 106416 84743 149526 134564 152412
$$ packed form
6099A77087n1733p9100j4882J5658k5242M573Q1313j08778p9333K3261O6073M8118
6087E7015L9631j00407M1464L9494j9487o9418j5258l697o2157K2671O7808r4336
6075i6677J27398L7410n7147N1517k3711m1160l3811k9973P1899J0797p6958K9466
6063c0950O3793O1556p0917o9458J7022O998N7862l9165r7814K916O3586Q2140
6051D7569L416M0391j37444L7933M0830k7591p9945K1040L1465J09795K7263p710
6039A07012j22841j1012K4254M6145m499J0815m8997m553R3351J6625n619j17853
6027a7172k3084L3798N7361M7551K50o4706l5409q0667Q4199J07625k1966q880
6015G8900P675L9163N96q0555j6911J9883n094K7968L4791k1673O4783j4962J7848
$$ plain form
6002 152412 168521 40799 51688 94993 36469 126382 134347 90776 92282 96060 101758 117995
5990 117995 103808 115932 141424 107446 87346 66366 76683 -34886 -117198 -101432 53940
5979 53940 196328 177712 160202 84308 135754 69115 -38542 -60715 -1135 57629 81069
5968 81069 91097 96127 63321 56424 118439 86158 14417 -63866 -49154 10195 7222 18604
5956 18604 2861 2922 -39171 -59225 -28357 -17208 96663 117615 74973 63141 85949 8072
5944 8072 32108 90591 14226 -18618 -18459 43470 80540 92345 7372 -7410 79282 100372
5932 100372 36949 42732 -43891 -53558 -46033 81340 111610 94570 136755 60159 93118 54841
5920 54841 97393 90412 128428 57502 89612 164368 230317 257115 189694 138639 156528 165125
$$ packed form
6002A52412J6109j27722J0889M3305n8524Q9913P965m3571J506L778N698J6237
5990A17995j4187J2124K5492l3978k0100k0980J0317j11569q2312J5766J55372
5979E3940J42388j8616j7510p5894N1446o6639j07657k2173N9580N8764K3440
5968H1069J0028N030l2806o897O2015l2281p1741p8283J4712N9349k973J1382
5956A8604j5743O1m2093k0054L0868J1149J13871K0952m2642j1832K2808p7877
5944H072K4036N8483p6365l2844J59O1929L7070J1805q4973j4782Q6692K1090
5932A00372o3423N783q6623r667P525J27373L0270j7040M2185p6596L2959l8277
5920E4841M2552o981L8016p0926L2110P4756O5949K6798o7421n1055J7889Q597
$$ plain form
5908 165125 137791 165689 240609 300546 295558 204831 187827 154778 168657 132043 92597 200627
5896 200627 274126 226875 205968 243477 201739 236994 221312 109230 125794 138458 156679
5885 156679 189941 183190 102190 98007 70128 23606 69985 62635 74207 77086 39134 114287
5873 114287 24254 14877 75352 122482 97440 46605 170137 120154 29571 73135 95506 104634
5861 104634 128458 67291 33161 56635 46891 91955 118461 59847 45668 94970 90119 24316
5849 24316 -7902 -5414 51789 -24872 25163 74116 154263 139747 138529 189691 150186 120290
5837 120290 189753 78928 32607 54608 66567 126832 193157 194723 198393 124112 84557 89257
5825 89257 148139 196535 129463 126001 160040 185383 122559 35788 74529 75186 19162 63113
$$ packed form
5908A65125k7334K7898P4920N9937m988r0727j7004l3049J3879l6614l9446J08030
5896B00627P3499m7251k0907L7509m1738L5255j5682j12082J6564J2664J8221
5885A56679L3262o751q1000m183k7879m6522M6379p350J1572K879l7952P5153
5873A14287r0033r377O0475M7130k5042n0835J23532m9983r0583M3564K2371R128
5861A04634K3824o1167l4130K3474r744M5064K6506n8614j4179M9302m851o5803
5849B4316l2218K488N7203p6661N0035M8953Q0147j4516j218N1162l9505k9896
5837A20290O9463j10825m6321K2001J1959O0265O6325J566L670p4281l9555M700
5825H9257N8882M8396o7072l462L4039K5343o2824q6771L8741O57n6024M3951
$$ plain form
5813 63113 141493 149384 74010 126857 193629 139422 101389 108625 95390 56810 52530 21474
5801 21474 29379 33618 92591 115493 84156 100576 109933 104994 69831 30502 62901 110086 79218
5788 79218 116176 117154 145307 166455 101011 151027 119776 77245 76881 85218 99929 149682 109482
5775 109482 150347 209925 141758 188277 215177 188952 143582 128435 114747 160596 71139 123028
5763 123028 176500 220382 56896 10431 65302 90847 94853 87937 139598 154658 103791 127230
5751 127230 156926 133213 139563 58353 -18423 11928 -7933 23292 126415 130671 173774 193549
5739 193549 225903 226884 149514 216766 219767 148498 82716 63733 103421 135497 182464 66097
5727 66097 26118 36783 77342 76600 96300 75065 41914 -4254 103207 103698 71705 122695
$$ packed form
5813F3113P8380P891p5374N2847O6772n4207l8033P236j3235l8580m280l1056
5801B1474P905M239N8973K2902l1337J6420R357m939l5163l9329L2399M7185l0868
5788G9218L6958R78K8153K1148o5444N0016l1251m2531l64Q337J4711M9753m0200
5775A09482M0865N9578o8167M6519K6900k6225m5370j5147j3688M5849q9457N1889
5763A23028N3472M3882j63486m6465N4871K5545M006o916N1661J5060n0867K3439
5751A27230K9696k3713O350q1210p6776L0351j9861L1225J03123M256M3103J9775
5739A93549L2354R81p7370O7252L001p1269o5782j8983L9688L2076M6967j16367
5727F6097l9979J0665M0559p42J9700k1235l3151m6168J07461M91l1993N0990
$$ plain form
5715 122695 81469 209387 212359 203373 251782 230914 103156 87176 110453 87634 138288 135461
5703 135461 86681 129260 133312 126298 148589 194903 135599 108461 32673 18562 22525 49559
5691 49559 101305 108744 103981 105298 136786 145102 148527 249610 274970 137460 157924 80566
5679 80566 61876 109600 97402 47474 160186 194343 119219 28479 73936 193767 54036
5668 54036 73844 73472 108055 159138 76581 69280 186629 199760 145356 175109 158831 218222
5656 218222 205059 145262 140361 128950 88273 160338 113236 110331 57922 50701 73636 120583
5644 120583 173628 114417 107744 24583 113367 118089 158612 111485 53492 113173 69770 47412
5632 47412 14938 44685 37622 91667 37083 64543 104109 106833 71749 77647 38934 8504
$$ packed form
5715A22695m1226J27918K972q986M8409k0868j27758j5980K3277k2819N0654k827
5703A35461m8780M2579M052p014K2291M6314n9304k7138p5788j4111L963K7034
5691D9559N1746P439m763J317L1488Q316L425J01083K5360j37510K0464p7358
5679H0566j8690M7724j2198m9928J12712L4157p5124r0740M5457J19831j39731
5668E4036J9808l72L4583N1083q2557p301J17349J3131n4404K9753j6278N9391
5656B18222j3163n9797m901j1411m0677P2065m7102k905n2409p221K2935M6947
5644A20583N3045n9211o673q3161Q8784M722M0523m7127n7993N9681m3403k2358
5632D7412l2474K9747p063N4045n4584K7460L9566K724l5084N898l8713l0430
$$ plain form
5620 8504 37879 112233 165912 129002 89717 53183 49494 48603 74853 38776 6203 77684 82153
5607 82153 35397 82161 75495 2269 80733 134175 78214 33938 58586 83676 121146 117008
5595 117008 103373 50661 60425 101959 120378 144704 148218 199012 130023 54055 137696 137111
5583 137111 155486 179228 104270 136601 163432 105195 11616 46235 41858 81553 105489 60166
5571 60166 4670 43662 70703 141417 115910 95534 53415 101995 93114 125710 138604 137612
5559 137612 198852 209063 141669 117963 90617 143729 40536 41182 83402 131892 168716 91977
5547 91977 55371 74019 120292 58512 127095 47020 50461 50463 27156 93366 108551 130226 134879
5534 134879 78729 65271 76538 183025 158633 175554 189425 130139 71746 62046 84249 62078
$$ packed form
5620H504K9375P4354N3679l6910l9285l6534l689q91K6250l6077l2573P1481M469
5607H2153m6756M6764o666p3226P8464N3442n5961m4276K4648K5090L7470m138
5595A17008j3635n2712R764M1534J8419K4326L514N0794o8989p5968Q3641n85
5583A37111J8375K3742p4958L2331K6831n8237r3579L4619m377L9695K3936m5323
5571F0166n5496L8992K7041P0714k5507k0376m2119M8580q881L2596J2894r92
5559A37612O1240J0211o7394k3706k7346N3112j03193O46M2220M8490L6824p6739
5547I1977l6606J8648M6273o1780O8583q0075L441Kk3307O6210J5185K1675M653
5534A34879n6150j3458J1267J06487k4392J6921J3871n9286n8393r700K2203k2171
$$ plain form
5522 62078 95259 140609 108749 77722 56258 59832 32247 154051 148870 174640 213924 207633
5510 207633 203804 134684 111689 102805 121169 153918 135560 65875 -18850 45803 57488 85263
5498 85263 113491 86678 83323 116833 147041 152104 127278 73632 76334 -12119 33600 79933
5486 79933 31734 40180 140594 47100 52050 49786 25865 30473 43929 -13955 61328 141652
5474 141652 101801 76038 101609 94690 4068 86874 33686 13180 107067 96095 162757 142905
5462 142905 69007 113128 236097 239205 139986 95632 102987 171626 100667 -1129 93691 94555
5450 94555 142486 110089 104213 95642 10756 113170 209337 213758 116602 90552 68982 91577
5438 91577 80454 71364 55105 19821 -2726 11117 -26720 49086 121307 68208 41307 30441
$$ packed form
5522F2078L3181M5350l1860l1027k1464L574k7585J21804n181K5770L9284o291
5510B07633l829o9120k2995q884J8364L2749j8358o9685q4725O4653J1685K7775
5498H5263K8228k6813l355L3510L0208N063k4826n3646K702q8453M5719M6333
5486G9933m8199Q446J00414r3494M950k264k3921M608J3456n7884P5283Q0324
5474A41652l9851k5763K5571o919r0622Q2806n3188k0506R3887j0972O6662j9852
5462A42905p3898M4121J22969L108r9219m4354P355O8639p0959j01796R4820Q64
5450I4555M7931l2397n876q571q4886J02414R6167M421r7156k6050k1570K2595
5438I1577j1123r090j6259l5284k2547J3843l7837P5806P2221n3099k6901j0866
$$ plain form
5426 30441 62222 55760 57538 94951 172801 51200 35998 76333 62709 65146 99928 111204
5414 111204 89208 25970 44677 -2537 5787 72744 52028 84713 52441 116439 123973 94946
5402 94946 94799 66268 24423 68852 65245 23982 89164 79321 139356 125805 33889 -6894 15002
5389 15002 39534 53822 73282 66530 111764 139264 188841 134529 120653 98029 107132 110431
5377 110431 55337 -27330 4028 -79669 -27436 32813 19801 58419 76358 41851 54728 125303
5365 125303 107072 49086 82354 46655 40538 107286 66644 62307 83205 89545 59811 62363
5353 62363 73666 77110 109779 80725 53562 106506 122568 88298 150002 216315 228063 161523
5341 161523 176906 210044 217046 169731 87442 81990 96053 138009 142184 133318 202708 116309
$$ packed form
5426C0441L1781o462J778L7413P7850j21601j5202M0335j3624K437L4782J1276
5414A11204k1996o3238J8707m7214Q324O6957k0716L2685l2272O3998P534k9027
5402I4946j47k8531m1845M4429l607m1263O5182r843O0035j3551r1916m0783K1896
5389A5002K4532J4288J9460o752M5234K7500M9577n4312j3876k2624R103L299
5377A10431n5094q2667L1358q3697N2233O0249j3012L8618J7939l4507J2877P0575
5365A25303j8231n7986L3268l5699o117O6748m0642m337K0898O340k9734K552
5353F2363J1303L444L2669k9054k7163N2944J6062l4270O1704O6313J1748o6540
5341A61523J5383L3138P002m7315q2289n452J4063M1956M175q866O9390q6399
$$ plain form
5329 116309 119317 144787 36359 -40543 -14158 111158 93117 107587 19574 -42170 -35424 35656
5317 35656 116400 161971 102092 123820 109670 47798 -17196 -22534 40579 124880 118499 126378
5305 126378 109101 50297 39436 74561 147272 92739 123315 206339 160056 86578 61238 99148
5293 99148 146971 70283 91382 81064 133194 161710 205489 173478 126587 66485 14652 64010
5281 64010 1220 10795 58312 77301 112756 132914 145545 160118 124405 107298 115910 151357
5269 151357 111213 159658 144318 184105 127263 91445 137134 153089 101323 100244 102678 168765
5257 168765 102041 73959 153837 183390 88723 137954 219119 242293 216143 317864 319961 281202
5245 281202 315248 233085 209004 165360 106958 152652 250675 265532 231803 156335 166994 174979
$$ packed form
5329A16309L008K5470j08428p6902K6385J25316j8041J4470q8013o1744O746P1080
5317C5656Q0744M5571n9879K1728j4150o1872o4994n338O3113Q4301o381P879
5305A26378j7277n8804j0861L5125P2711n4533L0576Q3024m6283p3478k5340L7910
5293I9148M7823p6688K1099j0318N2130K8516M3779l2011m6891o0102n1833M9358
5281F4010o2790R575M7517J8989L5455K0158J2631J4573l5713j7107Q612L5447
5269A51357m0144M8445j5340L9787n6842l5818M5689J5955n1766j079K434O6087
5257A68765o6724k8082P9878K9553r4667M9231Q1165K3174k6150J01721K097l8759
5245B81202L4046q2163k4081m3644n8402M5694R8023J4857l3729p5468J0659P985
$$ plain form
5233 174979 240491 204026 314572 236668 166071 231692 182557 212415 225082 184249 248774
5222 248774 193716 211500 252355 160778 245798 291883 272737 328035 190306 245071 309568
5211 309568 282176 215709 194771 220315 189403 293901 321979 272536 302703 265623 361941
5200 361941 428654 365163 355615 258183 245178 342605 400385 365588 316686 264781 248077 327981
5188 327981 400902 353344 402104 435401 462941 455266 399878 439338 465884 448055 495944 518944
5176 518944 546568 550193 605639 625874 589308 620897 577867 559335 604337 716602 658645 707318
5164 707318 768806 752736 685163 719639 777974 685161 677857 687390 764688 828264 790924 768086
5152 768086 716255 739664 763258 878827 971366 1040883 981216 971460 964588 975246 973441 932882
$$ packed form
5233A74979O5512l6465J10546p7904p0597O5621m9135K9858J2667m0833O4525
5222B48774n5058J7784M0855r1577Q5020M6085j9146N5298j37729N4765O4497
5211C09568k7392o6467k0938K5544l0912J04498K8078m9443L0167l7080R6318
5200C61941O6713o3491r548r7432j3005R7427N7780l4797m8902n1905j6704P9904
5188C27981P2921m7558M8760L3297K7540p675n5388L9460K6546j7829M7889K3000
5176E18944K7624L625N5446K0235l6566L1589m3030j8532M5002J12265n7957M8673
5164G07318O1488j6070o7573L4476N8335r2813p304R533P7298O3576l7340k2838
5152G68086n1831K3409K3594J15569R2539O9517n9667r756o872J0658j805m0559
$$ plain form
5140 932882 874712 940598 925512 969454 1053495 998222 942314 948397 940909 982178 1013006 987395
5128 987395 953954 963566 1089321 1093140 1099674 1089852 1104648 1108366 1145855 1095672 1045875 1093806
5116 1093806 1148143 1154729 1190676 1077813 1154179 1222634 1246644 1211437 1211216 1204469 1172774 1184134
5104 1184134 1238942 1247739 1278668 1239879 1161874 1183235 1167845 1158781 1199306 1218605 1184565 1139437
5092 1139437 1209797 1254653 1196104 1166150 1222988 1223129 1142610 1103521 1171880 1222858 1248742 1204005
5080 1204005 1191961 1196879 1279681 1317305 1306030 1332652 1241084 1259214 1333838 1366768 1288447 1180193
5068 1180193 1222351 1272735 1309425 1254750 1278262 1319846 1216650 1264975 1263398 1229301 1236501 1250063
5056 1250063 1347279 1385237 1353152 1303677 1338351 1307509 1316282 1285816 1323053 1353480 1319744 1345817
$$ packed form
5140I32882n8170O5886j5086M3942Q4041n5273n5908O083p488M1269L0828k5611
5128I87395l3441R612J25755L819O534r822J4796L718L7489n0183m9797M7931
5116A093806N4337O586L5947j12863P6366O8455K4010l5207k21o747l1695J1360
5104A184134N4808Q797L0929l8789p8005K1361j5390r064M0525J9299l4040m5128
5092A139437P0360M4856n8549k9954N6838J41q0519l9089O8359N0978K5884m4737
5080A204005j2044M918Q2802L7624j1275K6622r1568J8130P4624L2930p8321j08254
5068A180193M2158N0384L6690n4675K3512M1584j03196M8325j577l4097P200J3562
5056A250063R7216L7958l2085m9475L4674l0842Q773l0466L7237L0427l3736K6073
$$ plain form
5044 1345817 1364298 1462307 1433288 1418618 1411925 1521033 1534862 1547068 1595417 1574305 1537422
5033 1537422 1582245 1652234 1736000 1754080 1743372 1760734 1710163 1750696 1753002 1821530 1876662 1931750
5021 1931750 1959768 2010515 2092784 2046859 2062512 2102766 2079468 2077520 2152224 2180565 2237480 2283267
5009 2283267 2360445 2437433 2371475 2416876 2525340 2533871 2593042 2634457 2658645 2680424 2650684
4998 2650684 2620930 2679424 2680312 2739392 2733110 2827775 2792982 2776528 2858236 2950809 3050812 3082315
4986 3082315 3083968 3086144 3037366 3121552 3170717 3199139 3254865 3245909 3325627 3380841 3386336 3463838
4974 3463838 3553703 3626718 3618143 3625567 3745656 3811993 3832150 3845952 3924376 3992799 4035246 4159766
4962 4159766 4249607 4217160 4323124 4420341 4479589 4546509 4614061 4637038 4689601 4757963 4823474
$$ packed form
5044A345817J8481R8009k9019j4670o693J09108J3829J2206M8349k1112l6883
5033A537422M4823O9989Q3766J8080j0708J7362n0571M0533K306O8528N5132N5088
5021A931750K8018N0747Q2269m5925J5653M0254k3298j948P4704K8341N6915M5787
5009B283267P7178P6988o5958M5401J08464Q531N9171M1415K4188K1779k9740
4998B650684k9754N8494Q88N9080o282R4665l4793j6454Q1708R2573J00003L1503
4986C082315J653K176m8778Q4186M9165K8422N5726q956P9718N5214N495P7502
4974C463838Q9865P3015q575P424J20089O6337K0157J3802P8424O8423M2447J24520
4962D159766Q9841l2447J05964R7217N9248O6920O7552K2977N2563O8362O5511
$$ plain form
4951 4823474 4871431 4924726 4986384 5048050 5170827 5306902 5316604 5437746 5460913 5459719 5527793
4940 5527793 5641755 5626812 5748231 5836163 5958589 6088845 6185759 6364374 6550404 6662921
4930 6662921 6730693 6812723 6975530 7137793 7333760 7438844 7558075 7739769 7840753 8120764
4920 8120764 8373489 8613433 8853403 9211542 9496139 9819377 10171316 10525911 10842793 11256570
4910 11256570 11746159 12282306 12802372 13620661 14503732 15272940 16188260 17187518 18344271
4901 18344271 19634731 21159699 22795120 24542219 26499867 28483590 30636983 32873686
4893 32873686 34994370 37226538 39431452 41535300 43414672 45018629 46378153 47495081
4885 47495081 48457797 49183008 49826238 50402749 50865920 51152105 51377492 51713470 52179623
$$ packed form
4951D823474M7957N3295O1658O1666J22777J36075R702J21142K3167j194O8074
4940E527793J13962j4943J21419Q7932J22426J30256R6914J78615J86030J12517
4930F662921O7772Q2030J62807J62263J95967J05084J19231J81694J00984K80011
4920H120764K52725K39944K39970L58139K84597L23238L51939L54595L16882M13777
4910A1256570M89589N36147N20066Q18289Q83071P69208R15320R99258J156753
4901A8344271J290460J524968J635421J747099J957648J983723K153393K236703
4893C2873686K120684K232168K204914K103848J879372J603957J359524J116928
4885D7495081R62716P25211O43230N76511M63171K86185K25387L35978M66153
$$ plain form
4876 52179623 52843004 53857666 55238133 56961004 59046920 61395347 64133929 67341238
4868 67341238 70848366 74731312 78943728 83378566 87877927 92397329 96782859 100794539
4860 100794539 104335719 107080991 108941353 110040432 110637636 110844908 110410664 109303082
4852 109303082 107654016 105576887 103510637 101478347 99653075 98204535 97132004 96422566
4844 96422566 96137236 96255033 96844076 97660169 98604077 99807958 101357158 103316505 105875919
4835 105875919 108912488 112278553 115992476 119740245 123233856 126363285 129173164 131308398
4827 131308398 132792441 133446819 133463832 133052801 132199665 130939234 129088708 126454872 123143052
4818 123143052 119549972 115876925 112411663 109324222 106624344 104189681 102170354 100454278
$$ packed form
4876E2179623O63381J014662J380467J722871K085916K348427K738582L207309
4868F7341238L507128L882946M212416M434838M499361M519402M385530M011680
4860A00794539L541180K745272J860362J099079N97204K07272m34244j107582
4852A09303082j649066k077129k066250k032290j825272j448540j072531p09438
4844I6422566k85330J17797N89043Q16093R43908J203881J549200J959347K559414
4835A05875919L036569L366065L713923L747769L493611L129429K809879K135234
4827A31308398J484043O54378J7013m11031q53136j260431j850526k633836l311820
4818A23143052l593080l673047l465262l087441k699878k434663k019327j716076
$$ plain form
4810 100454278 99160199 98262173 97856175 97830087 97999815 98323482 98677360 98880632 98602159
4801 98602159 97836207 96675743 95307340 93756172 92160550 90466877 88654953 86455295
4793 86455295 83893301 80989397 77877383 74615703 71352528 68254959 65340104 62453128
4785 62453128 59609426 56809297 54243141 51834452 49614730 47603497 45713667 43997526
4777 43997526 42373349 40903472 39361699 37828077 36120656 34492250 33063147 31683146
4769 31683146 30358014 29024099 27744131 26609419 25538817 24515371 23555530 22637713
4761 22637713 21702561 20929950 20237093 19584025 18972510 18348961 17778574 17207253 16695250
4752 16695250 16216286 15810712 15470315 15052739 14564745 14236289 13928582 13598668 13212519
$$ packed form
4810A00454278j294079q98026m05998k6088J69728L23667L53878K03272k78473
4801I8602159p65952j160464j368403j551168j595622j693673j811924k199658
4793H6455295k561994k903904l112014l261680l263175l097569k914855k886976
4785F2453128k843702k800129k566156k408689k219722k011233j889830j716141
4777D3997526j624177j469877j541773j533622j707421j628406j429103j380001
4769C1683146j325132j333915j279968j134712j070602j023446r59841r17817
4761B2637713r35152p72611o92857o53068o11515o23549n70387n71321n12003
4752A6695250m78964m05574l40397m17576m87994l28456l07707l29914l86149
$$ plain form
4743 13212519 12955321 12719322 12413057 12151715 11873207 11640231 11394438 11188847 11053629
4734 11053629 10884245 10650198 10575938 10435584 10356672 10171145 10004387 9955373 9769619 9640333
4724 9640333 9516280 9402813 9318178 9118531 9041444 9080736 8898875 8800914 8731922 8628156
4714 8628156 8544366 8479954 8438938 8394090 8386407 8324587 8229732 8277112 8291608 8244359 8207527 8167418
4702 8167418 8250732 8224470 8149685 8225591 8332517 8366402 8391108 8466552 8507028 8554991 8581363
4691 8581363 8532434 8482191 8389277 8411957 8382541 8324650 8329031 8246930 8253706 8313194 8325009 8267016
4679 8267016 8308020 8326247 8456430 8522440 8582915 8664561 8690811 8812964 8995760 9105366 9126881
4668 9126881 9311503 9456649 9588930 9759855 10016208 10248375 10423277 10571350 10745762 10915434
$$ packed form
4743A3212519k57198k35999l06265k61342k78508k32976k45793k05591j35218
4734A1053629j69384k34047p4260j40354p8912j85527j66758m9014j85754j29286
4724I640333j24053j13467q4635j99647p7087L9292j81861r7961o8992j03766
4714H628156q3790o4412m1016m4848p683o1820r4855M7380J4496m7249l6832m0109
4702H167418Q3314k6262p4785P5906J06926L3885K4706P5444M0476M7963K6372
4691H581363m8929n0243r2914K2680k9416n7891M381q2101O776N9488J1815n7993
4679H267016M1004J8227J30183O6010O0475Q1646K6250J22153J82796J09606K1515
4668I126881J84622J45146J32281J70925K56353K32167J74902J48073J74412J69672
$$ plain form
4658 10915434 11084449 11275433 11502349 11706911 11940889 12254247 12593485 12951620 13314503
4649 13314503 13737484 14204251 14641753 15191120 15668908 16193486 16722066 17307835 18104013
4640 18104013 18910655 19846028 20732233 21766650 22984953 24289635 25717828 27389762 29285123
4631 29285123 31401755 33844991 36749347 40006213 43622030 47705941 52413849 57677040
4623 57677040 63628430 70527399 78540102 88068084 99900487 114110160 130722580 149964981
4615 149964981 171851908 195264823 219086142 242169976 261696646 275204588 282130512
4608 282130512 282511177 275875787 263711136 248671550 232590228 216867043 203206626
4601 203206626 192300440 183456955 175411219 167270303 158689939 149492760 139534117 129023612
$$ packed form
4658A0915434J69015J90984K26916K04562K33978L13358L39238L58135L62883
4649A3314503M22981M66767M37502N49367M77788N24578N28580N85769P96178
4640A8104013Q06642R35373Q86205J034417J218303J304682J428193J671934J895361
4631B9285123K116632K443236K904356L256866L615817M083911M707908N263191
4623E7677040N951390O898969Q012703R527982J1832403J4209673J6612420J9242401
4615A49964981K1886927K3412915K3821319K3083834J9526670J3507942O925924
4608B82130512L80665o635390j2164651j5039586j6081322j5723185j3660417
4601B03206626j0906186q843485q045736q140916q580364r197179r958643j0510505
$$ plain form
4593 129023612 118549057 108497585 99207776 91030920 83983937 77832351 72512619 67799229
4585 67799229 63651072 59992889 56684923 53607477 50755209 48173858 45676653 43375625
4577 43375625 41310583 39292770 37409964 35707112 34112107 32697780 31474356 30394236
4569 30394236 29333734 28404517 27486619 26657714 25837813 25058212 24342948 23712019 23115250
4560 23115250 22545397 21936471 21519119 21107407 20592542 20229991 19903428 19650322 19475694
4551 19475694 19346269 19259592 19188247 19193092 19362183 19648857 19962516 20375139 20723794 21011138
4541 21011138 21276080 21373999 21472843 21501064 21427937 21160655 20859260 20585768 20349562 20028963
4531 20028963 19725642 19338773 18842059 18395604 18022515 17670543 17373804 17104333 16843007
$$ packed form
4593A29023612j0474555j0051472r289809q176856p046983o151586n319732m713390
4585F7799229m148157l658183l307966l077446k852268k581351k497205k301028
4577D3375625k065042k017813j882806j702852j595005j414327j223424j080120
4569C0394236j060502r29217r17898q28905q19901p79601p15264o30929n96769
4560B3115250n69853o08926m17352m11712n14865l62551l26563k53106j74628
4551A9475694j29425q6677p1345M845J69091K86674L13659M12623L48655K87344
4541B1011138K64942R7919R8844K8221p3127k67282l01395k73492k36206l20599
4531B0028963l03321l86869m96714m46455l73089l51972k96739k69471k61326
$$ plain form
4522 16843007 16555980 16372733 16271364 16090999 16026797 15991698 15904063 15664101 15433003 15166423
4512 15166423 14905215 14529529 14183689 13804162 13426071 13080604 12659030 12266484 11953871
4503 11953871 11618028 11331359 11066971 10725702 10531846 10220348 9988405 9811932 9669325
4494 9669325 9497716 9302101 9184214 9129962 9090735 9032630 8934861 8810253 8753394 8684656 8580148
4483 8580148 8652552 8533883 8394837 8403433 8387794 8353123 8292944 8347068 8431267 8448573 8372876
4472 8372876 8390132 8365370 8358996 8438280 8502644 8600854 8587674 8618905 8718370 8885722 8955141
4461 8955141 8969197 8979024 8887571 8799813 8674517 8565063 8414983 8251514 8099560 7931650
4451 7931650 7854891 7753897 7672885 7625683 7597378 7567732 7630265 7592404 7593449 7641887 7569374
$$ packed form
4522A6843007k87027j83247j01369j80365o4202l5099q7635k39962k31098k66580
4512A5166423k61208l75686l45840l79527l78091l45467m21574l92546l12613
4503A1953871l35843k86669k64388l41269j93856l11498k31943j76473j42607
4494I669325j71609j95615j17887n4252l9227n8105r7769j24608n6859o8738j04508
4483H580148P2404j18669j39046Q596j5639l4671o0179N4124Q4199J7306p5697
4472H372876J7256k4762o374P9284O4364R8210j3180L1231R9465J67352O9419
4461H955141J4056R827r1453q7758j25296j09454j50080j63469j51954j67910
4451G931650p6759j00994q1012m7202k8305k9646O2533l7861J045M8438p2513
$$ plain form
4440 7569374 7577514 7509244 7342034 7187964 7090680 7067527 7099664 7067227 7003771 7044054 7149608
4429 7149608 7199287 7249159 7317403 7470396 7604510 7778048 7985882 8206518 8400125 8641129
4419 8641129 8963714 9267759 9580001 9894820 10358421 10854188 11364337 12092313 12838102 13810058
4409 13810058 15045184 16570752 18474123 20663440 22740952 24946470 27367790 29773078
4401 29773078 31850839 33320904 33745880 33536070 33863697 35163414 37378705 39951875 42356609
4392 42356609 45485217 48605357 50956044 52252439 51035407 47438984 43466475 40913987
4384 40913987 39233036 38339243 37662507 37358236 37496758 37299565 36608243 35217946 32800600
4375 32800600 29865607 27271351 25010841 23067689 21464265 20021554 18794246 17741505
$$ packed form
4440G569374Q140o8270j67210j54070r7284k3153L2137l2437o3456M0283J05554
4429G149608M9679M9872O8244J52993J34114J73538K07834K20636J93607K41004
4419H641129L22585L04045L12242L14819M63601M95767N10149P27976P45789R71956
4409A3810058J235126J525568J903371K189317K077512K205518K421320K405288
4401B9773078K077761J470065M24976k09810L27627J299717K215291K573170K404734
4392D2356609L128608L120140K350687J296395j217032l596423l972509k552488
4384D0913987j680951q93793o76736l04271J38522j97193o91322j390297k417346
4375C2800600k934993k594256k260510j943152j603424j442711j227308j052741
$$ plain form
4367 17741505 16768512 15875073 15112492 14454436 13927645 13482561 12985409 12489948 12052220
4358 12052220 11672704 11303401 11006723 10704111 10422369 10160012 9995494 9751860 9480472
4349 9480472 9331279 9174855 9049544 8915352 8684846 8601711 8552498 8381842 8264858 8138315
4339 8138315 8068499 7986162 7960067 7884022 7797656 7670484 7640504 7708413 7668355 7650376 7599097
4328 7599097 7569975 7636937 7701048 7694979 7724666 7743933 7591808 7583621 7456213 7333653 7258401
4317 7258401 7046651 6920562 6790209 6611875 6545728 6475502 6391184 6256932 6205218 6089472
4307 6089472 5941730 5894048 5797982 5725014 5664012 5690490 5618594 5474331 5362716 5392318 5379319
4296 5379319 5344373 5200748 5189904 5158911 5115322 5069822 5041659 5091767 5045746 4946209 5069310
$$ packed form
4367A7741505r72993q93439p62581o58056n26791m45084m97152m95461m37728
4358A2052220l79516l69303k96678l02612k81742k62357j64518k43634k71388
4349I480472j49193j56424j25311j34192k30506q3135m9213j70656j16984j26543
4339H138315o9816q2337k6095p6045q6366j27172k9980O7909m0058j7979n1279
4328G599097k9122O6962O4111o069K9687J9267j52125q187j27408j22560p5252
4317G258401k11750j26089j30353j78334o6147p0226q4318j34252n1714j15746
4307F089472j47742m7682r6066p2968o1002K6478p1896j44263j11615K9602j2999
4296E379319l4946j43625j0844l0993m3589m5500k8163N0108m6021r9537J23101
$$ plain form
4285 5069310 5093917 5075339 5046798 4980346 4952977 4928343 5026181 5004978 4925737 4933195 4920295 4839536
4273 4839536 4809599 4762770 4775911 4755413 4727931 4668199 4604212 4617004 4613675 4579401 4591863 4629828
4261 4629828 4589301 4620869 4588354 4592803 4567170 4578824 4628868 4672725 4754670 4797657 4889818 4884347
4249 4884347 4722910 4762648 4741214 4676628 4758807 4837590 4854028 4947616 4980274 4990159 5083000
4238 5083000 5047730 5095848 5188548 5299881 5286887 5358550 5325734 5342292 5415952 5515124 5607556
4227 5607556 5635525 5801790 5958496 6094114 6219693 6339606 6495217 6709289 6848857 7062230
4217 7062230 7355425 7623070 7900160 8238377 8655958 9149075 9631952 10080149 10662546 11250856
4207 11250856 11799988 12389725 12984433 13471752 14004199 14471151 14768453 15087353 15410031
$$ packed form
4285E069310K4607j8578k8541o6452k7369k4634R7838k1203p9241P458j2900q0759
4273D839536k9937m6829J3141k0498k7482n9732o3987J2792l329l4274J2462L7965
4261D629828m0527L1568l2515M449k5633J1654N0044M3857Q1945M2987R2161n471
4249D884347j61437L9738k1434o4586Q2179P8783J6438R3588L2658R885R2841
4238E083000l5270M8118R2700J11333j2994P1663l2816J6558P3660R9172R2432
4227E607556K7969J66265J56706J35618J25579J19913J55611K14072J39568K13373
4217G062230K93195K67645K77090L38217M17581M93117M82877M48197N82397N88310
4207A1250856N49132N89737N94708M87319N32447M66952K97302L18900L22678
$$ plain form
4198 15410031 15695388 16059048 16435017 16961416 17616030 18320498 19040396 19911128 20840940
4189 20840940 21846876 22780239 23688521 24477103 25252003 26057848 26845357 27511922 28113162
4180 28113162 28797847 29520955 30189379 30878493 31511148 32061637 32585324 33106083 33735222
4171 33735222 34313613 34853718 35326348 36045720 36930112 38084705 39526165 41163756 42876383
4162 42876383 44645908 46325072 47763156 48784035 49459605 49932009 50354326 50860076 51332430
4153 51332430 51783402 52173029 52389445 52562351 52717077 52891541 53155035 53406738 53629122
4144 53629122 53733846 53643682 53550065 53486177 53766937 54523861 55577983 56864867 58346753
4135 58346753 59929051 61549979 63289289 64897391 66191650 67208845 68237574 69281900
$$ packed form
4198A5410031K85357L63660L75969N26399O54614P04468P19898Q70732R29812
4189B0840940J005936R33363R08282P88582P74900Q05845P87509O66565O01240
4180B8113162O84685P23108O68424O89114O32655N50489N23687N20759O29139
4171C3735222N78391N40105M72630P19372Q84392J154593J441460J637591J712627
4162D2876383J769525J679164J438084J020879O75570M72404M22317N05750M72354
4153E1332430M50972L89627K16416J72906J54726J74464K63494K51703K22384
4144E3629122J04724r0164r3617o3888K80760P56924J054122J286884J481886
4135E8346753J582298J620928J739310J608102J294259J017195J028729J044326
$$ plain form
4127 69281900 70398921 71381080 72230832 72799795 72950353 72958670 72965922 73124668 73317906 73257745
4117 73257745 73072265 72945078 72906462 73070560 73581533 74314230 75327228 76719278 78373986
4108 78373986 80182666 81909650 83610108 85326317 86805954 88083985 89045675 89622234
4100 89622234 90053947 90308772 90392807 90097611 89818328 89494186 89049216 88695555 88583064 88725345
4090 88725345 89334368 90345739 91445994 92628066 93684117 94558163 95165336 95403264 95573313
4081 95573313 95656569 95671251 95660991 95360359 94823559 94162055 93262487 92228816 91085376 89777461
4071 89777461 88054695 86081157 84197876 82492389 81119976 80022632 78993610 78072330
4063 78072330 77248207 76722663 76378075 75928654 75330952 74589874 73795965 72876134 71895252
$$ packed form
4127F9281900J117021R82159Q49752N68963J50558Q317P252J58746J93238o0161
4117G3257745j85480j27187l8616J64098N10973P32697J012998J392050J654708
4108G8373986J808680J726984J700458J716209J479637J278031R61690N76559
4100H9622234M31713K54825Q4035k95196k79283l24142m44970l53661j12491J42281
4090H8725345O09023J011371J100255J182072J056051Q74046O07173K37928J70049
4081I5573313Q3256J4682j0260l00632n36800o61504q99568j033671j143440j307915
4071H9777461j722766j973538j883281j705487j372413j097344j029022r21280
4063G8072330q24123n25544l44588m49421n97702p41078p93909r19831r80882
$$ plain form
4054 71895252 70892908 69844772 68815021 67843483 66993348 66298289 65552209 64794072 64053991
4045 64053991 62912611 61484653 59587296 57369167 55196701 53238931 51545508 50169879
4037 50169879 48973159 47960583 47078485 46139482 45206283 44273650 43121438 42008571 41081247
4028 41081247 40167999 39368958 38627276 37903209 37157100 36447478 35684723 34892890 33992686
4019 33992686 33048893 32169973 31193213 30054701 28881889 27854269 26871157 25865309 25092193
4010 25092193 24352422 23774222 23191241 22611175 21968252 21446668 20872603 20262567 19745773
4001 19745773 19212424 18556203 17976842 17292047 16615725 15889825 15289409 14779796 14248430
3992 14248430 13664012 13155222 12719697 12354131 12011094 11624956 11261555 10913615 10513000
$$ packed form
4054G1895252j002344j048136j029751r71538q50135o95059p46080p58137p40081
4045F4053991j141380j427958j897357k218129k172466j957770j693423j375629
4037E0169879j196720j012576q82098r39003r33199r32633j152212j112867r27324
4028D1081247r13248p99041p41682p24067p46109p09622p62755p91833r00204
4019C3992686r43793q78920r76760j138512j172812j027620r83112j005848p73116
4010B5092193p39771n78200n82981n80066o42923n21584n74065o10036n16794
4001A9745773n33349o56221n79361o84795o76322p25900o00416n09613n31366
3992A4248430n84418n08790m35525l65566l43037l86138l63401l47940m00615
$$ plain form
3983 10513000 10273228 10124413 9830053 9559798 9418734 9139236 8989121 8804386 8664332
3974 8664332 8531823 8325451 8125798 7979895 7947961 7756049 7608172 7523765 7427993 7242502
3964 7242502 7093715 7027866 6989251 6850227 6798390 6731464 6663392 6435414 6349843 6325811 6233261
3953 6233261 6154817 6078022 5978674 6026511 5861522 5810813 5761951 5642216 5593142 5535275 5467862
3942 5467862 5480757 5513525 5496789 5442001 5342275 5278016 5200482 5234436 5240373 5207421 5165893 5151858
3930 5151858 5203035 5227934 5194683 5163054 5177022 5190390 5127754 5186293 5207448 5110130 5054990
3919 5054990 5045174 5090787 5093050 5059367 5078632 5102668 5124296 5083509 5090161 5120650 5040338 5032281
3907 5032281 5086007 5133497 5123757 5089617 5091013 5120510 5188940 5198607 5190026 5182315 5152772 5181997
$$ packed form
3983A0513000k39772j48815k94360k70255j41064k79498j50115j84735j40054
3974H664332j32509k06372j99653j45903l1934j91912j47877q4407r5772j85491
3964G242502j48787o5849l8615j39024n1837o6926o8072k27978q5571k4032r2550
3953F233261p8444p6795r9348M7837j64989n0709m8862j19735m9074n7867o7413
3942E467862J2895L2768j6736n4788r9726o4259p7534L3954N937l2952m1528j4035
3930E151858N1177K4899l3251l1629J3968J3368o2636N8539K1155r7318n5140
3919E054990r816M5613K263l3683J9265K4036K1628m0787O652L0489q0312q057
3907E032281N3726M7490r740l4140J396K9497O8430R667q581p711k9543K9225
$$ plain form
3895 5181997 5108623 5134791 5140154 5108211 5168789 5180497 5175959 5210672 5185012 5224478 5169662 5163286
3883 5163286 5200819 5187672 5121264 5278762 5300966 5298701 5252450 5234712 5338216 5309793 5395313
3872 5395313 5276628 5227869 5306886 5315972 5317522 5363891 5408798 5377514 5386794 5454621 5385125 5376175
3860 5376175 5396700 5440304 5458758 5438864 5532070 5526566 5605217 5582014 5505586 5655178 5610664
3849 5610664 5623659 5642707 5737557 5826410 5867568 5857577 5866393 5921222 5942472 5965430 5935924 5907455
3837 5907455 5951881 6011805 5994450 6047372 6053955 6138699 6182079 6189225 6203765 6195462 6155281 6199785
3825 6199785 6254314 6286161 6346810 6395693 6524876 6545832 6471236 6472908 6497300 6416863 6403867
3814 6403867 6383286 6475954 6499633 6544201 6522780 6505705 6619043 6706239 6749942 6834730 6898468
$$ packed form
3895E181997p3374K6168N363l1943O0578J1708m538L4713k5660L9466n4816o376
3883E163286L7533j3147o6408J57498K2204k265m6251j7738J03504k8423Q5520
3872E395313j18685m8759P9017R086J550M6369M4907l1284R280O7827o9496q950
3860E376175K0525M3604J8454j9894R3206n504P8651k3203p6428J49592m4514
3849E610664J2995J9048R4850Q8853M1158r991Q816N4829K1250K2958k9506k8469
3837E907455M4426N9924j7355N2922O583Q4744M3380P146J4540q303m0181M4504
3825F199785N4529L1847O0649M8883J29183K0956p4596J672K4392q0437j2996
3814F403867k0581R2668K3679M4568k1421j7075J13338Q7196M3703Q4788O3738
$$ plain form
3803 6898468 6893396 6994998 7138552 7299027 7463172 7576600 7741518 7864279 8063310 8208426
3793 8208426 8481676 8646874 8833897 9101548 9260817 9536121 9806003 10119809 10338720 10459583
3783 10459583 10421212 10258453 9779615 9339411 8903116 8428964 8001979 7603728 7303050 7024104
3773 7024104 6720714 6517266 6248697 5967256 5848826 5724739 5596073 5329255 5217473 5129199
3763 5129199 5064423 4950191 4846586 4766143 4641235 4574666 4540222 4503104 4359625 4176783
3753 4176783 4105577 4107423 4004686 3935112 3937637 3884339 3746127 3754232 3813678 3773570 3764910 3728382
3741 3728382 3670002 3654919 3625930 3578993 3574166 3609632 3675040 3509828 3428378 3410878 3361501
3730 3361501 3299402 3340377 3334146 3297879 3299569 3332987 3305828 3229065 3187210 3183054 3174748 3241538
$$ packed form
3803F898468n072J01602J43554J60475J64145J13428J64918J22761J99031J45116
3793H208426K73250J65198J87023K67651J59269K75304K69882L13806K18911J20863
3783A0459583l8371j62759m78838m40204m36295m74152m26985l98251l00678k78946
3773G024104l03390k03448k68569k81441j18430j24087j28666k66818j11782q8274
3763E129199o4776j14232j03605q0443j24908o6569l4444l7118j43479j82842
3753D176783p1206J846j02737o9574K525n3298j38212Q105N9446m0108q660l6528
3741C728382n8380j5083k8989m6937m827L5466O5408j65212q1450j7500m9377
3730C361501o2099M0975o231l6267J690L3418k7159p6763m1855m156q306O6790
$$ plain form
3718 3241538 3234631 3153081 3268449 3284562 3323107 3260887 3353024 3321798 3338501 3292758 3244597
3707 3244597 3235026 3185101 3173537 3216836 3181211 3212107 3238501 3160087 3229495 3198923 3270443 3307755
3695 3307755 3263220 3349259 3366045 3303992 3304244 3160148 3193112 3266143 3211132 3287030 3268993 3259752
3683 3259752 3178303 3282842 3207603 3133105 3265431 3283702 3204528 3231235 3251506 3237132 3236791
3672 3236791 3151042 3175948 3143368 3115383 3063672 3120391 3224828 3246579 3193373 3140629 3107529
3661 3107529 3135514 3227644 3248121 3208366 3206602 3208074 3256662 3321427 3253827 3297054 3361545 3426587
3649 3426587 3298963 3267695 3267220 3293914 3306082 3310566 3304688 3300197 3351791 3367754 3383517 3403321
3637 3403321 3495126 3458633 3587510 3553746 3526863 3667441 3676566 3622299 3547826 3616389 3593707
$$ packed form
3718C241538o907q1550J15368J6113L8545o2220R2137l1226J6703m5743m8161
3707C244597r571m9925j1564M3299l5625L0896K6394p8414O9408l0572P1520L7312
3695C307755m4535Q6039J6786o2053K52j44096L2964P3031n5011P5898j8037r241
3683C259752q1449J04539p5239p4498J32326J8271p9174K6707K0271j4374l41
3672C236791q5749K4906l2580k7985n1711N6719J04437K1751n3206n2744l3100
3661C107529K7985R2130K0477l9755j764J472M8588O4765o7600M3227O4491O5042
3649C426587j27624l1268m75K6694J2168M484n878m491N1594J5963J5763J9804
3637C403321R1805l6493J28877l3764k6883J40578R125n4267p4473O8563k2682
$$ plain form
3626 3593707 3602029 3643184 3639392 3560868 3502752 3502013 3525076 3647597 3700476 3601931 3555477 3549484
3614 3549484 3522510 3578709 3598606 3659568 3734488 3735979 3725118 3713301 3680369 3710702 3602002
3603 3602002 3608843 3593147 3569256 3595328 3621480 3620127 3569830 3636587 3749836 3831182 3891493 3864307
3591 3864307 3879615 3879735 3953458 4027389 4055810 4177786 4325648 4338185 4399915 4452609 4515048
3580 4515048 4568925 4544031 4527396 4632801 4764169 4776462 4865885 5038265 5097384 5146555 5248524
3569 5248524 5373838 5415477 5517910 5723666 5886236 6036941 6049613 6183204 6376555 6561537
3559 6561537 6706217 6875789 6980876 7157642 7374287 7560610 7852549 8136088 8385830 8598468
3549 8598468 8964427 9287421 9570363 9898274 10219142 10396216 10640572 10927579 11099020 11244292
$$ packed form
3626C593707Q322M1155l792p8524n8116p39K3063J22521N2879r8545m6454n993
3614C549484k6974N6199J9897O0962P4920J491j0861j1817l2932L0333j08700
3603C602002O841j5696k3891K6072K6152j353n0297O6757J13249Q1346O0311k7186
3591C864307J5308J20P3723P3931K8421J21976J47862J2537O1730N2694O2439
3580D515048N3877k4894j6635J05405J31368J2293Q9423J72380N9119M9171J01969
3569E248524J25314M1639J02433K05756J62570J50705J2672J33591J93351J84982
3559F561537J44680J69572J05087J76766K16645J86323K91939K83539K49742K12638
3549H598468L65959L22994K82942L27911L20868J77074K44356K87007J71441J45272
$$ plain form
3539 11244292 11334107 11421527 11450196 11466888 11383092 11251111 11050280 10780244 10498421 10142673
3529 10142673 9861932 9452414 9099963 8739522 8439474 8002139 7793261 7591941 7373046
3520 7373046 7154881 6947092 6661064 6414842 6290266 6107542 5975669 5782748 5686887 5562089
3510 5562089 5442335 5250201 5164280 5091008 5088424 4986681 4952289 4826714 4691918 4675359 4615922
3499 4615922 4523075 4566602 4545995 4508898 4389719 4302044 4231677 4287759 4248150 4096022 4006030
3488 4006030 3896538 3904156 3856450 3756277 3722662 3706090 3710776 3654988 3615810 3593432 3589773 3612018
3476 3612018 3517214 3493029 3511967 3443786 3426456 3328273 3290239 3206388 3166816 3135043 3131858 3089016
3464 3089016 3055856 3009993 2907909 2837791 2780885 2709491 2753810 2722366 2689905 2629703 2614904
$$ packed form
3539A1244292Q9815Q7420K8669J6692q3796j31981k00831k70036k81823l55748
3529A0142673k80741m09518l52451l60441l00048m37335k08878k01320k18895
3520G373046k18165k07789k86028k46222j24576j82724j31873j92921r5861j24798
3510E562089j19754j92134q5921p3272k584j01743l4392j25575j34796j6559n9437
3499D615922r2847M3527k0607l7097j19179q7675p0367N6082l9609j52128q9992
3488D006030j09492P618m7706j00173l3615j6572M686n5788l9178k2378l659K2245
3476C612018r4804k4185J8938o8181j7330r8183l8034q3851l9572l1773l185m2842
3464C089016l3160m5863j02084p0118n6906p1394M4319l1444l2461o0202j4799
$$ plain form
3453 2614904 2594096 2495139 2552461 2511570 2467590 2530069 2525201 2426238 2353200 2349941 2359684 2331495
3441 2331495 2334003 2333954 2334157 2387437 2363210 2326668 2400662 2393369 2315589 2272642 2308050 2226770 2213009
3428 2213009 2286508 2231490 2194456 2198337 2162046 2125323 2120378 2171742 2132391 2142070 2107431 2095254
3416 2095254 2022892 2030841 2080585 2086529 2118318 2089784 2088836 2086463 2043475 2095815 2052736 2035718
3404 2035718 2065075 2040807 1974393 1945389 1953952 1933465 1927032 1885738 1842803 1888939 1814002 1803928
3392 1803928 1789875 1748877 1773734 1713233 1684179 1723084 1761534 1746363 1653756 1658484 1636137 1659055
3380 1659055 1545347 1468105 1526905 1554116 1646481 1652421 1618147 1599903 1501228 1553695 1602006
3369 1602006 1623362 1659508 1567239 1524750 1526050 1491344 1456052 1422036 1437159 1420446 1375452 1411318
$$ packed form
3453B614904k0808r8957N7322m0891m3980O2479m868r8963p3038l259R743k8189
3441B331495K508m9K03N3280k4227l6542P3994p293p7780m2947L5408q1280j3761
3428B213009P3499n5018l7034L881l6291l6723m945N1364l9351R679l4639j2177
3416B095254p2362P949M9744N944L1789k8534r48k373m2988N2340m3079j7018
3404B035718K9357k4268o6414k9004Q563k0487o433m1294m2935M6136p4937j0074
3392A803928j4053m0998K4857o0501k9054L8905L8450j5171r2607M728k2347K2918
3380A659055j13708p7242N8800K7211R2365N940l4274j8244r8675N2467M8311
3369A602006K1356L6146r2269m2489J300l4706l5292l4016J5123j6713m4994L5866
$$ plain form
3357 1411318 1411749 1290394 1307126 1361403 1397960 1442240 1337777 1383392 1401555 1395984 1353399 1350165
3345 1350165 1383237 1420415 1409864 1364087 1329822 1276797 1203267 1255629 1338101 1287595 1249815
3334 1249815 1255066 1242521 1244473 1266708 1216020 1202287 1310281 1310557 1289939 1202376 1187995 1192084
3322 1192084 1151192 1190891 1171245 1125236 1173271 1266734 1249620 1172829 1132939 1089530 1141379
3311 1141379 1163515 1173005 1167695 1155566 1203911 1297091 1299974 1221691 1200889 1201996 1256428 1225296
3299 1225296 1182144 1320641 1278364 1125230 1079332 1123746 1186155 1192477 1213661 1187912 1250429
3288 1250429 1302878 1275835 1285393 1295480 1336967 1250808 1217601 1316088 1325537 1259465 1310851 1451864
3276 1451864 1487104 1432063 1401418 1373533 1347783 1313803 1366809 1415754 1429969 1537257 1517945
$$ packed form
3357A411318M31j21355J6732N4277L6557M4280j04463M5615J8163n571m2585l234
3345A350165L3072L7178j0551m5777l4265n3025p3530N2362Q2472n0506l7780
3334A249815N251j2545J952K2235n0688j3733J07994K76k0618q7563j4381M089
3322A192084m0892L9699j9646m6009M8035R3463j7114p6791l9890m3409N1849
3311A141379K2136R490n310j2129M8345R3180K883p8283k0802J107N4432l1132
3299A225296m3152J38497m2277j53134m5898M4414O2409O322K1184k5749O2517
3288A250429N2449k7043R558J0087M1487q6159l3207R8487R449o6072N1386J41013
3276A451864L5240n5041l0645k7885k5750l3980N3006M8945J4215J07288j9312
$$ plain form
3265 1517945 1502964 1560480 1612188 1586063 1561143 1519788 1578005 1634734 1627618 1655135 1737636 1754010
3253 1754010 1652761 1592314 1610113 1667179 1750933 1824022 1859186 1832587 1834068 1841019 1945504
3242 1945504 1939995 1905464 2045298 2125945 2176514 2266649 2270069 2349189 2437293 2509843 2626614
3231 2626614 2745211 2871208 2905276 3025469 3193199 3275964 3355906 3448968 3468809 3521360 3547168
3220 3547168 3558544 3544547 3533004 3590650 3690610 3744055 3847574 3792156 3913968 3977374 4040746
3209 4040746 4099677 4214256 4382854 4463292 4621631 4854783 5105398 5313260 5479498 5661693
3199 5661693 5866533 6038760 6207228 6274775 6223106 6190102 6050702 5752008 5556798 5407237
3189 5407237 5259879 5137900 5121070 5042445 5029768 4981662 4916167 4787237 4785683 4861256 4864120
$$ packed form
3265A517945j4981N7516N1708k6125k4920m1355N8217N6729p116K7517Q2501J6374
3253A754010j01249o0447J7799N7066Q3754P3089L5164k6599J481O951J04485
3242A945504n509l4531J39834Q0647N0569R0135L420P9120Q8104P2550J16771
3231B626614J18597J25997L4068J20193J67730Q2765P9942R3062J9841N2551K5808
3220C547168J1376j3997j1543N7646R9960N3445J03519n5418J21812O3406O3372
3209D040746N8931J14579J68598Q0438J58339K33152K50615K07862J66238J82195
3199E661693K04840J72227J68468O7547n1669l3004j39400k98694j95210j49561
3189E407237j47358j21979j6830p8625j2677m8106o5495j28930j554P5573K864
$$ plain form
3178 4864120 4854914 4880728 4903297 5036636 5028975 5020917 5117160 5262548 5235175 5156784 5248477 5180342
3166 5180342 5244841 5196350 4988706 4840820 4756737 4609617 4479076 4332405 4264352 4168432
3156 4168432 3945178 3921507 3829373 3744412 3721699 3579068 3544799 3456173 3413800 3380351 3260955
3145 3260955 3256010 3123638 3000937 2968916 2876332 2778791 2758411 2658718 2570148 2543498 2478697
3134 2478697 2383515 2309979 2280998 2253750 2127449 2120406 2072572 2003818 1879086 1919663 2000226
3123 2000226 1903049 1728952 1617277 1630120 1680841 1655960 1542520 1513595 1494338 1546341 1535592
3112 1535592 1551087 1545360 1457157 1386215 1405752 1388095 1359606 1298445 1228971 1215674 1219403 1267347
3100 1267347 1223374 1112267 1147540 1115948 1091278 1105363 1126076 1110673 1024107 1045403 1084802
$$ packed form
3178D864120r206K5814K2569J33339p661q058R6243J45388k7373p8391R1693o8135
3166E180342O4499m8491k07644j47886q4083j47120j30541j46671o8053r5920
3156D168432k23254k3671r2134q4961k2713j42631l4269q8626m2373l3449j19396
3145C260955m945j32372j22701l2021r2584r7541k0380r9693q8570k6650o4801
3134B478697r5182p3536k8981k7248j26301p043m7834o8754j24732M0577Q0563
3123B000226r7177j74097j11675J2843N0721k4881j13440k8925j9257N2003j0749
3112A535592J5495n727q8203p0942J9537j7657k8489o1161o9474j3297L729M7944
3100A267347m3973j11107L5273l1592k4670J4085K0713j5403q6566K1296L9399
$$ plain form
3089 1084802 1075754 948866 903409 935190 946266 931948 904430 847528 861523 892561 894288 861558
3077 861558 803569 805411 818158 798779 696405 770560 790207 756632 695047 623803 657993 723790
3065 723790 748385 778276 635023 574117 615120 600642 650693 624762 584523 575404 621285 583651
3053 583651 601871 661561 583879 568223 593826 609072 557388 487793 467510 505288 510007 489691
3041 489691 462682 432132 489137 488730 433557 383523 337716 353229 365818 344493 332966 387018
3029 387018 377453 372524 436437 423997 398335 335144 350588 320919 341817 334336 320779 325275
3017 325275 324425 281603 290130 325964 298216 298255 344193 311135 242527 300667 316921 268963 276830
3004 276830 299922 263085 235340 248380 305909 241512 224012 238318 213907 103011 101977 146144
$$ packed form
3089A084802r048j26888m5457L1781J1076j4318k7518n6902J3995L1038J727l2730
3077H61558n7989J842J2747j9379j02374P4155J9647l3575o1585p1244L4190O5797
3065G23790K4595K9891j43253o0906M1003j4478N0051k5931m0239r119M5881l7634
3053E83651J8220N9690p7682j5656K5603J5246n1684o9595k0283L7778M719k0316
3041D89691k7009l0550N7005m07n5173n0034m5807J5513J2589k1325j1527N4052
3029C87018r565m929O3913j2440k5662o3191J5444k9669K0898p481j3557M496
3017C25275q50m2822Q527L5834k7748L9M5938l3058o8608N8140J6254m7958P867
3004B76830K3092l6837k7745J3040N7529o4397j7500J4306k4411j10896j034M4167
$$ plain form
2992 146144 217338 197428 161397 154581 111134 157564 179759 141923 236835 174948 200111 222208
2980 222208 185849 179917 205571 282042 212595 229623 228525 172235 140623 134793 125450 88206
2968 88206 40969 61603 75867 6800 42710 88802 49676 104592 121355 108194 84381 38915
2956 38915 61946 203110 216932 127608 143989 167972 77292 47247 48604 154908 192752 112748
2944 112748 142935 174708 159726 189705 170049 120605 6406 36763 17730 -53963 2996
2933 2996 74060 45216 78327 157365 136800 105439 43151 55974 30524 -49918 59327 188573
2921 188573 221653 158011 79863 78250 56147 97934 109790 139139 169109 110730 109830 83087
2909 83087 65642 32974 65730 218913 247162 127178 128663 98375 67386 62228 42055 -27684
$$ packed form
2992A46144P1194j9910l6031o816m3447M6430K2195l7836R4912o1887K5163K2097
2980B22208l6359n932K5654P6471o9447J7028j098n6290l1612n830r343l7244
2968H8206m7237K0634J4264o9067L5910M6092l9126N4916J6763j3161k3813m5466
2956C8915K3031J41164J3822q9324J6381K3983r0680l0045J357J06304L7844q0004
2944A12748L0187L1773j4982K9979j9656m9444j14199L0357j9033p1693N6959
2933B996P1064k8844L3111P9038k0565l1361o2288J2823k5450q0442J09245J29246
2921A88573L3080o3642p8148j613k2103M1787J1856K9349K9970n8379r00k6743
2909H3087j7445l2668L2756J53183K8249j19984J485l0288l0989n158k0173o9739
$$ plain form
2897 -27684 -29183 -8099 34163 89462 40446 52331 113338 127096 77823 19507 16255 62171
2885 62171 166747 77610 4269 -864 -12764 -18804 -28222 23947 63495 48988 46402 31504
2873 31504 31298 85969 44410 90200 41877 125964 93641 36131 19394 92723 43661 69000
2861 69000 44917 32861 77567 50029 -18731 -109238 -79903 -73651 -71450 -65270 18075 -36730
2849 -36730 -58658 -18979 -39944 -48862 -1765 -53818 -70659 5195 115628 111680 90756 34883
2837 34883 17475 -69339 -63475 18227 42819 17459 -45398 -74406 -116567 -86530 61229 29176
2825 29176 -89893 -103420 -69995 47133 78315 34423 -38603 39056 -49629 -25529 40686
2814 40686 100049 106124 97486 52775 19904 46507 59991 36967 -1631 -55548 -11452 43588
$$ packed form
2897b7684j499K1084M2262N5299m9016J1885O1007J3758m9273n8316l252M5916
2885F2171J04576q9137p3341n133j1900o040r418N2169L9548j4507k586j4898
2873C1504k06N4671m1559M5790m8323Q4087l2323n7510j6737P3329m9062K5339
2861F9000k4083j2056M4706k7538o8760r0507K9335O252K201O180Q3345n4805
2849c6730k1928L9679k0965q918M7097n2053j6841P5854J10433l948k0924n5873
2837C4883j7408q6814N864Q1702K4592k5360o2857k9008m2161L0037J47759l2053
2825B9176j19069j3527L3425J17128L1182m3892p3026P7659q8685K4100O6215
2814D0686N9363O075q638m4711l2871K6603J3484k3024l8598n3917M4096N5040
$$ plain form
2802 43588 94331 49948 -25604 -105405 -53469 -54357 -524 -2070 -9262 11803 -38379 -17960 9351
2789 9351 -25794 -81312 -52616 -57324 -36329 -58685 -79870 -48196 -25125 -73194 -71322 -57715
2777 -57715 -52442 -71709 -52147 -23644 -29860 -15837 -33494 -67209 -17569 -25296 -39503 -53948
2765 -53948 18218 -7649 -48409 -117968 -154081 -111843 -67254 -21506 -40051 -46947 -104322 -103121
2753 -103121 27755 75894 26562 219 86955 -21888 -57929 -2937 41008 29852 34867
2742 34867 42519 3051 -37099 11897 -8208 -21150 -54157 -79770 -64473 -81101 -13580 -21521
2730 -21521 -30496 -15566 -28636 -44934 -76508 -36990 43040 15982 -47699 -71760 -69972 22585
2718 22585 17515 30037 53700 22646 -2004 -2131 -76884 -84739 -21226 -53915 -47556 -23450 -9645
$$ packed form
2802D3588N0743m4383p5552p9801N1936q88N3833j546p192K1065n0182K0419K7311
2789I351l5145n5518K8696m708K0995k2356k1185L1674K3071m8069J872J3607
2777e7715N273j9267J9562K8503o216J4023j7657l3715M9640p727j4207j4445
2765e3948P2166k5867m0760o9559l6113M2238M4589M5748j8545o896n7375J201
2753a03121J30876M8139m9332k6343Q6736j08843l6041N4992M3945j1156N015
2742C4867P652l9468m0150M8996k0105j2942l3007k5613J5297j6628O7521p941
2730b1521q975J4930j3070j6298l1574L9518Q0030k7058o3681k4061J788R2557
2718B2585n070J2522K3663l1054k4650j27p4753p855O3513l2689O359K4106J3805
$$ plain form
2705 -9645 -79165 -126562 -88931 -118321 -96231 -28082 4731 -3664 -8826 -59874 -34128 12277
2693 12277 -38224 -71540 -73407 -52020 -71030 -89792 -86260 -30720 -23573 -1291 -69608 5289
2681 5289 22135 -10171 55592 -40510 -98387 -76234 -119221 -46993 -21246 -14171 -15120 22954 -6388
2668 -6388 49303 34467 38616 9225 -18291 54752 72266 70463 64773 18229 934 24587 -35652
2655 -35652 -28053 -42070 14957 49302 35080 38521 -21050 -12502 44100 46530 13264 -77800 49730
2642 49730 83552 105787 71166 49909 56864 10662 4332 -56951 -63787 -133504 -164662 5140
2630 5140 -41341 -126717 -101290 -101259 -51450 -94895 -177176 -201248 -81111 -53140 14938 -1977
2618 -1977 -17122 -43184 -89580 -158780 -116566 -142385 -138902 -46310 -38462 -95123 -65671 46597
$$ packed form
2705i645o9520m7397L7631k9390K2090O8149L2813q395n162n1048K5746M6405
2693A2277n0501l3316j867K1387j9010j8762L532N5540P147K2282o8317P4897
2681E289J6846l2306O5763r6102n7877K2153m2987P2228K5747P075r49L8074k9342
2668f388N5691j4836M149k9391k7516P3043J7514j803n690m6544j7295K3653o0239
2655c5652P599j4017N7027L4345j4222L441n9571Q548N6602K430l3266r1064J27530
2642D9730L3822K2235l4621k1257O955m6202o330o1283o836o9717l1158J69802
2630E140m6481q5376K5427L1M9809m3445q2281k4072J20137K7971O8078j6915
2618a977j5145k6062m6396o9200M2214k5819L483R2592P848n6661K9452J12268
$$ plain form
2606 46597 19815 -29237 25102 37790 49882 -3585 -49464 17369 69182 42000 -81394 -82105
2594 -82105 -75058 -66359 892 36060 -3221 -1077 -40276 -55049 -4810 -60696 -84057 43756
2582 43756 33622 37781 36146 -57554 -138412 -97512 -76479 -35913 1067 -42943 7423 39834
2570 39834 -64902 -31543 -26721 -368 12551 -30133 -56624 -100648 -47739 -53903 -39161 -57918
2558 -57918 55808 41130 -33360 -89323 -75542 -41407 -24893 16204 -33620 -39008 -96727 -89148
2546 -89148 -29798 11829 -6201 -47275 -94786 -65630 -90315 -43187 23646 17287 46321 77298
2534 77298 41972 29597 44411 79291 184559 204424 158441 72052 145245 154717 47915 36799
2522 36799 13222 -31120 -43632 -76945 -65543 -59048 -25136 6373 -39345 -37460 -15713 -75654
$$ packed form
2606D6597k6782m9052N4339J2688J2092n3467m5879O6833N1813k7182j23394p11
2594h2105P047Q699O7251L5168l9281K144l9199j4773N0239n5886k3361J27813
2582D3756j0134M159j635r3700q0858M0900K1033M0566L6980m4010N0366L2411
2570C9834j04736L3359M822K6353J2919m2684k6491m4024N2909o164J4742j8757
2558e7918J13726j4678p4490n5963J3781L4135J6514M1097m9824n388n7719P579
2546h9148N9350M1627j8030m1074m7511K9156k4685M7128O6833o359K9034L0977
2534G7298l5326j2375J4814L4880J05268J9865m5983q6389P3193R472j06802j1116
2522C6799k3577m4342j2512l3313J1402O495L3912L1509m5718J885K1747n9941
$$ plain form
2510 -75654 -91596 -29841 34295 -9866 1349 -36748 -13407 61578 51607 82900 55484 1376
2498 1376 -40689 37347 47769 -39316 -53662 -15071 28188 118717 112104 41991 -38236 -37761 -10008
2485 -10008 32792 -1300 -31177 59011 113766 144339 149050 119250 146362 125949 94815 164465
2473 164465 160682 106198 78704 57353 72182 79617 131058 100252 131708 89904 92178 159647
2461 159647 191671 182665 163856 169452 177427 71352 157890 175408 123485 196668 291606 316357
2449 316357 247044 301796 280506 323554 320333 287583 280176 310387 317109 341907 414585 428744
2437 428744 394022 433970 464715 447482 528241 510619 516578 607158 646709 722975 808146 873132
2425 873132 900003 931463 1021781 1088485 1230951 1385009 1440205 1652338 1702961 1853706 2171960
$$ packed form
2510g5654j5942O1755O4136m4161J1215l8097K3341P4985r971L1293k7416n4108
2498A376m2065P8036J0422q7085j4346L8591M3259R0529o613p0113q0227M75K7753
2485a0008M2800l4092k9877R0188N4755L0573M711k9800K7112k0413l1134O9650
2473A64465l783n4484k7494k1351J4829P435N1441l0806L1456m1804K274O7469
2461A59647L2024r006j8809N596P975j06075Q6538J7518n1923P3183R4938K4751
2449C16357o9313N4752k1290M3048l221l2750p407L0211O722K4798P2678J4159
2437D28744l4722L9948L0745j7233Q0759j7622N959R0580L9551P6266Q5171O4986
2425H73132K6871L1460R0318O6704J42466J54058N5196K12133N0623J50745L18254
$$ plain form
2414 2171960 2409825 2675597 2933613 3252622 3629654 3912110 4381288 4873454 5601967 6478834
2404 6478834 7643675 9128279 10764243 12415514 14187486 16091891 17431124 18181512
2396 18181512 18377032 17713778 15696267 13370021 11675313 10407757 9332560 8393542 7553602
2387 7553602 6864320 6263378 5737335 5362728 4898908 4561466 4279121 3978796 3660645 3427823
2377 3427823 3200684 2965556 2754760 2553918 2348224 2229056 2129066 2036113 1890193 1804905
2367 1804905 1712769 1591496 1489250 1460903 1414896 1349072 1302864 1276182 1207382 1089932 1121216
2356 1121216 1044734 988860 961275 944138 902382 776309 807365 750301 765864 790593 744823
2345 744823 770748 768680 692801 655325 622169 554361 572749 521778 498541 500072 555637 459466
$$ packed form
2414B171960K37865K65772K58016L19009L77032K82456M69178M92166P28513Q76867
2404F478834J164841J484604J635964J651271J771972J904405J339233P50388
2396A8181512J95520o63254k017511k326246j694708j267556j075197r39018q39940
2387G553602o89282o00942n26043l74607m63820l37442k82345l00325l18151k32822
2377C427823k27139k35128k10796k00842k05694j19168r9990r2953j45920q5288
2367A804905r2136j21273j02246k8347m6007o5824m6208k6682o8800j17450L1284
2356A121216p6482n5874k7585j7137m1756j26073L1056n7064J5563K4729m5770
2345G44823K5925k068p5879l7476l3156o7808J8388n0971k3237J531N5565r6171
$$ plain form
2333 459466 325930 425698 432220 439576 410233 370743 413831 438448 444368 363195 321557 299139
2321 299139 246180 211942 267851 254981 272674 264435 290455 229723 271713 257994 204855 154424
2309 154424 145896 262351 341023 249983 228881 190924 156891 220887 192666 237989 272142 140020
2297 140020 141725 243721 217020 162083 219950 200293 118454 166644 210724 145992 225789 146431
2285 146431 113982 158201 121854 137140 158710 174606 120852 56444 59228 57766 24146 22756
2273 22756 59447 60385 145982 191927 195418 162780 128061 78560 85708 41986 29337 75103 52541
2260 52541 34939 52208 97940 130012 132192 45894 51804 110709 12621 59299 112705 31855
2248 31855 -10325 -2502 24278 -37574 -10264 -55029 -41451 14920 -7674 13843 54666 9307
$$ packed form
2333D59466j33536R9768O522P356k9343l9490M3088K4617N920q1173m1638k2418
2321B99139n2959l4238N5909j2870J7693q239K6020o0732M1990j3719n3139n0431
2309A54424q528J16455P8672r1040k1102l7957l4033O3996k8221M5323L4153j32122
2297A40020J705J01996k6701n4937N7867j9657q1839M8190M4080o4732P9797p9358
2285A46431l2449M4219l6347J5286K1570J5896n3754o4408K784j462l3620j390
2273B2756L6691R38Q5597M5945L491l2638l4719m9501P148m3722j2649M5766k2562
2260E2541j7602J7269M5732L2072K180q6298N910N8905r8088M6678N3406q0850
2248C1855m2180P823K6780o1852K7310m4765J3578N6371k2594K1517M0823m5359
$$ plain form
2236 9307 -23414 175 48610 -12794 -18575 -19687 -6636 33310 -39037 -8384 52644 42895 -16301
2223 -16301 -44545 -27078 -33924 -28162 -54837 -39390 -1970 94457 9059 45623 66550 73698
2211 73698 85570 141121 127760 46553 40966 145026 53481 10577 4448 63560 84268 75073
2199 75073 104204 97424 44451 45361 5309 -35910 313 64988 99521 -14330 -37207 53922
2187 53922 5714 -32787 -68567 -53670 -55819 -44368 45133 6748 42987 10066 37547 36295
2175 36295 -36068 21125 -120 63507 75698 55303 36905 84116 -27585 -53088 -52307 18880
2163 18880 456 -7406 66667 46841 71096 12205 34801 -50640 -65371 4737 79083 41814
2151 41814 -6670 -25947 -39824 -78427 11206 41883 75189 2766 -105638 -22422 102880
$$ packed form
2236I307l2721K3589M8435o1404n781j112J3051L9946p2347L0653O1028r749n9196
2223a6301k8244J7467o846N762k6675J5447L7420R6427q5398L6564K0927P148
2211G3698J1872N5551j3361q1207n587J04060r1545m2904o129N9112K0708r195
2199G5073K9131o780n2973R10m0052m1219L6223O4675L4533j13851k2877R1129
2187E3922m8208l8501l5780J4897k149J1451Q9501l8385L6239l2921K7481j252
2175C6295p2363N7193k1245O3627J2191k0395j8398M7211j11701k5503P81P1187
2163A8880j8424p862P4073j9826K4255n8891K2596q5441j4731P0108P4346l7269
2151D1814m8484j9277j3877l8603Q9633L0677L3306p2423j08404Q3216J25302
$$ plain form
2140 102880 109532 8042 3475 -34253 -19531 43745 -7085 50029 58268 9274 74552 123265
2128 123265 37041 115455 126029 205185 81845 53602 75345 143038 124294 86318 51710
2117 51710 117098 62621 47951 76493 37023 -32276 -54709 -65276 47093 8178 -8066 -25593
2105 -25593 -37139 -13509 -46779 -36437 -52 -59360 -102215 -154069 -78524 17603 -54110 -55511
2093 -55511 -52509 -7851 -27590 6673 -14892 -99394 -90913 -86052 -37435 27001 -33017 27664
2081 27664 14350 -24702 -65973 -23903 -73478 -60831 -67435 -8288 11611 -38897 -73811 -59805
2069 -59805 -92011 -84323 -34940 -114257 -99592 46782 20404 10902 -8531 -24285 -34142 -59664
2057 -59664 30666 -8973 -39465 -29411 -65638 -7581 -82184 -58683 -113083 -23690 31120 24877
$$ packed form
2140A02880O652j01490m567l7728J4722O3276n0830N7114Q239m8994O5278M8713
2128A23265q6224P8414J0574P9156j23340k8243K1743O7693j8744l7976l4608
2117E1710O5388n4477j4670K8542l9470o9299k2433j0567J12369l8915j6244j7527
2105b5593j1546K3630l3270J0342L6385n9308m2855n1854P5545R6127p1713j401
2093e5511L002M4658j9739L4263k1565q4502Q481M861M8617O4436o0018O0681
2081B7664j3314l9052m1271M2070m9575J2647o604N9147J9899n0508l4914J4006
2069e9805l2206P688M9383p9317J4665J46374k6378r502j9433j5754r857k5522
2057e9664R0330l9639l0492J0054l6227N8057p4603K3501n4400Q9393N4810o243
$$ plain form
2045 24877 -18312 -95027 -119692 -29541 6580 23856 -16497 -29165 -72597 -67297 -834 38637
2033 38637 -29692 -46649 -11282 -27822 -46805 -110611 -117706 -58805 8851 -39896 -42361 54972
2021 54972 44330 -5323 29169 26031 32375 -32883 -39035 -19925 1849 -37141 -8731 21920
2009 21920 35001 56831 -12826 -86884 -2142 8392 -65192 -69942 -31719 -82670 -86110 -68762
1997 -68762 -27417 13788 86102 73451 -15079 17487 33210 -51838 -54479 -44635 -62120 -23837
1985 -23837 41901 30269 9705 -15339 -72468 -51824 -114816 -54788 1323 71096 -38344 -70210
1973 -70210 -7546 -80997 -48590 -37611 -47075 -70190 -34369 -47716 9169 -4483 -35816 -63010
1961 -63010 3544 -5289 -50923 -30256 -27445 -102674 -45334 44269 54495 -26141 -41212 -57393
$$ packed form
2045B4877m3189p6715k4665R0151L6121J7276m0353j2668m3432N300O6463L9471
2033C8637o8329j6957L5367j6540j8983o3806p095N8901O7656m8747k465R7333
2021E4972j0642m9653L4492l138O344o5258o152J9110K1774l8990K8410L0651
2009B1920J3081K1830o9657p4058Q4742J0534p3584m750L8223n0951l440J7348
1997f8762M1345M1205P2314j2651q8530L2566J5723q5048k641R844j7485L8283
1985b3837O5738j1632k0564k5044n7129K0644o2992O0028N6111O9773j09440l1866
1973g0210O2664p3451L2407J0979r464k3115L5821j3347N6885j3652l1333k7194
1961f3010O6554q833m5634K0667K811p5229N7340Q9603J0226q0636j5071j6181
$$ plain form
1949 -57393 -101082 -129856 -28348 -15946 -38395 -39328 -40636 31825 17570 37196 -29255 27634
1937 27634 25184 -31763 -41606 -64157 -74789 -27717 -29033 26682 28695 -85594 -123789 -33350
1925 -33350 10166 40381 27637 62452 -36503 -80472 -94809 -57460 -36201 23717 2945 -57027
1913 -57027 -82809 -69134 16948 -9557 25939 -11279 28852 -4501 -28535 -35919 -54935 -20448
1901 -20448 -25922 9770 12372 -43037 -46622 -53102 -103922 -34149 52851 99816 97657 34489 7716
1888 7716 -26449 -1121 -12813 -28701 -86271 -78400 -14426 -17059 802 -14561 -52132 31678
1876 31678 -60933 -90856 -51413 -46922 21532 -4089 -81739 -109075 -90081 -62170 -22158 -27767
1864 -27767 -9057 -122603 -133247 -4348 63075 -64383 -142840 -81850 -91156 -48264 -59656
$$ packed form
1949e7393m3689k8774J01508J2402k2449r33j308P2461j4255J9626o6451N6889
1937B7634k450n6947r843k2551j0632M7072j316N5715K013j14289l8195R0439
1925c3350M3516L0215j2744L4815r8955m3969j4337L7349K1259N9918k0772n9972
1913e7027k5782J3675Q6082k6505L5496l7218M0131l3353k4034p384j9016L4487
1901b0448n474L5692K602n5409l585o480n0820O9773Q7000M6965k159o3168k6773
1888G716l4165K5328j1692j5888n7570P871O3974k633J7861j5363l7571Q3810
1876C1678r2611k9923L9443M491O8454k5621p7650k7336J8994K7911M0012n609
1864b7767J8710j13546j0644J28899O7423j27458p8457O0990r306M2892j1392
$$ plain form
1853 -59656 -67234 -43019 -17276 -31651 -65165 -3239 957 -55668 -101241 -72265 22182 83
1841 83 6258 53438 4848 -9376 -57769 -109564 -100154 -90003 -41287 9561 52982 -75094 -91325
1828 -91325 -113791 -75253 -16645 -31884 -66922 -16398 -6274 -8484 16004 -35159 -96303 -47824
1816 -47824 -22790 -74293 -9561 -30937 -36040 -34868 6662 14836 15084 86459 131634 -13164 -60114
1803 -60114 -62164 -62161 -26762 -80224 -95928 -36186 -43962 -26156 -8230 -78215 -155219 -91006 -107854
1790 -107854 -2363 2404 -83953 -71304 -79207 -13890 -16041 -84330 -85207 -5759 -53063 -97385
1778 -97385 -84516 -108139 -117370 -66948 -83860 -167330 -114170 -78271 -8656 38645 34065 78575
1766 78575 -10970 29257 24992 2532 -4662 -18043 -38485 -138102 -140707 -69007 -8758 9428
$$ packed form
1853e9656p578K4215K5743j4375l3514O1926M196n6625m5573K8976R4447k2099
1841H3O175M7180m8590j4224m8393n1795R410J0151M8716N0848M3421j28076j6231
1828i1325k2466L8538N8608j5239l5038N0524J0124k210K4488n1163o1144M8479
1816d7824K5034n1503O4732k1376n103J172M1530Q174K48P1375M5175j44798m6950
1803f0114k050LL5399n3462j5704N9742p776J7806J7926o9985p7004O4213j6848
1790a07854J05491M767q6357J2649p903O5317k151o8289q77P9448m7304m4322
1778i7385J2869k3623r231N0422j6912q3470N3160L5899O9615M7301m580M4510
1766G8575q9545M0227m265k2460p194j3381k0442r9617k605P1700O0249J8186
$$ plain form
1754 9428 63784 -11201 -11428 -38162 -54935 7323 -4520 -59716 6579 53974 7416 -106912
1742 -106912 -62600 -54091 37171 78792 59694 28488 33372 78615 63424 62553 -21718 -26061 -7041
1729 -7041 -5781 6350 -26506 -96062 -19509 9695 158765 31916 -36020 -51756 -76657 -9027
1717 -9027 43744 -73257 -13590 45620 45831 1430 20015 16022 29882 31717 -29322 51523 -3406
1704 -3406 -34567 -25120 -25022 -45348 -48697 -54009 -31135 -29979 -46676 22702 -17602 -34920 -76476
1691 -76476 -144975 -91625 21815 30505 -32182 -65762 -62234 -4060 -12993 -42915 -11101 6005
1679 6005 4906 85999 84925 43385 29608 10659 -54548 -39220 -31272 -12805 -54827 -7702 -6725
1666 -6725 -6716 -19992 1278 -20423 -79289 -101652 -30078 -19496 -141609 -102796 -14185 38617 45960
$$ packed form
1754I428N4356p4985k27k6734j6773O2258j1843n5196O6295M7395m6558j14328
1742a06912M4312Q509R1262M1621j9098l1206M884M5243j5191q71q4271m343J9020
1729g041J260J2131l2856o9556P6553K9204J49070j26849o7936j5736k4901O7630
1717i027N2771j17001N9667N9210K11m4401J8585l993J3860J835o1039Q0845n4929
1704c406l1161R447R8k0326l349n312K2874J156j6697O9378m0304j7318m1556
1691g6476o8499N3350J13440Q690o2687l3580L528N8174q933k9922L1814J7106
1679F005j099Q1093j074m1540j3777j8949o5207J5328P948J8467m2022M7125R77
1666f725Rj3276K1270k1701n8866k2363P1574J0582j22113L8813Q8611N2802P343
$$ plain form
1653 45960 -129382 -74507 -56356 -31947 82078 13255 -53405 -51999 -76600 -40430 -19798 -38750
1641 -38750 -37090 -76134 -114057 -106837 -97178 -76970 42909 -27370 -76416 -68983 -98994 -35620
1629 -35620 -58165 -54111 -27828 7421 -59368 -165596 -194282 -33264 103308 57033 6406
1618 6406 -69392 -88495 -38127 5186 -28599 -5631 -61349 -38792 -54954 34517 6140 -87579
1606 -87579 -37919 12224 -33229 -70698 -93735 -5700 -32836 -108891 -56583 -54161 -8512 29732
1594 29732 56926 40070 -90560 -51443 23116 -14601 -51267 -68977 -48200 -32785 -98514 41438
1582 41438 57724 22261 -12112 -10556 39315 20869 61508 78984 96546 78359 -59097 -93589
1570 -93589 -106956 -46027 75290 96041 -37268 -64326 -55095 -28928 71887 51819 38090
$$ packed form
1653D5960j75342N4875J8151K4409J14025o8823o6660J406k4601L6170K0632j8952
1641c8750J660l9044l7923P220R659K0208J19879p0279m9046P433l0011O3374
1629c5620k2545M054K6283L5249o6789j06228k8686J61018J36572m6275n0627
1618F406p5798j9103N0368M3313l3785K2968n5718K2557j6162Q9471k8377r3719
1606h7579M9660N0143m5453l7469k3037Q8035k7136p6055N2308K422M5649L8244
1594B9732K7194j6856j30630L9117P4559l7717l6666j7710K0777J5415o5729J39952
1582D1438J6286l5463l4373J556M9871j8446M0639J7476J7562j8187j37456l4492
1570i3589j3367O0929J21317K0751j33309k7058R231K6167J00815k0068j3729
$$ plain form
1559 38090 -18486 -78251 -84380 35388 10983 -13213 -9778 48761 17705 -18025 38838 18422
1547 18422 -21959 -54583 -115700 10259 85583 65612 -15313 -70889 -35946 -48865 -9735 -47201
1535 -47201 -45500 3197 -43592 -34118 -39510 97949 54833 -57444 -13031 34936 24030 54811
1523 54811 13008 18247 -53284 -40444 27372 41166 -23973 -11722 123983 107784 23563 -35737
1511 -35737 -73453 -41692 -23200 -77522 -92906 -43638 -108865 -147015 -94894 10024 15727 -6222
1499 -6222 -2688 -10617 -36790 -25208 -17313 -135637 -61143 -30261 2602 -37481 -71540 -38217
1487 -38217 -62103 5589 27157 12680 96053 -6543 -10012 8597 24424 86684 44534 -2057
1475 -2057 -35992 -13328 -25862 -65147 -46045 24382 -41483 -115475 -152005 -111563 -87827 -68432
$$ packed form
1559C8090n6576n9765o129J19768k4405k4196L435N8539l1056l5730N6863k0416
1547A8422m0381l2624o1117J25959P5324j9971q0925n5576L4943j2919L9130l7466
1535d7201J701M8697m6789R474n392J37459m3116j12277M4413M7967j0906L0781
1523E4811m1803N239p1531J2840O7816J3794o5139J2251J35705j6199q4221n9300
1511c5737l7716L1761J8492n4322j5384M9268o5227l8150N2121J04918N703k1949
1499f222L534p929k6173J1582P895j18324P4494L0882L2863m0083l4059L3323
1487c8217k3886O7692K1568j4477Q3373j02596l469J8609J5827O2260m2150m6591
1475b057l3935K2664j2534l9285J9102P0427o5865p3992l6530M0442K3736J9395
$$ plain form
1463 -68432 -49623 -29020 12796 -59276 -53670 -24249 17228 -11267 20010 65589 -42148 -35177
1451 -35177 -42853 -78755 -76507 -88942 -67046 -37178 -35220 -20239 -32242 74945 143114 115928
1439 115928 88249 -78239 -134988 -110060 61902 -14595 24416 5242 -6319 -16368 -58456
1428 -58456 -11905 18370 2363 -5436 -13904 10855 5174 -80632 -40395 51696 47244 -18683 -62916
1415 -62916 -130603 -118434 -100387 -31243 42190 10907 -23141 33561 26005 55094 12174 -89245
1403 -89245 -45629 21888 46606 1101 -44241 -76678 29181 15646 -10077 23352 -43329 -101107
$$ packed form
1463f8432J8809K0603M1816p2072N606K9421M1477k8495L1277M5579j07737O971
1451c5177p676l5902K248j2435K1896K9868J958J4981j2003J07187O8169k7186
1439A15928k7679j66488n6749K4928J71962p6497L9011j9174j1561j0049m2088
1428e8456M6551L0275j6007p799q468K4759n681q5806M0237R2091m452o5927m4233
1415f2916o7687J2169J8047O9144P3433l1283l4048N6702p556K9089m2920j01419
1403h9245M3616O7517K4718m5505m5342l2437J05859j3535k5723L3429o6681n7778
$$ [...]
##END NTUPLES=NMR SPECTRUM
##END=
