##TITLE=1H_EC-3359(2)
 200.13MHz,DMSO,
 8 sc
 
 27.8.2025
##JCAMPDX= 6.0         $$ Bruker NMR JCAMP-DX V2.0
##DATA TYPE= NMR SPECTRUM
##DATA CLASS= NTUPLES
##ORIGIN= UXNMR, Bruker Analytische Messtechnik GmbH
##OWNER= pz
$$ XWIN-NMR		Version 3.5
$$ Wed Aug 27 13:58:17 2025 Russian Standard Time (UT+4h)  she@DPX200
##.OBSERVE FREQUENCY= 200.1313
##.OBSERVE NUCLEUS= ^1H
##.ACQUISITION MODE= SIMULTANEOUS
##.ACQUISITION SCHEME= undefined
##.AVERAGES= 8
##.DIGITISER RES= 18
##SPECTROMETER/DATA SYSTEM= spect
##.PULSE SEQUENCE= zg30
##.SOLVENT NAME= CDCl3
##.SHIFT REFERENCE= (INTERNAL, CDCl3, 0, 15.4395)
##AUDIT TRAIL= $$ (NUMBER, WHEN, WHO, WHERE, WHAT)
$$ ##TITLE= Audit trail, XWIN-NMR		Version 3.5
$$ ##JCAMPDX= 5.01
$$ ##ORIGIN= Bruker BioSpin GmbH
$$ ##OWNER= she
$$ F:/spectra/data/she/nmr/H-C/1/pdata/1/auditp.txt
$$ ##AUDIT TRAIL=  $$ (NUMBER, WHEN, WHO, WHERE, WHAT)
(   1,<2025-08-27 13:57:02.98 +0400>,<she>,<DPX200>,
      <created by zg, POWCHK disabled, PULCHK disabled
       configuration hash MD5:
       00 E9 B6 7A A2 85 ED C7 34 08 36 98 17 FE 4E 26
       data hash MD5: 16K
       98 8A D6 D7 78 28 4E 14 A8 FD DC 61 1E 0C 8F 00>)
(   2,<2025-08-27 13:57:08.53 +0400>,<she>,<DPX200>,
      <Start of raw data processing
       efp BC_mod = 2 LB = 0.25 FT_mod = 6 PKNL = 1 PHC0 = -1718.127 PHC1 = 11.99228 SI = 16K 
       data hash MD5: 16K
       A1 6D 97 DD D5 F2 24 3C 02 9C 87 04 3C 0B E3 55>)
(   3,<2025-08-27 13:57:27.93 +0400>,<she>,<DPX200>,
      <pk PHC0 = -2.22062 PHC1 = 2 
       data hash MD5: 16K
       D1 C2 C2 33 36 A8 A4 F1 FD 9C C6 0A 65 79 30 34>)
(   4,<2025-08-27 13:57:32.21 +0400>,<she>,<DPX200>,
      <abs ABSG = 5 
       data hash MD5: 16K
       1C 43 E6 79 D9 FC 4D 7F AC AE B3 9B 42 93 EB E2>)
$$ ##END=
$$ 
$$ hash MD5
$$ F6 9E 05 A2 6D 7F D2 80 99 29 44 B6 7D 18 D9 44
##$RELAX= 
##$RELAX= 
##$RELAX= 
##$RELAX= 
##$RELAX= 
##$RELAX= 
$$ Bruker specific parameters
$$ --------------------------
##$DU= <F:/spectra>
##$EXPNO= 1
##$NAME= <H-C>
##$PROCNO= 1
##$TYPE= <nmr>
##$USER= <she>
##$AMP= (0..31)
100 100 100 100 100 100 100 100 100 100 100 100 100 100 100 100 100 100 
100 100 100 100 100 100 100 100 100 100 100 100 100 100 
##$AQSEQ= 0
##$AQ_mod= 1
##$AUNM= <au_zg>
##$AUTOPOS= <>
##$BF1= 200.13
##$BF2= 200.13
##$BF3= 200.13
##$BF4= 200.13
##$BF5= 200.13
##$BF6= 200.13
##$BF7= 200.13
##$BF8= 200.13
##$BYTORDA= 1
##$CFDGTYP= 0
##$CFRGTYP= 5
##$CHEMSTR= <none>
##$CNST= (0..31)
1 1 145 1 1 1 1 1 1 1 1 1 1 1 1 1 1 1 1 1 1 1 1 1 1 1 1 1 1 1 1 1 
##$CPDPRG= <>
##$CPDPRG1= <>
##$CPDPRG2= <>
##$CPDPRG3= <>
##$CPDPRG4= <mlev>
##$CPDPRG5= <mlev>
##$CPDPRG6= <mlev>
##$CPDPRG7= <mlev>
##$CPDPRG8= <mlev>
##$CPDPRGB= <>
##$CPDPRGT= <>
##$D= (0..31)
0 0.7 0 0 0 0 0 0 0 0 0 0.03 0 0 0 0 0 0 0 0 0 0 0 0 0 0 0 0 0 0 0 0 
##$DATE= 1756288622
##$DBL= (0..7)
120 120 120 120 120 120 120 120 
##$DBP= (0..7)
150 150 150 150 150 150 150 150 
##$DBP07= 0
##$DBPNAM0= <>
##$DBPNAM1= <>
##$DBPNAM2= <>
##$DBPNAM3= <>
##$DBPNAM4= <>
##$DBPNAM5= <>
$$ [...]
##$SUBNAM3= <"">
##$SUBNAM4= <"">
##$SUBNAM5= <"">
##$SUBNAM6= <"">
##$SUBNAM7= <"">
##$SUBNAM8= <"">
##$SUBNAM9= <"">
##$SW= 18.0517328524113
##$SWIBOX= (0..15)
0 0 2 0 0 0 0 0 0 0 0 0 0 0 0 0 
##$SW_h= 3612.71676300578
##$TD= 16384
##$TD0= 1
##$TE= 0
##$TE2= 300
##$TE3= 300
##$TEG= 300
##$TL= (0..7)
0 120 120 120 120 120 120 120 
##$TP= (0..7)
150 150 150 150 150 150 150 150 
##$TP07= 0
##$TPNAME0= <>
##$TPNAME1= <>
##$TPNAME2= <>
##$TPNAME3= <>
##$TPNAME4= <>
##$TPNAME5= <>
##$TPNAME6= <>
##$TPNAME7= <>
##$TPOAL= (0..7)
0.5 0.5 0.5 0.5 0.5 0.5 0.5 0.5 
##$TPOFFS= (0..7)
0 0 0 0 0 0 0 0 
##$TUNHIN= 0
##$TUNHOUT= 0
##$TUNXOUT= 0
##$USERA1= <user>
##$USERA2= <user>
##$USERA3= <user>
##$USERA4= <user>
##$USERA5= <user>
##$V9= 5
##$VALIST= <valist>
##$VCLIST= <CCCCCCCCCCCCCCC>
##$VD= 0
##$VDLIST= <DDDDDDDDDDDDDDD>
##$VPLIST= <PPPPPPPPPPPPPPP>
##$VTLIST= <TTTTTTTTTTTTTTT>
##$WBST= 1024
##$WBSW= 4
##$XGAIN= (0..3)
0 0 0 0 
##$XL= 0
##$YL= 0
##$YMAX_a= 87830
##$YMIN_a= -85217
##$ZGOPTNS= <>
##$ZL1= 120
##$ZL2= 120
##$ZL3= 120
##$ZL4= 120
##$ABSF1= 24.44183
##$ABSF2= 6.389818
##$ABSG= 5
##$ABSL= 3
##$ALPHA= 0
##$AQORDER= 0
##$ASSFAC= 0
##$ASSFACI= 0
##$ASSFACX= 0
##$ASSWID= 0
##$AUNMP= <proc_1d>
##$AZFE= 0.1
##$AZFW= 0.1
##$BCFW= 0
##$BC_mod= 2
##$BYTORDP= 0
##$COROFFS= 0
##$CY= -3
##$DATMOD= 1
##$DC= 0
##$DFILT= <>
##$DTYPP= 0
##$F1P= 0
##$F2P= 0
##$FCOR= 1
##$FTSIZE= 16384
##$FT_mod= 6
##$GAMMA= 0
##$GB= 0
##$INTBC= 1
##$INTSCL= 3.241238e-09
##$ISEN= 128
##$LB= 0.25
##$LEV0= 0
##$LPBIN= 0
##$MAXI= 10000
##$MC2= 0
##$MEAN= 0
##$ME_mod= 0
##$MI= 1.114404
##$NCOEF= 0
##$NC_proc= -9
##$NLEV= 6
##$NOISF1= 3.799351
##$NOISF2= 2.8
##$NSP= 0
##$NTH_PI= 0
##$NZP= 0
##$OFFSET= 15.43949
##$PC= 1
##$PHC0= -1720.348
##$PHC1= 13.99228
##$PH_mod= 1
##$PKNL= yes
##$PPARMOD= 0
##$PSCAL= 0
##$PSIGN= 0
##$REVERSE= no
##$SF= 200.130016454448
##$SI= 16384
##$SIGF1= 3
##$SIGF2= 2
##$SINO= 0.751879
##$SIOLD= 32768
##$SREGLST= <19F.Aceton>
##$SSB= 0
##$STSI= 16384
##$STSR= 0
##$SW_p= 3612.71676300578
##$SYMM= 0
##$S_DEV= 0
##$TDeff= 16384
##$TDoff= 0
##$TI= <>
##$TILT= no
##$TM1= 0
##$TM2= 0
##$TOPLEV= 0
##$USERP1= <user>
##$USERP2= <user>
##$USERP3= <user>
##$USERP4= <user>
##$USERP5= <user>
##$WDW= 1
##$XDIM= 16384
##$YMAX_p= 496923676
##$YMIN_p= -3901409
$$ End of Bruker specific parameters
$$ ---------------------------------
##NTUPLES= NMR SPECTRUM
##VAR_NAME=  FREQUENCY,     SPECTRUM/REAL,   SPECTRUM/IMAG
##SYMBOL=    X,             R,               I
##VAR_TYPE=  INDEPENDENT,   DEPENDENT,       DEPENDENT
##VAR_FORM=  AFFN,          ASDF,            ASDF
##VAR_DIM=   16384,         16384,           16384
##UNITS=     HZ,            ARBITRARY UNITS, ARBITRARY UNITS
##FACTOR=    0.220516191357247, 1,           1
##FIRST=     3089.90545144934, 0,            0
##LAST=      -522.811311556443, 0,           0
##MIN=       -522.811311556443, -3901409,    0
##MAX=       3089.90545144934, 496923676,    0
$$ Real data points
##PAGE= N=1
##DATA TABLE= (X++(R..R)), XYDATA
$$ [...]
$$ plain form
7563 -324407 -413813 -464515 -517876 -241833 -498272 -511771 -577009 -517727 -423277 -77823 -81619
7552 -81619 60889 -3309 -109788 -454205 -477111 -186841 -37824 103605 -118462 -141082
7542 -141082 -436006 -51934 112739 -172692 -39973 4684 -236208 -373195 -203714 -308186
7532 -308186 -351782 -105647 -270879 -409915 -391248 -379518 -383728 -553293 -598675 -230396 -79201
7521 -79201 -279473 -270004 -503249 -464695 -387348 -526088 13161 102191 136321 -159575 -306114
7510 -306114 -247124 -264841 -19346 -169934 -296973 -113501 -98705 -318932 -370972 -425296 -442356
7499 -442356 -248020 -130325 -330187 -467035 -256302 -348389 -290088 -455084 -377786 -411339
7489 -411339 -404134 -177743 -199307 -230789 -253230 -95070 -5561 71 -137350 103472 211121
$$ packed form
7563c24407q9406n0702n3361K76043k56439j3499o5238N9282R4450L45454l796
7552h1619J42508o4198j06479l44417k2906K90270J49017J41429k22067k2620
7542a41082k94924L84072J64673k85431J32719M4657k40892j36987J69481j04472
7532c08186m3596K46135j65232j39036J8667J1730m210j69565m5382L68279J51195
7521g9201k00272R469k33245L8554P7347j38740N39249Q9030L4130k95896j46539
7510c06114N8990j7717K45495j50588j27039J83472J4796k20227n2040n4324j7060
7499d42356J94336J17695j99862j36848K10733r2087N8301j64996P7298l3553
7489d11339P205K26391k1564l1482k2441J58160Q9509N632j37421K40822J07649
$$ plain form
7478 211121 -57999 -307626 -327104 -168152 -174043 -133901 -224333 20199 22086 -140388 -140792
7467 -140792 -322062 -280038 -69063 -122028 -179326 2985 141736 246835 -25255 -128848
7457 -128848 216311 231122 180892 173695 -293349 -353793 5238 -286826 -212357 -127547 -103701
7446 -103701 62763 -43262 78370 135874 -81558 84442 -44734 -177096 -73558 37765
7436 37765 -141721 -194715 120198 253230 247204 17771 39332 112854 95794 261315 201586
7425 201586 -45126 -33850 321664 325199 81619 182713 454364 884398 929575 1075757
7415 1075757 1214589 1337842 1343743 1370108 1070312 946565 920463 928183 689151 846057 740721
7404 740721 546666 576290 592452 702845 601974 554253 480419 329828 305844 423099 321704
$$ packed form
7478B11121k69120k49627j9478J58952n891M0142r0432K44532J887j62474m04
7467a40792j81270M2024K10975n2965n7298J82311J38751J05099k72090j03593
7457a28848L45159J4811n0230p197m67044o0444L59031k92064P4469Q4810K3846
7446a03701J66464j06025J21632N7504k17432J66000j29176j32362J03538J11323
7436C7765j79486n2994L14913J33032o026k29433K1561P3522j7060J65521n9729
7425B01586k46712J1276L55514L535k43580J01094K71651M30034M5177J46182
7415A075757J38832J23253N901K6365k99796j23747k6102P720k39032J56906j05336
7404G40721j94055K9624J6162J10393j00871m7721p3834j50591k3984J17255j01395
$$ plain form
7393 321704 248642 316096 621083 590901 798460 856796 968841 1111444 1141764 939467 920475
7382 920475 1117285 960523 793732 712049 736488 909462 855816 617201 486741 256414
7372 256414 268711 376763 386598 548326 687023 453299 306138 129083 158037 241560 145475
7361 145475 55166 53785 99066 -13846 -126846 8147 -139096 28299 -248062 -235224 -37904
7350 -37904 -154362 -177374 -457973 -439073 -470278 -390836 -463297 -547454 -457632 -385951 -132978
7339 -132978 -173011 -389769 -589100 -533272 -465097 -237617 -505461 -358459 -249794 -410691
7329 -410691 -352386 -463752 -512711 -465844 -414206 -592550 -372048 -389357 -385448 -90786 -128913
7318 -128913 -223563 -363481 -378397 -611037 -541170 -235621 -278987 -600913 -722367 -572546
$$ packed form
7393C21704p3062O7454L04987l0182K07559N8336J12045J42603L0320k02297j8992
7382I20475J96810j56762j66791q1683K4439J72974n3646k38615j30460k30327
7372B56414J2297J08052R835J61728J38697k33724j47161j77055K8954Q3523r6085
7361A45475r0309j381M5281j12912j13000J34993j47243J67395k76361J2838J97320
7350c7904j16458k3012k80599J8900l1205P9442p2461q4157Q9822P1681K52973
7339a32978m0033k16758j99331N5828O8175K27480k67844J47002J08665j60897
7329d10691N8305j11366m8959M6867N1638j78344K20502j7309L909K94662l8127
7318a28913r4650j39918j4916k32640O9867L05549m3366l21926j21454J49821
$$ plain form
7308 -572546 -483552 -262239 -356514 -421751 -574654 -734766 -580547 -401519 -520139 -471005
7298 -471005 -409129 -344593 -470839 -378045 -425170 -235248 -56457 -355322 -404853 -498203 -754818
7287 -754818 -607547 -699948 -875133 -664069 -567867 -646374 -598062 -399890 -150914 -397349
7277 -397349 -304834 -100921 -316298 -340268 -450490 -441855 -349609 -309403 -378705 -653229 -540337
7266 -540337 -620036 -457443 -413455 -520509 -333020 -406278 -269828 -126635 -180802 -293277
7256 -293277 -249720 -266908 -382121 -79107 -204394 -290125 -350763 -233792 -267490 -276611 -259095
7245 -259095 -374288 -168306 -131308 -282794 -388456 -471807 -350932 -203340 98046 -100785
7235 -100785 -540798 -465534 -516469 -527853 -512819 -546243 -501009 -311220 -437861 -348151 -120282
$$ packed form
7308e72546Q8994K21313r4275o5237j52903j60112J54219J79028j18620M9134
7298d71005O1876O4536j26246R2794m7125J89922J78791k98865m9531r3350k56615
7287g54818J47271r2401j75185K11064R6202p8507M8312J98172K48976k46435
7277c97349R2515K03913k15377k3970j10222Q635R2246M0206o9302k74524J12892
7266e40337p9699J62593M3988j07054J87489p3258J36450J43193n4167j12475
7256b93277M3557j7188j15213L03014j25287q5731o0638J16971l3698r121J7516
7245b59095j15193K05982L6998j51486j05662q3351J20875J47592L01386j98831
7235a00785m40013P5264n0935j1384J5034l3424M5234J89789j26641Q9710K27869
$$ plain form
7224 -120282 -469805 -291077 -168482 -140795 -189137 -227335 1850 -101319 -133680 -197146 -105406
7213 -105406 15463 204749 -167559 -432272 -478410 -370254 -202822 -308019 -312559 -190545
7203 -190545 -188249 -294262 -503004 -369921 -536295 -243607 -215807 -375397 -371471 -515631 -415595
7192 -415595 -367612 -348472 -307454 -108315 -121606 -241142 -566549 -612814 -240244 -402444 -408842
7181 -408842 -237002 -299668 -440765 -374248 -314525 43582 244705 3555 22345 7351 17041
7170 17041 -279073 -342230 -170663 -138182 -138803 -324031 -327498 -140989 145437 119683 -29275
7159 -29275 -5132 -22841 12483 269517 -1847 25287 78943 309438 -4440 -535896 -236173
7148 -236173 -96073 -98651 160783 143691 -220917 58429 55465 88565 31586 37227 119026
$$ packed form
7224a20282l49523J78728J22595K7687m8342l8198K29185j03169l2361o3466R1740
7213a05406J20869J89286l72308k64713m6138J08156J67432j05197m540J22014
7203a90545K296j06013k08742J33083j66374K92688K7800j59590L926j44160J00036
7192d15595M7983J9140M1018J99139j3291j19536l25407m6265L72570j62200o398
7181d08842J71840o2666j41097O6517N9723L58107K01123k41150J8790j4994R690
7170A7041k96114o3157J71567L2481o21j85228l467J86509K86426k5754j48958
7159b9275K4143j7709L5324K57034k71364K7134N3656K30495l13878n31456K99723
7148b36173J40100k578K59434j7092l64608K79346k964L3100n6979N641Q1799
$$ plain form
7137 119026 124445 -22401 277997 341514 167055 176714 -134637 -148520 -74877 -108760 -220293
7126 -220293 -191117 -77324 -139027 -384853 -290918 -221774 -361248 -418569 -396222 -357481 -97208
7115 -97208 28898 -238527 -244333 -343405 -303086 -338513 -422895 -321197 -311526 -163663 -291638
7104 -291638 -528883 -244193 -76003 -30576 -128051 -270978 -296252 -402752 -590245 -490598
7094 -490598 -322738 -188890 -25026 -192678 -330322 -410296 -466588 -483802 -198482 -305161
7084 -305161 -443388 -373026 -226243 -334722 -383402 -179910 -85182 -248520 -257086 -486763 -428148
7073 -428148 -200165 -131777 -295469 -439171 -140275 118439 24751 -262805 -334878 -398938
7063 -398938 -154479 -348513 -332250 -457836 -765882 -720560 -281110 -283199 -261320 -365439 -461169
$$ packed form
7137A19026N419j46846L00398O3517j74459R659l11351j3883P3643l3883j11533
7126b20293K9176J13793o1703k45826R3935O9144j39474n7321K2347L8741K60273
7115i7208J26106k67425n806r9072M0319l5427q4382J01698R671J47863j27975
7104b91638k37245K84690J68190M5427r7475j42927k5274j06500j87493R9647
7094d90598J67860J33848J63864j67652j37644p9974n6292j7214K85320j06679
7084c05161j38227P0362J46783j08479m8680K03492R4728j63338q566k29677N8615
7073d28148K27983O8388j63692j43702K98896K58714r3688k87556p2073o4060
7063c98938K44459j94034J6263j25586l08046M5322M39450k089K1879j04119r5730
$$ plain form
7052 -461169 -96995 175814 100674 229465 7867 -242190 -163882 -33457 -117004 -76258
7042 -76258 -145076 -308853 -252082 -121804 -42637 -272079 -57285 -7412 -108689 -320229 -485113
7031 -485113 -114829 -64750 -177094 -329615 -454834 -197695 90349 106619 125272 42320
7021 42320 52777 186305 285805 90681 201449 138825 -282556 -216411 93509 -12537 -77897
7010 -77897 -155824 -22357 113692 -8655 -78499 -144792 -28187 -175319 -108455 -104369 -61186
6999 -61186 -151418 -104130 -70482 -199241 -180683 -142896 40989 -19574 -97405 127843 286180
6988 286180 59623 -143662 -121581 -164243 137614 255744 139471 113963 133859 -28806
6978 -28806 326492 50775 -164525 38618 44955 255891 579794 599421 604654 572835 821128
$$ packed form
7052d61169L64174K72809p5140J28791k21598k50057P8308J30425q3547M0746
7042g6258o8818j63777N6771J30278P9167k29442K14794M9873j01277k11540j64884
7031d85113L70284N0079j12344j52521j25219K57139K88044J6270J8653q2952
7021D2320J0457J33528R9500j95124J10768o2624m21381O6145L09920j06046o5360
7010g7897p7927J33467J36049j22347o9844o6293J16605j47132O6864M086M3183
6999f1186r0232M7288L3648j28759J8558L7787J83885o0563p7831K25248J58337
6988B86180k26557k03285K2081m2662L01857J18130j16273k5508J9896j62665
6978b8806L55298k75717k15300K03143O337K10936L23903J9627N233l1819K48293
$$ plain form
6967 821128 948814 708933 576660 742338 466694 386372 581498 431304 486562 699367
6957 699367 787560 817145 620251 695292 928761 820248 784492 697938 520420 384632 469826
6946 469826 445948 384550 144359 506047 558031 265219 244327 349321 229971 -25320
6936 -25320 176768 129062 -18978 -141957 150487 178450 228898 69534 111699 205567 313002
6925 313002 327098 110665 144404 83350 86501 85575 167339 322678 298865 92676 289276
6914 289276 369548 372166 478513 337723 515999 507299 159810 112829 304432 426354 529114
6903 529114 667112 776716 653846 451237 576131 347489 699944 545277 513537 578432
6893 578432 419507 407980 557892 701792 750950 451228 483461 752232 784683 615910
$$ packed form
6967H21128J27686k39881j32273J65678k75644q0322J95126j50194N5258K12805
6957F99367Q8193K9585j96894P5041K33469j08513l5756q6554j77518j35788Q5194
6946D69826k3878o1398k40191L61688N1984k92812k0892J04994j19350k55291
6936b5320K02088m7706j48040j22979K92444K7963N0448j59364M2165R3868J07435
6925C13002J4096k16433L3739o1054L151r26Q1764J55339k3813k06189J96600
6914B89276Q0272K618J06347j40790J78276q700l47489m6981J91603J21922J02760
6903E29114J37998J09604j22870k02609J24894k28642L52455j54667l1740O4895
6893E78432j58925j1527J49912J43900M9158k99722L2233K68771L2451j68773
$$ plain form
6883 615910 489883 144259 325273 258484 351064 394427 318916 375816 307204 318150 336245
6872 336245 601540 679091 488446 482230 778536 692850 503418 774332 712798 334834 455396
6861 455396 265806 326058 526762 665264 543551 609929 723012 811395 947400 788103
6851 788103 645115 702284 614469 790819 465907 494105 735994 738227 759680 653427 623445
6840 623445 787265 706714 416233 800835 773266 675412 1024283 770061 686092 788111
6830 788111 927336 1076840 925232 816214 579527 656815 765838 670412 580673 747574
6820 747574 1032834 931368 689207 560427 509823 459308 661076 755566 591184 581489 475684
6809 475684 414132 874603 841625 606788 598570 733128 815330 776587 903151 962673 801514
$$ packed form
6883F15910j26027l45624J81014o6789R2580M3363p5511N6900o8612J0946J8095
6872C36245K65295P7551j90645o216K96306q5686j89432K70914o1534l77964J20562
6861D55396j89590O0252K00704J38502j21713O6378J13083Q8383J36005j59297
6851G88103j42988N7169q7815J76350l24912K8198K41889K233K1453j06253k9982
6840F23445J63820q0551k90481L84602k7569r7854L48871k54222q3969J02019
6830G88111J39225J49504j51608j09018k36687P7288J09023r5426q9739J66901
6820G47574K85260j01466k42161j28780n0604n0515K01768R4490j64382r695j05805
6809D75684o1552M60471l2978k34837q218J34558Q2202l8743J26564N9522j61159
$$ plain form
6798 801514 647689 449185 734940 965440 845861 793103 797595 530075 724077 745567
6788 745567 710755 892212 1070275 932047 925111 898946 884078 1234880 1101896 908613 942376
6777 942376 1254117 1124928 1029037 1279858 1371094 1451503 1219177 1162547 1258971 1349396 1553702
6766 1553702 1503213 1762721 1670605 1534498 1222815 1310812 1644745 1659115 1459603 1351877
6756 1351877 1436272 1755485 1955315 1959019 1806149 1682637 1451166 1560721 1427458 1520181
6746 1520181 1604611 1810606 1902558 2076875 2178761 2268604 2000453 2201254 2274663 2191719
6736 2191719 2428277 2347739 2625377 2572887 2672903 3064635 2953843 2820532 3130901 3200845
6726 3200845 3571120 3886179 3911124 3967800 3996750 3981406 4044981 4109754 4226372 4210502 4546690
$$ packed form
6798H01514j53825j98504K85755K30500j19579n2758M492k67520J94002K1490
6788G45567l4812J81457J78063j38228o936k6165j4868L50802j32984j93283L3763
6777I42376L11741j29189r5891K50821R1236Q0409k32326n6630R6424R0425K04306
6766A553702n0489K59508r2116j36107l11683Q7997L33933J4370j99512j07726
6756A351877Q4395L19213J99830L704j52870j23512k31471J09555j33263R2723
6746A520181Q4430K05995R1952J74317J01886Q9843k68151K00801P3409q2944
6736B191719K36558q0538K77638n2490J00016L91732j10792j33311L10369O9944
6726C200845L70275L15059K4945N6676K8950j5344O3575O4773J16618j5870L36188
$$ plain form
6715 4546690 4512833 4468466 4667681 4781537 4813115 4876669 4868819 4965882 5097480 5019197 4947405
6704 4947405 5297854 5490809 5697026 5756453 5825693 6165192 6318332 6619252 6932891 6956443
6694 6956443 7109146 7352307 7334336 7683787 7855000 8039154 8180974 8322944 8778118 9166300
6684 9166300 9635768 10068044 10648242 11166597 11858255 12402342 12830206 13463817 14498226
6675 14498226 15264300 15923910 17164310 18361364 19584283 20880138 22390478 23943796
6667 23943796 25707984 27558434 29662218 31849461 34432275 37676989 40925466 44332825
6659 44332825 48497724 53225122 58335135 64480951 71998468 81358958 93156303 107221692
6651 107221692 123258886 140107198 157340505 172595338 183390737 188412922 186411931
$$ packed form
6715D546690l3857m4367J99215J13856L1578O3554p850R7063J31598p8283p1792
6704D947405L50449J92955K06217N9427O9240L39499J53140L00920L13639K3552
6694F956443J52703K43161j7971L49451J71213J84154J41820J41970M55174L88182
6684I166300M69468M32276N80198N18355O91658N44087M27864O33611J034409
6675A4498226P66074O59610J240400J197054J222919J295855J510340J553318
6667B3943796J764188J850450K103784K187243K582814L244714L248477L407359
6659D4332825M164899M727398N110013O145816P517517R360490J1797345J4065389
6651A07221692J6037194J6848312J7233307J5254833J0795399N022185k000991
$$ plain form
6644 186411931 180225796 174785190 172593832 173663420 177994632 184884838 193297548 200986365
6636 200986365 205166012 203902816 195812336 180841693 164088997 148493382 134361127
6629 134361127 122119309 111755783 102735833 94485147 86888680 80191973 73885667 68106378
6621 68106378 62567746 57671164 53783808 50110874 46606500 43849032 40960323 38391848
6613 38391848 36280769 33818187 31660538 29915807 28259008 26926486 25660831 24454173
6605 24454173 23237997 21809711 20828844 19916721 18979479 18359638 17600914 16772581 16285902
6596 16285902 15593916 15051444 14522301 14106075 13555426 12921816 12289331 11828346 11667596
6587 11667596 11254274 10632208 10366355 10233515 9954665 9371227 9258617 8964965 8722294
$$ packed form
6644A86411931o186135n440606k191358J069588M331212O890206Q412710P688817
6636B00986365M179647j263196q090480j4970643j6752696j5595615j4132255
6629A34361127j2241818j0363526r019950q250686p596467o696707o306306n779289
6621F8106378n538632m896582l887356l672934l504374k757468k888709k568475
6613C8391848k111079k462582k157649j744731j656799j332522j265655j206658
6605B4454173j216176j428286r80867r12123r37242o19841p58724q28333m86679
6596A6285902o91986n42472n29143m16226n50649o33610o32485m60985j60750
6587A1667596m13322o22066k65853j32840k78850n83438j12610k93652k42671
$$ plain form
6578 8722294 8397637 8005911 8090855 8037513 7835616 7501727 7359770 6956942 6799386 6882941
6568 6882941 6584068 6521317 6158603 5931258 5802814 5992560 5754880 5375703 5125491 5088997
6558 5088997 5158103 4939416 4957538 4992461 4882583 4859966 4667128 4433179 4274898 4520638
6548 4520638 4519169 4604989 4613001 4243095 4089114 3879435 3816124 3721883 3639765 3601354 3337492
6537 3337492 3635003 3782456 3664858 3433658 3538048 3657100 3483418 3585175 3598229 3250954
6527 3250954 2890346 2845287 2752194 2676766 2499957 2604103 2575722 2773809 2958112 2715604
6517 2715604 2529179 2404978 2599591 2737553 2448127 2395840 2144733 2013876 2172082 2274189
6507 2274189 2261300 2367250 2307004 2100498 2086726 2125930 1904005 1897798 1787316 1794067 1803642
$$ packed form
6578H722294l24657l91726Q4944n3342k01897l33889j41957m02828j57556Q3555
6568F882941k98873o2751l62714k27345j28444J89746k37680l79177k50212l6494
6558E088997O9106k18687J8122L4923j09878k2617j92838k33949j58281K45740
6548D520638j469Q5820Q012l69906j53981k09679o3311r4241q2118l8411k63862
6537C337492K97511J47453j17598k31200J04390J19052j73682J01757J3054l47275
6527C250954l60608m5059r3093p5428j76809J04146k8381J98087J84303k42508
6517B715604j86425j24201J94613J37962k89426n2287k51107j30857J58206J02107
6507B274189j2889J05950o0246k06506j3772L9204k21925o207j10482O751R575
$$ plain form
6496 1803642 1754031 1500827 1433900 1661310 1875292 1947058 1617359 1775583 1672245 1341184
6486 1341184 1552196 1417523 1400771 1645537 1366151 1436227 1262625 1241890 1353131 1451166
6476 1451166 1327733 1234012 1287357 1247451 1480475 1448970 1547937 1533355 1280048 1239200 1276264
6465 1276264 860040 1004703 1008201 932674 981275 915669 718066 845935 938248 1067795 840486
6454 840486 901742 840757 844674 860716 826253 845879 851593 842621 871763 648045 443852 457469
6442 457469 510998 589768 1061989 1016013 854674 896095 677124 1050299 984285 1053932 1169360
6431 1169360 1267397 1207519 1001433 725349 821607 931065 988071 986328 928689 871654 980628
6420 980628 1018313 1408298 1178925 868574 700476 792197 775619 962769 1077790 952427
$$ packed form
6496A803642m9611k53204o6927K27410K13982P1766l29699J58224j03338l31061
6486A341184K11012j34673j6752K44766k79386P0076j73602k0735J11241R8035
6476A451166j23433r3721N3345l9906K33024l1505R8967j4582k53307m0848L7064
6465A276264m16224J44663L498p5527M8601o5606j97603J27869R2313J29547k27309
6454H40486O1256o0985L917J6042l4463J9626N714q972K9142k23718k04193J3617
6442D57469N3529P8770M72221m5976j61339M1421k18971L73175o6014O9647J15428
6431A169360R8037n9878k06086k76084R6258J09458N7006j743n7639n7035J08974
6420I80628L7685L89985k29373l10351j68098R1721j6578J87150J15021j25363
$$ plain form
6410 952427 1022947 937980 895376 1092346 1362860 1369818 999517 777381 1019243 1215403 1343744
6399 1343744 1411532 1685998 1828196 2014168 1940451 1979526 2028062 2020195 1596260 1622449 1948306
6388 1948306 2027915 2115470 1942703 1999279 2107041 2009984 1944073 2107848 2230203 2211397 2059107
6377 2059107 2220825 2378039 2636878 2441580 2396361 2172591 1959679 1843057 1960060 2170426
6367 2170426 1974878 1975856 2090080 2098461 1924344 2156353 2088701 1916112 1695800 1469403 1443044
6356 1443044 1099323 1143157 1106083 1135512 1058889 750204 776030 944508 896712 771595 771909
6345 771909 611664 586182 461450 474567 753405 633409 707238 721359 744180 726271 589473
6334 589473 369645 476900 474044 478325 648831 649971 739517 604257 764374 966426 1161561
$$ packed form
6410I52427P0520q4967m2604J96970K70514O958l70301k22136K41862J96160J28341
6399A343744O7788K74466J42198J85972p3717L9075M8536p867m23935K6189L25857
6388A948306P9609Q7555j72767N6576J07762r7057o5911J63775J22355j8806j52290
6377B059107J61718J57214K58839j95298m5219k23770k12912j16622J17003K10366
6367B170426j95548R78J14224Q381j74117K32009o7652j72589k20312k26397k6359
6356A443044l43721M3834l7074K9429p6623l08685K5826J68478m7796j25117L14
6345G71909j60245k5482j24732J3117K78838j19996P3829J4121K2821j7909j36798
6334E89473k19828J07255k856M281J70506J140Q9546j35260J60117K02052J95135
$$ plain form
6323 1161561 1033694 1014129 854957 860344 1180513 1291179 1078128 915723 992464 983738 1106039
6312 1106039 1143224 1029831 877947 891216 1011762 872553 930394 823387 662548 659475
6302 659475 840511 691173 495176 686697 918251 775542 727660 634062 550378 609090
6292 609090 744312 462757 451347 389532 346735 593456 370028 149264 440921 381283
6282 381283 359671 384953 452636 434381 289109 396895 580805 329961 225272 303634 404787
6271 404787 886542 416945 137308 210953 505909 513949 210024 152031 321619 485694
6261 485694 417630 284552 223136 179230 118595 149211 473655 365718 320073 692987 894977
6250 894977 934473 851180 744431 1097837 1176414 1444419 1338099 1088833 989832 1119170
$$ packed form
6323A161561j27867j9565j59172N387L20169J10666k13051j62405P6741q726J22301
6312A106039L7185j13393j51884J3269J20546j39209N7841j07007j60839l073
6302F59475J81036j49338j95997J91521K31554j42709m7882r3598q3684N8712
6292F09090J35222k81555j1410o1815m2797K46721k23428k20764K91657n9638
6282C81283k1612K5282O7683j8255j45272J07786J83910k50844j04689P8362J01153
6271D04787M81755m69597k79637P3645K94956Q040l03925n7993J69588J64075
6261D85694o8064j33078o1416m3906o0635L0616L24444j07937m5645L72914K01990
6250H94977L9496q3293j06749L53406P8577K68005j06320k49266r9001J29338
$$ plain form
6240 1119170 1243192 1069942 881521 1137726 1273481 1413833 1330900 828512 843339 857421
6230 857421 725122 607508 593826 563401 501297 514757 182502 125605 334161 443312 328664
6219 328664 497163 384131 406012 511152 48950 4382 127629 300454 73218 280708
6209 280708 428022 300366 111291 40467 153044 239223 287000 454598 410510 275539
6199 275539 167539 362967 166674 401596 463400 232152 298940 361712 344191 508199
6189 508199 457848 244287 19263 -84525 74034 268173 288852 51901 -104110 -96853
6179 -96853 -5983 254964 102207 -229086 41555 51693 163334 462769 457869 98023 15184
6168 15184 -3232 -169071 -99824 84574 129268 184469 429918 144370 -248205 -192628 39502
$$ packed form
6240A119170J24022j73250j88421K56205J35755J40352q2933n02388J4827J4082
6230H57421j32299j17614j3682l0425o2104J3460l32255n6897K08556J09151j14648
6219C28664J68499j13032K1881J05140m62202m4568J23247J72825k27236K07490
6209B80708J47314j27656j89075p0824J12577Q6179M7777J67598m4088j34971
6199B75539j08000J95428j96293K34922O1804k31248O6788O2772j7521J64008
6189E08199n0351k13561k25024j03788J58559J94139K0679k36951j56011P257
6179i6853R0870K60947j52757l31293K70641J0138J11641K99435m900l59846q2839
6168A5184j8416j65839O9247J84398M4694N5201K45449k85548l92575N5577K32130
$$ plain form
6157 39502 -91816 9180 291359 87281 30738 -7489 44086 228253 343041 272242 45280
6146 45280 -173025 162471 322391 594283 558804 260210 259670 260128 314521 103084 43049
6135 43049 279973 420957 498225 537549 445972 487772 422285 402209 407579 570913 438640
6124 438640 99154 283804 435704 242466 236086 82568 62247 270980 254725 310032 95185
6113 95185 132500 397953 402724 154792 279301 306769 363400 323729 503751 328198 276239
6102 276239 339383 192181 157726 -32927 141603 48197 141177 263457 106167 -110658
6092 -110658 -161966 101637 -22378 -32743 -138083 -175920 -96483 -263198 -208973 -304918 -242743
6081 -242743 -89670 7098 -143964 -274991 -29861 103151 180537 -61695 -391484 -354306
$$ packed form
6157C9502j31318J00996K82179k04078n6543l8227N1575J84167J14788p0799k26962
6146D5280k18305L35496J59920K71892l5479k98594n40M58N4393k11437o0035
6135D3049K36924J40984P7268L9324r1577M1800o5487k0076N370J63334j32273
6124D38640l39486J84650J51900j93238o380j53518k0321K08733j6255N5307k14847
6113I5185L7315K65453M771k47932J24509K7468N6631l9671J80022j75553n1959
6102B76239O3144j47202l4455j90653J74530r3406R2980J22280j57290k16825
6092a10658n1308K63603j24015j0365j05340l7837P9437j66715N4225r5945O2175
6081b42743J53073R6768j51062j31027K45130J33012P7386k42232l29789L7178
$$ plain form
6071 -354306 -135958 -227482 -167194 143826 235556 140796 136077 -133329 -16419 145082 -98309
6060 -98309 -106115 43019 -26511 -76376 173159 142978 153334 241657 127806 -91208 -84378
6049 -84378 -60141 -352949 -31388 209920 19573 -27766 -155994 86093 37404 108896 -101003
6038 -101003 49714 58439 57373 -151358 -303499 -179524 -39826 64089 -114392 -205920 69432
6027 69432 348854 296548 184120 -103405 -181048 44226 -170997 -154383 -39779 7604 -299151
6016 -299151 -176258 -89831 -21424 -43151 -377901 -83495 -187512 -132825 12804 -34996 -77695
6005 -77695 -72985 24570 328963 109649 75998 229331 207646 174094 212546 105954 23343
5994 23343 31342 374613 451146 214320 19535 107875 225456 333585 451532 318488 84553
$$ packed form
6071c54306K18348r1524O0288L11020R1730r4760m719k69406J16910J61501k43391
6060i8309p806J49134o9530m9865K49535l0181J0356Q8323j13851k19014O830
6049h4378K4237k92808L21561K41308j90347m7339j28228K42087m8689P1492k09899
6038a01003J50717Q725j066k08731j52141J23975J39698J03915j78481r1528K75352
6027F9432K79422n2306j12428k87525p7643K25274k15223J6614J14604M7383l06755
6016b99151J22893Q6427O8407k1727l34750K94406j04017N4687J45629m7800m2699
6005g7695M710R7555L04393k19314l3651J53333k1685l3552L8452j06592q2611
5994B3343P999L43271P6533k36826j94785Q8340J17581J08129J17947j33044k33935
$$ plain form
5983 84553 175638 115504 234802 358402 104874 -139832 -115188 -54244 99881 148719 160921
5972 160921 164673 156999 342129 278489 98904 230513 159473 -127270 -232806 -18805 -20041
5961 -20041 -16123 -66701 154506 295688 128681 -61499 -326314 -143789 -154224 129482 39333
5950 39333 -58363 -255463 -358326 -174405 94820 79933 168936 162117 -12061 67892 115046
5939 115046 -31230 -161193 -174288 213514 285077 355544 197196 -46383 53406 40769 -188342
5928 -188342 -92585 129352 279995 24517 -8739 10668 -133544 -227192 -71288 -93180 -268557
5917 -268557 58069 -16905 38626 -30130 72355 110647 -14984 119785 49976 149491 259962
5906 259962 221387 80950 -94590 134098 402342 158402 -3526 291584 296425 294674 174100
$$ packed form
5983H4553R1085o0134J19298J23600k53528k44706K4644O0944J54125M8838J2202
5972A60921L752p674J85130o3640j79585J31609p1040k86743j05536K14001j236
5961b0041L918n0578K21207J41182j67007j90180k64815J82525j0435K83706r0149
5950C9333r7696j97100j02863J83921K69225j4887Q9003o819j74178P9953M7154
5939A15046j46276j29963j3095L87802P1563P0467j58348k43579R9789j2637k29111
5928a88342R5757K21937J50643k55478l3256J9407j44212r3648J55904k1892j75377
5917b68557L26626p4974N5531o8756J02485L8292j25631J34769o9809R9515J10471
5906B59962l8575j40437j75540K28688K68244k43940j61928K95110M841j751j20574
$$ plain form
5895 174100 183404 476063 470981 614382 507988 240839 231757 436928 569288 504648 304760
5884 304760 395341 554876 382704 486394 352918 573858 644776 550855 471036 631483
5874 631483 779610 930974 719941 598521 539298 283900 211813 94591 316608 583335
5864 583335 640806 586793 311171 266279 34859 114854 226722 371011 351243 267759 163882
5853 163882 150932 225975 195098 225084 28569 -249993 -69151 126646 237431 356122
5843 356122 324170 399686 34039 -290840 -302965 -314900 -45628 51498 2867 -26124 -88193
5832 -88193 165583 235125 313572 74593 98875 404 -221354 -215290 -106626 353508 602066
5821 602066 216761 35968 113342 314224 90921 274470 381402 328493 274382 93196
$$ packed form
5895A74100R304K92659n082J43401j06394k67149r082K05171J32360o4640j99888
5884C04760R0581J59535j72172J03690j33476K20940P0918r3921p9819J60447
5874F31483J48127J51364k11033j21420n9223k55398p2087j17222K22017K66727
5864E83335N7471n4013k75622m4892k31420P9995J11868J44289j9768q3484j03877
5853A63882j2950P5043l0877K9986j96515k78562J80842J95797J10785J18691
5843C56122l1952P5516l65647l24879j2125j1935K69272R7126m8631k8991o2069
5832h8193K53776O9542P8447k38979K4282r8471k21758O064J08664M60134K48558
5821F02066l85305j80793P7374K00882k23303J83549J06932n2909n4111j81186
$$ plain form
5811 93196 276417 537624 399497 332750 266472 287271 414144 398003 141993 177603 345716
5800 345716 110245 -147498 12984 104518 -25190 204264 179597 34981 231943 193741
5790 193741 199574 153992 -38398 -92124 -48221 136372 73938 48487 70089 -106695 -350041
5779 -350041 157087 205964 109633 -14277 -268739 -140992 57274 -47579 76415 1548
5769 1548 -42019 -11346 101525 231259 133638 145051 419596 476657 243418 -32374 -8966
5758 -8966 82761 327494 425525 298659 -28658 -7937 177084 91302 152337 347853 234633
5747 234633 250194 80004 -182444 -223220 -205111 87818 105185 259533 55484 -33483 -109536
5736 -109536 -50189 -20087 -72264 -123035 -65781 -137256 -99878 -124996 -33623 166142 178449
$$ packed form
5811I3196J83221K61207j38127o6747o6278K0799J26873j6141k56010L5610J68113
5800C45716k35471k57743J60482R1534j29708K29454k4667j44616J96962l8202
5790A93741N833m5582j92390n3726M3903J84593o2434k5451K1602j76784k43346
5779c50041N07128M8877r6331j23910k54462J27747J98266j04853J23994p4867
5769A548m3567L0673J12871J29734r7621J1413K74545N7061k33239k75792K3408
5758h966R1727K44733R8031j26866l27317K0721J85021q5782O1035J95516j13220
5747B34633J5561j70190k62448m0776J8109K92929J7367J54348k04049q8967p6053
5736a09536N9347L0102n2177n0771N7254p1475L7378k5118R1373J99765J2307
$$ plain form
5725 178449 926 94896 393919 470799 288996 140876 -51091 -110682 3550 -128364
5715 -128364 59251 255561 174062 289855 215130 -27125 -193247 38830 252103 196045
5705 196045 112968 381 -18373 160354 208512 86540 57174 23457 -44831 162923 208865
5694 208865 -57613 -18481 -11592 220830 247106 140591 566532 453274 345976 329568 82963
5683 82963 50529 225548 404784 278527 98756 26354 31344 -5245 709 43472 28794
5672 28794 239246 182664 390254 583467 360002 11175 -18239 316979 263724 273735 176288
5661 176288 128618 299285 260217 340536 282990 121275 256514 380544 244144 256895 127732
5650 127732 25662 -907 181797 223182 154363 285049 203550 151076 100640 147103 353676
$$ packed form
5725A78449j77523R3970K99023P6880j81803j48120j91967n9591J14232j31914
5715a28364J87615J96310q1499J15793p4725k42255j66122K32077K13273n6058
5705A96045q3077j12587j8754J78727M8158j21972k9366l3717o8288K07754M5942
5694B08865k66478L9132O889K32422K6276j06515M25941j13258j07298j6408k46605
5683H2963l2434J75019J79236j26257j79771p2402M990l6589N954M2763j4678
5672B8794K10452n6582K07590J93213k23465l48827k9414L35218n3255J0011r7447
5661A76288m7670J70667l9068Q0319n7546j61715J35239J24030j36400J2751j29163
5650A27732j02070k6569J82704M1385o8819J30686q1499n2474n0436M6463K06573
$$ plain form
5639 353676 417818 173784 94198 -115986 236426 576076 374538 -11929 -259194 -92250
5629 -92250 290200 164706 70742 205773 286353 225773 3163 56243 151309 -4877 -112645
5618 -112645 -51458 -73978 -215618 82752 120147 387758 154433 335180 286507 38376
5608 38376 37528 282354 260120 47343 -182797 -50172 287038 292751 164933 99648 308510
5597 308510 275982 425799 348844 275885 170515 24913 -215053 -27184 85033 196134
5587 196134 228300 197535 183047 185985 168850 188012 202594 -49085 35195 143847 222249
5576 222249 142380 301523 432679 106539 -70827 207487 94367 170311 411526 107865
5566 107865 201520 221045 125055 380963 387971 271242 344332 126208 179959 216793 254823
$$ packed form
5639C53676O4142k44034p9586k10184L52412L39650k01538l86467k47265J66944
5629i2250L82450j25494r3964J35031Q0580o0580k22610N3080R5066j56186j07768
5618a12645O1187k2520j41640K98370L7395K67611k33325J80747m8673k48131
5608C8376q48K44826k2234k12777k30140J32625L37210N713j27818o5285K08862
5597C08510l2528J49817p6955p2959j05370j45602k39966J87869J12217J11101
5587A96134L2166l0765j4488K938j7135J9162J4582k51679Q4280J08652P8402
5576B22249p9869J59143J31156l26140j77366K78314j13120P5944K41215l03661
5566A07865R3655J9525r5990K55908P008j16729P3090k18124N3751L6834L8030
$$ plain form
5555 254823 370233 198884 95006 5911 58709 218276 224510 197506 29160 197997 387754
5544 387754 363342 434808 535798 230445 178690 283650 216933 72078 109414 144284 70655
5533 70655 -48871 219956 407320 315426 33521 140298 35010 -116168 174033 421394
5523 421394 269630 302835 218833 5286 88066 -26489 2097 203121 291813 269391 217951
5512 217951 319364 320014 194613 159880 42113 -58443 -172617 -99889 6405 100425 196707
5501 196707 291197 422860 228533 87993 -70366 107113 248396 82856 -95004 -12555
5491 -12555 139364 269530 39937 143060 275423 342902 123649 160765 29963 169884
5481 169884 202128 125131 384900 369049 308604 135131 46255 -95840 99918 19010 35880
$$ packed form
5555B54823J15410j71349j03878q9095N2798J59567O234k7004j68346J68837J89757
5544C87754k4412P1466J00990l05353n1755J04960o6717j44855L7336L4870p3629
5533G0655j19526K68827J87364r1894k81905J06777j05288j51178K90201K47361
5523D21394j51764L3205q4002k13547Q2780j14555K8586K01024Q8692k2422n1440
5512B17951J01413O50j25401l4733j17767j00556j14174P2728J06294R4020R6282
5501A96707R4490J31663j94327j40540j58359J77479J41283j65540j77860Q2449
5491a2555J51919J30166k29593J03123J32363O7479k19253L7116j30802J39921
5481A69884L2244p6997K59769j5851o0445j73473q8876j42095J95758q0908J6870
$$ plain form
5470 35880 79467 188398 112932 236054 94932 107611 -35319 4337 -6016 69839 69904 -151854
5458 -151854 -37877 240852 17379 -103099 -52408 360326 287179 75429 365014 357431
5448 357431 288529 121055 -75186 -50490 -63883 195570 172505 113221 272649 145426 177729
5437 177729 319004 122688 -94102 -219032 -157489 -108298 -228971 -42597 258054 179787
5427 179787 163494 148731 101024 -229403 -398942 -408818 -144879 -241425 -227442 33220 -88412
5416 -88412 -312836 -262840 -149918 -198268 4642 -19672 137262 256960 94791 1307 158171
5405 158171 155185 255712 222947 -185258 -119116 -14981 -228682 57369 389294 113236
5395 113236 -182529 -65169 -288656 -95458 -35889 66976 200204 35404 58323 144934
$$ packed form
5470C5880M3587J08931p5466J23122j41122J2679j42930L9656j0353P5855O5k21758
5458a51854J13977K78729k23473j20478N0691M12734p3147k11750K89585p583
5448C57431o8902j67474j96241K4696j3393K59453k3065n9284J59428j27223L2303
5437A77729J41275j96316k16790j24930O1543M9191j20673J86374L00651p8267
5427A79787j6293j4763m7707l30427j69539r876K63939r6546J3983K60662j21632
5416h8412k24424M9996J12922m8350K02910k4314J56934J19698j62169r3484J56864
5405A58171k986J00527l2765m08205O6142J04135k13701K86051L31925k76058
5395A13236k95765J17360k23487J93198N9569J02865J33228j64800K2919Q6611
$$ plain form
5385 144934 82125 126050 -81898 -228881 -339013 -170831 96815 -14019 -14609 -98502 308
5374 308 -248103 -12896 199279 81625 173086 -76228 86464 21517 -81569 228304 312500
5363 312500 23169 -199648 -226315 -103908 27766 123936 66574 52232 -12300 128184 -100688
5352 -100688 -296796 -200573 95535 -28957 -128431 245171 135242 -13328 -197444 -83711
5342 -83711 -57879 -20418 -152367 -41491 -149060 -109330 126918 144693 289085 214113 351782
5331 351782 90704 -70087 -133677 -288198 -11771 150436 -121908 -50733 -42435 8184 262739
5320 262739 196268 51229 -173134 -256461 -231486 -152299 -57315 72094 90896 107138 188115
5309 188115 280920 163789 247952 256302 299752 219748 179671 387446 254983 149492 308960
$$ packed form
5385A44934o2809M3925k07948j46983j10132J68182K67646j10834n90q3893R8810
5374C08k48411K35207K12175j17654R1461k49314J62692o4947j03086L09873Q4196
5363C12500k89331k22817k6667J22407J31674R6170n7362j4342o4532J40484k28872
5352a00688j96108R6223K96108j24492r9474L73602j09929j48570j84116J13733
5342h3711K5832L7461j31949J10876j07569L9730K36248J7775J44392p4972J37669
5331C51782k61078j60791o3590j54521K76427J62207k72344P1175Q298N0619K54555
5320B62739o6471j45039k24363q3327K4975P9187R4984J29409J8802J6242Q0977
5309A88115R2805j17131Q4163Q350M3450q0004m0077K07775j32463j05491J59468
$$ plain form
5298 308960 184515 -40180 86813 249829 328338 1007 -38151 28607 10417 -22349 134807
5287 134807 246611 227593 457331 309265 313306 168334 99471 237753 88726 1564 -69793
5276 -69793 -113552 -40503 28754 123366 76041 197112 291906 335301 363274 165462 24528
5265 24528 400517 390703 8365 3164 304507 233021 169502 458713 326057 436815 517825
5254 517825 611394 487296 538349 570484 242052 182877 262293 51220 105555 371028 297591
5243 297591 122243 348929 471738 523870 738417 806711 586851 367387 498299 539324
5233 539324 570700 541836 400744 440896 383761 341612 579193 698282 746285 847010 559176
5222 559176 345175 423060 404054 471872 457543 472641 633708 500355 598445 693345 628423
$$ packed form
5298C08960j24445k24695J26993J63016P8509l27331l9158O6758j8190l2766J57156
5287A34807J11804j9018K29738j48066M041j44972o8863J38282j49027q7162p1357
5276f9793m3759P3049O9257R4612m7325J21071R4794M3395K7973j97812j40934
5265B4528L75989r814l82338n201L01343p1486o3519K89211j32656J10758Q1010
5254E17825R3569j24098N1053L2135l28432n9175P9416k11073N4335K65473p3437
5243B97591j75348K26686J22809N2132K14547O8294k19860k19464J30912M1025
5233E39324L1376k8864j41092M0152n7135m2149K37581J19089M8003J00725k87834
5222E59176k14001P7885j9006O7818j4329J5098J61067j33353R8090R4900o4922
$$ plain form
5211 628423 672350 938533 1000590 906895 612640 650391 702420 604054 850364 578004 339804
5200 339804 401121 433547 618034 789638 809789 676344 627001 641868 642916 711403 976110
5189 976110 998419 762229 758101 902296 1137873 946310 970659 715386 661569 791958 815971
5178 815971 580886 683448 724266 953503 1084188 1108558 1211589 1100407 1099678 1109853 1219500
5167 1219500 1067615 1057695 1356643 1481923 1404720 1553366 1604559 1567559 1521774 1387157 1444683
5156 1444683 1629084 1514517 1700475 1742501 1583920 1479964 1480160 1473806 1067871 1125403 1439953
5145 1439953 1493727 1408658 1419082 1572408 1612581 1448827 1646274 1610140 1505411 1457877 1574637
5134 1574637 1809830 1921455 1906451 1859635 1940674 2115940 2198512 2336091 2140650 2193629
$$ packed form
5211F28423M3927K66183O2057r3695k94255L7751N2029r8366K46310k72360k38200
5200C39804O1317L2426J84487J71604K0151j33445m9343J4867J048O8487K64707
5189I76110K2309k36190m128J44195K35577j91563K4349k55273n3817J30389K4013
5178H15971k35085J02562M0818K29237J30685K4370J03031j11182p29J0175J09647
5167A219500j51885r920K98948J25280p7203J48646N1193l7000m5785j34617N7526
5156A444683J84401j14567J85958M2026j58581j03956J96o354m05935N7532L14550
5145A439953N3774q5069J0424J53326M0173j63754J97447l6134j04729m7534J16760
5134A574637K35193J11625j5004m6816Q1039J75266Q2572J37579j95441N2979
$$ plain form
5124 2193629 2029732 1969074 2220353 2228596 2176659 2070918 2084627 1981810 2119211 2272122
5114 2272122 2379581 2164669 2283151 2460741 2479770 2239889 2264505 2384080 2534274 2749411
5104 2749411 2794597 2770450 2944345 2801029 2770511 2910380 2792091 2953755 3018712 2860511
5094 2860511 2803856 2819433 2943068 3098897 3122974 3284859 3217381 3310206 3287040 3243622 3160014
5083 3160014 3202176 3146019 3510116 3687312 3300731 3128646 3202729 3498219 3435145 3644823
5073 3644823 3626611 3645536 3662795 3340351 3329217 3421367 3483715 3735578 3677215 3558756 3353086
5062 3353086 3274797 3343729 3392177 3530531 3623756 3458164 3809196 3537337 3317997 3433428
5052 3433428 3430279 3545591 3535613 3352981 3463476 3659899 3479526 3513338 3771295 3876106
$$ packed form
5124B193629j63897o0658K51279Q243n1937j05741J3709j02817J37401J52911
5114B272122J07459k14912J18482J77590J9029k39881K4616J19575J50194K15137
5104B749411M5186k4147J73895j43316l0518J39869j18289J61664O4957j58201
5094B860511n6655J5577J23635J55829K4077J61885o7478R2825k3166m3418q3608
5083C160014M2162n6157L64097J77196l86581j72085P4083K95490o3074K09678
5073C644823j8212J8925J7259l22444j1134R2150O2348K51863n8363j18459k05670
5062C353086p8289O8932M8448J38354R3225j65592L51032k71859k19340J15431
5052C433428l149J15312r978j82632J10495J96423j80373L3812K57957J04811
$$ plain form
5042 3876106 4175611 4211952 4083824 4081987 4123600 4374813 4413805 4352079 4126035 4010193 4218404
5031 4218404 4238802 4184294 4299090 4453211 4518166 4499437 4529140 4472128 4388762 4386254 4477763
5020 4477763 4684792 4711012 4617771 4945476 5132311 5082044 5152104 5128722 5216534 5102588 4970169
5009 4970169 5256687 5341423 5407464 5460272 5376433 5603957 5895131 5891441 5823071 6031686 5906551
4998 5906551 5999106 6222801 6261153 6386555 6308084 6492877 6779517 6645440 6664926 6928609
4988 6928609 6944359 6978941 7001107 7300575 7361817 7290252 7290134 7416962 7447237 7713003 7790885
4977 7790885 7687196 7640113 7951340 8336528 8322213 8216562 8144749 7969666 8193523 8037189
4967 8037189 8219068 8324486 8401198 8720040 8877551 8770156 8903388 9100450 9261982 9234440
$$ packed form
5042C876106K99505L6341j28128j837M1613K51213L8992o1726k26044j15842K08211
5031D218404K0398n4508J14796J54121O4955j8729K9703n7012q3366k508R1509
5020D477763K07029K6220r3241L27705J86835n0267P0060k3382Q7812j13946j32419
5009D970169K86518Q4736O6041N2808q3839K27524K91174l690o8370K08615j25135
4998E906551R2555K23695L8352J25402p8471J84793K86640j34077J9486K63683
4988F928609J5750L4582K2166K99468O1242p1565j18J26828L0275K65766P7882
4977G790885j03689m7083L11227L85188j4315j05651p1813j75083K23857j56334
4967H037189J81879J05418P6712L18842J57511j07395J33232J97062J61532k7542
$$ plain form
4957 9234440 9159821 9303086 9143834 9384620 9558780 9987900 10126382 9954303 10207163 10366090
4947 10366090 10686211 10940858 11290059 11247527 11398757 11431763 11269566 11477947 11631726 11796772
4937 11796772 11646631 11754749 11754889 12121333 12603066 12712267 12824322 13114020 13413952 13688298
4927 13688298 13693969 14186849 14598134 14883587 14856190 14914666 14920329 14973607 15432034 15693528 15941844
4916 15941844 16206261 16669740 16921236 17178391 17694524 18370523 18989861 19708212 20600119
4907 20600119 21541961 22287445 23197610 24171936 24932603 25695160 26701938 27713118 28736383
4898 28736383 29796458 30643060 31620622 32673702 33667858 34730782 35697851 36705653 38093321
4889 38093321 39879602 41576537 43123654 45132869 47377630 50096732 52959097 55562728
$$ packed form
4957I234440p4619J43265j59252K40786J74160M29120J38482j72079K52860J58927
4947A0366090L20121K54647L49201m2532J51230L3006j62197K08381J53779J65046
4937A1796772j50141J08118J40L66444M81733J09201J12055K89698K99932K74346
4927A3688298N671M92880M11285K85453k7397N8476N663N3278M58427K61494K48316
4916A5941844K64417M63479K51496K57155N16133O75999O19338P18351Q91907
4907B0600119R41842P45484R10165R74326P60667P62557J006778J011180J023265
4898B8736383J060075Q46602R77562J053080R94156J062924R67069J007802J387668
4889C8093321J786281J696935J547117K009215K244761K719102K862365K603631
$$ plain form
4881 55562728 58470841 62129300 66346527 70407292 74317300 77913416 81465238 84527092
4873 84527092 87262676 89295808 91123005 92457608 93449430 94426928 94861580 95275057 95597425
4864 95597425 95951184 96232337 96950232 98221908 99577778 101594039 104087630 107084836 110500350
4855 110500350 114438884 118815610 123664463 129073892 134730633 140627362 146253406 151544192
4847 151544192 155889788 159540787 162015575 164052593 165174175 165664818 165803950 166086417
4839 166086417 165820561 165369976 164790931 164455893 164336625 164739759 165390568 166856193 168884198
4830 168884198 171571863 175341234 179520094 184332489 189531157 194950305 200176376 205289630
4822 205289630 209951193 213555787 216582454 218796466 220443491 221466915 222405631 223339809
$$ packed form
4881E5562728K908113L658459M217227M060765L910008L596116L551822L061854
4873H4527092K735584K033132J827197J334603R91822R77498M34652M13477L22368
4864I5597425L53759K81153P17895J271676J355870K016261K493591K997206L415514
4855A10500350L938534M376726M848853N409429N656741N896729N626044N290786
4847A51544192M345596L650999K474788K037018J121582M90643J39132K82467
4839A66086417k65856m50585n79045l35038j19268M03134O50809J465625K028005
4830A68884198K687665L769371M178860M812395N198668N419148N226071N113254
4822B05289630M661563L604594L026667K214012J647025J023424R38716R34178
$$ plain form
4814 223339809 224466420 226332955 228310101 230296749 232827494 235639596 238453145 241675340
4806 241675340 244790137 247987596 250519733 253029844 255618525 258044361 260021659 261644775
4798 261644775 262985938 264018113 264679825 265513915 266162293 266599943 266082099 264254714 260886145
4789 260886145 256096355 250033745 243714784 237438859 232129612 227767376 224034876 220947061
4781 220947061 218593032 216700314 214768656 212171182 209495986 206501472 203169007 199626572
4773 199626572 195991639 192110606 187830074 183261882 178091733 173205390 168457017 163307681
4765 163307681 157806054 152641340 146770831 140494557 133661861 126557915 119488435 112649486
4757 112649486 106151984 100372257 94683353 89393888 84902064 80496867 76330209 72773279
$$ packed form
4814B23339809J126611J866535J977146J986648K530745K812102K813549L222195
4806B41675340L114797L197459K532137K510111K588681K425836J977298J623116
4798B61644775J341163J032175O61712Q34090O48378M37650n17844j827385l368569
4789B60886145m789790o062610o318961o275925n309247m362236l732500l087815
4781B20947061k354029j892718j931658k597474k675196k994514l332465l542435
4773A99626572l634933l881033m280532m568192n170149m886343m748373n149336
4765A63307681n501627n164714n870509o276274o832696p103946p069480o838949
4757A12649486o497502n779727n688904n289465m491824m405197m166658l556930
$$ plain form
4749 72773279 69282084 66198592 63593974 60840246 58265970 56034676 54203133 52385977
4741 52385977 50644588 48770978 46944123 45449536 44393091 43306991 41760277 40575322
4733 40575322 39751623 38760788 37777787 36732415 36081024 35348294 34692774 33958440 33402432
4724 33402432 32907750 32090494 31352478 30779347 30327596 29572610 29117224 28605489 28240416
4715 28240416 28060716 27918029 27582044 27254155 27137502 26934869 26854279 26335063 26279568 26192248
4705 26192248 26140538 26173499 26048525 25999428 25898897 25892399 25990591 25895040 25847107 25548592 25236231
4694 25236231 25249205 24863120 24772484 24700836 24421290 24395921 24562525 24751175 24572121 24298861
4684 24298861 24066336 23857193 23781270 23768670 23701291 23249741 23148951 23078450 22980696 22951199
$$ packed form
4749G2773279l491195l083492k604618k753728k574276k231294j831543j817156
4741E2385977j741389j873610j826855j494587j056445j086100j546714j184955
4733D0575322q23699r90835r83001j045372o51391p32730o55520p34334n56008
4724C3402432m94682q17256p38016n73131m51751p54986m55386n11735l65073
4715B8240416j79700j42687l35985l27889j16653k02633q0590n19216n5495q7320
4705B6192248n1710L2961j24974m9097j00531o498R8192r5551m7933k98515l12361
4694B5236231J2974l86085r0636p1648k79546k5369J66604J88650j79054k73260
4684B4298861k32525k09143p5923j2600o7379m51550j00790p0501r7754k9497
$$ plain form
4674 22951199 23030576 22989680 22689933 22753878 22912750 22649914 22343105 22343134 22448043 22529154 22443861
4663 22443861 22434533 22500282 22531255 22741547 22592898 22622852 22976520 23330776 23377159 23251832
4653 23251832 23428639 23749457 24230593 24369949 24720165 25112053 25554813 25799504 25989105
4644 25989105 26579339 26802618 27034094 27619460 27920834 28496642 28821391 29437728 30107315
4635 30107315 30575498 31033262 31768275 32312791 32953423 33634683 34081297 34894528 35636965
4626 35636965 36296202 37212710 38194477 39465885 40648090 41848816 43355541 44561218 45956679
4617 45956679 47133994 48781782 51111848 52864433 54714334 57345002 60015583 62874262
4609 62874262 66030865 69545790 73244867 77731289 82809611 88318983 94418278 101434017
$$ packed form
4674B2951199P9377m0896k99747O3945J58872k62836l06809K9J04909Q1111q5293
4663B2443861r328O5749L0973K10292j48649K9954L53668L54256M6383j25327
4653B3251832J76807L20818M81136J39356L50216L91888M42760K44691J89601
4644B5989105N90234K23279K31476N85366L01374N75808L24749O16337O69587
4635C0107315M68183M57764P35013N44516O40632O81260M46614Q13231P42437
4626C5636965O59237R16508R81767J271408J182205J200726J506725J205677J395461
4617D5956679J177315J647788K330066J752585J849901K630668K670581K858679
4609F2874262L156603L514925L699077M486422N078322N509372O099295P015739
$$ plain form
4601 101434017 108807550 117362415 126696858 137497114 149134665 163003928 179944837
4594 179944837 200670433 226393051 256829909 292461363 332096799 373234498 413381756
4587 413381756 447842852 473473704 490139152 496923676 494252103 485970890 476337352 466341784
4579 466341784 457504365 452311187 447921723 441450550 431630646 417476064 398038392 374369719
4571 374369719 348393473 321573676 295284392 271447983 250315796 231431476 214684111
4564 214684111 200185301 187241515 174565082 162989326 152728060 143097219 134225963
4557 134225963 126459710 119141007 113032164 107447695 102099874 97732914 93705871 89983998
4549 89983998 86559964 83829111 81104476 78663905 76681714 74617390 72748646 70943122
$$ packed form
4601A01434017P373533Q554865R334443J0800256J1637551J3869263J6940909
4594A79944837K0725596K5722618L0436858L5631454L9635436M1137699M0147258
4587D13381756L4461096K5630852J6665448O784524k671573q281213r633538r995568
4579D66341784q837419n193178m389464o471173r819904j4154582j9437672k3668673
4571C74369719k5976246k6819797k6289284k3836409k1132187j8884320j6747365
4564B14684111j4498810j2943786j2676433j1575756j0261266r630841q871256
4557A34225963p766253p318703o108843n584469n347821m366960m027043l721873
4549H9983998l424034k730853k724635k440571j982191k064324j868744j805524
$$ plain form
4541 70943122 69337596 67729152 66703423 65490386 64083810 62765867 61594211 60061711
4533 60061711 59061854 58161079 57553623 56746162 56285388 55901494 55786749 55625226 56191708
4524 56191708 56880542 57777330 59155074 60785844 62805404 65126615 67891895 70301224
4516 70301224 72168041 73769919 75044546 75882806 76527396 76606300 76228700 75958774 75246353
4507 75246353 74475437 73465694 72385920 71303919 70287181 69163539 68252505 67853793 67720865
4498 67720865 67468357 67559518 68925521 70888647 73450290 76549168 80356779 84224310 87503773
4489 87503773 90376654 91678507 91898133 90502465 87685949 84217917 80208291 75956436
4481 75956436 71482458 67016467 63343693 59995033 56996604 54382916 51904001 49830835
$$ packed form
4541G0943122j605526j608444j025729j213037j406576j317943j171656j532500
4533F0061711r99857r00775o07456q07461m60774l83894j14745j61523N66482
4524E6191708O88834Q96788J377744J630770K019560K321211K765280K409329
4516G0301224J866817J601878J274627Q38260O44590P8904l77600k69926p12421
4507G5246353p70916j009743j079774j082001j016738j123642r11034l98712j32928
4498F7720865k52508R1161J366003J963126K561643L098878L807611L867531L279463
4489H7503773K872881J301853K19626j395668k816516l468032m009626m251855
4481G5956436m473978m465991l672774l348660k998429k613688k478915k073166
$$ plain form
4473 49830835 47810407 46094453 44440300 43305453 41926662 40615782 39615409 38793061
4465 38793061 38150445 37588403 36821860 36466024 36216092 35626319 34949324 34799882 34652630
4456 34652630 34178642 34068631 34129883 34255312 34458583 34185590 34440210 34716297 35294853 35675728
4446 35675728 36044636 36710014 37589164 38534498 39571102 40363058 41341226 41852815 41795207
4437 41795207 42120001 41653528 40881309 39802085 38642559 37315923 36032373 35164439 33945985
4428 33945985 33106041 32477941 31850148 31283999 31166057 30813295 30223154 29879987 29437765
4419 29437765 29189447 28665585 28399174 28031317 27589572 27145621 26769962 26715301 26665243 26520098
4409 26520098 26120335 26045714 26037769 26072271 26203720 26303549 26803587 27411569 27608703 28323299
$$ packed form
4473D9830835k020428j715954j654153j134847j378791j310880j000373q22348
4465C8793061o42616n62042p66543l55836k49932n89773o76995j49442j47252
4456C4652630m73988j10011O1252J25429K03271k72993K54620K76087N78556L80875
4446C5675728L68908O65378Q79150R45334J036604P91956R78168N11589n7608
4437D1795207L24794m66473p72219j079224j159526j326636j283550q67934j218454
4428C3945985q39944o28100o27793n66149j17942l52762n90141l43167m42222
4419B9437765k48318n23862k66411l67857m41745m43951l75659n4661n0058j45145
4409B6520098l99763p4621p945L4502J31449R9829N00038O07982J97134P14596
$$ plain form
4399 28323299 28864155 29477762 30048848 30657343 31521279 32742913 33951698 35762159 38047841
4390 38047841 40826322 44102504 47635758 51523862 54619686 56950297 58633405 58933931
4382 58933931 58593799 58997395 60153881 63281007 67394909 71488977 76354124 81259879
4374 81259879 83923407 85757107 84081138 78980990 74723210 71250249 68846325 67726731
4366 67726731 67213582 67101119 67355604 66884376 66185796 64353453 60711455 56616462 53162316
4357 53162316 50121372 47292959 45158793 43457275 41693618 39859469 38462993 36913734
4349 36913734 35625721 34489162 33127382 32352531 31578958 30784234 30074038 29459466 28857617
4340 28857617 28361344 27975435 27309476 27208903 27009194 26283254 25810278 25568126 25421825
$$ packed form
4399B8323299N40856O13607N71086O08495Q63936J221634J208785J810461K285682
4390C8047841K778481L276182L533254L888104L095824K330611J683108L00526
4382E8933931l40132M03596J156486L127126M113902M094068M865147M905755
4374H1259879K663528J833700j675969n100148m257780l472961k403924j119594
4366F7726731n13149j12463K54485m71228o98580j832343l641998m094993l454146
4357E3162316l040944k828413k134166j701518j763657j834149j396476j549259
4349C6913734j288013j136559j361780p74851p73573p94724p10196o14572o01849
4340B8857617m96273l85909o65959j00573j99709p25940m72976k42152j46301
$$ plain form
4331 25421825 25068251 24930234 24696928 24373222 24248946 24184093 24029307 23706917 23895415 23947415
4321 23947415 23460197 22988095 22955415 22933948 22915805 22772614 22655470 22896214 22972239 22691529
4311 22691529 22625981 22809666 22929766 22728163 22835123 22943660 23071350 22981903 23042517 23216051
4301 23216051 23286793 23124502 23202548 23026232 22885664 22849863 22883501 22498266 22440699 22144313
4291 22144313 21914970 21957067 21908581 21677591 21414790 21219740 21212019 21058539 20699627 20303506
4281 20303506 19903897 19751699 19451794 19258910 19118569 18888359 18629877 18475457 18527601 18396444
4271 18396444 18071431 17744659 17531458 17809064 17343147 17024802 16891472 16898670 16663946 16566861
4261 16566861 16387649 16206466 15950622 15913845 15579131 15672876 15658063 15434038 15298040 15320957
$$ packed form
4331B5421825l53574j38017k33306l23706j24276o4853j54786l22390J88498N2000
4321B3947415m87218m72102l2680k1467j8143j43191j17144K40744P6025k80710
4311B2691529o5548J83685J20100k01603J06960J08537J27690q9447O0614J73534
4301B3216051P0742j62291P8046j76316j40568l5801L3638l85235n7567k96386
4291B2144313k29343M2097m8486k30990k62801j95050p721j53480l58912l96121
4281B0303506l99609j52198k99905j92884j40341k30210k58482j54420N2144j31157
4271A8396444l25013l26772k13201K77606m65917l18345j33330P198k34724r7085
4261A6566861j79212j81183k55844l6777l34714R3745j4813k24025j35998K2917
$$ plain form
4251 15320957 15230055 14943346 14826072 14939795 15134084 14948767 14727668 14509784 14764912 14943789
4241 14943789 14935682 14654670 14782471 14822247 15057080 15027418 14881379 14754490 14812312 15161112
4231 15161112 15104529 14948378 14764191 15056593 14839380 14900131 14852570 14585037 14797399 15036317
4221 15036317 15333805 15531745 15694476 15834532 15880948 16064690 16246684 16472789 16395588 16238146
4211 16238146 16476107 16650037 16777694 17278053 17269362 17217829 17525721 18112507 18128316 18284070
4201 18284070 18812382 18916892 19403425 20135201 20414494 20844440 21293774 21793291 22477207
4192 22477207 23410056 24188379 24840426 25977908 27215844 28455126 29414556 30443665 31464482
4183 31464482 32523220 33251006 33966742 34301323 34453840 35070216 35567330 36538115 37739414
$$ packed form
4251A5320957r0902k86709j17274J13723J94289j85317k21099k17884K55128J78877
4241A4943789q107k81012J27801L9776K34833k9662j46039j26889N7822L48800
4231A5161112n6583j56151j84187K92402k17213O0751m7561k67533K12362K38918
4221A5036317K97488J97940J62731J40056M6416J83742J81994K26105p7201j57442
4211A6238146K37961J73930J27657N00359q691n1533L07892N86786J5809J55754
4201A8284070N28312J04510M86533P31776K79293M29946M49334M99517O83916
4192B2477207R32849P78323O52047J137482J237936J239282R59430J029109J020817
4183C1464482J058738P27786P15736L34581J52517O16376M97114R70785J201299
$$ plain form
4174 37739414 38765355 40107546 41675941 43137885 44493416 46005280 47614910 49025300
4166 49025300 50360062 51768130 52829155 54166432 55582666 56612921 57707986 59054705
4158 59054705 60333871 61412818 62555721 63311666 64398971 65375537 66057633 66443179 66908612
4149 66908612 68049280 69612371 71252542 73569377 76317925 79413608 82553606 85593780
4141 85593780 88403056 90656674 92405679 93487527 94520174 95546579 96730119 97663194
4133 97663194 98765327 99736948 100812181 101413658 102617029 103499290 104009680 104833913 105284112
4124 105284112 105438320 105503913 105894569 106318796 107432392 108941908 111033221 113881934 116526732
4115 116526732 119494046 122471533 125354524 127484093 129752376 131737895 133724972 136083400
$$ packed form
4174C7739414J025941J342191J568395J461944J355531J511864J609630J410390
4166D9025300J334762J408068J061025J337277J416234J030255J095065J346719
4158E9054705J279166J078947J142903P55945J087305R76566O82096L85546M65433
4149F6908612J140668J563091J640171K316835K748548L095683L139998L040174
4141H5593780K809276K253618J749005J081848J032647J026405J183540R33075
4133I7663194J102133R71621J075233O01477J203371Q82261N10390Q24233M50199
4124A05284112J54208O5593L90656M24227J113596J509516K091313K848713K644798
4115A16526732K967314K977487K882991K129569K268283J985519J987077K358428
$$ plain form
4107 136083400 138433152 140064646 141661911 143234214 144559235 145970534 147319215 148551622
4099 148551622 149487869 149828193 149959035 150443143 150726407 151475354 152879820 155144214 157894293
4090 157894293 160936785 164686287 168858200 173095885 177380523 181102495 184723491 188299218
4082 188299218 191971377 195614158 198871579 201942817 204731477 206300339 207118715 207269822
4074 207269822 206998528 206280615 205847031 206903064 208660848 210844972 213359382 216234316
4066 216234316 218765219 221185960 223257575 224387992 225427823 226346160 227219955 227637233
4058 227637233 227373146 226311268 224977776 223485459 221853130 219729174 217942442 215776889
4050 215776889 213231668 209894699 206011149 202043935 197946444 193855899 189804965 186489360
$$ packed form
4107A36083400K349752J631494J597265J572303J325021J411299J348681J232407
4099A48551622R36247L40324J30842M84108K83264P48947J404466K264394K750079
4090A57894293L042492L749502M171913M237685M284638L721972L620996L575727
4082A88299218L672159L642781L257421L071238K788660J568862Q18376J51107
4074B07269822k71294p17913m33584J056033J757784K184124K514410K874934
4066B16234316K530903K420741K071615J130417J039831R18337Q73795M17278
4058B27637233k64087j061878j333492j492317j632329k123956j786732k165553
4050B15776889k545221l336969l883550l967214m097491m090545m050934l315605
$$ plain form
4042 186489360 183766393 181824549 179757427 177531170 175596082 173170121 170556435 167833304
4034 167833304 164904101 162146418 159343280 156373741 153747989 151674334 149700773 148060739
4026 148060739 146294940 143882443 141091420 137917272 133850271 129509907 125011286 120801568
4018 120801568 117261390 114118482 111534849 109431469 107226571 104986968 103236120 101163550
4010 101163550 99026213 96886397 95012246 92990766 91192238 89528864 87514863 85722134
4002 85722134 84016530 82366375 80746225 79426152 77560460 75960334 74219116 72296273
3994 72296273 70215052 68387323 66518610 64596376 63205330 61833979 60026815 58483079
3986 58483079 57277071 55775035 54541446 53281823 51983846 50851926 49896688 48578733
$$ packed form
4042A86489360k722967j941844k067122k226257j935088k425961k613686k723131
4034A67833304k929203k757683k803138k969539k625752k073655j973561j640034
4026A48060739j765799k412497k791023l174148m067001m340364m498621m209718
4018A20801568l540178l142908k583633k103380k204898k239603j750848k072570
4010A01163550k137337k139816j874151k021480j798528j663374k014001j792729
4002H5722134j705604j650155j620150j320073j865692j600126j741218j922843
3994G2296273k081221j827729j868713j922234j391046j371351j807164j543736
3986E8483079j206008j502036j233589j259623j297977j131920r55238j317955
$$ plain form
3978 48578733 47221308 46017265 44554733 43356449 42365384 41478562 40379740 39155895
3970 39155895 38130339 37327767 36402687 35415549 34607431 34164041 33428517 32541970 31973229
3961 31973229 31189633 30628796 30283961 29805491 29287250 28773991 28140491 27923752 27545390
3952 27545390 27324585 27203446 26797156 26713017 26323429 26044857 25934058 25632582 25255231 24825185
3942 24825185 24618847 24347907 24005987 23763668 23511590 23349551 23327472 23063733 22740182 22490101
3932 22490101 21987950 21945401 21883072 21837482 21580485 21099588 20918739 20822852 20923906 21188992
3922 21188992 20966916 20706594 20616480 20376502 20414606 20336180 20216870 20145592 20135971 20089816 20206539
3911 20206539 20178305 20194430 20274869 20346226 20133689 20433781 20450043 20516551 20679888 20796637
$$ packed form
3978D8578733j357425j204043j462532j198284r91065q86822j098822j223845
3970C9155895j025556q02572r25080r87138q08118m43390p35524q86547n68741
3961C1973229p83596n60837l44835m78470n18241n13259o33500k16739l78362
3952B7545390k20805j21139m06290q4139l89588k78572j10799l01476l77351m30046
3942B4825185k06338k70940l41920k42319k52078j62039k2079k63739l23551k50081
3932B2490101n02151m2549o2329m5590k56997m80897j80849r5887J01054K65086
3922B1188992k22076k60322r0114k39978L8104p8426j19310p1278r621m6155J16723
3911B0206539k8234J6125Q0439P1357k12537L00092J6262O6508J63337J16749
$$ plain form
3901 20796637 20862171 20988325 21098438 21224360 21127126 21284649 21343682 21404152 21333574 21334692 21762216
3890 21762216 21488750 21386211 21274603 21242373 21448946 21591057 21481364 21441761 21602964 21621121
3880 21621121 21515833 21414972 21468752 21766498 21807702 21786300 21933892 22108683 21953118 21998181
3870 21998181 22176390 22322641 22339352 22448262 22381742 22442209 22268358 22574462 22755417 22471058
3860 22471058 22297854 22488410 22774024 22630117 22801508 22842350 22901267 22601430 22696517 22882422
3850 22882422 22983933 22779283 22426759 22462341 22442140 22404813 22501004 22710846 22262275 21832345
3840 21832345 21927034 21844832 21675957 21685024 21600475 21368235 21644601 21492906 21048041 21014527
3830 21014527 20738943 20649217 20661194 20538118 20334133 19978851 19917688 20214045 20063512 19938206
$$ packed form
3901B0796637O5534J26154J10113J25922r7234J57523N9033O0470p0578J118M27524
3890B1762216k73466j02539j11608l2230K06573J42111j09693l9603J61203J8157
3880B1621121j05288j00861N3780K97746M1204k1402J47592J74791j55565M5063
3870B1998181J78209J46251J6711J08910o6520O0467j73851L06104J80955k84359
3860B2471058j73204J90556K85614j43907J71391M0842N8917k99837R5087J85905
3850B2882422J01511k04650l52524L5582k0201l7327R6191K09842m48571m29930
3840B1832345R4689q2202j68875R067q4549k32240K76366j51695m44865l3514
3830B1014527k75584q9726J1977j23076k03985l55282o1163K96357j50533j25306
$$ plain form
3820 19938206 20160361 20053096 19990858 19867227 19598382 19651575 19441700 19619791 19418532 19324424
3810 19324424 19339822 19314737 19085923 18940716 18945023 19252985 18925679 18957594 19197497 19083408
3800 19083408 18930089 18490053 18406254 18269677 18099862 18068117 18166422 18366760 18268600 18253811
3790 18253811 18120762 17793461 17611212 17305026 17230635 16966690 16760076 16523332 16450401 16368646
3780 16368646 16220033 16165115 16009362 15855622 15791143 15775308 15750851 15345336 15185183 14949867
3770 14949867 14768426 14534684 14142543 13900660 14076393 13901805 13746849 13785659 13539292 13729998
3760 13729998 13598190 13385870 13443406 13050118 13241612 13510888 13319158 12828992 12754630 12875130
3750 12875130 12802717 12793139 13146322 13242540 13134641 13100390 13176631 13133452 12987236 12760393 12951083
$$ packed form
3820A9938206K22155j07265o2238j23631k68845N3193k09875J78091k01259r4108
3810A9324424J5398k5085k28814j45207M307L07962l27306L1915K39903j14089
3800A9083408j53319m40036q3799j36577j69815l1745R8305K00338r8160j4789
3790A8253811j33049l27301j82249l06186p4391k63945k06614k36744p2931q1755
3780A6368646j48613n4918j55753j53740o4479j5835k4457m05515j60153k35316
3770A4949867j81441k33742l92141k41883J75733j74588j54956L8810k46367J90706
3760A3729998j31808k12320N7536l93288J91494K69276j91730m90166p4362J20500
3750A2875130p2413r578L53183R6218j07899l4251P6241m3179j46216k26843J90690
$$ plain form
3739 12951083 12809527 12412586 12203529 12239001 12180582 12129258 12338488 12359189 12506291 12423624
3729 12423624 12453831 12375738 12299576 12587396 12865986 12717888 12630443 12771064 12775973 12485940
3719 12485940 12538870 12434177 12329814 12389913 12395235 12427656 12588821 12442902 12386303 12297297 12245788
3708 12245788 12326436 12404749 12629956 12951085 12949661 12926573 12781124 12912997 13087082 12959145
3698 12959145 13141131 13002877 13259717 13125527 13431919 13638698 13482153 13484263 13608400 13585289
3688 13585289 13475843 13762139 13795759 13583586 13633055 13835363 13709144 13672454 13548660 13654375
3678 13654375 13910119 14290525 14376772 14404374 14484213 14778431 15045654 15296771 15496317 15199511
3668 15199511 15326609 15484702 15585603 15681423 15570145 15576703 15898307 15767050 15453103 15653323
$$ packed form
3739A2951083j41556l96941k09057L5472n8419n1324K09230K0701J47102q2667
3729A2423624L0207p8093p6162K87820K78590j48098q7445J40621M909k90033
3719A2485940N2930j04693j04363O0099N322L2421J61165j45919n6599q9006n1509
3708A2245788Q0648P8313K25207L21129j424k3088j45449J31873J74085j27937
3698A2959145J81986j38254K56840j34190L06392K06779j56545K110J24137k3111
3688A3585289j09446K86296L3620k12173M9469K02308j26219l6690j23794J05715
3678A3654375K55744L80406Q6247K7602P9839K94218K67223K51117J99546k96806
3668A5199511J27098J58093J00901R5820j11278O558L21604j31257l13947K00220
$$ plain form
3658 15653323 15525080 15273855 14979127 14918593 14702183 14572498 14452137 14425351 14380941 14355048
3648 14355048 14458950 14213230 14141959 14402994 14582093 14455270 14426293 14535327 14428182 14158787
3638 14158787 14111927 14088933 14042496 13638551 13536567 13454578 13233803 13408769 13343745 13278390
3628 13278390 13418878 13570583 13503013 13639180 14116093 13892054 14064702 14377633 14698043 14975527
3618 14975527 15168547 15625933 15675996 15971586 16239591 16462382 16439811 16617134 16323301 16017519
3608 16017519 16118994 16014879 16005130 15851288 15551115 15513501 15608550 15581168 15698446 16088319
3598 16088319 16211132 16479311 16603382 16568846 16203015 15870457 15871563 15697770 15357235 15028533
3588 15028533 14799447 14794528 14595062 14033083 13701682 13879952 13937033 13961472 14009607 13787351
$$ packed form
3658A5653323j28243k51225k94728o0534k16410j29685j20361k6786m4410k5893
3648A4355048J03902k45720p1271K61035J79099j26823k8977J09034j07145k69395
3638A4158787m6860k2994m6437m03945j01984q1989k20775J74966o5024o5355
3628A3278390J40488J51705o7570J36167M76913k24039J72648L12931L20410K77484
3618A4975527J93020M57386N0063K95590K68005K22791k2571J77323k93833l05782
3608A6017519J01475j04115r749j53842l00173l7614R5049k7382J17278L89873
3598A6088319J22813K68179J24071l4536l65831l32558J106j73793l40535l28702
3588A5028533k29086m919j99466n61979l31401J78270N7081K4439M8135k22256
$$ plain form
3578 13787351 13462077 13240867 13186582 13131574 13193289 12937756 12947716 13029658 13082051 13114635 13235773
3567 13235773 13483311 13699354 14173196 14301114 14254408 14660282 14836114 15010749 15256736 15418269
3557 15418269 15857715 16495149 16687489 17295091 17727376 18386714 18695209 18896834 19309791
3548 19309791 19633364 19870139 19979442 19761324 19542070 19664222 19693774 19806277 20026171 20254797
3538 20254797 20485649 20995360 21470211 22032013 22573782 23252121 23777620 24418054 25153444
3529 25153444 25748204 26234888 26743862 27027732 27089112 27583345 27931279 28391049 28750445 29232507
3519 29232507 29381087 29619808 30009939 30156892 30231168 30142399 30357303 30409575 30647992 30759818
3509 30759818 30810079 30608892 30583566 30093269 29270425 28339129 27511439 26618064 25364136 24519229
$$ packed form
3578A3787351l25274k21210n4285n5008O1715k55533R960Q1942N2393L2584J21138
3567A3235773K47538K16043M73842J27918m6706M05874J75832J74635K45987J61533
3557A5418269M39446O37434J92340O07602M32285O59338L08495K01625M12957
3548A9309791L23573K36775J09303k18118k19254J22152K9552J12503K19894K28626
3538B0254797K30852N09711M74851N61802N41769O78339N25499O40434P35390
3529B5153444N94760M86684N08974K83870O1380M94233L47934M59770L59396M82062
3519B9232507J48580K38721L90131J46953P4276q8769K14904N2272K38417J11826
3509C0759818N0261k01187k5326m90297q22844r31296q27690q93375j253928q44907
$$ plain form
3499 24519229 23643804 22554596 21739210 21115514 20698688 20004027 19234396 18725938 18326590
3490 18326590 17995175 17871509 17749086 17331169 17075574 16884713 16389305 16022797 15687476
3481 15687476 15186259 14743027 14312962 14263714 13928971 13681342 13457545 13181026 13197003 13268859
3471 13268859 13243972 13145727 13385508 13549662 13720930 13635643 13522154 13509893 13352787 13107957
3461 13107957 12575310 12371261 12097473 11904516 11377906 10825649 10552380 10515914 10572312 10380640
3451 10380640 10306395 10172701 10205821 10224724 10055148 10142643 10157754 10240167 10168250 10104636 9838034
3440 9838034 9499818 9341869 9219066 8854399 8707185 8640148 8347967 8209364 8043427 7956144
3430 7956144 7912191 7913968 7377559 7431738 7651958 7551748 7541291 7359469 7157395 6861010
$$ packed form
3499B4519229q75425j089208q15386o23696m16826o94661p69631n08458l99348
3490A8326590l31415j23666j22423m17917k55595j90861m95408l66508l35321
3481A5687476n01217m43232m30065m9248l34743k47629k23797k76519J5977P1856
3471A3268859k4887r8245K39781J64154J71268q5287j13489j2261j57106k44830
3461A3107957n32647k04049k73788j92957n26610n52257k73269l6466N6398j91672
3451A0380640p4245j33694L3120J8903j69576Q7495J5111Q2413p1917o3614k66602
3440I838034l38216j57949j22803l64667j47214o7037k92181j38603j65937q7283
3430G956144m3953J777n36409N4179K20220j00210j0457j81822k02074k96385
$$ plain form
3420 6861010 6805652 6917226 6794847 6803642 6688857 6584916 6684281 6529508 6429219 6449626
3410 6449626 6440562 6591125 6661401 6766067 6793664 6944972 6955940 7107173 7125879 7221321 7266456
3399 7266456 7273911 7171449 7035935 7022735 6827802 6904819 6687018 6536646 6781202 6666600
3389 6666600 6695718 6677259 6654001 6803750 6774090 6740311 6881719 7136347 7172145 7079266 6892581
3378 6892581 6761572 6615987 6833699 6852729 6659279 6610200 6405966 6213856 6170280 6236682
3368 6236682 6357633 6304549 6103842 6076111 6225778 6167251 6039440 5749373 5853549 5851410
3358 5851410 5597146 5558515 5384951 5459725 5538786 5506529 5341454 5442904 5337208 5306332
3348 5306332 5191373 5434268 5269729 5132339 4885470 4883501 5081105 5084209 5044582 5126579 5322403
$$ packed form
3420F861010n5358J11574j22379Q795j14785j03941R9365j54773j00289K0407
3410F449626r064J50563P0276J04666K7597J51308J0968J51233J8706R5442M5135
3399G266456P455j02462j35514j3200j94933P7017k17801j50372K44556j14602
3389F666600K9118j8459k3258J49749k9660l3779J41408K54628L5798r2879j86685
3378F892581j31009j45585K17712J9030j93450m9079k04234j92110m3576O6402
3368F236682J20951n3084k00707k7731J49667n8527j27811k90067J04176k139
3358E851410k54264l8631j73564P4774P9061l2257j65075J01450j05696l0876
3348E306332j14959K42895j64539j37390k46869j969J97604L104l9627Q1997J95824
$$ plain form
3337 5322403 5038984 4934997 4774939 4952885 5070716 4784273 4780683 4892468 4709523 4732936
3327 4732936 4722193 4831842 4816515 4863393 4671908 4460446 4239380 4418870 4393997 4514742
3317 4514742 4530829 4782527 4574695 4601747 4285937 4384872 4498796 4395219 4519633 4523426
3307 4523426 4358890 4042120 4188299 4200349 4113043 4361050 4290554 4331403 4498144 4304885
3297 4304885 4202193 3965000 4024928 3901110 4038620 3941386 3761211 3950974 3979343 3933785
3287 3933785 4012077 3956705 3640358 3752863 4039621 3885678 3908919 3837294 3615845 3597036
3277 3597036 3780254 3582784 3632127 3651929 3681873 4069394 4008336 4025921 3781741 3305579
3267 3305579 3741858 3792030 3908715 3728565 3868056 3829406 3613284 3440919 3533721 3586911
$$ packed form
3337E322403k83419j03987j60058J77946J17831k86443l590J11785j82945K3413
3327D732936j0743J09649j5327M6878j91485k11462k21066J79490k4873J20745
3317D514742J6087K51698k07832K7052l15810R8935J13924j03577J24414L793
3307D523426j64536l16770J46179J2050q7306K48007p0496M0849J66741j93259
3297D304885j02692k37193N9928j23818J37510r7234j80175J89763K8369m5558
3287C933785P8292n5372l16347J12505K86758j53943K3241p1625k21449j8809
3277C597036J83218j97470M9343J9802K9944L87521o1058J7585k44180m76162
3267C305579M36279N0172J16685j80150J39491l8650k16122j72365R2802N3190
$$ plain form
3257 3586911 3594904 3848707 3972842 3676354 3603574 3619646 3706539 3903122 3889497 4015385 3971996
3246 3971996 3852172 3838822 3846387 3821816 3858973 3647784 3637314 3729349 3797686 3871113 3702917
3235 3702917 3462083 3805287 4020619 3879874 3921425 3923048 4263596 4259480 4131029 4293943
3225 4293943 4135257 4183575 4506267 4408566 4456803 4443100 4459887 4552691 4568108 4503461 4312559
3214 4312559 4631875 4737515 4874140 5029720 5172957 5565490 5983450 6233092 6735500 6649191
3204 6649191 6738537 6964773 7209986 7547718 7619944 7666165 7632605 7886710 7972079 7868054
3194 7868054 8109878 8238036 8108285 8048101 8280263 8466657 8503073 8624599 8974113 9238851
3184 9238851 9482267 9486034 9502189 9755412 10017928 10470045 11096124 11443534 11798967 12302733
$$ packed form
3257C586911P993K53803J24135k96488p2780J6072Q6893J96583j3625J25888m3389
3246C971996j19824j3350P565k4571L7157k11189j0470R2035O8337P3427j68196
3235C702917k40834L43204K15332j40745M1551J623L40548m116j28451J62914
3225D293943j58686M8318L22692r7701M8237j3703J6787R2804J5417o4647j90902
3214D312559L19316J05640J36625J55580J43237L92533M17960K49642N02408q6309
3204F649191Q9346K26236K45213L37732P2226M6221l3560K54105Q5369j04025
3194G868054K41824J28158j29751o0184K32162J86394L6416J21526L49514K64738
3184I238851K43416L767J6155K53223K62516M52117O26079L47410L55433N03766
$$ plain form
3174 12302733 12731427 13385953 13737616 14201053 14240832 13860185 13561021 13131519 12558596 11953314
3164 11953314 11649698 11249015 10999276 10706316 10611046 10159193 9837502 9831105 9640345 9422322
3154 9422322 9241554 9269385 9351530 9563337 9704047 9779190 9787751 9675261 9785542 10040925
3144 10040925 10059807 10148535 10292050 10287597 10137055 9875580 9792286 9812054 9695789 9237532
3134 9237532 8887957 8791929 8678581 8818258 8700535 8540178 8511180 8383542 8214484 7659236
3124 7659236 7875795 7992545 7742483 7381425 6894365 6941711 6821637 6521777 6308407 6260525
3114 6260525 6024515 5677051 5422859 5427415 5299138 4919890 4783750 4520709 4352258 4230792
3104 4230792 4209588 4012308 3652824 3552855 3281339 3428469 3373337 3308330 3134833 3318778
$$ packed form
3174A2302733M28694O54526L51663M63437L9779l80647k99164m29502n72923o05282
3164A1953314l03616m00683k49739k92960r5270m51853l21691o397j90760k18023
3154I422322j80768K7831Q2145K11807J40710P5143Q561j12490J10281K55383
3144A0040925J8882Q8728J43515m453j50542k61475q3294J9768j16265m58257
3134I237532l49575r6028j13348J39677j17723j60357k8998j27638j69058n55248
3124G659236K16559J16750k50062l61058m87060M7346j20074k99860k13370m7882
3114F260525k36010l47464k54192M556j28277l79248j36140k63041j68451j21466
3104D230792k1204j97280l59484r9969k71516J47130n5132o5007j73497J83945
$$ plain form
3094 3318778 3341692 3335570 3228234 3148860 3017837 2955525 2849952 2876024 2592446 2437980 2397275
3083 2397275 2451938 2651643 2612678 2449578 2185205 2309682 2204070 2049950 2295151 2244673
3073 2244673 2095804 1941231 1962475 2144666 1977664 1944970 1828805 1956566 2136045 1948926
3063 1948926 1918970 1521373 1399965 1619087 1501700 1613397 1621657 1755857 1644563 1567948
3053 1567948 1687460 1826935 1649787 1733989 1612200 1328407 1527891 1716380 1849814 1906829
3043 1906829 1539524 1288844 1346976 1369223 1479230 1452082 1131292 1199933 1108510 1223356
3033 1223356 1457136 1718110 1372350 863052 956844 1229409 1034660 862084 925711 1085158
3023 1085158 1048428 1096858 1296088 1086278 1027037 1035978 970185 1065355 1077228 1119465 1106569
$$ packed form
3094C318778K2914o122j07336p9374j31023o2312j05573K6072k83578j54466m0705
3083B397275N4663J99705l8965j63100k64373J24477j05612j54120K45201n0478
3073B244673j48869j54573K1244J82191j67002l2694j16165J27761J79479j87119
3063A948926k9956l97597j21408K19122j17387J11697Q260J34200j11294p6615
3053A567948J19512J39475j77148Q4202j21789k83793J99484J88489J33434N7015
3043A906829l67305k50680N8132K2247J10007k7148l20790O8641r1423J14846
3033A223356K33780K60974l45760n09298R3792K72565j94749j72576O3627J59447
3023A085158l6730M8430J99230k09810n9241Q941o5793R5170J1873M2237j2896
$$ plain form
3012 1106569 975048 1031091 1078630 1113827 1231687 1170805 716340 757422 709779 968532 739677
3001 739677 733482 1130858 1132104 799348 761182 647409 519300 634867 513192 552344 522046
2990 522046 624536 849851 1013154 865231 703276 842633 871700 660253 336169 281102
2980 281102 505516 580489 628682 693036 592852 590312 608170 673111 420241 551906 466871
2969 466871 368309 361690 265752 231075 207631 432727 384213 540322 801822 784155 573124
2958 573124 560177 597413 633593 546153 520875 449758 524446 445761 612349 700503 526976
2947 526976 161211 239630 320015 106969 484379 774505 691196 750163 484712 230331
2937 230331 256672 77843 91290 47241 210486 414453 383415 513015 502045 444603 419895
$$ packed form
3012A106569j31521N6043M7539L5197J17860o0882m54465M1082m7643K58753k28855
3001G39677o195L97376J246l32756l8166j13773j28109J15567j21675L9152l0298
2990E22046J02490K25315J63303j47923j61955J39357K9067k11447l24084n5067
2980B81102K24414P4973M8193O4354j00184k540J7858O4941k52870J31665q5035
2969D66871r8562o619r5938l4677k3444K25096m8514J56109K61500j7667k11031
2958E73124j2947L7236L6180q7440k5278p1117P4688p8685J66588Q8154j73527
2947E26976l65765P8419Q0385k13046L77410K90126q3309N8967k65451k54381
2937B30331K6341j78829J3447m4049J63245K03967l1038J29600j0970n7442k4708
$$ plain form
2926 419895 445544 412608 575274 367201 258182 505759 728838 727614 695498 322543 95175
2915 95175 23598 238204 309867 250655 74382 76422 437736 282122 276069 140275 89311
2904 89311 406098 728684 514722 47482 196671 119237 -56742 82091 203858 371182
2894 371182 249709 460982 270888 324799 401641 411491 520538 271741 51077 97667 109655
2883 109655 215406 193526 139644 121530 90050 20112 153839 331376 286790 255162 211485
2872 211485 75569 292187 138379 -28703 94244 265404 167710 335968 366878 159874
2862 159874 313126 -35726 86401 304937 121651 217184 145903 293871 146625 25562
2852 25562 136707 277583 321255 253989 20290 41627 78903 256945 255148 187117 178775
$$ packed form
2926D19895K5649l2936J62666k08073j09019K47577K23079j224l2116l72955k27368
2915I5175p1577K14606P1663n9212j76273K040L61314j55614o053j35794n0964
2904H9311L16787L22586k13962m67240J49189p7434j75979J38833J21767J67324
2894C71182j21473K11273j90094N3911P6842R850J09047k48797k20664M6590J1988
2883A09655J05751k1880n3882j8114l1480o9938J33727J77537m4586l1628m3677
2872B11485j35916K16618j53808j67082J22947J71160r7694J68258L0910k07004
2862A59874J53252l48852J22127K18536j83286R5533p1281J47968j47246j21063
2852B5562J11145J40876M3672o7266k33699K1337L7276J78042j797o8031q342
$$ plain form
2841 178775 -10143 250881 239736 29440 -44343 -40824 -35941 330590 284518 -146964 -288710
2830 -288710 32245 168988 -62778 -207961 -129047 102113 116292 79101 95352 8247 -109292
2819 -109292 40827 158513 -5452 554722 488233 342413 176014 190531 185420 56289
2809 56289 324493 84821 -44921 153938 142660 235358 476744 485951 190128 -97547 -38814
2798 -38814 69878 238687 329501 135007 184078 289651 53555 -194525 -109953 179999
2788 179999 434729 123521 -3776 -13258 269051 204824 215888 290639 -198429 4683 -85458
2777 -85458 -187761 111148 12806 -83875 36951 68964 -155444 -252018 -114337 -98968 91576
2766 91576 -44351 -85931 51679 -78827 30108 -32309 -321196 -191377 -78244 -379385
$$ packed form
2841A78775j88918K61024j1145k10296p3783L519M883L66531m6072m31482j41746
2830b88710L20955J36743k31766j45183P8914K31160J4179l7191J6251q7105j17539
2819a09292J50119J17686j63965N60174o6489j45820j66399J4517n111j29131
2809E6289K68204k39672j29742J98859j1278R2698K41386R207k95823k87675N8733
2798c8814J08692J68809R0814j94494M9071J05573k36096k48080Q4572K89952
2788A79999K54730l11208j27297r482K82309o4227J1064P4751m89068K03112r0141
2777h5458j02303K98909r8342r6681J20826L2013k24408r6574J37681J5369J90544
2766I1576j35927m1580J37610j30506J08935o2417k88887J29819J13133l01141
$$ plain form
2756 -379385 -219827 103307 64912 -68750 81023 -15945 -168843 301144 48775 -276377
2746 -276377 -17805 233654 114275 -208142 -170440 64226 -215899 -323491 -9274 -3880
2736 -3880 243086 288351 179437 183040 141581 303694 306787 4884 229100 222375 206039 28094
2724 28094 -21224 98462 17055 191215 196982 201584 -6332 -213275 -172304 -27601 -55544
2713 -55544 318325 195649 51417 153700 -44248 -172152 60887 159743 -205609 -11498
2703 -11498 43342 -121231 36008 141991 195499 54973 64629 -119340 -188951 118825 207617
2692 207617 314408 9251 -19275 38187 37821 49993 174255 -150602 -321951 4703 182943
2681 182943 390213 166207 -10437 -30361 58833 -192082 -106205 27628 45000 61868 421210
$$ packed form
2756c79385J59558L23134l8395j33662J49773r6968j52898M69987k52369l25152
2746b76377K58572K51459j19379l22417L7702K34666k80125j07592L14217N394
2736c880K46966M5265j08914L603m1459J62113L093l01903K24216o725j6336j77945
2724B8094m9318J19686q1407J74160N767M602k07916k06943M0971J44703k7943
2713e5544L73869j22676j44232J02283j97948j27904K33039R8856l65352J94111
2703a1498N4840j64573J57239J05983N3508j40526R656j83969o9611L07776Q8792
2692B07617J06791l05157k8526N7462l66J2172J24262l24857j71349L26654J78240
2681A82943K07270k24006j76644j9924Q9194k50915Q5877J33833J7372J6868L59342
$$ plain form
2670 421210 457170 119088 3758 63263 -186270 -93755 101860 -11375 26212 97160 90884
2659 90884 34990 270343 420583 136149 20659 -342153 -207064 -9225 -36034 244137
2649 244137 297330 -37544 -46181 -99284 -49830 170319 55682 3994 -82779 317228 464017
2638 464017 368070 625789 455901 219272 205946 155832 481309 289486 -1889 20073
2628 20073 148983 222025 338084 242608 163965 5258 34034 -37604 -43901 138308 -42173
2617 -42173 -52340 171001 8786 -127777 -48978 -290289 -193372 -4569 -3864 174231 -8899
2606 -8899 294121 362068 322279 293280 234461 113949 15851 -94465 113954 226593 240651
2595 240651 220280 256828 117237 -103568 -137517 -27541 -65991 -124297 322256 292925 248989
$$ packed form
2670D21210L5960l38082j15330N9505k49533R2515J95615j13235L7587P0948o276
2659I0884n5894K35353J50240k84434j15490l62812J35089J97839k6809K80171
2649B44137N3193l34874q637n3103M9454K20149j14637n1688q6773M00007J46789
2638D64017r5947K57719j69888k36629j3326n0114L25477j91823k91375K1962
2628B0073J28910P3042J16059r5476p8643j58707K8776p1638o297J82209j80481
2617d2173j0167K23341j62215j36563P8799k41311R6917J88803P05J78095j83130
2606h899L03020O7947l9789k8999n8819j20512r8098j10316K08419J12639J4058
2595B40651k0371L6548j39591k20805l3949J09976l8450n8306M46553k9331m3936
$$ plain form
2584 248989 -17244 145924 360542 352264 253197 51762 -101955 -45945 -173582 -148349 -175571
2573 -175571 76306 199937 -118859 -207681 -224275 -237375 -204154 -202896 44704 -23826 -32179
2562 -32179 94536 -56547 30536 -191024 -173598 65008 275041 159383 30222 -204558
2552 -204558 -78644 46532 -219143 -38189 -18067 -114683 204584 471277 443890 325198
2542 325198 65219 -20453 151294 449237 692807 204952 -57118 -36778 92462 246668
2532 246668 23624 130238 61080 141393 95442 239796 168510 128306 32415 161330 8960
2521 8960 -204144 -170242 -332095 -301435 -53011 263448 -215913 -270548 -30747 -105571 -379715
2510 -379715 -120074 269242 601843 629532 450909 383322 265744 273902 124676 42754 245301
$$ packed form
2584B48989k66233J63168K14618q278r9067k01435j53717N6010j27637K5233k7222
2573a75571K51877J23631l18796q8822j6594j3100L3221J258K47600o8530q353
2562c2179J26715j51083Q7083k21560J7426K38606K10033j15658j29161k34780
2552b04558J25914J25176k65675J80954K0122r6616L19267K66693k7387j18692
2542C25198k59979q5672J71747K97943K43570m87855k62070K0340J29240J54206
2532B46668k23044J06614o9158Q0313m5951J44354p1286m0204r5891J28915j52370
2521H960k13104L3902j61853L0660K48424L16459m79361n4635K39801p4824k74144
2510c79715K59641L89316L32601K7689j78623o7587j17578Q158j49226q1922K02547
$$ plain form
2499 245301 195038 372863 321103 169905 331461 257925 121337 293114 129712 130915 15610
2488 15610 52698 195179 207492 26303 243537 485691 125000 80382 56317 -129887 -71302
2477 -71302 -57269 -192398 177968 355879 237798 93236 -150113 -80197 299993 383785
2467 383785 182326 190644 355048 249732 117371 25909 -1368 112005 230835 302838 244356
2456 244356 187526 293425 155498 122636 280214 463138 324387 612374 700590 710557 547560
2445 547560 530768 619099 688460 587608 675905 701120 753871 497202 581611 733762 492229
2434 492229 586875 792386 986237 829812 947540 736730 596463 737388 817513 462204
2424 462204 390123 798220 1046181 1083942 1119308 1175553 1104925 1337145 1595808 1719969 1546760
$$ packed form
2499B45301n0263J77825n1760j51198J61556p3536j36588J71777j63402J203j15305
2488A5610L7088J42481J2313j81189K17234K42154l60691m4618k4065j86204N8585
2477g1302J4033j35129L70366J77911j18081j44562k43349O9916L80190Q3792
2467C83785k01459Q318J64404j05316j32361r1462k7277J13373J18830P2003n8482
2456B44356n6830J05899j37927l2862J57578J82924j38751K87987Q8216R967j62997
2445E47560j6792Q8331O9361j00852Q8297K5215N2751k56669Q4409J52151k41533
2434D92229R4646K05511J93851j56425J17728k10810j40267J40925Q0125l55309
2424D62204p2081M08097K47961L7761L5366N6245p0628K32220K58663J24161j73209
$$ plain form
2413 1546760 1400839 1462072 1476172 1570534 1605643 1702570 2070266 2063640 2296646 2742394 2717066
2402 2717066 2805858 3072484 2914888 3446858 3854836 3943058 4370937 4720597 5138266 5645427
2392 5645427 6075320 6456341 7241359 8157474 8850188 9560526 10486101 11584115 12328575
2383 12328575 13376921 14534540 15789143 17451959 19735354 22862574 27558731 33699662
2375 33699662 39763349 46213078 53296373 57693975 60399604 60932745 55196756 49152142
2367 49152142 44563789 39758204 35442573 32184201 29389840 27007669 24594776 22733775
2359 22733775 21028162 19542164 18062975 16464058 14918663 13945243 13133588 12040097
2351 12040097 10887098 10328291 9851039 9231381 8449446 7671783 7259132 7124484 6757702
$$ packed form
2413A546760j45921O1233J4100R4362L5109R6927L67696o626K33006M45748k5328
2402B717066Q8792K66626j57596N31970M07978Q8222M27879L49660M17669N07161
2392E645427M29893L81021P85018R16115O92714P10338R25575J098014P44460
2383A2328575J048346J157619J254603J662816K283395L127220M696157O140931
2375C3699662O063687O449729P083295M397602K705629N33141n735989o044614
2367D9152142m588353m805585m315631l258372k794361k382171k412893j861001
2359B2733775j705613j485998j479189j598917j545395r73420q11655j093491
2351A2040097j152999n58807m77252o19658p81935p77663m12651j34648l66782
$$ plain form
2342 6757702 6313030 5744967 5502352 5441155 5254448 5026996 4820599 4436115 3994998 3999600
2332 3999600 4078603 4052182 4073497 3806603 3493428 3381962 3081675 2838247 2748636 2470165
2322 2470165 2404554 2520193 2430975 2548651 2541178 2295247 2258123 2121714 1853377 1759469 1794480
2311 1794480 2007358 1892686 1744952 1739495 1699879 1394602 1290502 1296755 1342153 1195430 1348140
2300 1348140 1270107 1228746 1148165 1215894 1057763 1105557 1152006 1318298 1406274 1342054 1228873
2289 1228873 951980 943956 1153190 1220034 852418 737040 823465 999163 1223891 1034119
2279 1034119 851585 824531 947318 949929 953478 723083 445816 456702 751889 852262 652701
2268 652701 529582 591695 534253 605212 529891 548039 603254 697845 663190 464373 705422
$$ packed form
2342F757702m44672n68063k42615o1197j86707k27452k06397l84484m41117M602
2332C999600P9003k6421K1315k66894l13175j11466l00287k43428q9611k78471
2322B470165o5611J15639q9218J17676p473k45931l7124j36409k68337r3908L5011
2311A794480K12878j14672j47734n457l9616l05277j04100O253M5398j46723J52710
2300A348140p8033m1361q0581O7729j58131M7794M6449J66292Q7976o4220j13181
2289A228873k76893q024K09234O6844l67616j15378Q6425J75698K24728j89772
2279A034119j82534k7054J22787K611L549k30395k77267J0886K95187J00373j99561
2268F52701j23119O2113n7442P0959p5321J8148N5215R4591l4655j98817K41049
$$ plain form
2257 705422 771543 637805 821658 759397 541371 598544 649716 701822 962940 930327 722267
2246 722267 694245 566679 138802 319461 519093 391867 392924 388819 321396 206216 446651
2235 446651 664899 798491 522783 312380 423400 260714 321101 207234 162506 313436
2225 313436 338322 516951 321617 459735 404701 282818 492749 436578 348665 395071 409157
2214 409157 374999 72808 225868 302970 504231 537780 125553 -24023 5144 104982 334721
2203 334721 237625 165608 363627 245204 288139 141377 127329 392857 278386 230458 182222
2192 182222 154825 160463 349639 334464 -71766 -1586 78175 58373 214868 242380 274370
2181 274370 227145 169204 -10054 -102749 65725 80738 -166761 -35330 73516 214684
$$ packed form
2257G05422O6121j33738J83853o2261k18026N7173N1172N2106K61118l2613k08060
2246G22267k8022j27566m27877J80659J99632j27226J057m105o7423j15180K40435
2235D46651K18248J33592k75708k10403J11020j62686O0387j13867m4728J50930
2225C13436K4886J78629j95334J38118n5034j21883K09931n6171q7913M6406J4086
2214D09157l4158l02191J53060P7102K01261L3549m12227j49576K9167R9838K29739
2203C34721r7096p2017J98019j18423M2935j46762j4048K65528j14471m7928m8236
2192A82222k7397N638J89176j5175m06230P0180P9761j9802J56495K7512L1990
2181B74370m7225n7941j79258r2695J68474J5013k47499J31431J08846J41168
$$ plain form
2171 214684 116404 -38056 98763 -10253 -125000 29127 7833 184730 101726 224050
2161 224050 63406 93454 52471 31877 298561 285519 64630 36803 -182927 -426259 -259583
2150 -259583 -218854 120026 129824 59154 32428 14499 256737 216788 104332 186368 262072
2139 262072 464450 434809 332166 456919 358582 188328 -14619 -102407 -110441 -7860 206700
2128 206700 99941 218026 114459 -50247 177679 82775 -94122 -203539 46554 -50726
2118 -50726 27514 14760 -184413 -195884 -119261 -297183 -90730 -41710 147667 305622 166480
2107 166480 32172 61728 626055 318401 338025 168296 243176 179302 343389 192894
2097 192894 101082 270994 331656 79002 110197 31413 101788 80973 108377 -4982 108144
$$ packed form
2171B14684r8280j54460J36819j09016j14747J54127k1294J76897q3004J22324
2161B24050j60644L0048m0983k0594K66684j3042k20889k7827k19730k43332J66676
2150b59583M0729L38880R798p0670k6726j7929K42238l9949j12456Q2036P5704
2139B62072K02378k9641j02643J24753r8337j70254k02947q7788q034J02581K14560
2128B06700j06759J18085j03567j64706K27926r4904j76897j09417K50093r7280
2118e0726P8240j2754j99173j1471P6623j77922K06453M9020J89377J57955j39142
2107A66480j34308K9556N64327l07654J9624j69729P4880o3874J64087j50495
2097A92894r1812J69912O0662k52654L1195p8784P0375k0815K7404j13359J13126
$$ plain form
2086 108144 -49276 31711 246472 -97443 -93024 204538 7227 -59615 -192158 -285065 -5232
2075 -5232 51741 11125 106145 -26395 -68853 -99602 13307 -83558 -149178 -197476 139249
2064 139249 45419 836 13646 -68550 186718 -129936 -73924 -15641 -69554 17263 98022
2053 98022 62830 271966 227748 104665 -257691 -261505 -282379 -119384 24482 -196650 -394266
2042 -394266 -240056 33488 174427 31290 -108876 -337205 -470535 -505367 -83521 -118938
2032 -118938 51915 60309 -246368 -109640 110632 166280 56273 -143086 -9376 -11020 160155
2021 160155 -998 -211021 -89818 -154612 -6092 -38686 5594 315522 361936 151685
2011 151685 24015 69511 -6065 344115 262193 -43358 -198263 -229224 -77951 114687
$$ packed form
2086A08144j57420Q0987K14761l43915M419K97562j97311o6842j32543r2907K79833
2075e232N6973m0616R5020j32540m2458l0749J12909r6865o5620m8298L36725
2064A39249r3830m4583J2810q2196K55268l16654N6012N8283n3913Q6817Q0759
2053I8022l5192K09136m4218j23083l62356l814k0874J62995J43866k21132j97616
2042c94266J54210K73544J40939j43137j40166k28329j33330l4832M21846l5417
2032a18938J70853Q394l06677J36728K20272N5648j10007j99359J33710j644J71175
2021A60155j61153k10023J21203o4794J48520l2594M4280L09928M6414k10251
2011A51685j27670M5496p5576L50180q1922l05551j54905l0961J51273J92638
$$ plain form
2001 114687 187494 27111 167787 233462 217834 15038 -21475 12705 86618 141271 5897
1990 5897 -128873 -356464 -95224 255316 131695 210008 268060 170517 185498 169023 21379
1979 21379 -160095 -2205 256920 17280 -314774 -292642 -329762 -101388 251618 284765
1969 284765 168071 119939 381039 172460 -17928 215603 39164 52295 -28748 -58688
1959 -58688 -209679 -540221 -322962 -174826 152144 282499 312771 74351 -82223 -301313
1949 -301313 -109421 295574 131252 -217007 -145659 -127063 -137031 -437795 -273076 -179337 -202771
1938 -202771 -144566 -359099 -88363 -153213 -59616 -49120 -29776 104739 -136984 -154050 80331
1927 80331 -122739 -112896 49042 65773 -93616 -296174 -187563 -105069 -88420 -165253 -256277
$$ packed form
2001A14687P2807j60383J40676O5675j5628k02796l6513L4180P3913N4653j35374
1990E897j34770k27591K61240L50540j23621P8313N8052r7543J4981j6475j47644
1979B1379j81474J57890K59125k39640l32054K2132l7120K28374L53006L3147
1969B84765j16694m8132K61100k08579j90388K33531j76439J3131q1043k9940
1959e8688j50991l30542K17259J48136L26970J30355L0272k38420j56574k19090
1949c01313J91892M04995j64322l48259P1348J8596r968l00764J64719R3739k3434
1938b02771N8205k14533K70736o4850R3597J0496J9344J34515k41723j7066K34381
1927H0331k03070R843J61938J6731j59389k02558J08611Q2494J6649p6833r1024
$$ plain form
1916 -256277 -52902 -208638 -342762 -272575 -394916 -467277 -403856 -484103 -270175 -205972 -124314
1905 -124314 -84348 -101925 144699 337918 424286 235960 88644 -71351 149241 97638
1895 97638 -231252 -464225 -94294 -3183 99467 240437 77205 -58801 126107 244640
1885 244640 2085 -222556 -86508 122903 233136 440260 490606 216561 67675 110919
1875 110919 29456 -213289 -342901 -385078 -230546 -399331 -270920 -85120 -259293 -94334
1865 -94334 -51458 -186602 -120035 -153644 -93634 -2656 47665 262284 121377 118568 -296679
1854 -296679 -132887 158526 23816 44792 -71697 -225900 -44276 173453 158867 190853
1844 190853 -43615 99304 113303 26795 -195361 -181359 8648 -235364 86918 40089
$$ packed form
1916b56277K03375j55736j34124P0187j22341p2361O3421q0247K13928O4203Q1658
1905a24314L9966j7577K46624J93219Q6368j88326j47316j59995K20592n1603
1895I7638l28890k32973L69931R1111J02650J40970j63232j36006J84908J18533
1885B44640k42555k24641J36048K09411J10233K07124N0346k74045j48886M3244
1875A10919q1463k42745j29612m2177J54532j68785J28411J85800j74173J64959
1865i4334M2876j35144O6567l3609O0010R0978N0321K14619j40907k809m15247
1854b96679J63792K91413j34710K0976j16489j54203J81624K17729j4586L1986
1844A90853k34468J42919J3999q6508k22156J4002J90007k44012L22282m6829
$$ plain form
1834 40089 -71131 -183669 -185595 -214907 -170513 31258 119072 127217 -57978 -123654 22174
1823 22174 -261662 -412564 -399896 -457725 -148846 154128 -95682 -110755 -243493 -140288
1813 -140288 -26584 -77497 150794 104585 241206 466372 240068 42906 -3390 -59702
1803 -59702 -173981 -140306 -240948 -215413 -73670 -181705 -195265 34237 77540 -195318 -210907
1792 -210907 -261407 -267598 -323008 -71512 -165616 -517526 -235090 66274 -151195 -39244 129614
1781 129614 -38826 -354752 -288236 -42762 -195094 -20559 -116899 -316744 9420 -17515
1771 -17515 -163605 -235612 -256607 -588843 -421773 -239825 -84378 105853 49079 -132819
1761 -132819 -369325 -19714 101145 -765 -249963 -261170 2181 -15262 -78053 -405764
$$ packed form
1834D0089j11220j12538j926k9312M4394K01771Q7814Q145j85195o5676J45828
1823B2174k83836j50902J2668n7829L08879L02974k49810j5073j32738J03205
1813a40288J13704n0913K28291m6209J36621K25166k26304j97162m6296n6312
1803e9702j14279L3675j00642K5535J41743j08035j3560K29502M3303k72858j5589
1792b10907n0500o191n5410K51496r4104l51910K82436L01364k17469J11951J68858
1781A29614j68440l15926O6516K45474j52332J74535r6340j99845L26164k6935
1771a7515j46090p2007k0995l32236J67070J81948J55447J90231n6774j81898
1761a32819k36506L49611J20859j01910k49198j1207K63351j7443o2791l27711
$$ plain form
1751 -405764 -142986 95866 -119141 -266655 -121767 29666 -134512 128087 192179 238431
1741 238431 120528 38598 74788 271870 249517 -98594 -183476 -53260 -10739 -164044 165900
1730 165900 -39040 -109238 -184253 -164885 -38257 -139554 165147 -124228 -106908 73984
1720 73984 72444 150191 -2221 377786 226727 -147768 -46116 -100434 51305 37619 -45467
1709 -45467 -51961 -61871 -106959 -198798 -65735 102182 133931 171304 -12729 -106517 -111439 -91740
1697 -91740 -197137 -21645 93700 -348503 -323942 180123 85128 291406 186375 -81742
1687 -81742 -163490 -435948 -378447 -253076 -196228 -151372 -106141 35919 -287544 -271859 -301998
$$ packed form
1751d05764K62778K38852k15007j47514J44888J51433j64178K62599O4092M6252
1741B38431j17903q1930L6190J97082k2353l48111q4882J30216M2521j53305L29944
1730A65900k04940p0198p5015J9368J26628j01297L04701k89375J7320J80892
1720G3984j540P7747j52412L80007j51059l74495J01652n4318J51739j3686q3086
1709d5467o494r910m5088r1839J33063J67917L1749L7373j84033r3788m922J9699
1697i1740j05397J75492J15345m42203K4561N04065r4995K06278j05031k68117
1687h1742q1748k72458N7501J25371N6848M4856M5231J42060l23463J5685l0139
$$ [...]
##END NTUPLES=NMR SPECTRUM
##END=
