##TITLE=1H_EC-3359(1)
 200.13MHz,DMSO,
 8 sc
 
 27.8.2025
##JCAMPDX= 6.0         $$ Bruker NMR JCAMP-DX V2.0
##DATA TYPE= NMR SPECTRUM
##DATA CLASS= NTUPLES
##ORIGIN= UXNMR, Bruker Analytische Messtechnik GmbH
##OWNER= pz
$$ XWIN-NMR		Version 3.5
$$ Wed Aug 27 13:53:09 2025 Russian Standard Time (UT+4h)  she@DPX200
##.OBSERVE FREQUENCY= 200.1313
##.OBSERVE NUCLEUS= ^1H
##.ACQUISITION MODE= SIMULTANEOUS
##.ACQUISITION SCHEME= undefined
##.AVERAGES= 8
##.DIGITISER RES= 18
##SPECTROMETER/DATA SYSTEM= spect
##.PULSE SEQUENCE= zg30
##.SOLVENT NAME= CDCl3
##.SHIFT REFERENCE= (INTERNAL, CDCl3, 0, 24.4418)
##AUDIT TRAIL= $$ (NUMBER, WHEN, WHO, WHERE, WHAT)
$$ ##TITLE= Audit trail, XWIN-NMR		Version 3.5
$$ ##JCAMPDX= 5.01
$$ ##ORIGIN= Bruker BioSpin GmbH
$$ ##OWNER= she
$$ F:/spectra/data/she/nmr/H-C/1/pdata/1/auditp.txt
$$ ##AUDIT TRAIL=  $$ (NUMBER, WHEN, WHO, WHERE, WHAT)
(   1,<2025-08-27 13:50:41.95 +0400>,<she>,<DPX200>,
      <created by zg, POWCHK disabled, PULCHK disabled
       configuration hash MD5:
       00 E9 B6 7A A2 85 ED C7 34 08 36 98 17 FE 4E 26
       data hash MD5: 16K
       36 4B 49 74 CC 93 B9 2C 94 CF 61 5E D7 E9 37 3F>)
(   2,<2025-08-27 13:50:44.90 +0400>,<she>,<DPX200>,
      <Start of raw data processing
       efp BC_mod = 2 LB = 0.25 FT_mod = 6 PKNL = 1 PHC0 = -1727.056 PHC1 = 24.99228 SI = 16K 
       data hash MD5: 16K
       67 A7 16 5B 0F C2 51 36 5C 9F 4E B8 D5 95 0A A2>)
(   3,<2025-08-27 13:51:08.26 +0400>,<she>,<DPX200>,
      <pk PHC0 = 8.929164 PHC1 = -13 
       data hash MD5: 16K
       72 38 B6 68 AB 42 01 20 CA 8B 54 EA 94 6D F7 1E>)
(   4,<2025-08-27 13:51:12.68 +0400>,<she>,<DPX200>,
      <abs ABSG = 5 
       data hash MD5: 16K
       23 3F FC CB 18 32 38 6F C5 C3 5A 58 69 02 E2 FB>)
$$ ##END=
$$ 
$$ hash MD5
$$ 22 5E 77 0D 15 09 55 9E 77 58 10 3C 8D 79 00 42
##$RELAX= 
##$RELAX= 
##$RELAX= 
##$RELAX= 
##$RELAX= 
##$RELAX= 
$$ Bruker specific parameters
$$ --------------------------
##$DU= <F:/spectra>
##$EXPNO= 1
##$NAME= <H-C>
##$PROCNO= 1
##$TYPE= <nmr>
##$USER= <she>
##$AMP= (0..31)
100 100 100 100 100 100 100 100 100 100 100 100 100 100 100 100 100 100 
100 100 100 100 100 100 100 100 100 100 100 100 100 100 
##$AQSEQ= 0
##$AQ_mod= 1
##$AUNM= <au_zg>
##$AUTOPOS= <>
##$BF1= 200.13
##$BF2= 200.13
##$BF3= 200.13
##$BF4= 200.13
##$BF5= 200.13
##$BF6= 200.13
##$BF7= 200.13
##$BF8= 200.13
##$BYTORDA= 1
##$CFDGTYP= 0
##$CFRGTYP= 5
##$CHEMSTR= <none>
##$CNST= (0..31)
1 1 145 1 1 1 1 1 1 1 1 1 1 1 1 1 1 1 1 1 1 1 1 1 1 1 1 1 1 1 1 1 
##$CPDPRG= <>
##$CPDPRG1= <>
##$CPDPRG2= <>
##$CPDPRG3= <>
##$CPDPRG4= <mlev>
##$CPDPRG5= <mlev>
##$CPDPRG6= <mlev>
##$CPDPRG7= <mlev>
##$CPDPRG8= <mlev>
##$CPDPRGB= <>
##$CPDPRGT= <>
##$D= (0..31)
0 0.7 0 0 0 0 0 0 0 0 0 0.03 0 0 0 0 0 0 0 0 0 0 0 0 0 0 0 0 0 0 0 0 
##$DATE= 1756288241
##$DBL= (0..7)
120 120 120 120 120 120 120 120 
##$DBP= (0..7)
150 150 150 150 150 150 150 150 
##$DBP07= 0
##$DBPNAM0= <>
##$DBPNAM1= <>
##$DBPNAM2= <>
##$DBPNAM3= <>
##$DBPNAM4= <>
$$ [...]
##$SUBNAM3= <"">
##$SUBNAM4= <"">
##$SUBNAM5= <"">
##$SUBNAM6= <"">
##$SUBNAM7= <"">
##$SUBNAM8= <"">
##$SUBNAM9= <"">
##$SW= 18.0517328524113
##$SWIBOX= (0..15)
0 0 2 0 0 0 0 0 0 0 0 0 0 0 0 0 
##$SW_h= 3612.71676300578
##$TD= 16384
##$TD0= 1
##$TE= 0
##$TE2= 300
##$TE3= 300
##$TEG= 300
##$TL= (0..7)
0 120 120 120 120 120 120 120 
##$TP= (0..7)
150 150 150 150 150 150 150 150 
##$TP07= 0
##$TPNAME0= <>
##$TPNAME1= <>
##$TPNAME2= <>
##$TPNAME3= <>
##$TPNAME4= <>
##$TPNAME5= <>
##$TPNAME6= <>
##$TPNAME7= <>
##$TPOAL= (0..7)
0.5 0.5 0.5 0.5 0.5 0.5 0.5 0.5 
##$TPOFFS= (0..7)
0 0 0 0 0 0 0 0 
##$TUNHIN= 0
##$TUNHOUT= 0
##$TUNXOUT= 0
##$USERA1= <user>
##$USERA2= <user>
##$USERA3= <user>
##$USERA4= <user>
##$USERA5= <user>
##$V9= 5
##$VALIST= <valist>
##$VCLIST= <CCCCCCCCCCCCCCC>
##$VD= 0
##$VDLIST= <DDDDDDDDDDDDDDD>
##$VPLIST= <PPPPPPPPPPPPPPP>
##$VTLIST= <TTTTTTTTTTTTTTT>
##$WBST= 1024
##$WBSW= 4
##$XGAIN= (0..3)
0 0 0 0 
##$XL= 0
##$YL= 0
##$YMAX_a= 78129
##$YMIN_a= -67075
##$ZGOPTNS= <>
##$ZL1= 120
##$ZL2= 120
##$ZL3= 120
##$ZL4= 120
##$ABSF1= 15.51662
##$ABSF2= -2.53523
##$ABSG= 5
##$ABSL= 3
##$ALPHA= 0
##$AQORDER= 0
##$ASSFAC= 0
##$ASSFACI= 0
##$ASSFACX= 0
##$ASSWID= 0
##$AUNMP= <proc_1d>
##$AZFE= 0.1
##$AZFW= 0.1
##$BCFW= 0
##$BC_mod= 2
##$BYTORDP= 0
##$COROFFS= 0
##$CY= -3
##$DATMOD= 1
##$DC= 0
##$DFILT= <>
##$DTYPP= 0
##$F1P= 0
##$F2P= 0
##$FCOR= 1
##$FTSIZE= 16384
##$FT_mod= 6
##$GAMMA= 0
##$GB= 0
##$INTBC= 1
##$INTSCL= 3.241238e-09
##$ISEN= 128
##$LB= 0.25
##$LEV0= 0
##$LPBIN= 0
##$MAXI= 10000
##$MC2= 0
##$MEAN= 0
##$ME_mod= 0
##$MI= 1.114404
##$NCOEF= 0
##$NC_proc= -8
##$NLEV= 6
##$NOISF1= 3.799351
##$NOISF2= 2.8
##$NSP= 0
##$NTH_PI= 0
##$NZP= 0
##$OFFSET= 24.44183
##$PC= 1
##$PHC0= -1718.127
##$PHC1= 11.99228
##$PH_mod= 1
##$PKNL= yes
##$PPARMOD= 0
##$PSCAL= 0
##$PSIGN= 0
##$REVERSE= no
##$SF= 200.128214859491
##$SI= 16384
##$SIGF1= 3
##$SIGF2= 2
##$SINO= 0.751879
##$SIOLD= 32768
##$SREGLST= <19F.Aceton>
##$SSB= 0
##$STSI= 16384
##$STSR= 0
##$SW_p= 3612.71676300578
##$SYMM= 0
##$S_DEV= 0
##$TDeff= 16384
##$TDoff= 0
##$TI= <>
##$TILT= no
##$TM1= 0
##$TM2= 0
##$TOPLEV= 0
##$USERP1= <user>
##$USERP2= <user>
##$USERP3= <user>
##$USERP4= <user>
##$USERP5= <user>
##$WDW= 1
##$XDIM= 16384
##$YMAX_p= 278022231
##$YMIN_p= -635786
$$ End of Bruker specific parameters
$$ ---------------------------------
##NTUPLES= NMR SPECTRUM
##VAR_NAME=  FREQUENCY,     SPECTRUM/REAL,   SPECTRUM/IMAG
##SYMBOL=    X,             R,               I
##VAR_TYPE=  INDEPENDENT,   DEPENDENT,       DEPENDENT
##VAR_FORM=  AFFN,          ASDF,            ASDF
##VAR_DIM=   16384,         16384,           16384
##UNITS=     HZ,            ARBITRARY UNITS, ARBITRARY UNITS
##FACTOR=    0.220516191357247, 1,           1
##FIRST=     4891.4997420376, 0,             0
##LAST=      1278.78297903182, 0,            0
##MIN=       1278.78297903182, -635786,      0
##MAX=       4891.4997420376, 278022231,     0
$$ Real data points
##PAGE= N=1
##DATA TABLE= (X++(R..R)), XYDATA
$$ [...]
$$ plain form
7751 -241657 -154553 -64321 -85443 -47922 -22912 32751 62520 35277 -46494 -51838 -62561 -144368
7739 -144368 -155322 -98374 -125687 -58338 -217560 -102275 102428 21771 -84771 22096 113072
7728 113072 -711 -161298 -228294 -227610 -29087 -37578 10786 136501 19162 -195388 -250310
7717 -250310 -59112 -14443 -3810 64978 97368 49877 61298 147613 11134 131308 157906
7706 157906 125627 164906 248271 412367 359813 267517 56464 86539 212101 192124 116100
7695 116100 153485 201500 150031 114472 208719 264456 257222 151029 155166 182459 244467 209814
7683 209814 88094 224999 310192 248825 129201 191484 119515 80073 117550 75162 22940
7672 22940 141135 104727 36811 53004 -17174 -183271 -165659 -137180 -225210 -168936 -97408
$$ packed form
7751b41657Q7104R0232k1122L7521K5010N5663K9769k7243q1771n344j0723q1807
7739a44368j0954N6948k7313O7349j59222J15285K04703q0657j06542J06867R0976
7728A13072j13783j60587o6996O84J98523q491M8364J25715j17339k14550n4922
7717b50310J91198M4669J0633O8788L2390m7491J1421Q6315j36479J20174K6598
7706A57906l2279L9279Q3365J64096n2554r2296k11053L0075J25562j9977p6024
7695A16100L7385M8015n1469l5559R4247N5737p234j06193M137K7293O2008l4653
7683B09814j21720J36905Q5193o1367j19624O2283p1969l9442L7477m2388n2222
7672B2940J18195l6408o7916J6193p0178j66097J7612K8479q8030N6274P1528
$$ plain form
7661 -97408 -44644 -28592 -27861 68615 1523 31681 99883 82707 9813 -22215 -13131 -18790 2359
7648 2359 -439 -65017 836 -22953 14919 -68729 -92166 -63178 -118676 -120353 -140006 -99802
7636 -99802 -176169 -9350 -58406 -39408 -87820 -196660 -65616 -46943 7332 -37090 -4342
7625 -4342 -4122 15747 50084 -107161 -161287 -134209 -97503 -48046 18162 26624 -32614 -114967
7613 -114967 -104711 -108049 -71994 -72553 -78081 -98478 -47797 -70930 -51979 -56708 42349 70771 31411
7600 31411 -26704 12399 50087 -97620 -19286 -93826 -154194 -111488 -55055 -35486 -89548 -33156
7588 -33156 -30754 -48979 -99643 -112421 -151241 -200643 -66736 -9447 -58085 13486 -30516 -7943
7576 -7943 -35114 -74525 -85416 21632 107787 -31934 -27309 116956 142703 78322 -23764
$$ packed form
7661i7408N2764J6052P31R6476o7092L0158O8202j7176p2894l2028R084n659K1149
7648B359k798o4578O5853k3789L7872q3648k3437K8988n5498j677j9653M0204
7636i9802p6367J66819m9056J8998m8412j08840J31044J8673N4275m4422L2748
7625d342K20J9869L4337j57245n4126K7078L6706M9457O6208Q462n9238q2353
7613a14967J0256l338L6055n59n528k0397N0681k3133J8951m729R9057K8422l9360
7600C1411n8115L9103L7688j47707P8334p4540o0368M2706N6433J9569n4062N6392
7588c3156K402j8225n0664j2778l8820m9402J33907N7289m8638P1571m4002K2573
7576g943k7171l9411j0891J07048Q6155j39721M625J44265K5747o4381j02086
$$ plain form
7565 -23764 -78201 -8455 20621 -36057 -56838 -70133 -90028 -25971 -65055 -127511 -125780 -69371
7553 -69371 -47853 -639 -51249 28030 -2458 3063 51391 109201 85879 17331 31858 -59491
7541 -59491 -31239 17329 27168 5246 159906 96954 -53366 -55311 39935 -136857 -123263 -56526
7529 -56526 -36149 -86201 84239 2344 -36447 -88168 -113235 -147213 -85141 -55912 -140254 -142054
7517 -142054 -179828 -194076 -138973 -144127 -145769 -243410 -383269 -203607 -152296 -28307 16409
7506 16409 76084 -85254 -23493 -38831 -141814 -149787 551 10034 9696 76455 5244 -53004
7494 -53004 74611 122436 134111 119036 182155 -1344 -107157 -59074 -69537 41456 -12559
7483 -12559 61592 87898 8295 49932 83311 178879 136728 186217 151553 105968 56608 -109586
$$ packed form
7565b3764n4437O9746K9076n6678k0781j3295j9895O4057l9084o2456J731N6409
7553f9371K1518M7214n0610P9279l0488N521M8328N7810k3322o8548J4527r1349
7541e9491K8252M8568R839k1922J54660o2952j50320j945R5246j76792J3594O6737
7529e6526K0377n0052J70440q1895l8791n1721k5067l3978O2072K9229q4342j800
7517a42054l7774j4248N5103n154j642r7641j39859J79662N1311J23989M4716
7506A6409N9675j61338O1761j5338j02983p973J50338R483l38O6759p1211n8248
7494e3004J27615M7825J1675j5075O3119j83499j05813M8083j0463J10993n4015
7483a2559P4151K6306p9603M1637L3379R5568m2151M9489l4664m5585m9360j66194
$$ plain form
7471 -109586 24510 195773 179079 128197 4567 28871 40032 130931 149835 48075 -17289
7460 -17289 -60851 -31281 27660 100974 100874 64771 98076 68121 73081 190367 168549 52400
7448 52400 261992 203807 49501 44427 174223 244243 362975 416621 369864 238617 282521
7437 282521 365176 148683 226345 154325 285232 411740 466022 500426 466508 430249 491396
7426 491396 470301 453367 528209 595279 596585 741956 859141 867657 1163841 1470747 1561116
7415 1561116 1799795 1838668 1779516 1790135 1727504 1527943 1342621 1268542 1116209 1039561 1038975
7404 1038975 911798 912875 882876 807230 809295 794294 891880 835672 820720 747215 701539 843580
7392 843580 887856 1037752 1221450 1324616 1539528 1759049 1817705 1812652 1659372 1756265 1624872
$$ packed form
7471a09586J34096J71263j6694n0882j23630K4304J1161R0899J8904j01760o5364
7460a7289m3562K9570N8941P3314j00l6103L3305k9955M960J17286k1818j16149
7448E2400K09592n8185j54306n074J29796P0020J18732N3646m6757j31247M3904
7437B82521Q2655k16493P7662p2020J30907J26508N4282L4404l3918l6259O1147
7426D91396k1095j6934P4842O7070J306J45371J17185Q516K96184L06906R0369
7415A561116K38679L8873n9152J0619o2631j99561j85322p4079j52333p6648n86
7404A038975j27177J077k9999p5646K065j5001R7586n6208j4952p3505m5676J42041
7392H43580M4276J49896J83698J03166K14912K19521N8656n053j53280R6893j31393
$$ plain form
7381 1624872 1370318 1241521 1061447 1013387 907544 836008 716344 636510 742588 710298
7371 710298 535615 376234 386974 443782 405054 274706 258749 301991 245013 180051 91322
7360 91322 111067 246552 258512 253910 229171 65767 14141 -48952 41430 88635 174138 138147
7348 138147 27476 164469 158644 122527 73447 77647 -27262 -59088 -87803 -8475 85229
7337 85229 83797 53276 32351 35544 -21281 13867 113381 69319 -71467 -84077 -156625 -163226
7325 -163226 -152881 -52603 4174 67321 -9868 -38683 53021 57016 -91505 -175662 -19025
7314 -19025 61092 -34775 -159045 -99233 -17347 49415 -1862 -109573 -130368 -186456 -213977
7303 -213977 -157989 -88180 -33523 -96988 -42807 71953 161061 107474 5961 -11 10969
$$ packed form
7381A624872k54554j28797j80074m8060j05843p1536j19664p9834J06078l2290
7371G10298j74683j59381J0740N6808l8728j30348j5957M3242n6978o4962q8729
7360I1322J9745J35485J1960m602k4739j63404n1626o3093R0382M7205Q5503l5991
7348A38147j10671J36993n825l6117m9080M200j04909l1826k8715P9328R3704
7337H5229j432l0521k0925L193n6825L5148R9514m4062j40786j2610p2548o601
7325a63226J0345J00278N6777O3147p7189k8815R1704L995j48521q4157J56637
7314a9025Q0117r5867j24270N9812Q1886O6762n1277j07711k0795n6088k7521
7303b13977N5988O9809N4657o3465N4181J14760Q9108n3587j01513n972J0980
$$ plain form
7292 10969 49697 -42992 -210554 -46452 87411 -48986 -175520 -109799 -61647 17175 99658
7281 99658 -96785 93592 62139 -81503 -111492 -140284 22171 -183960 -200309 -45012 -26891
7270 -26891 -41104 27507 117019 55475 -101746 -83918 -40004 15171 -46091 -71323 -15264 -178229
7258 -178229 -207188 -148176 -76270 -72674 -63683 -155584 2064 -102184 -151327 -197329 -182047 -15120
7246 -15120 -84848 -72783 28517 40942 30576 -89008 -58068 -33364 14944 90165 1704
7235 1704 -55397 -65660 -35625 -150910 -210506 -214832 -140124 -26660 33894 19830 -46321 -118474
7223 -118474 -146351 -107697 -147373 -21465 -31151 -7702 11418 3709 -117329 -116439 -148901 24018
7211 24018 13408 -11912 -12969 -42804 -97698 -241520 -7605 -26350 -90394 -44163 -49017 34202
$$ packed form
7292A0969L8728r2689j67562J64102J33863j36397j26534O5721M8152P8822Q2483
7281I9658j96443J90377l1453j43642k9989k8792J62455k06131j6349J55297J8121
7270b6891j4213O8611Q9512o1544j57221J7828M3914N5175o1262k5232N6059j62965
7258a78229k8959N9012P1906L596Q991r1901J57648j04248m9143m6002J5282J66927
7246a5120o9728J2065J01300J2425j0366j19584L0940K4704M8308P5221q8461
7235A704n7101j0263L0035j15285n9596m326P4708J13464O0554j4064o6151p2153
7223a18474k7877L8654l9676J25908r686K3449J9120p709j21038Q90l2462J72919
7211B4018j0610k5320j057k9835n4894j43822K33915j8745o4044M6231m854Q3219
$$ plain form
7199 34202 96768 -104852 -16329 5100 -124040 -95873 -58018 -154776 -91498 -22644 -6780
7188 -6780 -181444 -96191 -102541 35870 127439 21144 -82054 -231855 -62137 -33931 2984
7177 2984 -54498 -155500 -186062 -185923 -142701 -95079 67640 -1298 -131934 -238356 -101437
7166 -101437 -11870 25707 89272 1478 -59278 13830 90771 140383 69294 310206 341082
7155 341082 137297 128384 165429 171157 130099 84048 169619 277111 251555 261835 307945 168995
7143 168995 186166 359663 435101 370203 258126 98307 80676 222074 116411 213304 319143
7132 319143 285546 268552 189023 138613 80430 96684 132224 105550 226368 231840 228156 168580
7120 168580 196345 74276 16229 61240 40750 80125 122796 158801 38557 97570 85244
$$ packed form
7199C4202O2566k01620Q8523K1429j29140K8167L7855r6758O3278O8854J5864
7188f780j74664Q5253o350J38411R1569j06295j03198j49801J69718K8206L6915
7177B984n7482j01002l0562J39M3222M7622J62719o8938j30636j06422J36919
7166a01437Q9567L7577O3565q7794o0756P3108P6941M9612p1089K40912L0876
7155C41082k03785q913L7045N728m1058m6051Q5571J07492k5556J0280M6110j38950
7143A68995J7171J73497P5438o4898j12077j59819j7631J41398j05663R6893J05839
7132C19143l3597j6994p9529n0410n8183J6254L5540k6674J20818N472l684n9576
7120A68580K7765j22069n8047M5011k0490L9375M2671L6005j20244N9013j2326
$$ plain form
7109 85244 -8295 100405 97269 78287 -34737 56733 150763 97253 -15205 146551 232789
7098 232789 106550 30378 -14405 146336 193258 131559 123437 221498 131822 86232 140230
7087 140230 224428 281040 319365 242642 241361 286807 302382 302007 149482 178846 172248 224591
7075 224591 225141 209641 197061 209615 210133 211375 207761 299031 308183 248783 186029 90029 115902
7062 115902 128599 104460 50769 -38737 -82633 238816 493020 301943 172422 146495 65475
7051 65475 28555 127761 184877 310614 217058 87342 131679 166409 197249 7801 64822
7040 64822 13873 141309 114467 185838 299039 277612 394015 244572 154416 166409 186014
7029 186014 90631 332186 327452 270235 234884 255598 142863 12489 -24650 90833 5694
$$ packed form
7109H5244r3539J08700l136j8982j13024R1470R4030n3510j12458J61756Q6238
7098B32789j26239p6172m4783J60741M6922o1699q122R8061q9676m5590N3998
7087A40230Q4198N6612L8325p6723j281M5446J5575l75j52525K9364o598N2343
7075B24591N50j5500j2580J2554N18J242l614R1270R152n9400o2754r6000K5873
7062A15902J2697k4139n3691q9506m3896L21449K54204j91077j29521k5927q1020
7051F5475l6920R9206N7116J25737r3556j29716M4337L4730L0840j89448N7021
7040F4822n0949J27436k6842P1371J13201k1427J16403j49443r0156J1993J9605
7029A86014r5383K41555m734n7217l5351K0714j12735j30374l7139J15483q5139
$$ plain form
7018 5694 23910 214522 182962 94887 77509 198317 177461 205629 99210 -66480 -209774
7007 -209774 -113069 73156 59562 102098 88851 64867 12992 -220241 -125440 -2109 68490
6996 68490 131970 59126 -127790 -139289 -103362 81333 105042 264876 234610 43536 -23982
6985 -23982 86312 222937 180561 202639 179935 237965 313806 288392 346905 375034 318139
6974 318139 421647 501371 421681 482331 681719 743682 737471 787648 878458 802929 817756
6963 817756 769028 608404 568191 639476 778087 752191 812995 894322 803650 797148 662955
6952 662955 633585 620714 579986 582288 491369 508040 422380 343051 313333 252925 295275 399640
6940 399640 380439 323305 215781 190262 210357 258802 182359 89344 48879 35662 60202
$$ packed form
7018E694J8216J90612l1560q8075j7378J20808k0856K8168j06419j65690j43294
7007b09774R6705J86225j3594M2536j3247k3984n1875k33233R4801J23331P0599
6996F8490O3480p2844j86916j1499L5927J84695K3709J59834l0266j91074o7518
6985b3982J10294J36625m2376K2078k2704N8030P5841k5414N8513K8129n6895
6974C18139J03508P9724p9690O0650J99388O1963o211N0177R0810p5529J4827
6963H17756m8728j60624m0213P1285J38611k5896O0804Q1327r0672o502j34193
6952F62955k9370j2871m0728K302r0919J6671q5660p9329k9718o0408M2350J04365
6940C99640j9201n7134j07524k5519K0095M8445p6443r3015m0465j3217K4540
$$ plain form
6929 60202 96866 90202 54200 80190 247197 280858 134011 98574 53454 151813 229059 273138
6917 273138 240364 337576 296643 245552 291693 365287 369845 213582 266103 317669 277330 237833
6905 237833 251302 283741 300215 248357 313708 374083 364645 340328 379159 474819 305426 323601
6893 323601 237647 211047 211727 262658 308367 392408 453347 523906 390658 296831 453018 426776
6881 426776 402960 376278 446413 408219 328216 388912 326468 357608 534909 618011 451612
6870 451612 363153 335604 305277 394960 435971 361160 370166 344973 382996 423518 389275 466481
6858 466481 331392 294025 379762 490913 476609 417535 251674 383947 374537 411480 419048
6847 419048 473770 416448 368745 447559 451703 380119 326755 457439 501379 442146 403381 392003
$$ packed form
6929F0202L6664o664l6002K5990J67007L3661j46847l5437m5120R8359P7246M4079
6917B73138l2774R7212m0933n1091M6141P3594M558j56263N2521N1566m0339l9497
6905B37833J3469L2439J6474n1858O5351O0375r438k4317L8831R5660j69393J8175
6893C23601q5954k6600O80N0931M5709Q4041O0939P0559j33248r3827J56187k6242
6881D26776k3816k6682P0135l8194q0003O0696o2444L1140J77301Q3102j66399
6870D51612q8459k7549l0327Q9683M1011p4811R006k5193L8023M0522l4243P7206
6858D66481j35089l7367Q5737J11151j4304n9074j65861J32273r410L6943P568
6847D19048N4722n7322m7703P8814M144p1584n3364J30684M3940n9233l8765j1378
$$ plain form
6835 392003 448290 358592 262893 362869 449434 395661 437090 480698 388052 367968 414344 453976
6823 453976 514115 469144 531417 710878 556818 522717 611479 606157 582623 631868 570881
6812 570881 712509 821457 804347 708419 665232 706765 687539 734657 638571 662207 658291
6801 658291 587838 671145 771458 772217 746013 720496 620855 720743 668313 662144 664975 685691
6789 685691 638756 786738 900057 951065 926363 798425 767368 744935 708700 737451 788818
6778 788818 842110 844664 773537 785300 818678 904590 828630 842594 954417 882227 812953 756193
6766 756193 807812 794770 964410 1040279 981360 930184 902575 1004829 1096105 1190851 1158149
6755 1158149 1081501 1049736 1115031 1260475 1446407 1439255 1356520 1404791 1345232 1327671 1446638
$$ packed form
6835C92003N6287q9698r5699R9976Q6565n3773M1429M3608r2646k0084M6376L9632
6823D53976O0139m4971O2273J79461j54060l4101Q8762n322k3534M9245o0987
6812E70881J41628J08948j7110r5928m3187M1533j9226M7118r6086K3636l916
6801F58291p0453Q3307J00313P59k6204k5517r9641R9888n2430o169K831K0716
6789F85691m6935J47982J13319N1008k4702j27938l1057k2433l6235K8751N1367
6778G88818N3292K554p1127J1763L3378Q5912p5960J3964J11823p2190o9274n6760
6766G56193N1619j3042J69640P5869n8919n1176k7609J02254R1276R4746l2702
6755A158149p6648l1765O5295J45444J85932p152q2735M8271n9559j7561J18967
$$ plain form
6744 1446638 1455056 1563386 1629530 1815391 1721920 1687026 1799342 1833347 1922239 2066944 1980091
6733 1980091 1986431 2022491 2103133 2229522 2305308 2376066 2353474 2321263 2294969 2352659 2457419
6722 2457419 2470108 2561162 2697102 2729012 2849551 2903457 2946420 3016283 3075321 3247311 3405705
6711 3405705 3298782 3287224 3396264 3567164 3698920 3660063 3854866 4020522 4088829 4132671
6701 4132671 4190100 4395924 4471789 4722116 4887328 4866420 5007643 5171810 5354039 5503954
6691 5503954 5576574 5804695 6038017 6367936 6635001 6840189 7127334 7495426 8000086 8395705
6681 8395705 8833167 9337468 9716297 10138353 10764602 11417896 12123065 12880068 13638726 14481540
6671 14481540 15592892 16875174 18016244 19400641 20945328 22399970 24231196 26384054
$$ packed form
6744A446638Q418J08330O6144J85861r3471l4894J12316L4005Q8892J44705q6853
6733A980091O340L6060Q0642J26389P5786P0758k2592l2211k6294N7690J04760
6722B457419J2689R1054J35940L1910J20539N3906M2963O9863N9038J71990J58394
6711C405705j06923j1558J09040J70900J31756l8857J94803J65656O8307M3842
6701D132671N7429K05824P5865K50327J65212k0908J41223J64167J82229J49915
6691E503954P2620K28121K33322L29919K67065K05188K87145L68092N04660L95619
6681H395705M37462N04301L78829M22056O26249O53294P05169P57003P58658Q42814
6671A4481540J111352J282282J141070J384397J544687J454642J831226K152858
$$ plain form
6663 26384054 28754720 31468600 34351299 37713460 41537520 46019903 51476188 57676784
6655 57676784 64917819 73319295 83211195 94072696 104871727 114736265 122536212 127625283
6647 127625283 129724721 128035226 124099048 120817639 120336966 122679795 127092279 132328656
6639 132328656 136595667 139065223 138761684 135465441 128085312 116902097 104906683 94451835
6631 94451835 86167327 79290970 73459356 68177275 63216908 58552863 54176703 50112312
6623 50112312 46057658 42339314 39083887 36303472 33739278 31579655 29591145 27831601
6615 27831601 26035660 24470481 22922161 21679519 20538475 19416772 18474476 17564484
6607 17564484 16611401 15677806 14986893 14270206 13774694 13304693 12731884 12103668 11500762
$$ packed form
6663B6384054K370666K713880K882699L362161L824060M482383N456285O200596
6655E7676784P241035Q401476R891900J0861501J0799031R864538P799947N089071
6647A27625283K099438j689495l936178l281409m80673K342829M412484N236377
6639A32328656M267011K469556l03539l296243p380129j1183215j1995414j0454848
6631I4451835q284508o876357n831614n282081m960367m664045m376160m064391
6623E0112312m054654l718344l255427k780415k564194k159623j988510j759544
6615B7831601j795941j565179j548320j242642j141044j121703r42296r09992
6607A7564484r53083r33595o90913p16687m95512m70001n72809o28216o02906
$$ plain form
6598 11500762 11114844 10755143 10297238 9837966 9381536 9121505 8788644 8454346 8149595
6589 8149595 7865284 7560775 7320530 6951116 6837186 6684825 6510424 6275554 6077169 5925482
6579 5925482 5696988 5544133 5447628 5234942 4933253 4890833 4871571 4748378 4572256 4415236
6569 4415236 4179372 4115581 4028684 4004660 3917589 3864785 3757468 3663063 3779815 3680809 3594796
6558 3594796 3584337 3444240 3330663 3185317 3182379 3042270 3006728 2938859 2829904 2770161 2617806
6547 2617806 2615567 2530025 2600148 2632628 2574923 2510412 2513075 2495405 2409378 2347816 2332309 2258842
6535 2258842 2231925 2141857 2282838 2239029 2197976 2127324 1958196 1951016 1887654 1968746 2066389
6524 2066389 2098614 2027185 2028057 1883676 1774071 1603778 1645237 1646568 1599867 1697022 1677498
$$ packed form
6598A1500762l85918l59701m57905m59272m56430k60031l32861l34298l04751
6589H149595k84311l04509k40245l69414j13930j52361j74401k34870j98385j51687
6579E925482k28494j52855r6505k12686l01689m2420j9262j23193j76122j57020
6569D415236k35864o3791q6897k4024q7071n2804j07317r4405J16752r9006q6013
6558C594796j0459j40097j13577j45346k938j40109l5542o7869j08955n9743j52355
6547B617806k239q5542P0123L2480n7705o4511K663j7670q6027o1562j5507p3467
6535B258842k6917r0068J40981m3809m1053p0652j69128p180o3362Q1092R7643
6524B066389L2225p1429Q72j44381j09605j70293M1459J331m6701R7155j9524
$$ plain form
6513 1677498 1671364 1532005 1607537 1620821 1575169 1573980 1465022 1305891 1248072 1379045 1408569
6502 1408569 1319112 1389071 1432186 1425399 1418656 1363553 1438835 1358455 1278925 1287037 1140870 1044965
6490 1044965 998217 992012 949861 892037 932355 823861 801528 808219 843661 889972 939507 758036
6478 758036 715778 692575 667827 626249 607656 687240 638245 632812 718224 740832 636024 552161
6466 552161 543833 664727 723779 645541 662540 635073 491188 402557 400172 516219 542122
6455 542122 551040 638823 625593 582110 636710 615071 649337 567899 505247 494421 484758 501674
6443 501674 579593 630783 648720 629631 498930 538120 656193 652432 668136 728599 725338 759448
6431 759448 696295 522453 336934 252905 425774 343005 376742 249002 227949 310017 415286
$$ packed form
6513A677498o134j39359P5532J3284m5652j189j08958j59131n7819J30973K9524
6502A408569q9457O9959M3115o787o743n5103P5282q0380p9530Q112j46167r5905
6490A044965m6748o205m2151n7824M0318j08494k2333O691L5442M6311M9535j81471
6478G58036m2258k3203k4748m1578j8593P9584m8995n433Q5412K2608j04808q3863
6466E52161q328J20894N9052p8238J6999k7467j43885q8631k385J16047K5903
6455E42122Q918Q7783j3230m3483N4600k1639L4266q1438o2652j0826r663J6916
6443E01674P7919N1190J7937j9089j30701L9190J18073l761J5704O0463l261L4110
6431G59448o3153j73842j85519q4029J72869q2769L3737j27740k1053Q2068J05269
$$ plain form
6420 415286 432285 322439 381250 399457 414357 524543 472710 369239 461916 506787 282498
6409 282498 244234 396803 458151 389178 236021 267263 353022 362283 261666 162363 154371
6398 154371 132212 223986 297164 212501 182038 105016 165385 146013 167102 186399 297825
6387 297825 353491 262008 171105 275549 201956 287421 370047 277121 392997 525499 530452
6376 530452 438456 372080 346257 324367 327330 458478 450405 377899 251217 201788 193796 161206
6364 161206 220725 158698 53542 176822 271437 187705 275271 253819 257519 278986 258402
6353 258402 175678 246500 238127 195037 332135 285440 280532 209460 147768 213035 274998 301389
6341 301389 267910 296745 390109 276335 262446 146028 175339 174834 305554 395571 378210
$$ packed form
6420D15286J6999j09846N8811J8207J4900J10186n1833j03471R2677M4871k24289
6409B82498l8264J52569O1348o8973j53157L1242Q5759R261j00617r9303p992
6398A54371k2159R1774P3178q4663l0463p7022O0369j9372K1089J9297J11426
6387B97825N5666r1483r0903J04444p3593Q5465Q2626r2926J15876J32502M953
6376E30452r1996o6376k5823k1890K963J31148q073p2506j26682m9429p992l2590
6364A61206N9519o2027j05156J23280R4615q3732Q7566k1452L700K1467k0584
6353B58402q2724P0822q373m3090J37098m6695m908p1072o1692O5267O1963K6391
6341C01389l3479K8835R3364j13774j3889j16418K9311n05J30720R0017j7361
$$ plain form
6330 378210 624221 602757 587229 552729 608263 555341 567873 586323 621426 653039 671109
6319 671109 576353 589822 680754 750489 726427 757397 665381 748739 753744 749494 705923 549200
6307 549200 491421 465988 421239 436594 543183 468492 381514 304745 330726 238599 201779
6296 201779 133998 306339 311128 336281 246472 149368 119285 88320 37739 37844 123219 289614
6284 289614 287357 92962 15922 229720 142016 92442 125783 179536 226434 89944 2871
6273 2871 -117453 -61403 49278 23352 -70405 -24046 -50561 20940 65092 119284 188114 65649
6261 65649 -27656 12354 129664 33530 98619 -38376 -54879 -14141 -88806 -49456 -123018
6250 -123018 -45380 56341 -28831 53928 83082 -32646 -23377 -96331 -61823 21694 128062
$$ packed form
6330C78210K46011k1464j5528l4500N5534n2922J2532J8450L5103L1613J8070
6319F71109r4756J3469R0932O9735k4062L0970r2016Q3358N005m250m3571j56723
6307E49200n7779k5433m4749J5355J06589p4691q6978p6769K5981r2127l6820
6296B01779o7781J72341M789K5153q9809r7104l0083l0965n0581J05Q5375J66395
6284B89614k257j94395p7040K13798q7704m9574L3341N3753M6898j36490q7073
6273B871j20324N6050J10681k5926r3757M6359k6515P1501M4152N4192O8830j22465
6261F5649r3305M0010J17310r6134O5089j36995j6503M0738p4665L9350p3562
6250a23018P7638J01721q5172Q2759K9154j15728R269p2954L4508Q3517J06368
$$ plain form
6239 128062 106689 43392 -18895 1378 69211 -46478 -23479 115112 126460 226443 234577
6228 234577 182815 63297 -10853 22677 70171 128529 161162 17283 -8577 -3708 -57206
6217 -57206 -135798 -87773 -109315 -122810 -177210 -127526 143822 92338 -41916 -100808 -110122 -7541
6205 -7541 -35520 33236 -5774 -44058 -53751 55042 61884 1685 57725 -25453 -34045 -49830
6193 -49830 2461 17047 32651 30303 -106819 -4825 76994 -51160 -83577 -99107 -149653
6182 -149653 -2152 97632 13117 -28495 -48620 -11752 6888 34946 -31817 -51516 -166103
6171 -166103 -102281 -202137 -78829 76810 46583 -207169 -222529 -191954 -151634 17835 -35858
6160 -35858 -14273 -215646 -165249 -115267 -101353 -89735 -49602 -57757 -127809 -119878 -48889 -163009
$$ packed form
6239A28062k1373o3297o2287K0273O7833j15689K2999J38591J1348R9983Q134
6228B34577n1762j19518p4150L3530M7494N8358L2633j43879k5860M869n3498
6217e7206p8592M8025k1542j3495n4400M9684K71348n1484j34254n8892r314J02581
6205g541k7979O8756l9010l8284r693J08793O842o0199N6040q3178q592j5785
6193d9830N2291J4586J5604k348j37122J01994Q1819j28154l2417j5530n0546
6182a49653J47501R9784q4515m1612k0125L6868J8640K8058o6763j9699j14587
6171a66103O3822r9856J23308J55639l0227k53752j5360L0575M0320J69469n3693
6160c5858K1585k01373N0397M9982J3914J1618M0133q155p0052P931P0989j14120
$$ plain form
6148 -163009 -73631 8057 -72173 25647 8083 168866 51946 -73827 -109573 -60680 23419
6137 23419 40880 -45733 -55939 17197 -124879 -67707 -161647 -106667 -11034 110389 240471
6126 240471 178998 6556 -11912 25443 -35487 -3032 -63125 -81214 -41103 -139537 -214966
6115 -214966 -209682 -30676 -35207 -56008 -150090 -190740 12702 38515 85607 35 145147
6104 145147 120141 -100133 -70183 -66603 -205199 -64587 80115 -7326 -133577 -154998 -73187
6093 -73187 -6472 -82186 -36996 19833 13598 -1260 -60116 58545 5776 -1591 -43955 84042
6081 84042 58310 -41391 -7573 26987 80696 66292 -42664 -94867 48784 8579 -43542
6070 -43542 32324 -3864 -48313 20144 12672 -52413 -22645 31939 50975 -34929 -143871 -75077
$$ packed form
6148a63009Q9378Q1688q0230R7820j7564J60783j16920j25773l5746M8893Q4099
6137B3419J7461q6613j0206P3136j42076N7172r3940N4980R5633J21423J30082
6126B40471o1473j72442j8468L7355o0930L2455o0093j8089M0111r8434p5429
6115b14966N284J79006m531k0801r4082m0650K03442K5813M7092q5572J45112
6104A45147k5006k20274K9950L580j38596J40612J44702q7441j26251k1421Q1811
6093g3187O6715p5714M5190N6829o235j4858n8856J18661n2769p367m2364J27997
6081H4042k5732r9701L3818L4560N3709j4404j08956n2203J43651m0205n2121
6070d3542P5866l6188m4449O8457p472o5085K9768N4584J9036q5904j08942O8794
$$ plain form
6058 -75077 -94264 -125186 -273127 -138204 -63521 -107861 -127036 -64187 -69496 -194767 -160856
6047 -160856 -181089 -110750 -91136 -45337 -78272 73064 27472 13052 14472 -80441 -68741 -26026
6035 -26026 23101 -36886 -101975 -195786 -197227 -99932 -74126 -102388 -149783 -113610 -124309 -135931
6023 -135931 -94148 -37673 -18269 -31592 20149 -65949 -152704 -78220 -15841 -109725 -10507 59519
6011 59519 39540 64657 -41925 -44450 12724 35921 19695 -99640 -94181 -164239 -45378 125623
5999 125623 -16075 -130852 -200463 -33013 -31241 -29098 23616 -76602 -122338 -179169 5945
5988 5945 49434 71042 37594 121836 112954 186 5487 17876 25623 -20079 37427 8711
5976 8711 -77657 -18123 -100704 -72728 -16814 -44986 -92670 -92475 9922 2330 20239 96323
$$ packed form
6058g5077j9187l0922j47941J34923P4683m4340j9175O2849n309j25271L3911
6047a60856k0233P0339J9614M5799l2935J51336m5592j4420J420r4913J1700M2715
6035b6026M9127n9987o5089r3811j441R7295K5806k8262m7395L6173j0699j1622
6023a35931M1783N6475J9404j3323N1741q6098q6755P4484O2379r3884R9218P0026
6011E9519j9979K5117j06582k525N7174K3197j6226j19335N459p0058J18861J71001
5999A25623j41698j14777o9611J67450J772K143N2714j00218m5736n6831J85114
5988E945M3489K1608l3448Q4242q882j12768N301J2389P747m5702N7506k8716
5976H711q6368N9534q2581K7976N5914k8172m7684J95J02397p592J7909P6084
$$ plain form
5964 96323 74608 -83346 -126667 -53034 -114450 -183684 -74989 -48122 -51609 16729 -34246 45001
5952 45001 55664 45803 158081 112526 135587 212956 129179 4330 59734 102869 78367 20984
5940 20984 50399 -14247 52044 187210 52592 -73374 -80295 31797 10450 -172735 -75126
5929 -75126 -43613 -47783 -106594 -101213 -88095 -37954 197 6348 -31094 6323 83733 2152
5917 2152 -35786 79597 -105594 -140568 -107308 21586 104895 781 49782 92191 88513
5906 88513 55744 38095 51217 6094 -38641 -128598 -104099 -58310 -162460 -161240 -138844 -35737
5894 -35737 -46995 73541 33520 41508 45690 56596 4860 -33919 -13301 -72776 57409 27728
5882 27728 -6828 51120 80268 -22464 -19385 2445 8794 -122422 -100618 9459 24930 64227
$$ packed form
5964I6323k1715j57954m3321P3633o1416o9234J08695K6867l487O8338n0975P9247
5952D5001J0663r861J12278m5555K3061P7369q3777j24849N5404M3135k4502n7383
5940B0984K9415o4646O6291J35166j34618j25966o921J12092k1347j83185R7609
5929g5126L1513m170n8811N381J3118N0141L8151O151l7442L7417P7410q1581
5917B152l7938J15383j85191l4974L3260J28894Q3309j04114M9001M2409l678
5906H8513l2769j7649J3122m5123m4735q9957K4499M5789j04150J220K2396J03107
5894c5737j1258J20536m0021P988M182J0906n1736l8779K0618n9475J30185k9681
5882B7728l4556N7948K9148j02732L079K1830O349j31216K1804J10077J5471L9297
$$ plain form
5870 64227 67924 49436 -5944 -140157 -118841 -17460 -95457 -73421 -132874 -155839 -156819 -64176
5858 -64176 -73041 -41785 -155113 -83395 -218866 -135159 -127749 -136859 -81762 1114 64867 -7409
5846 -7409 -60678 -41241 -15590 -49940 -5458 46161 3511 -39035 -3479 74890 -15182 -26757
5834 -26757 -145855 -76565 63761 48857 -40872 -118163 -174360 -217571 -28654 -25039 -105005
5823 -105005 -151067 -42505 -162608 -111227 -120681 -50757 60542 -64013 -28469 -13343 -27047
5812 -27047 -1362 -40088 65604 197840 68718 -25712 44415 7137 31730 113825 119418
5801 119418 79232 -302 -19537 2719 -121510 -181855 -161843 36237 101232 -41627 -23811
5790 -23811 98320 26407 219152 195222 180313 -27934 41252 29078 89078 130839 -13927
$$ packed form
5870F4227L697j8488n5380j34213K1316J01381p7997K2036n9453k2965r80R2643
5858f4176q865L1256j13328P1718j35471Q3707P410r110N5097Q2876O3753p2276
5846g409n3269J9437K5651l4350M4482N1619m2650m2546L5556P8369r0072j1575
5834b6757j19098O9290J40326j4904q9729p7291n6197m3211J88917L615p9966
5823a05005m6062J08562j20103N1381r454O9924J11299j24555L5544J5126j3704
5812b7047K5685l8726J05692J32236j29122r4430P0127l7278K4593Q2095N593
5801A19418m0186p9534j9235K2256j24229o0345K0012J98080O4995j42859J7816
5790b3811J22131p1913J92745k3930j4909k08247O9186j2174O0000M1761j44766
$$ plain form
5779 -13927 113369 113762 -29258 52834 9274 -62354 81612 31323 -136740 21406 49629
5768 49629 -91408 -207745 -64361 52433 6141 70492 -85724 -122127 -46328 134945 92433
5757 92433 56953 -77214 -26668 -36458 -93357 -21654 -61881 -59883 -11617 -24631 21652 194084
5745 194084 231636 83917 48418 148564 131086 34254 126683 128226 43135 68680 80945
5734 80945 11842 56948 1632 -5371 16228 17944 -55344 108679 96410 156662 89130 109076
5722 109076 145254 26088 30908 54419 57031 55630 116067 -31161 61296 155146 65204 273012
5710 273012 198872 180789 283723 301973 304233 65081 178384 261231 320545 386090 416390
5699 416390 459240 379758 416320 272130 135680 260115 154691 138800 64774 57640 206713
$$ packed form
5779a3927J27296L93j43020Q2092m3560p1628J43966n0289j68063J58146K8223
5768D9629j41037j16337J43384J16794m6292O4351j56216l6403P5799J81273m2512
5757I2433l5480j34167N0546r790n6899P1703m0227J998M8266j3014M6283J72432
5745A94084L7552j47719l5499J00146j7478r6832R2429J543q5091K5545J2265
5734H0945o9103M5106n5316p003K1599J716p3288J64023j2269O0252o7532J9946
5722A09076L6178j19166M820K3511K612j401O0437j47228R2457R3850q9942K07808
5710B73012p4140j8083J02934J8250K260k39152J13303Q2847N9314O5545L0300
5699D16390M2850p9482L6562j44190j36450J24435j05424j5891p4026p134J49073
$$ plain form
5688 206713 216867 257640 73529 -25175 94499 189610 236256 152452 294165 431199 364467
5677 364467 199238 168649 306539 166165 274057 305146 398344 400121 414067 432601 284300
5666 284300 378528 388631 342956 277081 227270 250862 339175 167380 128326 175551 197961
5655 197961 185288 177453 193385 167074 141812 102258 172139 209097 183135 208214 246786 195357
5643 195357 187302 251895 180819 73390 30474 183342 169983 58460 91180 145144 153295
5632 153295 248033 124826 13414 231625 178633 208528 172134 21491 100566 89315 95550
5621 95550 132039 165526 94026 33747 -31028 41241 104096 -2759 98261 99123 97563 211106
5609 211106 159377 91944 138613 139680 21488 17274 -36309 10956 44450 45186 20039 120761
$$ packed form
5688B06713J0154M0773j84111r8704J19674R5111M6646q3804J41713J37034o6732
5677C64467j65229l0589J37890j40374J07892L1089R3198J777J3946J8534j48301
5666B84300R4228J0103m5675o5875m9811K3592Q8313j71795l9054M7225K2410
5655A97961j2673p835J5932k6311k5262l9554O9881L6958k5962K5079L8572n1429
5643A95357q055O4593p1076j07429m2916J52868j3359j11523L2720N3964Q151
5632A53295R4738j23207j11412K18211n2992K9895l6394j50643P9075j1251O235
5621I5550L6489L3487p1500o0279o4775P2269O2855j06855J01020Q62j560J13543
5609B11106n1729o7433M6669J067j18192m214n3583M7265L3494P36k5147J00722
$$ plain form
5597 120761 37122 81675 98364 51897 139754 119957 69666 -5279 133757 181628 112536
5586 112536 39900 147136 169539 318222 247274 106049 32567 -11720 106225 113281 45428
5575 45428 114636 169463 207837 135018 22559 81402 33485 -9263 -3164 71825 83448 105934
5563 105934 97327 40674 28053 183974 228797 276293 256773 238328 359772 247276 55064
5552 55064 182842 228637 126371 266656 240933 203503 165923 124157 43171 40167 -3314
5541 -3314 130497 158038 98930 93737 8333 212708 286611 158233 189512 99585 51876 -41163
5529 -41163 -101149 -129733 -145471 -25688 -42820 69958 18657 -8845 191268 267884 -41375
5518 -41375 -11127 150725 163267 129528 105885 85482 183262 229931 209541 196629 151304 273234
$$ packed form
5597A20761q3639M4553J6689m6467Q7857j9797n0291p4945J39036M7871o9092
5586A12536p2636J07236K2403J48683p0948j41225p3482m4287J17945P056o7853
5575D5428O9208N4827L8374p2819j12459N8843m7917m2748O099P4989J1623K2486
5563A05934q607n6653j2621J55921M4823M7496j9520j8445J21444j12496j92212
5552E5064J27778M5795j02266J40285k5723l7430l7580m1766q0986l004m3481
5541c314J33811K7541n9108n193q5404K04375P3903j28378L1279q9927m7709r3039
5529d1163n9986k8584j5738J19783j7132J12778n1301k7502K00113P6616l09259
5518d1375L0248J61852J2542l3739k3643k0403R7780M6669k0390j2912m5325J21930
$$ plain form
5506 273234 199523 173875 156825 266704 181248 161304 170166 156644 188636 189588 222589 224198
5494 224198 124796 3489 15659 32167 80497 143134 141850 255234 227001 180785 263302
5483 263302 229231 184148 218297 383812 401416 312022 387600 410783 347377 172953 161473
5472 161473 167987 65486 166949 253048 194594 42887 93484 174573 221823 328466 280368
5461 280368 300846 291168 345847 256474 312579 407808 410761 414940 303681 230787 250519 384680
5449 384680 349954 304094 199670 110602 266902 394123 321597 327938 307829 347172 355804
5438 355804 142534 128834 139846 168850 308163 300180 325931 273151 315909 378788 347873
5427 347873 322664 294720 260589 440059 432878 345477 353952 301587 208402 276843 180145 234735
$$ packed form
5506B73234p3711k5648j7050J09879q5456j9944Q862j3522L1992R52L3001J609
5494B24198r9402j21307J2170J6508M8330O2637j284J13384k8233m6216Q2517
5483B63302l4071m5083L4149J65515J7604q9394P5578K3183o3406j74424j1480
5472A61473O514j02501J01463Q6099n8454j51707N0597Q1089M7250J06643m8098
5461B80368K0478r678N4679q9373N6105R5229K953M179j11259p2894J9732J34161
5449C84680l4726m5860j04424q9068J56300J27221p2526O341k0109L9343Q632
5438C55804k13270j3700J1012K9004J39313p983K5751n2780M2758O2879l0915
5427C47873k5209k7944l4131J79470p181q7401Q475n2365r3185O8441r6698N4590
$$ plain form
5415 234735 320497 233650 247567 187934 108868 284107 264257 174696 85140 118257 283498
5404 283498 352557 357124 322524 174867 195287 255591 307169 270963 345414 184028 45634
5393 45634 213459 99268 137000 95567 93723 69236 217364 118075 73341 93265 246906
5382 246906 284673 265547 323546 374998 464666 317621 275555 430116 256016 212195 291696
5371 291696 260286 383128 351572 526051 593489 421042 322215 262058 359587 240484 93961
5360 93961 93739 337371 406932 361874 325494 295970 144521 25928 79070 104134 324551
5349 324551 263528 230954 350251 197562 150982 154622 165067 103746 206485 198300 144266
5338 144266 210524 221154 284669 107449 36063 30950 15550 141004 237777 212903 192646
$$ packed form
5415B34735Q5762q6847J3917n9633p9066J75239j9850q9561q9556L3117J65241
5404B83498O9059M567l4600j47657K0420O0304N1578l6206P4451j61386j38394
5393D5634J67825j14191L7732m1433j844k4487J48128r9289m4734J9924J53641
5382B46906L7767j9126N7999N1452Q9668j47045m2066J54561j74100m3821P9501
5371B91696l1410J22842l1556J74479O7438j72447r8827o0157R7529j19103j46523
5360I3961k22K43632O9561m5058l6380k9524j51449j18593N3142K5064K20417
5349C24551o1023l2574J19297j52689m6580L640J0445o1321J02739q185n4034
5338A44266O6258J0630O3515j77220p1386n113j5400J25454R6773k4874k0257
$$ plain form
5327 192646 169452 79665 84674 287575 369735 358552 191891 191423 220902 213328 114865 57498
5315 57498 9397 35980 56103 165552 195184 277670 254611 149144 176770 264897 244138
5304 244138 129127 83184 200824 230718 204334 290272 95821 -12952 167766 190058 212052
5293 212052 86716 119087 203493 85207 177540 159567 82763 194568 267584 162918 194984
5282 194984 122731 134619 103026 294008 273502 189678 145353 129539 50882 131724 214405
5271 214405 306428 335498 362683 298458 195562 170723 226319 192311 223072 230394 178090 246420
5259 246420 175266 104219 80721 143445 108783 327399 388407 276783 216230 195731 231118
5248 231118 299739 358359 200564 181941 128726 93316 171705 254232 134237 191759 218619
$$ packed form
5327A92646k3194q9787N009K02901Q2160j1183j66661m68K9479p574r8463n7367
5315E7498m8101K6583K0123J09449K9632Q2486k3059j05467K7626Q8127k0759
5304B44138j15011m5943J17640K9894k6384Q5938j94451j08773J80718K2292K1994
5293B12052j25336L2371Q4406j18286R2333j7973p6804J11805P3016j04666L2066
5282A94984p2253J1888l1593J90982k0506q3824m4325j5814p8657Q0842Q2681
5271B14405R2023K9070K7185o4225j02896k4839N5596l4008L0761P322n2304O8330
5259B46420p1154p1047k3498O2724l4662K18616O1008j11624o0553k0499L5387
5248B31118O8621N8620j57795j8623n3215l5410P8389Q2527j19995N7522K6860
$$ plain form
5237 218619 205960 215893 268900 288070 163792 284455 235460 267702 121657 133152 317373
5226 317373 385443 452753 173154 184643 213589 259256 354098 327859 292402 209285 263778
5215 263778 250208 325095 323845 404353 308748 223771 228461 159322 103331 236887 335279 422672
5203 422672 364741 318029 250300 296668 448380 440100 372479 367633 434880 386156 222243 294911
5191 294911 216983 266157 191642 282953 374034 311085 249886 302185 319506 298936 361664 424308
5179 424308 311354 389217 383827 409562 429761 392016 601900 594337 479223 350523 562662
5168 562662 556265 414525 458325 535852 575179 675785 622484 716152 639951 605610 601885 746053
5156 746053 675720 680177 724865 752666 881435 934919 876841 793304 844381 820118 727531 718669
$$ packed form
5237B18619j2659R933N3007J9170j24278J20663m8995L2242j46045J1495J84221
5226C17373O8070O7310k79599J1489K8946M5667R4842k6239l5457q3117N4493
5215B63778j3570P4887j250Q0508r5605q4977M690o9139n5991J33556R8392Q7393
5203D22672n7931m6712o7729M6368J51712q280o7621m846O7247m8724j63913P2668
5191B94911p7928M9174p4515R1311R1081o2949o1199N2299J7321k0570O2728O2644
5179D24308j12954P7863n390K5735K0199l7745K09884p563j15114j28700K12139
5168E62662o397j41740M3800P7527L9327J00606n3301R3668p6201l4341l725J44168
5156G46053p0333M457M4688K7801J28769N3484n8078q3537N1077k4263r2587q862
$$ plain form
5144 718669 728043 814658 875806 781459 845819 934891 934102 946741 1007895 943622 877497 1028655
5132 1028655 1023676 1041505 1192679 1098636 1053937 1082088 988700 1002007 870043 944691 1081496
5121 1081496 993582 976371 1039702 1016938 1001609 1075376 1024657 1020457 1017090 1043367 1232433 1202701
5109 1202701 1143360 1065645 1025956 1022048 1127025 1286143 1175080 1153252 1276200 1266445 1255315
5098 1255315 1315636 1214129 1134868 1165711 1234771 1274081 1285702 1254454 1294732 1361131 1347676
5087 1347676 1371616 1447963 1346538 1368217 1464071 1384378 1368630 1282264 1232170 1254998 1249503
5076 1249503 1333958 1477336 1356067 1404652 1327236 1271705 1438652 1356465 1370019 1400510 1371985
5065 1371985 1395571 1375847 1304788 1357307 1387758 1401426 1348547 1312719 1470337 1433338 1229297
$$ packed form
5144G18669R374Q6615O1148r4347O4360Q9072p89J2639O1154o4273o6125J51158
5132A028655m979J7829J51174r4043m4699K8151r3388J3307j31964P4648J36805
5121A081496q7914j7211O3331k2764j5329P3767n0719m200l367K6277J89066k9732
5109A202701n9341p7715l9689l908J04977J59118j11063k1828J22948r755j1130
5098A255315O0321j01507p9261L0843O9060L9310J1621l1248M0278O6399j3455
5087A347676K3940P6347j01425K1679R5854p9693j5748q6366n0094K2828n495
5076A249503Q4455J43378j21269M8585p7416n5531J66947q2187J3554L0491k8525
5065A371985K3586j9724p1059N2519L0451J3668n2879l5828J57618l6999k04041
$$ plain form
5054 1229297 1198598 1256723 1262751 1364848 1451719 1295068 1296580 1375335 1235872 1111419 1223915
5043 1223915 1281059 1157194 1179031 1252058 1231932 1425229 1379697 1339266 1411167 1497637 1514324
5032 1514324 1603887 1486676 1396437 1404674 1571052 1691263 1639669 1663316 1751538 1813699 1868054
5021 1868054 1886205 1886162 1857557 1762554 1800655 1699317 1759544 1904234 1869638 1741654 1567931
5010 1567931 1667479 1759600 1873791 1804236 1882321 1941824 1862204 1851707 1952590 1908690 1810222
4999 1810222 1899034 1842366 1810625 1797364 1870917 1905950 1967292 1910838 1869276 1941607 2002809
4988 2002809 2136137 2084696 2076976 2293840 2337881 2255611 2256685 2313826 2396288 2442368 2321246
4977 2321246 2432297 2519686 2512828 2541909 2685044 2737966 2791572 2705663 2850104 2921591 2869156
$$ packed form
5054A229297l0699N8125O028J02097Q6871j56651J512P8755j39463j24453J12496
5043A223915N7144j23865K1837P3027k0126J93297m5532m0431P1901Q6470J6687
5032A514324Q9563j17211r0239Q237J66378J20211n1594K3647Q8222O2161N4355
5021A868054J8151m3k8605r5003L8101j01338O0227J44690l4596j27984j73723
5010A567931R9548R2121J14191o9555P8085N9503p9620j0497J00883m3900r8468
4999A810222Q8812n6668l1741j3261P3553L5033O1342n6454m1562P2331O1202
4988B002809J33328n1441p720K16864M4041q2270J074N7141Q2462M6080j21122
4977B321246J11051Q7389o858K9081J43135N2922N3606q5909J44441P1487n2435
$$ plain form
4966 2869156 2809055 2870434 2944662 3033923 2993843 2989041 3079809 3190086 3226995 3160735 3277558
4955 3277558 3263855 3344595 3376451 3357356 3489114 3506735 3505834 3544852 3580611 3587523 3700319 3803813
4943 3803813 3678876 3732513 4091561 4177879 4214656 4274040 4270058 4254222 4402803 4531572 4587485
4932 4587485 4613804 4601735 4603718 4776533 4935208 4960722 5176015 5218730 5351371 5455557 5575270
4921 5575270 5629077 5739068 5851206 5871626 6110409 6232911 6307852 6371890 6475354 6664134
4911 6664134 7009212 7297847 7509651 7613833 7607116 7904237 8157942 8623198 8925432 9228559
4901 9228559 9756329 10069166 10520399 10990643 11523712 12168809 12704032 13290619 14043156 14945307
4891 14945307 15943119 17072742 18254929 19430781 20734053 22405897 24094649 25924795
$$ packed form
4966B869156o0101O1379P4228Q9261m0080m802R0768J10277L6909o6260J16823
4955C277558j3703Q0740L1856j9095J31758J7621r01L9018L5759O912J12796J03494
4943C803813j24937N3637L59048Q6318L6777N9384l982j5836J48581J28769N5913
4932D587485K6319j2069J983J72815J58675K5514K15293M2715J32641J04186J19713
4921E575270N3807J09991J12138K0420K38783J22502P4941O4038J03464J88780
4911F664134L45078K88635K11804J04182o717K97121K53705M65256L02234L03127
4901I228559N27770L12837M51233M70244N33069O45097N35223N86587P52537R02151
4891A4945307R97812J129623J182187J175852J303272J671844J688752J830146
$$ plain form
4883 25924795 27980345 30034104 32092166 34413449 36672447 38983620 41414515 43684667
4875 43684667 45712480 47626818 49186028 50585093 51655317 52487082 53213068 53809173 54372716
4866 54372716 54729404 55219482 55611326 56257451 57084333 58271582 59800619 61522730 63586060
4857 63586060 65857084 68614943 71522686 74713779 78003212 81220850 84602326 88105838
4849 88105838 91304194 93873691 95892124 97191829 98041799 98463258 98231055 97963550 97628821
4840 97628821 97113817 96401827 95577623 94724567 94038068 93590909 93498676 93714222 94178235 94877644
4830 94877644 95879662 97139467 98568512 100057532 101418897 102701630 103481669 103944653
4822 103944653 103951481 103708211 103065965 102277356 101471051 100618612 100025783 99711757 99621413 99710940
$$ packed form
4883B5924795K055550K053759K058062K321283K258998K311173K430895K270152
4875D3684667K027813J914338J559210J399065J070224Q31765P25986N96105N63543
4866E4372716L56688M90078L91844O46125Q26882J187249J529037J722111K063330
4857F3586060K271024K757859K907743L191093L289433L217638L381476L503512
4849H8105838L198356K569497K018433J299705Q49970M21459k32203k67505l34729
4840I7628821n15004p11990q24204q53056o86499m47159r2233K15546M64013O99409
4830I4877644J002018J259805J429045J489020J361365J282733P80039M62984
4822A03944653O828k43270o42246p88609q06305q52439n92829l14026r0344Q9527
$$ plain form
4812 99710940 100115682 100672817 101218097 102085555 102980571 103821945 104543039 105248484 105859556
4803 105859556 106091450 106215675 106131777 105506940 104009503 102101615 99561360 96484965 93425036
4794 93425036 90435143 87531884 84713060 82304443 79867023 77554373 75684952 74119339
4786 74119339 72589900 71267303 70437832 69781287 69246824 68997832 68758832 68413902 67909561
4777 67909561 67144260 66262772 65244600 64111697 62583500 60639355 58523563 56183210
4769 56183210 53689630 51135810 48626526 46188918 44049065 41866774 39504315 37351269
4761 37351269 35355580 33487403 31806682 30128881 28625717 27309440 25925840 24694422
4753 24694422 23697452 22601517 21667589 20805440 19968149 19181589 18273938 17767591 17338446
$$ packed form
4812I9710940M04742N57135N45280Q67458Q95016Q41374P21094P05445O11072
4803A05859556K31894J24225q3898o24837j497437j907888k540255l076395l059929
4794I3425036k989893k903259k818824k408617k437420k312650j869421j565613
4786G4119339j529439j322597q29471o56545n34463k48992k39000l44930n04341
4777F7909561p65301q81488j018172j132903j528197j944145k115792k340353
4769E6183210k493580k553820k509284k437608k139853k182291k362459k153046
4761C7351269j995689j868177j680721j677801j503164j316277j383600j231418
4753B4694422r96970j095935r33928q62149q37291p86560r07651n06347m29145
$$ plain form
4744 17338446 16717587 16277064 15766525 15317945 14937699 14561058 14126201 13920196 13597482
4735 13597482 13218534 12955634 12639985 12297972 12079195 11961384 11637102 11425363 11164822
4726 11164822 10954221 10821050 10616718 10370972 10214466 10052655 9888069 9633405 9430894
4717 9430894 9326470 9230452 9235006 9086851 8844304 8717745 8564604 8433088 8450547 8299392
4707 8299392 8125717 8199720 8201584 8129525 7852599 7716009 7746022 7715369 7708710 7724179 7612151
4696 7612151 7485707 7415567 7371313 7362961 7284507 7211131 7220758 7098107 7109664 7070357 6876376
4685 6876376 6887438 7042530 7121806 7143228 7070000 6976436 6936220 6964464 6985094 6996182 7072567
4674 7072567 7084128 7023171 6967721 6943872 7057012 7035465 7029969 7177511 7195021 7122203 7257737
$$ packed form
4744A7338446o20859m40523n10539m48580l80246l76641m34857k06005l22714
4735A3597482l78948k62900l15649l42013k18777j17811l24282k11739k60541
4726A1164822k10601j33171k04332k45746j56506j61811j64586k54664k02511
4717I430894j04424r6018M554j48155k42547j26559j53141j31516J7459j51155
4707H299392j73675P4003J864p2059k76926j36590L0013l0653o659J5469j12028
4696G612151j26444p0140m4254q352p8454p3376R627j22651J1557l9307j93981
4685F876376J1062J55092P9276K1422p3228r3564m0216K8244K0630J1088P6385
4674G072567J1561o0957n5450k3849J13140k1547n496J47542J7510p2818J35534
$$ plain form
4663 7257737 7203281 7182731 7291980 7408769 7410115 7431106 7506695 7674185 7757700 7774897 7899918
4652 7899918 7962231 8186231 8216649 8274971 8424023 8604618 8678002 8774634 8973582 9029426 9239614
4641 9239614 9429221 9495757 9663639 9784663 10152660 10437446 10571464 10742155 11120745 11408032
4631 11408032 11744129 12128140 12505528 12816745 13126929 13636475 14081708 14663334 15292833
4622 15292833 15897879 16401244 17068717 17835802 18616068 19557578 20377586 21368316 22541245
4613 22541245 23836516 25387035 26973845 28706320 30480186 32506956 34749208 37304174
4605 37304174 40130178 43563501 47397871 51525608 56221976 61677801 67826576 74482535
4597 74482535 82284943 91315860 101869014 114308764 129201445 146719249 166758038
$$ packed form
4663G257737n4456k0550J09249J16789J346K0991P5589J67490Q3515J7197J25021
4652G899918O2313K24000L0418N8322J49052J80595P3384R6632J98948N5844K10188
4641I239614J89607O6536J67882J21024L67997K84786J34018J70691L78590K87287
4631A1408032L36097L84011L77388L11217L10184N09546M45233N81626O29499
4622A5292833O05046N03365O67473P67085P80266R41510Q20008R90730J172929
4613B2541245J295271J550519J586810J732475J773866K026770K242252K554966
4605C7304174K826004L433323L834370M127737M696368N455825O148775O655959
4597G4482535P802408R030917J0553154J2439750J4892681J7517804K0038789
$$ plain form
4590 166758038 188742307 211709091 234176494 254114603 269037968 277126803 278022231
4583 278022231 272195749 259891650 243076888 224586789 205842420 187872683 172198895
4576 172198895 158827141 147105574 136317345 126107662 116535642 107509879 99003374
4569 99003374 91218037 83972454 77461875 71773333 66696461 62139167 58038826 54521162
4561 54521162 51277949 48402544 45814701 43419436 41232695 39141646 37220193 35496279
4553 35496279 33994630 32484405 31094495 29883810 28857430 27841218 26847673 25924218
4545 25924218 25031062 24177274 23325534 22577927 21722287 20960902 20367582 19662437 18908048
4536 18908048 18497996 18065226 17559537 17209731 16861082 16416339 15995584 15629079 15401322
$$ packed form
4590A66758038K1984269K2966784K2467403J9938109J4923365Q088835Q95428
4583B78022231n826482j2304099j6814762j8490099j8744369j7969737j5673788
4576A72198895j3371754j1721567j0788229j0209683r572020r025763q506505
4569I9003374p785337p245583o510579n688542n076872m557294m100341l517664
4561E4521162l243213k875405k587843k395265k186741k091049j921453j723914
4553C5496279j501649j510225j389910j210685j026380j016212r93545r23455
4545B5924218q93156q53788q51740p47607q55640p61385n93320p05145p54389
4536A8908048m10052m32770n05689l49806l48649m44743m20755l66505k27757
$$ plain form
4527 15401322 15179664 14994056 14668175 14442468 14228458 14062824 14057623 14206023 14170355 13981954
4517 13981954 14117486 14360670 14544673 14831980 15202505 15637714 16385559 17137353 17932764
4508 17932764 18867099 19644352 20421928 20929149 21073166 20872665 20513817 19806753 18888144
4499 18888144 17850238 16962743 16072954 15296345 14752915 14189749 13608328 13016780 12607504
4490 12607504 12168134 11750721 11455639 11087001 10674863 10429462 10115443 9706331 9368488
4481 9368488 9424391 9256328 9006039 9087893 8954530 8706552 8592864 8395524 8232711 8194896
4471 8194896 8139442 8012719 7933907 7993443 7931795 7781524 7699904 7635876 7470581 7557267 7500319
4460 7500319 7448874 7299005 7196754 7281061 7158298 7193044 7297530 7223432 7057780 7101368
$$ packed form
4527A5401322k21658j85608l25881k25707k14010j65634n201J48400l5668j88401
4517A3981954J35532K43184J84003K87307L70525M35209P47845P51794P95411
4508A7932764R34335P77253P77576N07221J44017k00501l58848p07064r18609
4499A8888144j037906q87495q89789p76609n43430n63166n81421n91548m09276
4490A2607504m39370m17413k95082l68638m12138k45401l14019m09112l37843
4481I368488N5903j68063k50289Q1854j33363k47978j13688j97340j62813l7815
4471H194896n5454j26723p8812N9536o1648j50271q1620o4028j65295Q6686n6948
4460G500319n1445j49869j02251Q4307j22763L4746J04486p4098j65652M3588
$$ plain form
4450 7101368 7028634 7091926 6994775 6862923 6848460 6795331 6775996 6828244 6771354 6759149 6717452
4439 6717452 6691074 6712340 6555231 6556012 6495732 6510041 6688868 6683246 6565252 6574066 6692368
4428 6692368 6777789 6865758 6989079 7062443 7225725 7434360 7545660 7653132 7926994 8140052
4418 8140052 8161986 8080531 7924487 7915017 7819050 7925103 8163659 8317385 8552277 8749788
4408 8749788 8901904 9037451 9239182 9590746 9975682 10342815 10809671 11230252 11811434 12521480
4398 12521480 13200256 14152281 14995995 16097797 17672896 19379295 21087480 23380105 26123474
4389 26123474 29114584 32112845 34929859 37357270 39277657 40778503 41353488 41469627
4381 41469627 42183825 44071118 46773222 50478786 54503963 58172812 60856703 61902549
$$ packed form
4450G101368p2734O3292r7151j31852j4463n3129j9335N2248n6890j2205m1697
4439F717452k6378K1266j57109P81o0280J4309J78827n622j17994Q814J18302
4428F692368Q5421Q7969J23321P3364J63282K08635J11300J07472K73862K13058
4418H140052K1934q1455j56044r470r5967J06053K38556J53726K34892J97511
4408H749788J52116J35547K01731L51564L84936L67133M66856M20581N81182P10046
4398A2521480O78776R52025Q43714J101802J575099J706399J708185K292625K743369
4389B6123474K991110K998261K817014K427411J920387J500846N74985J16139
4381D1469627P14198J887293K702104L705564M025177L668849K683891J045846
$$ plain form
4373 61902549 62129178 60327333 55807846 51612823 48817170 47511068 46859604 46830378 46844379
4364 46844379 46477313 45580032 44091135 41881607 38351249 34641345 31423083 28880683
4356 28880683 26796724 25036422 23424590 22057363 20815311 19565746 18320412 17288327
4348 17288327 16244830 15261084 14394222 13685548 13028524 12424326 11929123 11517759 11140285
4339 11140285 10713366 10168005 9911735 9624666 9276254 9012149 8704643 8558763 8236288
4330 8236288 7990633 7918780 7816762 7446350 7323164 7251198 7074678 6945654 6921967 6911896
4320 6911896 6686071 6550157 6387931 6282316 6221069 6210606 6204177 6077424 5970382 5980306 5986523
4309 5986523 5867784 5725324 5742275 5875643 5970626 5920391 5871297 6012553 6050800 6138692 6239933
$$ packed form
4373F1902549K26629j801845m519487m195023k795653j306102o51464k9226J4001
4364D6844379l67066q97281j488897k209528l530358l709904l218262k542400
4356B8880683k083959j760302j611832j367227j242052j249565j245334j032085
4348A7288327j043497r83746q66862p08674o57024o04198m95203m11364l77474
4339A1140285m26919n45361k56270k87069l48412k64105l07506j45880l22475
4330H236288k45655p1853j02018l70412j23186p1966j76520j29024k3687j0071
4320F911896k25825j35914j62226j05615o1247j0463o429j26753j07042R924O217
4309E986523j18739j42460J6951J33368R4983n0235m9094J41256L8247Q7892J01241
$$ plain form
4298 6239933 6181211 5952538 5828239 5770312 5712253 5543581 5340721 5160828 5029664 5009448
4288 5009448 4931270 4755588 4567190 4595474 4586810 4456433 4478137 4546768 4496939 4378179 4362994
4277 4362994 4354541 4282663 4301062 4152658 4011331 4090956 4095195 4099179 4081537 4034727 3964453 3988737
4265 3988737 4187218 4279171 4358860 4348243 4249459 4163718 4115121 4021340 4117680 4005157 4062575
4254 4062575 4126925 4015717 3973602 4052136 4119110 4018724 4069396 4056407 3948266 4062996 4137588
4243 4137588 4007054 4046505 4084700 4155342 4213653 4169275 4277141 4379921 4340307 4110673 4200509
4232 4200509 4259439 4266251 4315885 4390815 4416172 4429430 4535458 4506508 4593286 4664659 4631790
4221 4631790 4700572 4754296 4676116 4766484 4952642 5067830 5170922 5286448 5257520 5338215 5338771
$$ packed form
4298F239933n8722k28673j24299n7927n8059j68672k02860j79893j31164k0216
4288E009448p8178j75682j88398K8284q664j30377K1704O8631m9829j18760j5185
4277D362994q453p1878J8399j48404j41327P9625M239L984j7642m6810p0274K4284
4265C988737J98481R1953P9689j0617r8784q5741m8597r3781R6340j12523N7418
4254D062575O4350j11208m2115P8534O6974j00386N0672j2989j08141J14730P4592
4243D137588j30534L9451L8195P0642N8311m4378J07866J02780l9614k29634Q9836
4232D200509N8930O812M9634P4930K5357J3258J06028k8950Q6778P1373l2869
4221D631790O8782N3724p8180R0368J86158J15188J03092J15526k8928Q0695N56
$$ plain form
4210 5338771 5400921 5593776 5697313 5773563 5913953 6112439 6310499 6532263 6666424 6873677
4200 6873677 7134673 7264097 7610548 7817597 8238199 8723492 9144719 9624048 10013039 10489224
4190 10489224 11117492 11739501 12333479 13051454 13793863 14308914 14822531 15132466 15453378
4181 15453378 15817147 16177914 16542700 16816125 17086228 17715071 18450643 19260854 20052410
4172 20052410 21055555 22012917 22762630 23970798 24982377 25644712 26571787 27294210 28040158
4163 28040158 28917719 29741408 30680786 31548938 32258820 33068551 33828012 34446857 35152273
4154 35152273 35593812 35990280 36389823 36833409 37317401 38199691 39117746 40388983 41863076
4145 41863076 43604436 45339186 46897286 48444377 49846581 50712138 51239797 51662499 52045743
$$ packed form
4210E338771O2150J92855J03537P6250J40390J98486J98060K21764J34161K07253
4200F873677K60996J29424L46451K07049M20602M85293M21227M79329L88991M76185
4190A0489224O28268O22009N93978P17975P42409N15051N13617L09935L20912
4181A5453378L63769L60767L64786K73425K70103O28843P35572Q10211P91556
4172B0052410J003145R57362P49713J208168J011579O62335R27075P22423P45948
4163B8040158Q77561Q23689R39378Q68152P09882Q09731P59461O18845P05416
4154C5152273M41539L96468L99543M43586M83992Q82290R18055J271237J474093
4145D1863076J741360J734750J558100J547091J402204Q65557N27659M22702L83244
$$ plain form
4136 52045743 52404023 52935543 53386358 53705915 54005879 54338008 54421188 54679814 54987264 55168547
4126 55168547 55292872 55219162 55209733 55198052 55225307 55399130 55935680 56790420 58027077 59367182
4116 59367182 60887118 62344342 63612110 64739302 65675894 66689046 67400472 67988910 68772931
4107 68772931 69451590 70044810 70453660 70509123 70321494 70031723 69584359 69226165 68744744 68149905
4097 68149905 67542192 67167844 66997283 66922392 67332253 68017038 68963141 70234908 71538308
4088 71538308 72886665 74094676 75149798 76118143 76790926 77261604 77722259 77730145 77464323
4079 77464323 76991545 76355027 75500241 74393639 73065082 71811228 70936846 70347795 70150848
4070 70150848 70439367 70910338 71474940 72232360 72825635 73279764 73691963 74130937 74264038
$$ packed form
4136E2045743L58280N31520M50815L19557K99964L32129Q3180K58626L07450J81283
4126E5168547J24325p3710r429j1681K7255J73823N36550Q54740J236657J340105
4116E9367182J519936J457224J267768J127192R36592J013152P11426N88438P84021
4107F8772931O78659N93220M08850N5463j87629k89771m47364l58194m81421n94839
4097F8149905o07713l74348j70561p4891M09861O84785R46103J271767J303400
4088G1538308J348357J208011J055122R68345O72783M70678M60655P886k65822
4079G7464323m72778o36518q54786j106602j328557j253854q74382n89051j96947
4070G0150848K88519M70971N64602P57420N93275M54129M12199M38974J33101
$$ plain form
4061 74264038 74362232 74496088 74406251 74221616 73892010 73438649 72802987 72111119 71340021 70447683
4051 70447683 69350959 68037615 66666396 65205863 63725316 62735609 62005458 61551203 61484864
4042 61484864 61592713 61737190 61794347 61824768 61600067 61237447 60861271 60537030 60100670 59608101
4032 59608101 58965380 58423930 58052408 57703697 57515999 57407859 57025146 56458991 55659524
4023 55659524 54303043 52845210 51022740 49293341 47733734 46519019 45437324 44474292
4015 44474292 43767487 43073732 42527876 41928125 41133627 40274608 39492789 38643655 37883498
4006 37883498 37105394 36443088 35744605 35028328 34279915 33575967 32800651 31824299 31071853
3997 31071853 30211843 29178053 28191637 27232914 26115283 25089035 24449525 23636853 22863260
$$ packed form
4061G4264038R8194J33856q9837j84635l29606m53361o35662o91868p71098q92338
4051G0447683j096724j313344j371219j460533j480547r89707p30151m54255o6339
4042F1484864J07849J44477N7157L0421k24701l62620l76176l24241m36360m92569
4032E9608101o42721n41450l71522l48711j87698j08140l82713n66155p99467
4023E5659524j356481j457833j822470j729399j559607j214715j081695r63032
4015D4474292p06805o93755n45856n99751p94498q59019p81819q49134p60157
4006C7883498p78104o62306o98483p16277p48413p03948p75316r76352p52446
3997C1071853q60010j033790r86416r58723j117631j026248o39510q12672p73593
$$ plain form
3988 22863260 22232124 21806659 21330395 20854389 20396011 19927021 19406904 18964840 18329573
3979 18329573 17600790 17090034 16691519 16069124 15408389 14786208 14231451 13693487 13203083
3970 13203083 12813187 12466874 12111021 11618957 11415905 11025722 10586295 10386748 10179077
3961 10179077 9832371 9685941 9443509 9120281 8888416 8729234 8575454 8387918 8302923 8227146
3951 8227146 8060878 8035936 8053452 7841548 7542484 7504418 7267029 7195414 7112175 7000901
3941 7000901 7003537 6928614 6873191 6803456 6666507 6452684 6443588 6558916 6396369 6168013 6075953
3930 6075953 6005871 5999526 5991413 5880857 5856116 5930676 5870520 5812880 5748706 5861493 5672711
3919 5672711 5618082 5712632 5572727 5524472 5549934 5457667 5366536 5327831 5336089 5278358 5235437
$$ packed form
3988B2863260o31136m25465m76264m76006m58378m68990n20117m42064o35267
3979A8329573p28783n10756l98515o22395o60735o22181n54757n37964m90404
3970A3203083l89896l46313l55853m92064k03052l90183m39427j99547k07671
3961A0179077l46706j46430k42432l23228k31865j59182j53780j87536q4995p5777
3951H227146j66268k4942J7516k11904k99064l8066k37389p1615q3239j11274
3941G000901K636p4923n5423o9735j36949k13823r096J15328j62547k28356r2060
3930F075953p0082o345q113j10556k4741P4560o0156n7640o4174J12787j88782
3919E672711n4629R4550j39905m8255K5462r2267r1131l8705Q258n7731m2921
$$ plain form
3908 5235437 5239422 5204216 5222222 5164153 5112330 5144677 5105905 5053299 5031934 4987540 4922758 4878858
3896 4878858 4789458 4767830 4792936 4864012 4850642 4705572 4708989 4757604 4762639 4746331 4670762 4620041
3884 4620041 4809029 4745957 4616201 4629162 4622874 4547234 4509395 4548502 4583294 4526477 4553412
3873 4553412 4549152 4614178 4594159 4515030 4438062 4381089 4287427 4197626 4307546 4473754 4639871
3862 4639871 4580195 4415612 4261641 4253032 4253125 4202477 4228121 4248136 4199498 4286872 4274132 4299984
3850 4299984 4459078 4410228 4333759 4284250 4138460 4328222 4342227 4254869 4215694 4221420 4194133
3839 4194133 4203192 4223932 4097309 4269921 4270305 4310363 4174714 4251397 4245944 4191969 4214613 4326861
3827 4326861 4358513 4266164 4358042 4289121 4251737 4263169 4320793 4239454 4442104 4263195 4287236
$$ packed form
3908E235437L985l5206J8006n8069n1823L2347l8772n2606k1365m4394o4782m3900
3896D878858q9400k1628K5106P1076j3370j45070L417M8615N035j6308p5569n0721
3884D620041J88988o3072j29756J2961o288p5640l7839L9107L4792n6817K6935
3873D553412m260O5026k0019p9129p6968n6973r3662q9801J09920J66208J66117
3862D639871n9676j64583j53971q609R3n0648K5644K0015m8638Q7374j2740K5852
3850D299984J59094m8850p6469m9509j45790J89762J4005q7358l9175N726k7287
3839D194133R059K0740j26623J72612L84M0058j35649P6683n453n3975K2644J12248
3827D326861L1652r2349R1878o8921l7384J1432N7624q1339K02650j78909K4041
$$ plain form
3816 4287236 4413080 4332198 4447622 4482458 4504816 4546020 4342112 4373857 4358600 4496169 4668662
3805 4668662 4726506 4652702 4672275 4694266 4603819 4730435 4810944 4723024 4780089 4767700 4938729
3794 4938729 4932734 4852807 4821946 4899943 5014149 4984604 5092978 5141900 5304659 5319235 5420659
3783 5420659 5457925 5452877 5487490 5745955 6032282 6176274 6207116 6351835 6359318 6634241 6774563
3772 6774563 6962584 7248756 7639523 7969989 8406858 8785041 9223402 9872289 10455496 11172469
3762 11172469 11981623 13052180 14329966 15828257 17629658 19706998 22212511 24887776
3754 24887776 27556055 29609458 30803511 31147137 30377704 28105640 25176409 22939692
3746 22939692 21013785 19562724 18323283 17176240 16056819 15067118 14138250 13489621 12651923
$$ packed form
3816D287236J25844q0882J15424L4836K2358M1204k03908L1745j5257J37569J72493
3805D668662N7844p3804J9573K1991r0447J26616Q0509q7920N7065j2389J71029
3794D938729n995p9927l0861P7997J14206k9545J08374M8922J62759J4576J01424
3783E420659L7266n048L4613K58465K86327J43992L0842J44719P483K74923J40322
3772F774563J88021K86172L90767L30466M36869L78183M38361O48887N83207P16973
3762A1172469Q09154J070557J277786J498291J801401K077340K505513K675265
3754B4887776K668279K053403J194053L43626p69433k272064k929231k236717
3746B2939692j925907j451061j239441j147043j119421r89701r28868o48629q37698
$$ plain form
3737 12651923 11840159 11154074 10452113 9946558 9444216 9118139 8718461 8518957 8252417
3728 8252417 7908852 7572556 7426196 7228647 6984537 6879193 6734353 6534598 6369637 6184863
3718 6184863 6235934 6100618 6040003 6013537 5901379 5849818 5721873 5669873 5572300 5556969 5488926
3707 5488926 5331400 5163356 5144583 5203539 4953106 5004728 4999999 4950191 4851101 4868177 4853875
3696 4853875 4722429 4628135 4551768 4547425 4545903 4671146 4604809 4454016 4496131 4642148 4476416
3685 4476416 4550857 4670915 4539574 4480994 4456584 4423730 4609630 4578806 4357511 4380035 4467701
3674 4467701 4468925 4298853 4355537 4319576 4443013 4472729 4326724 4476328 4390913 4477692 4412048
3663 4412048 4369339 4339008 4288813 4326404 4571777 4499008 4376780 4501957 4467406 4483617 4492675
$$ packed form
3737A2651923q11764o86085p01961n05555n02342l26077l99678j99504k66540
3728H252417l43565l36296j46360j97549k44110j05344j44840j99755j64961j84774
3718F184863N1071j35316o0615k6466j12158n1561j27945n2000r7573j5331o8043
3707E488926j57526j68044j8773N8956k50433N1622m729m9808r9090J7076j4302
3696D853875j31446r4294p6367m343j522J25243o6337j50793M2115J46017j65732
3685D476416P4441J20058j31341n8580k4410l2854J85900l0824k21295K2524Q7666
3674D467701J224j70072N6684l5961J23437K9716j46005J49604q5415Q6779o5644
3663D412048m2709l0331n0195L7591K45373p2769j22228J25177l4551J6211R058
$$ plain form
3652 4492675 4431267 4410590 4462448 4538111 4646667 4542874 4446710 4544558 4446379 4540445 4486293
3641 4486293 4519704 4381763 4449194 4721669 4898488 4733724 4654752 4727988 4740818 4807160 4776432
3630 4776432 4755415 4853079 4839627 5028617 4975065 4985325 4918999 5003242 5163617 5233110 5181399
3619 5181399 5090104 5172765 5213395 5336013 5413455 5390035 5421643 5467141 5375124 5479656 5552975
3608 5552975 5523215 5608212 5702214 5659285 5730623 5756703 5792396 5840423 6035801 6155926 6055215
3597 6055215 5996168 6311301 6282543 6264349 6207183 6240389 6264161 6359639 6421952 6494840 6331212
3586 6331212 6440646 6614777 6620544 6660388 6822314 6875520 7016242 7150824 7161752 7320573
3576 7320573 7350465 7353684 7475748 7575090 7683025 7800410 7807380 7946873 8061077 8147047 8271142
$$ packed form
3652D492675o1408k0677N1858P5663J08556j03793r6164R7848r8179R4066n4152
3641D486293L3411j37941O7431K72475J76819j64764p8972P3236J2830O6342l0728
3630D776432k1017R7664j3452J88990n3552J0260o6326Q4243J60375O9493n1711
3619E181399r1295Q2661M0630J22618P7442k3420L1608M5498r2017J04532P3319
3608E552975k9760Q4997R4002m2929P1338K6080L5693M8027J95378J20125j00711
3597F055215n9047L15133k8758j8194n7166L3206K3772R5478O2313P2888j63628
3586F331212J09434J74131N767L9844J61926N3206J40722J34582J0928J58821
3576G320573K9892L219J22064R9342J07935J17385O970J39493J14204Q5970J24095
$$ plain form
3565 8271142 8186779 8369819 8723281 8859965 9069464 9200692 9243287 9326311 9471986 9588331
3555 9588331 9693738 9884488 9964054 10110759 10338854 10540649 10650200 10865080 11014674 11166173
3545 11166173 11410764 11552222 11824084 12050238 12350816 12614651 12854854 13201878 13446076
3536 13446076 13817054 14189280 14568076 14947895 15440669 15703451 16060416 16733859 17292039
3527 17292039 17997334 18544738 19186999 19965799 20749779 21704288 22644030 23491832 24271350
3518 24271350 25135135 26094816 26929872 27919867 28895800 29567698 30217778 30612187 30974352
3509 30974352 31111874 31027908 30890442 30515129 29757997 28790414 27936882 27108519 26181157 25308589
3499 25308589 24490603 23608657 22920478 22178112 21428102 20720866 20090286 19438016 18853171
$$ packed form
3565H271142q4363J83040L53462J36684K09499J31228M2595Q3024J45675J16345
3555I588331J05407J90750P9566J46705K28095K01795J09551K14880J49594J51499
3545A1166173K44591J41458K71862K26154L00578K63835K40203L47024K44198
3536A3446076L70978L72226L78796L79819M92774K62782L56965O73443N58180
3527A7292039P05295N47404O42261P78800P83980R54509R39742Q47802P79518
3518B4271350Q63785R59681Q35056R89995R75933O71898O50080L94409L62165
3509C0974352J37522q3966j37466l75313p57132r67583q53532q28363r27362q72568
3499B5308589q17986q81946o88179p42366p50010p07236o30580o52270n84845
$$ plain form
3490 18853171 18494592 18023872 17368805 16948813 16562455 16209001 15886695 15536875 15165048
3481 15165048 14793634 14444135 14126500 13913203 13699145 13425738 13227594 13035248 12863718
3472 12863718 12663935 12639603 12421582 12153775 11837940 11523102 11234722 11104177 11003168 10834854
3462 10834854 10673691 10495025 10293313 10256657 10128325 10004436 9890448 9716060 9553989 9476733
3452 9476733 9459461 9482824 9278156 9041146 9059254 9131815 9145234 8981107 8896575 8840750 8695839
3441 8695839 8550690 8435574 8375173 8360402 8333212 8160142 8079129 7895311 7823086 7899987 7822343
3430 7822343 7778603 7669038 7584005 7549693 7602133 7409385 7400776 7322228 7313354 7494922 7537944
3419 7537944 7577313 7523503 7502677 7534347 7524068 7399352 7248659 7168048 7104170 6970063 6908493
$$ packed form
3490A8853171l58579m70720o55067m19992l86358l53454l22306l49820l71827
3481A5165048l71414l49499l17635k13297k14058k73407j98144j92346j71530
3472A2863718j99783k4332k18021k67807l15835l14838k88380j30545j01009j68314
3462A0834854j61163j78666k01712l6656j28332j23889j13988j74388j62071p7256
3452I476733j7272K3363k04668k37010J8108P2561J3419j64127q4532n5825j44911
3441H695839j45149j15116o0401j4771k7190j73070q1013j83818p2225P6901p7644
3430G822343m3740j09565q5033l4312N2440j92748q609p8548q874J81568M3022
3419G537944L9369n3810k0826L1670j0279j24716j50693q0611o3878j34107o1570
$$ plain form
3408 6908493 6865038 6686388 6593835 6681973 6613564 6439029 6379872 6302670 6293539 6240960 6246203
3397 6246203 6205953 6164940 6104865 5995787 5884547 5942343 5921074 5881102 5797311 5904689 5887233
3386 5887233 5836594 5757715 5744584 5937306 5808318 5659441 5550084 5550004 5569680 5578110 5497647
3375 5497647 5392582 5363554 5295298 5234692 5061768 5025047 5059367 5070833 4884155 4931692 4973870
3364 4973870 4965543 4914251 4791021 4859399 4805303 4777627 4668176 4655397 4592896 4597867 4569846
3353 4569846 4582261 4614195 4611152 4631232 4500462 4582259 4581052 4574563 4438667 4406042 4514542
3342 4514542 4395615 4480718 4497128 4277000 4246441 4293824 4302296 4366602 4348550 4304389 4136795
3331 4136795 4247526 4270216 4106358 4206845 4160028 4089431 4114037 4068605 4116343 4117307 4091080
$$ packed form
3408F908493m3455j78650r2553Q8138o8409j74535n9157p7202r131n2579N243
3397F246203m0250m1013o0075j09078j11240N7796k1269l9972q3791J07378j7456
3386E887233n0639p8879j3131J92722j28988j48877j09357q0J9676Q430q0463
3375E497647j05065k9028o8256o0606j72924l6721L4320J1466j86678M7537M2178
3364D973870q327n1292j23230O8378n4096k7676j09451j2779o2501M971k8021
3353D569846J2415L1934l043K0080j30770Q1797j207o489j35896l2625J08500
3342D514542j18927Q5103J6410k20128l0559M7383Q472O4306j8052m4161j67594
3331D136795J10731K2690j63858J00487m6817p0597K4606m5432M7738R64k6227
$$ plain form
3320 4091080 3981005 3842190 3986428 3952039 3905851 3895729 3892371 4010578 4053784 3887560 3822254
3309 3822254 3934463 3948607 3867253 3706677 3590657 3762712 3945028 3732158 3664714 3670119
3299 3670119 3744803 3711547 3597513 3597172 3654512 3506568 3554583 3670534 3528219 3537993 3462942
3288 3462942 3506676 3632270 3639514 3625346 3579493 3602220 3630965 3544656 3517149 3623688 3498684
3277 3498684 3444656 3573298 3632674 3646171 3725671 3736111 3567884 3574494 3716840 3791340 3788895
3266 3788895 3993431 3962649 3848051 3909541 3968132 3944585 4048448 3952217 4039624 4108892 4028970
3255 4028970 4097818 4090921 4157373 4210843 4219446 4374598 4557452 4475953 4491428 4511056 4470498
3244 4470498 4601515 4597512 4607844 4718381 4789978 4883733 4825279 5060719 5028727 5040827 5088474
$$ packed form
3320D091080j10075j38815J44238l4389m6188j0122l358J18207M3206j66224o5306
3309C822254J12209J4144q1354j60576j16020J72055J82316k12870o7444N405
3299C670119P4684l3256j14034l41N7340j47944M8015J15951j42315R774p5051
3288C462942M3734J25594P244j4168m5853K2727K8745q6309k7507J06539j25004
3277C498684n4028J28642N9376J3497P9500J0440j68227O610J42346P4500k445
3266C788895K04536l0782j14598O1490N8591k3547J03863r6231Q7407O9268p9922
3255D028970O8848o897O6452N3470Q603J55152J82854q1499J5475J9628m0558
3244D470498J31017m003J0332J10537P1597R3755n8454K35440l1992J2100M7647
$$ plain form
3233 5088474 5232835 5387693 5127886 5015021 5025944 5030884 5261958 5372788 5435825 5437557 5567815
3222 5567815 5846293 5957608 5977937 6044000 5982430 6116583 6164664 6284563 6447175 6596229
3212 6596229 6761682 6846862 7096866 7279610 7392747 7595733 7780840 7922079 8208350 8453308
3202 8453308 8633374 8773918 8932802 9079879 9210535 9280775 9574941 9735376 9725999 9918533
3192 9918533 10106524 10176263 10335463 10555067 10766697 10826409 11023205 11217266 11368736 11549522
3182 11549522 11860922 12291209 12548876 12915284 13500732 13856682 14178385 14629591 15183363
3173 15183363 15678897 16102396 16538584 16770152 16868038 16853682 16665784 16425511 16143261 15958154
3163 15958154 15639539 15475252 15371334 15092344 15023039 14898416 14869500 14782333 14856434 15110312
$$ packed form
3233E088474J44361J54858k59807j12865J0923M940K31074J10830O3037J732J30258
3222E567815K78478J11315K0329O6063o1570J34153M8081J19899J62612J49054
3212F596229J65453Q5180K50004J82744J13137K02986J85107J41239K86271K44958
3202H453308J80066J40544J58884J47077J30656P0240K94166J60435r377J92534
3192I918533J87991O9739J59200K19604K11630N9712J96796J94061J51470J80786
3182A1549522L11400M30287K57667L66408N85448L55950L21703M51206N53772
3173A5183363M95534M23499M36188K31568R7886j4356j87898k40273k82250j85107
3163A5958154l18615j64287j03918k78990o9305j24623k8916q7167P4101K53878
$$ plain form
3153 15110312 15240338 15391469 15469026 15672013 15766870 15897688 16059551 16326641 16547360 16606329
3143 16606329 16634491 16609185 16568125 16440398 16193753 16090434 15849297 15396849 15147343 14677924
3133 14677924 14205004 14016164 13811339 13416386 13140909 12943277 12609601 12451265 12429649 12174956
3123 12174956 12124208 12108494 11935757 11801048 11807086 11597826 11155130 10971135 10680080 10385252
3113 10385252 10097859 10007684 9816922 9494821 9106282 8869117 8813832 8563696 8303710 8080512
3103 8080512 7854141 7653039 7469394 7317194 7158982 7033293 6922308 6673087 6595231 6520723
3093 6520723 6356722 6234019 5928854 5755754 5776511 5888812 5743472 5433393 5240283 5126310
3083 5126310 5014676 4932414 5079559 4989580 4876972 4937895 4779647 4747875 4645284 4420578
$$ packed form
3153A5110312J30026J51131P7557K02987R4857J30818J61863K67090K20719N8969
3143A6606329K8162k5306m1060j27727k46645j03319k41137m52448k49506m69419
3133A4677924m72920j88840k04825l94953k75477j97632l33676j58336k1616k54693
3123A2174956n0748j5714j72737j34709O038k09260m42696j83995k91055k94828
3113A0385252k87393r0175j90762l22101l88539k37165n5285k50136k59986k23198
3103H080512k26371k01102j83645j52200j58212j25689j10985k49221p7856p4508
3093F520723j64001j22703l05165j73100K0757J12301j45340l10079j93110j13973
3083E126310j11634q2262J47145q9979j12608O0923j58248l1772j02591k24706
$$ plain form
3073 4420578 4323266 4388731 4378646 4250067 4190530 4092912 4051698 3866599 3874628 3774008 3621086
3062 3621086 3606832 3536273 3509725 3529298 3529876 3443442 3337796 3266311 3215263 3138351 3065493 3150559
3050 3150559 3061234 3008804 2989697 2996299 2830900 2826229 2818365 2714533 2645353 2657956 2650073 2671512
3038 2671512 2578100 2566892 2426364 2411799 2440096 2401162 2427809 2371848 2321243 2203207 2113025
3027 2113025 2124599 2036532 2001694 2102526 2123553 2104869 1938331 1929266 1916325 1915636 1908814 1888048
3015 1888048 1850466 1854996 1760183 1677924 1533339 1531029 1621439 1619133 1537141 1549364 1585076 1548659
3003 1548659 1569341 1628251 1508983 1548100 1462631 1343699 1274766 1274628 1327418 1356831 1214092
2992 1214092 1163121 1140448 1129264 1102497 1125648 1268663 1163589 1181826 1159106 1204446 1212036
$$ packed form
3073D420578r7312O5465j0085j28579n9537r7618m1214j85099Q029j00620j52922
3062C621086j4254p0559k6548J9573N78q6434j05646p1485n1048p6912p2858Q5066
3050C150559q9325n2430j9107O602j65399m671p864j03832o9180J2603p883K1439
3038B671512r3412j1208j40528j4565K8297l8934K6647n5961n0605j18036r0182
3027B113025J1574q8067l4838J00832K1027j8684j66538r065j2941o89o822k0766
3015A888048l7582M530r4813q2259j44585k310R0410k306q1992J2223L5712l6417
3003A548659K0682N8910j19268L9117q5469j18932o8933j38N2790K9413j42739
2992A214092n0971k2673j1184k6767K3151J43015j05074J8237k2720M5340P590
$$ plain form
2981 1212036 1214144 1213120 1179052 1159469 940839 881560 954788 956306 987243 988042 877517 846252
2969 846252 816287 724926 848832 923522 972882 1081487 981572 849990 873221 788173 807820
2958 807820 822064 712813 745952 736001 663770 698468 810766 751960 781202 742766 824427
2947 824427 638713 651811 679935 694471 704842 746844 861557 735044 593076 651764 713359
2936 713359 667715 665988 638370 654254 595475 576407 542670 552265 566639 591409 631900 672754
2924 672754 585951 632304 514773 499220 470188 529848 499831 557205 645769 564116 522406
2913 522406 525611 573218 501091 424272 557156 598020 547539 466466 396093 304825 447870
2902 447870 494406 458584 497630 375534 335336 349732 386231 425157 303920 341271 441947
$$ packed form
2981A212036K108j024l4068j9583k18630n9279P3228J518L0937P99j10525l1265
2969H46252k9965r1361J23906P4690M9360J08605r9915j31582K3231q5048J9647
2958H07820J4244j09251L3139r951p2231L4698J12298n8806K9242l8436Q1661
2947H24427j85714J3098K8124J4536J0371M2002J14713j26513j41968N8688O1595
2936G13359m5644j727k7618J5884n8779j9068l3737R595J4374K4770M0491M0854
2924F72754q6803M6353j17531j5553k9032N9660l0017N7374Q8564q1653m1710
2913E22406L205M7607p2127p6819J32884M0864n0481q1073p0373r1268J43045
2902D47870M6536l5822L9046j22096m0198J4396L6499L8926j21237L7351J00676
$$ plain form
2891 441947 444378 454152 352781 240382 369344 346530 363525 449221 329302 331646 383102
2880 383102 462821 245094 251952 277777 256742 358324 380197 325544 413705 402765 278855
2869 278855 157562 208788 249637 164503 231719 321466 324641 192562 322936 268096 117484
2858 117484 160040 341020 360419 201594 216750 246841 388391 487905 377542 294426 374147
2847 374147 355111 314265 386796 261951 250017 292279 273073 284473 364461 304716 101198
2836 101198 78033 142467 396177 343538 299244 243175 231464 287635 235506 278531 189529
2825 189529 139157 122506 149162 101251 157672 187423 147180 274878 188976 131272 167657
2814 167657 253494 222972 138828 194009 273800 317690 423447 285771 219646 204015 88426
$$ packed form
2891D41947K431R774j01371j12399J28962k2814J6995Q5696j19919K344N1456
2880C83102P9719k17727O858K5825k1035J01582K1873n4653Q8161j0940j23910
2869B78855j21293N1226M0849q5134O7216Q9747L175j32079J30374n4840j50612
2858A17484M2556J80980J9399j58825J5156L0091J41550R9514j10363q3116P9721
2847C74147j9036m0846P2531j24845j1934M2262j9206J1400P9988n9745k03518
2836A01198k3165O4434K53710n2639m4294n6069j1711N6171n2129M3025q9002
2825A89529n0372j6651K6656m7911N6421K9751m0243J27698q5902n7704L6385
2814A67657Q5837l0522q4144N5181P9791M3890J05757j37676o6125j5631j15589
$$ plain form
2803 88426 92642 173005 261116 228599 187678 204747 236412 238487 211547 244267 231834 113750
2791 113750 34842 109524 247798 240640 60349 -22279 125309 72152 82499 35892 73974
2780 73974 133375 111576 24924 22430 123485 128664 201149 157574 76080 39535 154787 30480
2768 30480 51142 133701 252149 160047 35325 58015 87617 212164 135240 -95099 -202897
2757 -202897 -120086 48388 77988 -3229 127910 223741 210486 178936 107006 16127 -39971
2746 -39971 152949 224705 75734 46087 104846 101466 132554 204296 199547 177332 123412 205845
2734 205845 161390 121864 64284 3326 84450 57824 10139 -27764 -75477 -107186 -78785 -18122
2722 -18122 16436 -1225 -79807 54017 55943 63536 56520 76705 85105 16564 -74579 -38002
$$ packed form
2803H8426M216Q0363Q8111l2517m0921J7069L1665K075k6940L2720j2433j18084
2791A13750p8908P4682J38274p158j80291q2628J47588n3157J0347m6607L8082
2780G3974N9401k1799q6652k494J01055N179P2485m3575q1494l6545J15252j24307
2768C0480K0662Q2559J18448r2102j24722K2690K9602J24547p6924k30339j07798
2757b02897Q2811J68474K9600q1217J31139R5831j3255l1550p1930r0879n6098
2746c9971J92920P1756j48971k9647N8759l380L1088P1742m749k2215n3920Q2433
2734B05845m4455l9526n7580o0958Q1124k6626m7685l7903m7713l1709K8401O0663
2722a8122L4558j7661p8582J33824J926P593p016K0185Q400o8541r1143L6577
$$ plain form
2710 -38002 -150887 -209418 -215624 -69071 -79869 -12484 -58893 -58414 18912 -18257 140493 167595
2698 167595 54994 -62574 -74402 52180 28429 -45372 50878 -4412 -92293 -34535 21867
2687 21867 152132 47567 55968 -16158 -94354 -51645 -106257 -143975 -178148 -81416 -23917 21750
2675 21750 41941 38901 -53522 -165248 -108725 54607 -18349 -138335 -168936 -26919 -66465
2664 -66465 -140874 -91032 97920 107399 -49231 -40536 20871 65594 68347 -10137 110782 253718
2652 253718 245669 6753 43152 62497 7539 -6704 -21820 5477 105000 86709 72542 130909
2640 130909 35494 27004 61810 215270 149869 -40102 74194 137258 184106 107325 50902
2629 50902 -24146 34943 19876 64057 154048 128144 33520 12556 62447 101593 40492 54620
$$ packed form
2710c8002j12885n8531o206J46553j0798O7385m6409M79P7326l7169J58750K7102
2698A67595j12601j17568j1828J26582k3751p3801R6250n5290q7881N7758N6402
2687B1867J30265j04565Q401p2126p8196M2709n4612l7718l4173R6732N7499M5667
2675B1750K0191l040r2423j11726N6523J63332p2956j19986l0601J42017l9546
2664f6465p4409M9842J88952R479j56630Q695O1407M4723K753p8484J20919J42936
2652B53718q049k38916L6399J9345n4958j4243j5116K7297R9523j8291j4167N8367
2640A30909r5415q490L4806J53460o5401j89971J14296O3064M6848p6781n6423
2629E0902p5048N9089j5067M4181Q9991k5904r4624k0964M9891L9146o1101J4128
$$ plain form
2617 54620 60125 -15751 -12497 86452 23805 92496 201862 114051 118558 -68815 -40458 91988
2605 91988 87750 67724 194950 128687 129292 178682 45097 53924 24079 55961 -59452 -174187
2593 -174187 -168300 -42177 691 -89225 -79046 -46704 46363 134617 37226 8278 31816 110811
2581 110811 43443 8358 86986 11646 97580 -25212 38343 61957 26060 -17722 124794
2570 124794 166917 90311 58055 93904 81081 -90387 -127820 -130271 12191 156399 63988
2559 63988 168286 212283 101228 -103743 -92809 42978 235645 273634 80263 -40890
2549 -40890 156418 218038 189400 78365 -83776 128937 203277 153515 170696 60666 60638
2538 60638 58906 158259 214069 139814 82578 -50821 55920 141796 95768 7207 -4938 -258815
$$ packed form
2617E4620N505p5876L254R8949o2647O8691J09366q7811M507j87373K8357J32446
2605I1988m238k0026J27226o6263O05M9390j33585Q827k9845L1882j15413j14735
2593a74187N887J26123M2868q9916J0179L2342R3067Q8254r7391k8948K3538P8995
2581A10811o7368l5085P8628p5340Q5934j22792O3555K3614l5897m3782J42516
2570A24794M2123p6606l2256L5849j2823j71468l7433k451J42462J44208r2411
2559F3988J04298M3997j11055k04971J0934J35787J92667L7989j93371j21153
2549d0890J97308O1620k8638j11035j62141K12713P4340m9762J7181j10030k8
2538F0638j732R9353N5810p4255n7236j33399J06741Q5876m6028q8561j2145k53877
$$ plain form
2526 -258815 -217637 -34342 56715 178869 -22381 31063 86331 -29951 -86428 -31364 -16776
2515 -16776 10000 194057 286252 177802 237896 58498 174357 249100 141425 162245 130818
2504 130818 47953 -8128 103640 147306 162951 207424 118673 111107 158872 63567 103555 43244
2492 43244 90925 -45808 -115597 -100981 93859 128780 50105 94776 30130 -51333 48594
2481 48594 39687 43120 193848 233084 64589 -92114 43715 116478 61818 30167 85295
2470 85295 231448 232922 185626 128924 114819 55350 187618 269788 243804 178530 205537 153644
2458 153644 198324 34404 11143 169130 149020 213140 129996 147124 218190 183269 312032
2447 312032 348208 393006 328299 349790 343759 402884 433125 321625 333910 359504 413061 452797
$$ packed form
2526b58815M1178J83295R1057J22154k01250N3444N5268j16282n6477N5064J4588
2515a6776K6776J84057R2195j08450O0094j79398J15859P4743j07675K0820l1427
2504A30818q2865n6081J11768M3666J5645M4473q8751p566M7765r5305L9988o0311
2492D3244M7681j36733o9789J4616J94840L4921p8675M4671o4646q1463R9927
2481D8594q907L433J50728L9236j68495j56703J35829P2763n4660l1651N5128
2470H5295J46153J474m7296n6702j4105n9469J32268Q2170k5984o5274K7007n1893
2458A53644M4680j63920k3261J57987k0110O4120q3144J7128P1066l4921J28763
2447C12032L6176M4798o4707K1491o031N9125L0241j11500J2285K5594N3557L9736
$$ plain form
2435 452797 383002 291195 424980 418629 496723 469358 399318 453535 566492 605800 684137
2424 684137 604520 525410 577379 627725 660790 672780 693958 601096 540159 671724 624294
2413 624294 750533 772724 803524 955949 1029911 988779 1101663 1225021 1338331 1488785
2403 1488785 1524577 1624809 1741767 1853171 1906755 2021385 2124704 2309120 2515256 2721060
2393 2721060 3048234 3427720 3559634 3820369 4230869 4593343 5108421 5463167 5945939 6474636
2383 6474636 7267158 7896359 8598882 9478184 10610894 12220693 14087863 16351805 19072261
2374 19072261 22219442 25415876 28238646 30000602 30716222 30805512 29066691 25159112 21932404
2365 21932404 19661064 18074704 16636337 15390809 14225620 13280194 12283330 11372029 10579075
$$ packed form
2435D52797o9795r1807J33785o351P8094k7365p0040N4217J12957L9308P8337
2424F84137p9617p9110N1969N0346L3065J1990K1178r2862o0937J31565m7430
2413F24294J26239K2191L0800J52425P3962m1132J12884J23358J13310J50454
2403A488785L5792J00232J16958J11404N3584J14630J03319J84416K06136K05804
2393B721060L27174L79486J31914K60735M10500L62474N15078L54746M82772N28697
2383F474636P92522O29201P02523Q79302J132710J609799J867170K263942K720456
2374A9072261L147181L196434K822770J761956P15620Q9290j738821l907579l226708
2365B1932404k271340j586360j438367j245528j165189r45426r96864r11301p92954
$$ plain form
2356 10579075 9718932 8935084 8138550 7452732 6816030 6437174 5917392 5487772 4994675
2347 4994675 4693654 4469065 4251485 3931791 3639892 3421801 3239601 3075494 2949005 2819713
2337 2819713 2792597 2680333 2505789 2367244 2267376 2135544 2047768 1977660 1865905 1726247
2327 1726247 1511738 1507048 1605425 1483915 1457952 1513328 1349007 1146819 1119071 1177108 1165406
2316 1165406 1020605 929694 1065110 1158729 1049650 1056516 939117 891967 861871 843154 826496
2305 826496 880805 921440 860035 813926 725935 731325 578255 599842 645344 623397 615334 611294
2293 611294 589740 564653 511567 468373 572762 601522 564274 569411 501823 478089 431214 422905
2281 422905 317110 336804 386588 325310 285649 541461 594777 469947 335997 306060 272092
$$ packed form
2356A0579075q60143p83848p96534o85818o36702l78856n19782m29620m93097
2347D994675l01021k24589k17580l19694k91899k18091j82200j64107j26489j29292
2337B819713k7116j12264j74544j38545r9868j31832q7776p0108j11755j39658
2327A726247k14509m690R8377j21510k5963N5376j64321k02188k7748N8037j1702
2316A165406j44801r0911J35416R3619j09079O866j17399m7150l0096j8717j6658
2305H26496N4309M0635o1405m6109q7991N390j53070K1587M5502k1947q063m040
2293F11294k1554k5087n3086m3194J04389K8760l7248N137o7588k3734m6875q309
2281D22905j05795J9694M9784o1278l9661K55812N3316j24830j33950k9937l3968
$$ plain form
2270 272092 228339 217103 302867 389865 494643 496977 371034 333861 467569 450084 388110
2259 388110 399375 543784 571432 387953 345730 330545 338473 179582 102151 173309 171831
2248 171831 102357 128158 236543 225760 262295 216501 192189 214575 30487 160206 83963
2237 83963 121645 54573 71162 160297 124695 109181 50572 81357 113072 156385 169068 245949
2225 245949 223728 140556 131753 121470 120125 40559 55649 114455 70371 71917 151245 162847
2213 162847 72545 71274 146789 98492 44495 15423 36525 25670 20167 73770 66571 104007
2201 104007 120041 103620 89119 76689 47711 -26657 -25422 -61480 -26136 6332 114987 156321
2189 156321 49260 57875 -73140 -18333 68980 76903 106353 3745 26631 24626 -21773 -94461
$$ packed form
2270B72092m3753j1236Q5764Q6998J04778K334j25943l7173J33708j7485o1974
2259C88110J1265J44409K7648j83479m2223j5185P928j58891p7431P1158j478
2248A71831o9474K5801J08385j0783L6535m5794k4312K2386j84088J29719p6243
2237H3963L7682o7072J6589Q9135l5602j5514n8609L0785L1715M3313J2683P6881
2225B45949k2221q3172q803j0283j345p9566J5090N8806m4084J546P9328J1602
2213A62847r0302j271P5515m8297n3997k9072K1102j0855n503N3603p199L7436
2201A04007J6034j6421j4501j2430k8978p4368J235l6058L5344L2468J08655M1334
2189A56321j07061Q615j31015N4807Q7313P923K9450j02608K2886k005m6399p2688
$$ plain form
2177 -94461 -138943 8873 -77239 -110836 -14050 -81890 -29860 55745 19093 45044 -14964 -177882
2165 -177882 -119825 62569 46402 41082 82956 70418 -72065 -88361 76225 112454 120906
2154 120906 30462 34096 109524 63773 -55691 -38743 76319 47142 17194 -47307 -57848
2143 -57848 83296 134268 -51623 36773 28945 -19134 82174 7754 39540 -39820 -37084 -71011
2131 -71011 44664 15908 -23477 49093 -20382 11919 120308 68926 90518 -13445 -154114
2120 -154114 -71709 -40234 83483 141365 146646 98138 78010 696 15051 49438 49889 1622
2108 1622 44393 120368 226967 118050 111540 211715 276318 251608 254276 288616 228614 189984
2096 189984 43528 54258 127797 90888 20491 41605 32971 -49889 -25848 20961 126246
$$ packed form
2177i4461m4482J47816q6112l3597R6786o7840N2030Q5605l6652K5951o0008j62918
2165a77882N8057J82394j6167n320M1874j2538j42483j6296J64586L6229Q452
2154A20906r0444L634P5428m5751j19464J6948J15062k9177k9948o4501j0541
2143e7848J41144N0972j85891Q8396p828m8079J01308p4420L1786p9360K736l3927
2131g1011J15675k8756l9385P2570o9475L2301J08389n1382K1592j03963j40669
2120a54114Q2405L1475J23717N7882N281m8508k0128p7314J4355L4387M51m8267
2108A622M2771P5975J06599j08917o510J00175O4603k4710K668L4340o0002l8630
2096A89984j46456J0730P3539l6909p0397K1114q634q2860K4041M6809J05285
$$ plain form
2085 126246 72063 -13575 -32313 -110120 -138664 -119811 -82008 -5096 -33084 -102611 29314
2074 29314 29385 -5722 76590 87374 -47745 -25516 20217 -82221 -1310 35977 -113556 -99210
2062 -99210 -116620 -151311 -11115 -77995 -98684 -33773 -208450 -112364 1934 -150020 -228958
2051 -228958 -158231 -118664 -218154 -128007 167604 -9061 -86385 -81772 -3040 190807 186955
2040 186955 138261 1111 -128370 -111351 -80634 -54777 -67584 -8080 43053 86074 485
2029 485 -30625 42225 -216676 -228031 -233739 -60705 27118 -6921 40523 8029 -83409 -120013
2017 -120013 -216302 -102716 -164430 -204495 -75044 -29578 -20842 -198548 -120584 -89405 -142622
2006 -142622 -155515 -66410 -25574 -58457 31959 38500 -53386 -25299 -169589 -122994 24252
$$ packed form
2085A26246n4183q5638j8738p7807k8544J8853L7803P6912k7988o9527J31925
2074B9314P1l5107Q2312J0784j35119K2229M5733j02438Q0911L7287j49533J4346
2062i9210j7410l4691J40196o6880k0689O4911j74677R6086J14298j51954p8938
2051b28958P0727L9567r9490R0147K95611j76665p7324M613P8732J93847l852
2040A86955m8694j37150j29481J7019L0717K5857j2807N9504N1133M3021q5589
2029D85l1110P2850k58901j1355n708J73034Q7823l4039M7444l2494r1438l6604
2017a20013r6289J13586o1714m0065J29451M5466Q736j77706P7964L1179n3217
2006a42622j2893Q9105M0836l2883R0416O541r1886K8087j44290M6595J47246
$$ plain form
1995 24252 1888 68054 52080 -182293 -166035 -18922 47254 89084 22839 22592 13793 -67093
1983 -67093 24166 110804 12255 -112009 15785 16742 -62224 -209050 -183903 -173682 -87171 49595
1971 49595 -45989 -15009 7246 -53667 -4487 21488 -23094 -26984 28080 26621 -158273 -132491
1959 -132491 -4439 -469 -69389 -20985 -60265 -28348 60491 66185 46223 43859 54526 61062
1947 61062 10276 -6526 -117045 -90970 -9475 -64486 -142758 -68525 -45709 -115319 -107022 -66184
1935 -66184 14547 -43852 -128024 -187965 -168203 -25366 25778 77899 45810 21642 86169 101186
1923 101186 -42798 -65543 -64365 -188063 -202281 -129248 -22801 -56926 -95198 -56519 47114
1912 47114 -59311 -62370 -61455 -144767 -94840 -27332 -56195 -55999 29858 -6716 20361 29437 -38019
$$ packed form
1995B4252k2364O6166j5974k34373J6258J47113O6176M1830o6245k47q799q0886
1983f7093R1259Q6638r8549j24264J27794R57p8966j46826K5147J0221Q6511J36766
1971D9595r5584L0980K2255o0913M9180K5975m4582l890N5064j459j84894K5782
1959a32491J28052L970o8920M8404l9280L1917Q8839N694j9962k364J0667O536
1947F1062n0786j6802j10519K6075Q1495n5011p8272P4233K2816o9610Q297M0838
1935f6184Q0731n8399q4172n9941J9762J42837N1144N2121l2089k4168O4527J5017
1923A01186j43984k2745J178j23698j4218P3033J06447l4125l8272L8679J03633
1912D7114j06425l059R15q3312M9927O7508k8863J96Q5857l6574K7077R076o7456
$$ plain form
1899 -38019 -74478 -30941 -107600 6682 -72179 -23276 31678 -74200 -29594 -2746 1966 -42111
1887 -42111 -141110 -65305 64554 1318 -119841 -84469 20039 -28100 -82805 -145980 -141122
1876 -141122 -196623 -122447 -50344 -54119 -69796 -109882 -235556 -104409 1655 -75369 -90116
1865 -90116 -18148 93686 -1685 -146941 -107184 -135579 -311285 -246576 -100786 -74298 -34957
1854 -34957 35548 8482 -63871 62417 72134 5822 -38130 17070 15581 12613 79002 47069
1842 47069 -65889 -92878 -59605 -88453 -124346 -155361 -42087 -27850 -110585 -89161 -71267
1831 -71267 -129971 -87685 -109487 -10729 -61232 -102524 -46705 -98575 -151568 48777 176625
1820 176625 191233 120708 -148482 -76103 94535 33297 -3351 147078 119488 50491 -83881
$$ packed form
1899c8019l6459M3537p6659J14282p8861M8903N4954j05878M4606K6848M712m4077
1887d2111r8999P5805J29859o3236j21159L5372J04508m8139n4705o3175M858
1876a41122n5501P4176P2103l775j5677m0086j25674J31147J06064p7024j4747
1865i0116P1968J11834r5371j45256L9757k8395j75706O4709J45790K6488L9341
1854c4957P0505k7066p2353J26288R717o6312m3952N5200j489k968O6389l1933
1842D7069j12958k6989L3273k8848l5893l1015J13274J4237q2735K1424J7894
1831g1267n8704M2286k1802R8758n0503m1292N5819n1870n2993K00345J27848
1820A76625J4608p0525k69190P2379J70638o1238l6648J50429k7590o8997j34372
$$ plain form
1809 -83881 -167268 -181169 -28595 -148519 -92573 105596 109829 78031 -40834 -1690 -54088
1798 -54088 -198882 -68566 55366 33095 -11200 -140800 -159380 -38123 51937 -14309 -40066
1787 -40066 -111709 -123711 -59916 -41963 -94163 -199825 -105212 -117547 -121235 -84242 -34352 -73882
1775 -73882 -19255 -65175 44982 87637 8509 27780 -105215 -155817 30378 -4024 -114594
1764 -114594 -25557 -91950 -76979 -91107 -12181 -16077 -36845 -46765 -82368 -107044 -21938 -122697
1752 -122697 -127724 -70743 -31731 -100716 -58435 -116323 -44585 15939 14194 25266 -51622 -4465
1740 -4465 -33515 -58463 -54628 -96979 -110821 -99703 -29690 -4871 -163467 -123459 -2987 57329
1728 57329 -17945 -122272 -133046 -32410 -28794 -23642 -49605 5703 100025 50516 77674 69824
$$ packed form
1809h3881q3387j3901J52574j19924N5946J98169M233l1798j18865L9144n2398
1798e4088j44794J30316J23932k2271m4295j29600j8580J21257R0060o6246k5757
1787d0066p1643j2002O3795J7953n2200j05662R4613j2335l688L6993M9890l9530
1775g3882N4627m5920J10157M2655p9128J9271j32995n0602J86195l4402j10570
1764a14594Q9037o6393J4971j4128P8926l896k0768r920l5603k4676Q5106j00759
1752a22697n027N6981L9012o8985M2281n7888P1738O0524j745J1072p6888M7157
1740d465k9050k4948L835m2351j3842J1118P0013K4819j58596M0008J20472O0316
1728E7329p5274j04327j0774J00636L616N152k5963N5308R4322m9509K7158p850
$$ plain form
1716 69824 -72570 -79705 3049 36389 -97279 -179611 -59636 -45933 -13859 -40863 -4403
1705 -4403 18118 -91326 -71672 18098 20666 -86241 -79104 48536 121246 20119 10472 99451
1693 99451 -1836 38027 -83065 -40462 43347 105801 -23143 -135518 -72268 -124272 -76909
1682 -76909 -12756 32095 24185 -81291 -172641 -156210 -94823 -31368 -33895 37511 -21611 33095
1670 33095 26576 -30821 -81496 -50257 -20526 -5424 11484 6141 -129529 -67558 -22647 -41112
1658 -41112 29632 15811 46875 45807 22549 -32053 -50268 -5237 169443 118775 88180 158478
1646 158478 21492 -38627 -68114 -121635 9440 118563 -10111 -98277 -79909 35121 160789
1635 160789 5113 -45994 -6932 -30160 -30119 -118837 -103931 -25558 -64149 -29687 -71852 -83818
$$ packed form
1716F9824j42394p135Q2754L3340j33668q2332J19975J3703L2074k7004L6460
1705d403K2521j09444J9654Q9770K568j06907P137J27640P2710j01127r647Q8979
1693I9451j01287L9863j21092M2603Q3809O2454j28944j12375O3250n2004M7363
1682g6909O4153M4851p910j05476r1350J6431O1387O3455k527P1406n9122N4706
1670C3095o519n7397n0675L1239K9731J5102J6908n343j35670O1971M4911j8465
1658d1112P0744j3821L1064j068k3258n4602j8215M5031J74680n0668l0595P0298
1646A58478j36986o0119k9487n3521J31075J09123j28674q8166J8368J15030J25668
1635A60789j55676n1107L9062k3228M1q8718J4906P8373l8591L4462m2165j1966
$$ plain form
1623 -83818 39395 -20181 -93987 -207528 -286871 -248940 -190761 -183092 -70089 12436 76302
1612 76302 86040 8186 47115 9657 -113724 -132920 -137726 -176336 -183059 -87151 -180140 -204249
1600 -204249 -55828 -50425 -49451 -28267 106920 147446 67698 -96100 -100223 -78593 -58959 19785
1588 19785 46238 9782 -17123 -45829 -55920 -122996 -63508 -44601 -28937 -33071 -63682 54563
1576 54563 24949 -92418 -1468 -28502 -81160 2822 20767 49935 72015 45856 -124040
1565 -124040 16225 23799 -67658 -121877 -3763 78124 -69351 -187257 -137546 -117520 -179389
1554 -179389 -165378 -125428 -112701 -30689 -9497 -52256 36266 14228 -73839 -83759 35655 -65338
1542 -65338 -66286 -21681 -593 -9527 -132416 -169192 -246341 -117319 42253 24098 -88693 -129840
$$ packed form
1623h3818J23213n9576p3806j13541p9343L7931N8179P669J13003Q2525O3866
1612G6302R738p7854L8929l7458j23381j9196m806l8610o723R5908r2989k4109
1600b04249J48421N403R74K1184J35187M0526p9748j63798m123K1630J9634P8744
1588A9785K6453l6456k6905k8706j0091o7076N9488J8907J5664m134l0611J18245
1576E4563k9614j17367R0950k7034n2658Q3982J7945K9168K2080k6159j69896
1565a24040J40265P574r1457n4219J18114Q1887j47475j17906M9711K0026o1869
1554a79389J4011L9950J2727Q2012K1192m2759Q8522k2038q8067r920J19414j00993
1542f5338r48M4605K1088q934j22889l6776p7149J29022J59572j8155j12791m1147
$$ plain form
1530 -129840 -92827 15617 43004 -13133 56637 94423 68721 120700 32830 24016 59361 32843
1518 32843 -41220 -99423 -67256 40830 -8889 -60502 14961 173011 134474 -21124 63617
1507 63617 85132 -31754 -82966 -125805 -95092 -52807 100571 116729 -118227 -66959 -19341
1496 -19341 -1322 -8282 133899 6232 -32413 -54693 98088 76981 -274 -34992 -92857
$$ packed form
1530a29840L7013J08444K7387n6137O9770L7786k5702N1979q7870q814L5345k6518
1518C2843p4063n8203L2167J08086m9719n1613P5463J58050l8537j55598Q4741
1507F3617K1515j16886n1212m2839L0713M2285J53378J6158k34956N1268M7618
1496a9341J8019o960J42181j27667l8645k2280J52781k1107p7255l4718n7865
$$ [...]
##END NTUPLES=NMR SPECTRUM
##END=
