##TITLE=1H_EC-3358oc
 200.13MHz, DMSO,
 8 sc
 
 25.8.2025
##JCAMPDX= 6.0         $$ Bruker NMR JCAMP-DX V2.0
##DATA TYPE= NMR SPECTRUM
##DATA CLASS= NTUPLES
##ORIGIN= UXNMR, Bruker Analytische Messtechnik GmbH
##OWNER= pz
$$ XWIN-NMR		Version 3.5
$$ Mon Aug 25 14:10:36 2025 Russian Standard Time (UT+4h)  she@DPX200
##.OBSERVE FREQUENCY= 200.1308
##.OBSERVE NUCLEUS= ^1H
##.ACQUISITION MODE= SIMULTANEOUS
##.ACQUISITION SCHEME= undefined
##.AVERAGES= 8
##.DIGITISER RES= 18
##SPECTROMETER/DATA SYSTEM= spect
##.PULSE SEQUENCE= zg30
##.SOLVENT NAME= CDCl3
##.SHIFT REFERENCE= (INTERNAL, CDCl3, 0, 14.9173)
##AUDIT TRAIL= $$ (NUMBER, WHEN, WHO, WHERE, WHAT)
$$ ##TITLE= Audit trail, XWIN-NMR		Version 3.5
$$ ##JCAMPDX= 5.01
$$ ##ORIGIN= Bruker BioSpin GmbH
$$ ##OWNER= she
$$ F:/spectra/data/she/nmr/H-C/1/pdata/1/auditp.txt
$$ ##AUDIT TRAIL=  $$ (NUMBER, WHEN, WHO, WHERE, WHAT)
(   1,<2025-08-25 14:09:07.50 +0400>,<she>,<DPX200>,
      <created by zg, POWCHK disabled, PULCHK disabled
       configuration hash MD5:
       00 E9 B6 7A A2 85 ED C7 34 08 36 98 17 FE 4E 26
       data hash MD5: 16K
       6A 80 0C 34 20 D1 23 71 68 F0 D1 C8 E7 34 9D EE>)
(   2,<2025-08-25 14:09:10.09 +0400>,<she>,<DPX200>,
      <Start of raw data processing
       efp BC_mod = 2 LB = 0.25 FT_mod = 6 PKNL = 1 PHC0 = -1568.002 PHC1 = 19.99228 SI = 16K 
       data hash MD5: 16K
       B5 86 F8 72 A8 63 DA 9F A7 FF 87 E5 91 B2 C7 55>)
(   3,<2025-08-25 14:09:25.96 +0400>,<she>,<DPX200>,
      <pk PHC0 = 4.36914 PHC1 = -10.4 
       data hash MD5: 16K
       CC 85 9D E1 BA 5D 73 F6 B7 87 50 CC 56 69 57 14>)
(   4,<2025-08-25 14:09:29.06 +0400>,<she>,<DPX200>,
      <abs ABSG = 5 
       data hash MD5: 16K
       80 D1 16 93 8C 3C 0A 7B 62 B2 4E 4A 59 0B BB A5>)
$$ ##END=
$$ 
$$ hash MD5
$$ 75 1F 02 F5 68 B9 99 57 CF 93 43 F0 0E 2F 04 06
##$RELAX= 
##$RELAX= 
##$RELAX= 
##$RELAX= 
##$RELAX= 
##$RELAX= 
$$ Bruker specific parameters
$$ --------------------------
##$DU= <F:/spectra>
##$EXPNO= 1
##$NAME= <H-C>
##$PROCNO= 1
##$TYPE= <nmr>
##$USER= <she>
##$AMP= (0..31)
100 100 100 100 100 100 100 100 100 100 100 100 100 100 100 100 100 100 
100 100 100 100 100 100 100 100 100 100 100 100 100 100 
##$AQSEQ= 0
##$AQ_mod= 1
##$AUNM= <au_zg>
##$AUTOPOS= <>
##$BF1= 200.13
##$BF2= 200.13
##$BF3= 200.13
##$BF4= 200.13
##$BF5= 200.13
##$BF6= 200.13
##$BF7= 200.13
##$BF8= 200.13
##$BYTORDA= 1
##$CFDGTYP= 0
##$CFRGTYP= 5
##$CHEMSTR= <none>
##$CNST= (0..31)
1 1 145 1 1 1 1 1 1 1 1 1 1 1 1 1 1 1 1 1 1 1 1 1 1 1 1 1 1 1 1 1 
##$CPDPRG= <>
##$CPDPRG1= <>
##$CPDPRG2= <>
##$CPDPRG3= <>
##$CPDPRG4= <mlev>
##$CPDPRG5= <mlev>
##$CPDPRG6= <mlev>
##$CPDPRG7= <mlev>
##$CPDPRG8= <mlev>
##$CPDPRGB= <>
##$CPDPRGT= <>
##$D= (0..31)
0 0.7 0 0 0 0 0 0 0 0 0 0.03 0 0 0 0 0 0 0 0 0 0 0 0 0 0 0 0 0 0 0 0 
##$DATE= 1756116547
##$DBL= (0..7)
120 120 120 120 120 120 120 120 
##$DBP= (0..7)
150 150 150 150 150 150 150 150 
##$DBP07= 0
##$DBPNAM0= <>
##$DBPNAM1= <>
##$DBPNAM2= <>
##$DBPNAM3= <>
##$DBPNAM4= <>
$$ [...]
##$SUBNAM3= <"">
##$SUBNAM4= <"">
##$SUBNAM5= <"">
##$SUBNAM6= <"">
##$SUBNAM7= <"">
##$SUBNAM8= <"">
##$SUBNAM9= <"">
##$SW= 18.0517779522481
##$SWIBOX= (0..15)
0 0 2 0 0 0 0 0 0 0 0 0 0 0 0 0 
##$SW_h= 3612.71676300578
##$TD= 16384
##$TD0= 1
##$TE= 0
##$TE2= 300
##$TE3= 300
##$TEG= 300
##$TL= (0..7)
0 120 120 120 120 120 120 120 
##$TP= (0..7)
150 150 150 150 150 150 150 150 
##$TP07= 0
##$TPNAME0= <>
##$TPNAME1= <>
##$TPNAME2= <>
##$TPNAME3= <>
##$TPNAME4= <>
##$TPNAME5= <>
##$TPNAME6= <>
##$TPNAME7= <>
##$TPOAL= (0..7)
0.5 0.5 0.5 0.5 0.5 0.5 0.5 0.5 
##$TPOFFS= (0..7)
0 0 0 0 0 0 0 0 
##$TUNHIN= 0
##$TUNHOUT= 0
##$TUNXOUT= 0
##$USERA1= <user>
##$USERA2= <user>
##$USERA3= <user>
##$USERA4= <user>
##$USERA5= <user>
##$V9= 5
##$VALIST= <valist>
##$VCLIST= <CCCCCCCCCCCCCCC>
##$VD= 0
##$VDLIST= <DDDDDDDDDDDDDDD>
##$VPLIST= <PPPPPPPPPPPPPPP>
##$VTLIST= <TTTTTTTTTTTTTTT>
##$WBST= 1024
##$WBSW= 4
##$XGAIN= (0..3)
0 0 0 0 
##$XL= 0
##$YL= 0
##$YMAX_a= 251356
##$YMIN_a= -308415
##$ZGOPTNS= <>
##$ZL1= 120
##$ZL2= 120
##$ZL3= 120
##$ZL4= 120
##$ABSF1= 15.39435
##$ABSF2= -2.657543
##$ABSG= 5
##$ABSL= 3
##$ALPHA= 0
##$AQORDER= 0
##$ASSFAC= 0
##$ASSFACI= 0
##$ASSFACX= 0
##$ASSWID= 0
##$AUNMP= <proc_1d>
##$AZFE= 0.1
##$AZFW= 0.1
##$BCFW= 0
##$BC_mod= 2
##$BYTORDP= 0
##$COROFFS= 0
##$CY= -3
##$DATMOD= 1
##$DC= 0
##$DFILT= <>
##$DTYPP= 0
##$F1P= 0
##$F2P= 0
##$FCOR= 1
##$FTSIZE= 16384
##$FT_mod= 6
##$GAMMA= 0
##$GB= 0
##$INTBC= 1
##$INTSCL= 3.241238e-09
##$ISEN= 128
##$LB= 0.25
##$LEV0= 0
##$LPBIN= 0
##$MAXI= 10000
##$MC2= 0
##$MEAN= 0
##$ME_mod= 0
##$MI= 1.114404
##$NCOEF= 0
##$NC_proc= -6
##$NLEV= 6
##$NOISF1= 3.799351
##$NOISF2= 2.8
##$NSP= 0
##$NTH_PI= 0
##$NZP= 0
##$OFFSET= 14.91726
##$PC= 1
##$PHC0= -1563.633
##$PHC1= 9.592279
##$PH_mod= 1
##$PKNL= yes
##$PPARMOD= 0
##$PSCAL= 0
##$PSIGN= 0
##$REVERSE= no
##$SF= 200.129620972305
##$SI= 16384
##$SIGF1= 3
##$SIGF2= 2
##$SINO= 0.751879
##$SIOLD= 32768
##$SREGLST= <19F.Aceton>
##$SSB= 0
##$STSI= 16384
##$STSR= 0
##$SW_p= 3612.71676300577
##$SYMM= 0
##$S_DEV= 0
##$TDeff= 16384
##$TDoff= 0
##$TI= <>
##$TILT= no
##$TM1= 0
##$TM2= 0
##$TOPLEV= 0
##$USERP1= <user>
##$USERP2= <user>
##$USERP3= <user>
##$USERP4= <user>
##$USERP5= <user>
##$WDW= 1
##$XDIM= 16384
##$YMAX_p= 302140319
##$YMIN_p= -504120
$$ End of Bruker specific parameters
$$ ---------------------------------
##NTUPLES= NMR SPECTRUM
##VAR_NAME=  FREQUENCY,     SPECTRUM/REAL,   SPECTRUM/IMAG
##SYMBOL=    X,             R,               I
##VAR_TYPE=  INDEPENDENT,   DEPENDENT,       DEPENDENT
##VAR_FORM=  AFFN,          ASDF,            ASDF
##VAR_DIM=   16384,         16384,           16384
##UNITS=     HZ,            ARBITRARY UNITS, ARBITRARY UNITS
##FACTOR=    0.220516191357247, 1,           1
##FIRST=     2985.38562376394, 0,            0
##LAST=      -627.331139241829, 0,           0
##MIN=       -627.331139241829, -504120,     0
##MAX=       2985.38562376394, 302140319,    0
$$ Real data points
##PAGE= N=1
##DATA TABLE= (X++(R..R)), XYDATA
$$ [...]
9049E6801K6409r7536R327N9455M1922j27082M3677K4140j7740j6361J42003n7205
9037H7810p1393j27775n9413J84196R4670p7167j39596J0392o571K14746J23407
9026B33306k9074M4302j06415q1332k6449m988q7171J94922n9410L7071m264K1056
9014A31554j5676J7183n5069N3552N650J27700o9732J6059j23874k5057L1978
9003I4268p4601j19725o640Q5006K1156Q1983l400l0501j22984k2794J37029k4774
8991A4023L2037N0507j19912n5277P6406J4470j01524M0428R7436j2684o6138
8980c0228J90726o5744r7135O6764p7895J28688j0462n9687l4969J54770J66965
8969C31793j35883o1627m7809q9677j05080J01287p4221L2029P622L567j07049
$$ plain form
9049 56801 83210 -14326 -4999 54456 96378 -30704 12973 37113 19373 3012 145015 87810
9037 87810 16417 -111358 -170771 13425 108095 30928 -108668 -98276 -104847 109899 233306
9026 233306 204232 248534 142119 60787 34338 29350 -57821 137101 77691 114762 110498 131554
9014 131554 115878 133061 77992 131544 137194 264894 195162 211221 87347 62290 94268
9003 94268 19667 -100058 -106698 -21692 -536 81447 78047 47546 -75438 -98232 38797 14023
8991 14023 46060 96567 -23345 -78622 -2216 12254 -89270 -48842 48594 35910 -30228
8980 -30228 160498 94754 -2381 64383 -13512 115176 104714 45027 10058 164828 331793
8969 331793 195910 134283 86474 -3203 -108283 -6996 -81217 -49188 -41566 -37999 -145048
8958a45048K1365J14266L4593k10708n9773J48830O2670j07463m7094P9050N7518
8947e1794N2425n6101p6197M9957j95494O4500J33037J13311K8929n4188n1725
8936d3340J8401m8033r8363J33044j49711J09366P5041j22646K8686l7419J72120
8925C7146k3374O9652R8534j08565r8415Q826j44812j51951Q5779K844k965K1474
8913b05827J81829j12055o3875o9226o089Q326O3864m4600P2915j4201J3366j7460
8901a93033j42822J08083N0129J49485l8797k09264r792K01812M7153Q1935R9305
8890A44194k13235k7496o0254m0439k6307J00830j2687m5115m173J08798o5185
8879a41069j81944J37546J6860M7315j13547j68108k5195L1578j07556J08750
$$ plain form
8958 -145048 -123683 -9417 25176 -185532 -245305 -96475 -33805 -141268 -188362 -109312 -51794
8947 -51794 631 -55470 -131667 -81710 -277204 -212704 -79667 33644 62573 8385 -43340
8936 -43340 -24939 -72972 -171335 -38291 -188002 -78636 -3595 -126241 -97555 -134974 37146
8925 37146 13772 83424 181958 73393 -25022 -16196 -161008 -312959 -227180 -224336 -227301 -205827
8913 -205827 -23998 -136053 -199928 -269154 -275243 -266917 -203053 -247653 -174738 -188939 -175573 -193033
8901 -193033 -335855 -227772 -177643 -28158 -66955 -276219 -286011 -84199 -37046 44889 144194
8890 144194 -69041 -96537 -156791 -197230 -223537 -122707 -135394 -180509 -184682 -75884 -141069
8879 -141069 -323013 -185467 -168607 -121292 -234839 -402947 -428142 -396564 -504120 -395370
8869c95370J91749j41931m1167J62120J25033j05138j63916J21761M2091L437
8859b01331M3720p5450N9293P5856m035R0838j40726Q1700o2067N372m161m1542
8847a72533o9219l931J65784M3946j4092r7127J31672k208j08803o8703K8463
8836a66751r3257j2695O5906P2712K5481q0215j74297J03030J73847K683j40664
8825b24220q9470j7017j20505J73455Q6263r531p9602K0525K06740l8928p7919
8814a70209J15452m8688N6408r3944q7249O1837J14528q0210j92560R7544R5537
8803a31554j15620j51092J54590M2733J1472K7031J05740o9594n3277l3679p697
8792b20947L8367P0279P0103J5449l7102m1377k11627l1545J41705J23940m1287
$$ plain form
8869 -395370 -203621 -345552 -386719 -224599 -99566 -204704 -368620 -246859 -204768 -201331
8859 -201331 -157611 -233061 -173768 -97912 -101947 -11109 -151835 -70135 -132202 -126830 -130991 -172533
8847 -172533 -241752 -245683 -79899 -35953 -50045 -147172 -15500 -17708 -126511 -195214 -166751
8836 -166751 -260008 -272703 -206797 -134085 -108604 -188819 -363116 -260086 -86239 -83556 -224220
8825 -224220 -313690 -330707 -451212 -277757 -191494 -201025 -280627 -260102 -53362 -92290 -170209
8814 -170209 -54757 -103445 -47037 -140981 -228230 -166393 -51865 -132075 -324635 -227091 -131554
8803 -131554 -247174 -398266 -243676 -200943 -189471 -162440 -56700 -126294 -179571 -213250 -220947
8792 -220947 -182580 -112301 -42198 -26749 -63851 -105228 -316855 -348400 -206695 -82755 -124042
8781a24042j23933J3130j12963K8654J22056P6288n9737q222N0651j15907N970
8770b48055k408R4711P6570q7598p5908J1681O1743J2610L9763k5099K2597q7073
8758b06466K244j2086J22544J8699j06753n7101M126m0783q912J00912m5647o8118
8746b97341J67183P8632m1303P6723L9147q648o8682L5708j9047J7190m40l4328
8734e5206n6569M6895j65221k4208j0796k091J25236P5491P2522n3091m1518k15436
8722c03992m3426J61107R1398N0433l5740j88686J52024J67756J6502n6078j31835
8711a20537p1430o9556J39507O6559q5119J2948L2088l041j28047n7335p0149
8700c54112R0717R5470p1215N0669K4348L9506j06322j23074J05929N237m2973
$$ plain form
8781 -124042 -247975 -234845 -347808 -319154 -197098 -120810 -180547 -188769 -138118 -254025 -248055
8770 -248055 -250463 -155752 -79182 -166780 -242688 -231007 -169264 -156654 -116891 -141990 -119393 -206466
8758 -206466 -204222 -216308 -93764 -75065 -181818 -238919 -234793 -275576 -284488 -183576 -229223 -297341
8746 -297341 -130158 -51526 -92829 -16106 23041 14393 -54289 -18581 -37628 -20438 -20878 -55206
8734 -55206 -111775 -64880 -230101 -254309 -265105 -267196 -141960 -66469 6053 -47038 -88556 -303992
8722 -303992 -347418 -186311 -94913 -44480 -80220 -268906 -116882 50874 67376 11298 -120537
8711 -120537 -191967 -261523 -122016 -55457 -140576 -127628 -95540 -98581 -226628 -283963 -354112
8700 -354112 -263395 -167925 -239140 -188471 -164123 -124617 -230939 -354013 -248084 -242847 -285820
8689b85820m3164j22048m3877J17417P3020m5302M438j7591J07113l64l3493J18887
8677a70784K0606m8533M819N3579l1802q929l0071n497l6183M8635m4821p706
8665b56687J14595n7524m0579J9136J94371p1802o8753J5313L4424K233J19250
8654C977j42686j15289K24013j3253j01007q7529K40299j00521J26259o5796j00593
8643a32126M5178k0397n0701l970J70120j0047j46385q5574J99914p9760n6130
8632a69878P6001j26921K0218O3728O713J50221n5741j97094O4312J09591L158
8621e5692j71786j44557L25073P9527r847j014q6817Q578J32577j04476k95047
8610c23481l0247J2250J30277Q7773J33392k1691J83066j60378k11665j06525
$$ plain form
8689 -285820 -328984 -451032 -494909 -377492 -304472 -349774 -345336 -362927 -255814 -256178 -289671 -170784
8677 -170784 -150178 -198711 -193892 -140313 -172115 -181044 -211115 -216612 -252795 -204160 -248981 -256687
8665 -256687 -142092 -199616 -240195 -221059 -26688 -98490 -167243 -151930 -117506 -115273 3977
8654 3977 -138709 -253998 -29985 -43238 -144245 -231774 8525 -91996 34263 -31533 -132126
8643 -132126 -86948 -107345 -158046 -162016 8104 -1943 -148328 -233902 -33988 -113748 -169878
8632 -169878 -93877 -220798 -200580 -136852 -130139 20082 -35659 -232753 -168441 -58850 -55692
8621 -55692 -227478 -372035 -46962 32565 22718 21704 -65113 -56535 76042 -28434 -323481
8610 -323481 -353728 -341478 -211201 -123428 9964 -11727 171339 10961 -200704 -307229
8600c07229J18906K100q3270J58359j67753J03375J39820L365j01019j2910l457
8589a49713j34460j15448J66696p9001K2964J48366J24441L9107k4698p4766k7400
8578a03912J25973l5319k6829N3166j71873n3253J60402J95443j9504j45348r5310
8567a16364p5883j08460J35458O6934n7006M3140N8599j70013J65937N6428k15259
8556b16489l162M4459J40037K7033j76534p2252J09195q8864j2254J5125j20588
8545c54294m159Q1430J04670L3288j84763l5760Q4488o26P0125j48822J33753
8534b20670J9921L1545O795m1164M772L3775J924q7483J27232k0047n4636n4279
8522b52315n614j0935N9409J45318J3441k98904j5019R0748Q2947m9712N1804
$$ plain form
8600 -307229 -188323 -186223 -269493 -111134 -278887 -175512 -35692 -32327 -133346 -146256 -149713
8589 -149713 -284173 -399621 -232925 -311926 -288962 -140596 -16155 22952 -1746 -76512 -103912
8578 -103912 22061 -13258 -40087 13079 -158794 -212047 -51645 143798 124294 -21054 -116364
8567 -116364 -192247 -300707 -165249 -98315 -155321 -112181 -53582 -223595 -57658 -1230 -216489
8556 -216489 -219651 -175192 -35155 -8122 -184656 -256908 -147713 -236577 -248831 -233706 -354294
8545 -354294 -358453 -277023 -172353 -139065 -323828 -359588 -275100 -275726 -205601 -354423 -220670
8534 -220670 -200749 -169204 -162409 -203573 -198801 -165026 -163102 -250585 -123353 -143400 -198036 -252315
8522 -252315 -257929 -268864 -209455 -64137 -50696 -349600 -364619 -273871 -190924 -240636 -188832
8511a88832L1317J23337r6665R545Q5806j21188k6910Q0890J5326j22972J21053
8500h9293Q7457M1789M007n7007K9174q0656p511j7997J8090M2452j07003J9834
8488a16664Q1719r926O7090k4706k4477j72274J28662K5412l3353N1802N0818
8477B4103n7548r6950Q775J64496n7811M4469n6736j67295m8115J71147m676o5039
8465a41180Q2682P3730n5798m0697K8254n9903O6725J49020J44295j54151j06513
8454a3536o1584L8157J5248o3844j51396j01703J15647j11505o3389J12402J91900
8443i3603P7876n0679L757p3330R8154r264J46056r8780k31940J59795P2206m641
8431d393p8365q4316J18591q6316J992k0027j298m1260J42709N4993J16748n0820
$$ plain form
8511 -188832 -157515 -34178 -130843 -121298 -35492 -156680 -183590 -102700 -87374 -210346 -89293
8500 -89293 -1836 39953 43960 -13047 16127 -64529 -72040 -90037 -71947 -29495 -136498 -116664
8488 -116664 -34945 -44871 22219 -2487 -26964 -199238 -70576 -45164 -78517 -26715 24103
8477 24103 -33445 -130395 -121620 42876 -14935 29534 -27202 -194497 -242612 -71465 -76141 -141180
8465 -141180 -58498 15232 -40566 -81263 -53009 -112912 -46187 102833 247128 92977 -13536
8454 -13536 -75120 -36963 -21715 -85559 -236955 -338658 -223011 -334516 -397905 -285503 -93603
8443 -93603 -15727 -66406 -62649 -135979 -37825 -47089 98967 187 -231753 -71958 248 -4393
8431 -4393 -82758 -167074 -48483 -134799 -132807 -152834 -154132 -195392 -52683 2310 119058 68238
8419F8238O9328R1745J2397j04416k80472n1253K71844q0449o9605J31720R9645
8408A58722k19059j6505j13774k6336J23643J00487m9635O4458Q991q4070L4300
8397a8778J17663k8593J0125j09934j09641R8920m2783J08980r3282j470o597
8386g5390j35394j2288K63600J00985L4417q74N4538p8157k26298q5956J18883
8375d1934k745J06195P7264j03416o2775K4628P3932j22657q8177L1560N848j47143
8363b49420J20838J92789j16893M0241O5676p1352k1103Q1527r0410J30243J3442
8352I5578j5482J6020O78j74680R4087j289m3765P9636J42750j29683M0949j00860
8340C939j30234K24489j35412k7506P2784n3174N3201L0135k2320j24905N868
$$ plain form
8419 68238 137566 229311 241708 137292 -143180 -194433 77411 -3038 -72643 59077 158722
8408 158722 -60337 -76842 -190616 -216952 -93309 7178 -42457 22001 30992 -53078 -18778
8397 -18778 98885 70292 80417 -29517 -139158 -40238 -83021 25959 -67323 -68793 -75390
8386 -75390 -210784 -223072 40528 141513 175930 175056 229594 151437 -74861 -160817 -41934
8375 -41934 -44679 61516 138780 35364 -27411 -2783 71149 -51508 -139685 -108125 -102277 -249420
8363 -249420 -128582 64207 -52686 -12445 53231 -18121 -39224 42303 -48107 82136 95578
8352 95578 80096 96116 96794 -77886 16201 14912 -28853 50783 193533 63850 104799 3939
8340 3939 -126295 98194 -37218 -64724 8060 -45114 8087 38222 15902 -109003 -103135
8329a03135P2829l4263r2748K03568m959M017m8338j37138J02016O4304R7245
8318A23398P1775J44150o1262j40293l7983K2593o6372J21590j57055J77951j08441
8307I0051L2098P600n4773J01323p3145Q4702O479K04549j17816j33098k9073
8296A18897k6606m9366R3264P3171n8935M8869l2832O9930N8824r0221j8829o3393
8284A22773l7957J63984N6047L6236L4926M4484q756q9116J2167n7494O6881J37298
8272D81473P7651p896j20327j39925M7002K89692j64747r362P9125j47694Q0441
8261D65433P3893M0056o3240Q717r3059l1908O5018L8144o7491l9084m7564Q1742
8249D30657o6511j56351k2129J15663K4851l1977L2930j0640J578m6505J27610
$$ plain form
8329 -103135 -30306 -64569 -157317 46251 41292 45309 -3029 -140167 -38151 26153 123398
8318 123398 195173 339323 278061 137768 99785 122378 56006 177596 20541 198492 90051
8307 90051 122149 129749 74976 176299 103154 187856 194335 398884 281068 147970 118897
8296 118897 92291 42925 136189 209360 150425 199294 166462 236392 295216 204995 186166 122773
8284 122773 84816 248800 304847 341083 376009 420493 411737 322621 334788 277294 344175 481473
8272 481473 559124 551228 430901 290976 337978 627670 462923 453561 532686 384992 465433
8261 465433 539326 579382 516142 524859 431800 399892 464910 503054 435563 396479 348915 430657
8249 430657 364146 207795 185666 301329 326180 294203 327133 316493 318071 271566 399176
8238C99176j3522q1573n6210m6439J7202j8850P1877J04797O859r0440j3778K6509
8226C05608o126j6954N2109J14848K7135K3729m8265j76634p0964P4424j41562
8215A37348P2477J57295M0632K3122J7582k21913o7912J24562N2128O3816L5054
8204D34191j183K1644k63166J78529M8525j630M6337J40247N646n0458o9033M54045
8192I43694n47226p61519L83055m0332K71531J2178J20507l4987m4575J67061
8182D69387r4582j01754o4843J32483Q2477j21095J3588M9365M4286o0290O5166
8171D14188m4558L0303r210M6495J0607q7142L0733O9914r5607J09598J91429
8160F66750l7657k84885O510L0225p0430R6845N2347J33055k8191P4883q6019
$$ plain form
8238 399176 385654 304081 247871 201432 218634 199784 271661 376458 383317 292877 279099 305608
8226 305608 299482 282528 334637 449485 476620 500349 452084 275450 204486 278910 137348
8215 137348 209825 367120 407752 430874 448456 226543 158631 283193 335321 399137 434191
8204 434191 433008 454652 191486 370015 418540 416910 463247 603494 609140 558682 489649 943694
8192 943694 396468 -365051 18004 -22328 249203 261381 381888 346901 302326 469387
8182 469387 374805 273051 208208 340691 423168 302073 315661 365026 409312 349022 414188
8171 414188 369630 399933 390723 437218 447825 360683 391416 461330 365723 475321 666750
8160 666750 629093 344208 350718 380943 310513 407358 459705 592760 564569 639452 553433
8149E53433K599J10571N1897n4560J4418m1664N1518N2765Q36m0267l5031k8734
8137F37781o87L00807m9704j70973l8351O672O8346P6281J11171J6232o7071j46572
8125G43932J7078J60142m0607o4357j9890J90270j73948L1202J39400j2870J40971
8114A111323j15233j49896J70461R6835n4150J10661p2536n8727K9528J59463
8104A227729M6803L8790J02208j333n177p378J12526K25182J59220P702k924O4841
8092A968189J09255J39678K04200M4658K30159J11426J38320J75533L12456L74514
8082C808388L54972L29630M61339L34695P4405j47136j81507j63989O9465R2897
8072E033159m17596k84259l02038k55371j63611k02594j03396j69636j96072o4506
$$ plain form
8149 553433 556032 666603 718500 663940 678358 636694 688212 740977 741813 701546 666515 637781
8137 637781 637094 937901 888197 717224 678873 685545 753891 830172 941343 957575 890504 743932
8125 743932 761010 921152 880545 816188 796298 986568 812620 843822 983222 970352 1111323
8114 1111323 996090 846194 1016655 1113490 1059340 1170001 1097465 1038738 1068266 1227729
8104 1227729 1274532 1313322 1415530 1414197 1409020 1401642 1514168 1739350 1898570 1906272 1903348 1968189
8092 1968189 2077444 2217122 2421322 2465980 2696139 2807565 2945885 3121418 3433874 3808388
8082 3808388 4163360 4492990 4954329 5289024 5363429 5216293 5034786 4870797 4940262 5033159
8072 5033159 4615563 4331304 4029266 3773895 3610284 3407690 3304294 3134658 2938586 2874080
8062B874080O1457L5512j95248j16158n8689n8498m4985O3380j07901R3546k7135
8051B519361o6873l3693o3244R4267M2035R701M9902L6948o2233J11584N8937
8040B696692J11497J51978J5793j07644j1834k9271O2952J94956l684K6787K61620
8029C369842Q9453m8895P3624J37614r1974r1873J66853J89848J62796k5184J89469
8018D121573J20601K23027J03776J28696K32555K28100K38485O9838K06348L00562
8008E973561K77633L70057L41802L39145K10180L22711L69771M80911N80370M91857
7998I757998N58831M33900N79557P09364M10767N66928L28132J10961N70364J86704
7988A4213506J26173K07802l6160Q5382J8804K58895Q5669J06941L97731M18146
$$ plain form
8062 2874080 2935537 2971049 2775801 2659643 2600954 2542456 2497471 2560851 2452950 2546496 2519361
8051 2519361 2452488 2418795 2355551 2449818 2491853 2501554 2551456 2588404 2526171 2637755 2696692
8040 2696692 2808189 2960167 2975960 2868316 2856482 2827211 2890163 3085119 3081435 3108222 3369842
8029 3369842 3459295 3410400 3484024 3621638 3529664 3437791 3604644 3794492 3957288 3932104 4121573
8018 4121573 4242174 4465201 4568977 4697673 4930228 5158328 5396813 5466651 5672999 5973561
8008 5973561 6251194 6621251 6963053 7302198 7512378 7835089 8204860 8685771 9266141 9757998
7998 9757998 10316829 10750729 11330286 12039650 12450417 13017345 13345477 13456438 14026802 14213506
7988 14213506 14339679 14547481 14511321 14596703 14615507 14874402 14960071 15067012 15464743 15882889
7978A5882889L31612L53434M97160N47207O09821Q34082J006673R40045J228042
7969B2230965J250942J352330J646407J867710J892288K215739K299690K633438
7961C7389509K969844K954540L219979L502051L769132L646936L917706L591306
7953F4961003L155797K414463J509762O48240l47542j180995j662721k249535
7945F7248472k823333l061766l466655l417610l459760l541137l189056k933892
7937D1355263k778702k476548k269033k115549k183057j625298j511558j516154
7929B4879364j372841j146219j230570j036714r37155j139831j045316p86333
7921A6184385n95885m89927p19681n32907m54870m53677l97811n71528n01242
$$ plain form
7978 15882889 16214501 16567935 17065095 17612302 18222123 19056205 20062878 21002923 22230965
7969 22230965 23481907 24834237 26480644 28348354 30240642 32456381 34756071 37389509
7961 37389509 40359353 43313893 46533872 50035923 53805055 57451991 61369697 64961003
7953 64961003 68116800 70531263 72041025 72689265 72341723 71160728 69498007 67248472
7945 67248472 64425139 61363373 57896718 54479108 51019348 47478211 44289155 41355263
7937 41355263 38576561 36100013 33830980 31715431 29532374 27907076 26395518 24879364
7929 24879364 23506523 22360304 21129734 20093020 19155865 18016034 16970718 16184385
7921 16184385 15588500 15098573 14378892 13845985 13391115 12937438 12539627 11968099 11466857
7912A1466857l60260l60668m04051l03741k21859k70273o47437j87724j08637
7903H602207k95911j28713k54107q7193k59476k13203j08726l39208k46784j78053
7893F490833k90611j13660j21206q1968r6867k06429k81249k87077k03694o7343
7883D740729N193j56724j94968J7068j58094q0141k70204m7931j34082q3071R7453
7872C735228o3878j6296j89529K627J62817r3422j90078j80579L7307J01985j52809
7861C153373O9928j82688j23281J12613R651k13021q5940k6363J30243p9578J1917
7850B776854n7572M7092j75969j62428M1111j13488j75804q5127J5185o0471j64299
7839A885084Q1764O7166j34544m0145M2736J62131m121j43997l9709k04140q5199
$$ plain form
7912 11466857 11106597 10745929 10341878 10038137 9816278 9546005 8898568 8710844 8602207
7903 8602207 8306296 8177583 7923476 7836283 7576807 7363604 7254878 6915670 6668886 6490833
7893 6490833 6200222 6086562 5965356 5883388 5786521 5580092 5298843 5011766 4808072 4740729
7883 4740729 4745922 4589198 4394230 4411298 4253204 4173063 3902859 3854928 3720846 3637775 3735228
7872 3735228 3671350 3655054 3465525 3468152 3630969 3537547 3347469 3166890 3204197 3306182 3153373
7861 3153373 3223301 3040613 2917332 3029945 3039596 2826575 2740635 2714272 2844515 2764937 2776854
7850 2776854 2719282 2766374 2590405 2427977 2469088 2355600 2179796 2094669 2109854 2049383 1885084
7839 1885084 1966848 2034014 1899470 1859325 1902061 2064192 2060071 1916074 1876365 1672225 1587026
7828A587026m3447o1526N6540K1228J72272j02614q1032K6458j20640p5052k6099
7817A353114k0145k15290K38710J39954m7636k26580k6652P321j19602j03832
7807I79362q8426P091Q3707J33996N8187l7775j1105k53778J11880K11314j82180
7796A012273j8756j03779m7313l0585J78293k9167l6289J5872R6549j9607j66691
7785H50800l097k010j38139M5505M9850o1888l9016M3194l5884N7253q677j35885
7773F22006L9636O205r5105j4897P8774J54901p3949O9790q0699j75975r0483
7762D40204J29528J04779k8774j4723q7148q7769M474L5981J8854q2627P6167
7751E08946o7140M8497J26234q4711N3381l5931l02505l2001M7370Q042j49852
$$ plain form
7828 1587026 1543579 1482053 1538593 1559821 1732093 1629479 1548447 1574905 1454265 1379213 1353114
7817 1353114 1332969 1117679 1356389 1496343 1448707 1222127 1195475 1202796 1083194 979362
7807 979362 890936 898027 981734 1115730 1173917 1136142 1125037 871259 983139 1194453 1012273
7796 1012273 993517 889738 842425 811840 990133 960966 924677 940549 1037098 1017491 850800
7785 850800 847703 845693 707554 753059 802909 741021 702005 745199 709315 766568 757891 622006
7773 622006 661642 667847 572742 557845 636619 791520 717571 787361 706662 530687 440204
7762 440204 569732 674511 645737 631014 543866 456097 460571 496552 515406 432779 508946
7751 508946 441806 490303 616537 531826 585207 549276 246771 214770 262140 270182 120330
7740A20330J24641J97486k165M171j01425R6829J50889M3696L1770j12351k33422
7729C20449m280J3357O7910J08260p1373j22555j5714L0926p8546j03915Q3199
7718B27718K7096o8534o767J88174j28204N1442K2353O1810p5327l7641n0737
7707B11383J22471J01447M1201J8620j1294J49955k15069m9865q841J1389J08393
7696D79790p5357k1503O3816L0203j43438o8555l0775O7122R9756j8435P5125
7685D57749L2706r2118r5169m134l1145N8518K1206p0635j3512M7491N0878M0845
7673D02680n6735m3781J43010l411j73783k4693R3219R2257q1351R9122k7491
7662D19043J05652k7252k5000J04447j65623j12621J2942O980k8667J0263p227
$$ plain form
7740 120330 244971 442457 440292 444463 343038 439867 590756 634452 666222 553871 320449
7729 320449 316169 329526 397436 505696 434323 311768 296054 326980 248434 144519 227718
7718 227718 254814 186280 179513 367687 239483 290925 313278 375088 299761 262120 211383
7707 211383 333854 435301 476502 495122 483828 633783 418714 368849 360008 371397 479790
7696 479790 404433 382930 446746 476949 333511 264956 234181 301303 401059 382624 457749
7685 457749 490455 398337 303168 299034 267889 326407 347613 276978 263466 310957 361835 402680
7673 402680 345945 302164 445174 441763 267980 243287 336506 428763 347412 446534 419043
7662 419043 524695 497443 472443 576890 411267 298646 311588 318568 289901 300164 292937
7651B92937J69235j92827K4295R9300L4804M681j27921q793J02038k3574J3112
7640C87287Q636N5746K6586l4169M7401L1721K7429L5628l2792l0603L5113M3098
7628F01081j21716L4118l5258o5771L0050L4657P9081J09269o6550k09689p0802
7617C18470K3211P4616q7094N0136j04109K4735K4008l6265r2381K539Q4766j35493
7605A47139n189O7944r5487M854N7971J04103l2651J5806n6406L4830j46447J58527
7593B54994N7945L7768j9331n381M7129j17045j99698J36832J2364j90033j12719
7582i7175J13219K49615k10579p5498L877K37325P854R4962L2972j7441K8502
7571C67633P3041k55021R4614j00504j48316K5209P4391K403k59596J38848N9676
$$ plain form
7651 292937 462172 269345 293640 392940 427744 432425 304504 295711 397749 374175 387287
7640 387287 395923 451669 478255 444086 491487 523208 550637 586265 553473 522870 557983 601081
7628 601081 479365 513483 478225 412454 442504 477161 556242 665511 598961 389272 318470
7617 318470 341681 416297 329203 379339 275230 299965 323973 287708 195327 197866 282632 147139
7605 147139 141950 209894 114407 119261 177232 281335 248684 264490 208084 242914 96467 254994
7593 254994 312939 350707 331376 325995 373124 256079 56381 193213 205577 15544 -97175
7582 -97175 16044 265659 55080 -20418 -16541 220784 228638 323600 356572 339131 367633
7571 367633 440674 185653 280267 179763 31447 56656 131047 133450 -126146 12702 72378
7560G2378J15094k7827j17357J13011j966P7463j26569l3761k2106j80978N4786
7549g7832J07927N2197j05716J02977O0814q8301j17017J55362p7395Q9434J38693
7538B41143k5915r7763Q5403R281n1002m5403M4641k5012j43047K15236J7093
7527B24655r4181j1970K15Q7673Q2065K6117j56654k12674J34886J6795j24105
7516b7178l3591K12336n680O2218K4487P5075j10320m3726o9254n231P8960j25544
7504C2552m3385K06256K7797j89161J41270J45796j71585n8903J24070J22663
7494C37370n0729l1823P2843k38710j23097M9426p5341J55918n1943O0903J88639
7483B93456j80761j90353J6895J31315p7985J85102o4237K1157J05351p9179N3912
$$ plain form
7560 72378 187472 159645 42288 155299 153333 230796 104227 70466 48360 -132618 -77832
7549 -77832 30095 82292 -23424 79553 140367 52066 -64951 90411 13016 102450 241143
7538 241143 215228 117465 202868 212149 161147 115744 160385 135373 -7674 207562 224655
7527 224655 130474 118504 118719 206392 288457 314574 157920 -54754 80132 96927 -27178
7516 -27178 -60769 151567 145887 208105 232592 307667 197347 153621 84367 79136 158096 32552
7504 32552 -10833 195423 223220 34059 175329 321125 149540 90637 214707 337370
7494 337370 286641 254818 327661 88951 -34146 15280 -60061 95857 43914 104817 293456
7483 293456 112695 -77658 -60763 70552 -7433 177669 113432 134589 239940 160761 214673
7472B14673K1438q5034j19573k7266O4994J91940q7848J312l8403K8860K55755
7461D20848k67674r730k2886p1607j55286p8754K38409N4519j93888K4428M002
7450e7619K2130K07489q5145M2021N4142j8452l7963N9317J02756m7713j02897
7439A38066R8832N0797j69187O104j83283L9574J15623k5169j46035J16870P5808
7428A18000r8500J35427J32422M0811j20202J5770j06785k2691o2581N297N6561
7417I3529J22937m986o0670o186k6867J5725j06298j60682J39452J25942l2849
7406I9047L215L920N1652J33502P616q2080j17278m6661N8660N0075J39785k83808
7394A7645L0308Q4480R2415J4172o7818M91r4384L3568O710K2703J8332l0542
$$ plain form
7472 214673 236111 151077 31504 4238 69232 261172 173324 174636 136233 165093 420848
7461 420848 153174 143444 120558 48951 -106335 -185089 53320 107839 -86049 -61621 -57619
7450 -57619 -35489 172000 86855 128876 183018 164566 126603 185920 288676 240963 138066
7439 138066 236898 287695 118508 124612 -58671 -19097 96526 71357 -74678 42192 118000
7428 118000 19500 154927 287349 328160 207958 223728 116943 94252 31671 36968 93529
7417 93529 216466 211480 150810 144624 117757 133482 27184 -133498 5954 131896 99047
7406 99047 102262 106182 157834 291336 298952 216872 99594 52933 111593 161668 301453 17645
7394 17645 47953 132433 224848 239020 171202 171693 77309 110877 117587 140290 158622 128080
7382A28080O7444J8176n0283k08336R1563J19464N606p5869o6937J83208j4903
7371A97213N7858o8974j60410j204K9597M2761l787L5605L1640J49208R4026j32510
7359B71023M7143q8307j33710M666o2122N7347o4429K1219M9545P0638R8022N0960
7347C21995P2089k52166j23191J19990J58636O4062p4388n5105o276j11065L7699
7336A52280j32644P7499J07150Q4670j35440m6474j41274p6183J43847o663q1191
7325e4423J23934J40198O1678j0781j86179O2883p5871J06924n7676J43836q4801
7314A69722J19091P3105j10573j4466j12604N7317N4978N1582o4215N015j62998
7303F5954J94944n3466J3536J54504r2425r6660k6920J20760M606j36704J12359
$$ plain form
7382 128080 195524 213700 163417 -44919 46644 166108 171714 95845 28908 212116 197213
7371 197213 255071 186097 25687 24483 54080 96841 93054 128659 160299 309507 403533 271023
7359 271023 318166 229859 96149 100815 38693 96040 31611 52830 102375 173013 271035 321995
7347 321995 394084 141918 18727 138717 297353 361415 287027 231922 225646 114581 152280
7336 152280 19636 97135 204285 288955 153515 107041 -34233 -110416 33431 26768 -54423
7325 -54423 69511 209709 271387 260606 74427 137310 61439 168363 110687 254523 169722
7314 169722 288813 361918 251345 236879 124275 181592 236570 288152 223937 228952 65954
7303 65954 260898 207432 220968 375472 283047 186387 159467 280227 284833 148129 260488
7292B60488P2515p0261N6516k15207m190J44753K4473j0406M595q0297j59962
7281B3017M4918m7845n3150J2620J64145J05215p1212n0918k2067q1850O5786
7270H8659l0969J27073J95785o5048p7182J6009R7887j71003j2825k6068J1247
7259A53565K6672J09324O8346p1535k35746k0244J63482n2203P276P485O9542
7248B25964m422l9433p5953m0450k2302O4295j907O8364N2624o9040m2694K3780
7236A38826J8469J39395m0431O028o3296K6390N0318p6105l1034L2861J78950
7225C80371j63989J874m8128m6302o8398J86471J50948j20861j46694p8107P557
7214E4742Q7847J31518J38293j25599R6141q8336l12694J10211J41478m9968N6455
$$ plain form
7292 260488 333003 262742 319258 104051 99861 244614 269087 258681 263276 182979 23017
7281 23017 67935 20090 -33060 -20440 143705 248920 177708 126790 104723 22873 88659
7270 88659 57690 184763 380548 315500 238318 254327 352214 181211 168386 142318 153565
7259 153565 180237 289561 357907 286372 50626 30382 193864 141661 148937 156422 225964
7248 225964 221542 182109 106156 65706 43404 107699 105792 174156 226780 157740 115046 138826
7236 138826 157295 296690 256259 262287 198991 225381 275699 199594 168560 201421 380371
7225 380371 216382 218256 170128 123826 55428 241899 392847 271986 125292 47185 54742
7214 54742 142589 274107 412400 286801 382942 294606 -18088 92123 233601 183633 240088
7203B40088Q7206n3303M8412k0881L2105j57946j39595J84678j29524R8261p3274
7192A16227L4047R3833R1068N6498K5438o8401j26667N2052O7205K3847n0621
7181C14526q9044K0324J29519n1022o87Q0758L9865j38762K9904M1226j25055
7170B51552N7376O409o311M5079J40874k8019j77163O6923p076n5163P9599j5564
7158C58516j46392k1167L9440M5394N4131J69748K6210k6876j88012N0838K3724
7147C85554p6071N2174M9521p4967J03683q4189j3152J79376k5362r3948j80020
7136B22599l6717J88360J28341K7512j49064q0266J40611p7086j13705M9023J62405
7125D62013o4461p7311J81080j34140j52532L2346J99045p964k321k9187o2258
$$ plain form
7203 240088 327294 273991 322403 301522 333627 175681 36086 220764 91240 189501 116227
7192 116227 150274 244107 335175 391673 417111 348710 222043 274095 341300 365147 314526
7181 314526 225482 245806 375325 324303 323616 404374 444239 305477 335381 376607 251552
7170 251552 308928 315337 309026 354105 494979 466960 289797 356720 349644 294481 374080 358516
7158 358516 212124 190957 230397 275791 329922 499670 525880 499004 310992 361830 385554
7147 385554 309483 361657 411178 336211 439894 355705 342553 521929 496567 402619 222599
7136 222599 185882 374242 502583 530095 381031 300765 441376 364290 250585 299608 462013
7125 462013 397552 320241 501321 367181 214649 246995 446040 438076 435755 406568 344310
7114C44310j8897j09706K19225M9631j40218n8547L6254J68350q0793J06572m4009
7103D72172P5481j61649n0473K35750j87759N3682K1844L7673L818q2345O2767
7092D80961J43796J6797j14676j5009J69849J25137j05777l1893j67093k8000
7082D74092k4187M113K15876K9237r0151j46154J83221O5564J0508M0865Q8197
7071H51181j79376K5809J17335j14171l00687R4388J52772o3046J86269o7776
7061G02698k4006r2630J7563n707J06951L233j6533J94429J17263j09035L1224
7050I25450j07742j61178n6249o8294R4959J44468J0439M6111J55050p9027j20944
7039G83043L6439L2132j22524k45731P3358J50775m5652P4195j06289q532n9317
$$ plain form
7114 344310 325413 215707 434932 484563 344345 285798 322052 490402 409609 516181 472172
7103 472172 547653 386004 335531 571281 383522 437204 459048 496721 500539 418194 480961
7092 480961 624757 641554 526878 511869 681718 806855 701078 669185 502092 474092
7082 474092 449905 454018 669894 699131 608980 462826 646047 711611 722119 762984 851181
7071 851181 671805 697614 814949 700778 400091 494479 647251 584205 770474 702698
7061 702698 678692 586062 603625 597918 704869 708102 691569 885998 1003261 894226 925450
7050 925450 817708 656530 600281 531987 626946 771414 781853 827964 983014 903987 783043
7039 783043 819482 851614 729090 483359 556717 707492 661840 736035 629746 621214 561897
7028E61897J6632N0239M5690O8013r784r722O6984j69302M5766K1431p2848K002
7016F16998K3204K3039L1402J47874P844j67338l8104R4586k8692m8231J6226
7005F78808J35255N2208l9334k8940m6563q1082L2651J35912q5156n4831K5274
6994G24202J71824p8506K0127N8113K707J32499J1440j76827j69702N1369J06669
6983H53915J41505O1563j19450j31748M9439J6156r770q8420q7053K41253K4452
6972I51842j05863J7003m059k8598N332j7167K51779q5510m8228M0797P2669M8357
6960A098354j50724m9530Q6041Q8390O8729o296L4121J29321k9454l5406Q4905
6949A318451j64412L834J4794m6549J36778j5902L1736N4867M1223j9989m5531
$$ plain form
7028 561897 578529 628768 674458 742471 732687 722965 789949 620647 666413 687844 614996 616998
7016 616998 640202 663241 694643 842517 850361 683023 644919 739505 710813 662582 678808
7005 678808 814063 866271 826937 797997 751434 670352 703003 838915 753759 698928 724202
6994 724202 896026 817520 837647 895760 898467 1030966 1042406 865579 695877 747246 853915
6983 853915 995420 1056983 937533 805785 855224 871380 861610 773190 686137 927390 951842
6972 951842 845979 862982 858923 830325 835657 818490 1070269 984759 936531 977328 1049997 1098354
6960 1098354 947630 898100 984141 1072531 1141260 1134964 1169085 1298406 1268952 1233546 1318451
6949 1318451 1154039 1157873 1172667 1126118 1262896 1246994 1278730 1333597 1374820 1354831 1309300
6938A309300l7228L1218P4531J13929n6078n9066l0077N9081P7163J63415Q4486
6927A730674L20361k3669r5165m8606n9241K63804N5991m5228j30090Q926J68932
6916B146689m0715J14999K18645K75946J5202O8866j03666M5405K80692K17065
6906C239128j07803K58602o7924L8635N2595L02513J53725l0609n766J24216n234
6895C952078j10553J7205N8508L3271M2512L5442O3129K20094q0145l0323J67010
6884D368228K11317K35605K49928J03504K45673J58813q9275Q5745O9893k9414
6874E610017j7310o0301j926m4345k03941j05896k32733j45507P8748j42909m7310
6863D686587k7930N1064J55906J04126J1879j22810L8407J89980L4136k1008o0610
$$ plain form
6938 1309300 1272072 1303290 1377821 1491750 1435672 1376606 1346529 1405610 1482773 1646188 1730674
6927 1730674 2051035 2027366 1932201 1883595 1824354 2088158 2144149 2098921 1968831 1977757 2146689
6916 2146689 2105974 2220973 2439618 2715564 2730766 2799632 2695966 2741371 3022063 3239128
6906 3239128 3131325 3389927 3322003 3360638 3413233 3715746 3869471 3838862 3833096 3957312 3952078
6895 3952078 3841525 3858730 3917238 3950509 3993021 4028463 4091592 4311686 4231541 4201218 4368228
6884 4368228 4579545 4815150 5065078 5168582 5414255 5573068 5483793 5569538 5639431 5610017
6874 5610017 5592707 5532406 5530480 5486135 5282194 5176298 4943565 4798058 4876806 4733897 4686587
6863 4686587 4658657 4709721 4865627 4969753 4981632 4858822 4897229 5087209 5121345 5100337 5039727
6852E039727m7017j27626M9388r3475K6507j69258j85688j26321j03332j28995
6842D133910J6471j51770j03967N9023N3999j54080K1586J239J59526j86583j90948
6831C658406p0994J18927K21053J39010J56657o6922l9010M0164m8163q114n6264
6820D044750P0895p5837J78700R9400o9360J61238R688L1865M3952N6542K95622
6809D847455J68750N3272N9365K37358J6463m2272K15703K61420J40668J22757
6799F080939K98220J85835J41730K57534J56652K78075L91915L17075K45551K79705
6789H633231M54268M14543L17164N14206O76203N65145O47859M19527P14637P59098
6779A4115881P06637Q14522Q09894P01545J286197J223430R99804J148186R22499
$$ plain form
6852 5039727 4992710 4865084 4914472 4820997 4847504 4678246 4492558 4366237 4262905 4133910
6842 4133910 4150381 3998611 3894644 3953667 4007666 3853586 3875172 3876411 4035937 3849354 3658406
6831 3658406 3587412 3706339 3927392 4066402 4223059 4156137 4117127 4157291 4109128 4101014 4044750
6820 4044750 4115645 4039808 4218508 4317908 4248548 4409786 4419474 4451339 4495291 4551833 4847455
6809 4847455 5016205 5069477 5128842 5366200 5382663 5340391 5556094 5817514 5958182 6080939
6799 6080939 6379159 6564994 6706724 6964258 7120910 7398985 7790900 8107975 8353526 8633231
6789 8633231 9087499 9502042 9819206 10333412 11009615 11574760 12222619 12642146 13356783 14115881
6779 14115881 14822518 15637040 16446934 17148479 18434676 19658106 20657910 21806096 22728595
6770B2728595R79877Q74626R46305O30960Q53280O01034N04406L22221L31407
6761B8772711N25958L72794M59676L34572O26599P69967O53542Q22954J149161
6752C4487934J032989J298420J130383J138312J038824R46479P01761P53957K17325
6743D2746384M8102q7632m04586o36726r21735p29632q97018r75867q57966p97866
6733C6485458p64158p24485n95748n98784k11073k58874k34610k94816l60913
6724C2441997l00395k53331l16243k83921o57237p83644p85507p80519j237370
6715B7043830j036260j004634j168821j051302j010225j082170j129380r69174
6707A8591864r45284q57596p27611o96192n90556o44005n89645p91560l61672
$$ plain form
6770 22728595 23708472 24583098 25529403 26160363 27013643 27614677 28119083 28441304 28772711
6761 28772711 29298669 29671463 30131139 30465711 31092310 31862277 32515819 33338773 34487934
6752 34487934 35520923 36819343 37949726 39088038 40126862 41073341 41775102 42529059 42746384
6743 42746384 42794486 42706854 42302268 41665542 40743807 40014175 39117157 38141290 37283324 36485458
6733 36485458 35721300 34996815 34401067 33802283 33591210 33332336 33097726 32802910 32441997
6724 32441997 32141602 31888271 31572028 31288107 30630870 29847226 29061719 28281200 27043830
6715 27043830 26007570 25002936 23834115 22782813 21772588 20690418 19561038 18591864
6707 18591864 17646580 16788984 16061373 15365181 14774625 14130620 13540975 12749415 12387743
6698A2387743l48681o35700l54084l69293l78500m13044k09405l38109m88985
6689H851942l20841k34410l63437k20405j59637j83273k79693k13117k05174j52250
6679F519705j41016M0580l23395l03535N8205j25403m9460j35477k70959j65791
6669E103454k10567J6115p4720k2839j99559J6632j97249K6676j39481k12367
6659D106095j81739K06373j33162k11901j16293k28542M2881J80978O505j18727
6649C552468q3547j12287j29359n9725k2972m7285N324r8830J876q4219k00257
6638B721187P0772K07227o8767q7375l4773r9378o8911l742J6420J40102L5913
6627B828675j40321j36285l6038m0746N2090n7843j10812p4239J22123P5060j55482
$$ plain form
6698 12387743 12039062 11403362 11049278 10679985 10301485 9888441 9679036 9340927 8851942
6689 8851942 8531101 8296691 7933254 7712849 7553212 7369939 7090246 6877129 6671955 6519705
6679 6519705 6378689 6419269 6095874 5792339 5850544 5725141 5675681 5540204 5269245 5103454
6669 5103454 4892887 4909002 4834282 4811443 4611884 4628516 4431267 4457943 4318462 4106095
6659 4106095 3924356 4130729 3997567 3785666 3669373 3440831 3483712 3664690 3671195 3552468
6649 3552468 3468921 3356634 3227275 3167550 3144578 3097293 3102617 3003787 3005663 2921444 2721187
6638 2721187 2791959 2999186 2930419 2843044 2808271 2708893 2639982 2636240 2652660 2792762 2828675
6627 2828675 2688354 2552069 2516031 2475285 2527375 2469532 2358720 2284481 2406604 2481664 2326182
6616B326182J49569m412j95905p7826J4766m31q8813j02236N3413j28968k338
6605A943001J06759K0077r6828n8363J35035n9178J231M0765n4932R5527O7776
6594B140870k14955M7174M6520l2858j71198R3529L6793j22723Q9856O8086j52790
6583A828304O9691R3133j75525k7858N5531j43507n2838J39668R3375j95016M5428
6572A730386K20085J6814n3384r6404l7148k4720q1924o9899J52249l472Q085
6561A760668j4413J1892l4N4868L2138j23706j5301N6229L2130L0750k2857p8039
6549A724325p9447L8759K0721j66571J05056J2308l6259L9053q3180J08127J10510
6538A793402p7976j9278n5804p9153M677J65242q888J58319j15420j50752Q9741
$$ plain form
6616 2326182 2475751 2471339 2275434 2197608 2212374 2211943 2123130 2020894 2074307 1945339 1943001
6605 1943001 2049760 2069837 1973009 1914646 2049681 1990503 1991734 2032499 1977567 2073094 2140870
6594 2140870 1925915 1973089 2019609 1986751 1815553 1909082 1945875 1823152 1913008 1981094 1828304
6583 1828304 1897995 1991128 1815603 1787745 1843276 1699769 1646931 1786599 1879974 1684958 1730386
6572 1730386 1950471 1967285 1913901 1817497 1780349 1755629 1673705 1603806 1756055 1752583 1760668
6561 1760668 1746255 1758147 1758113 1812981 1845119 1721413 1706112 1762341 1794471 1825221 1802364 1724325
6549 1724325 1644878 1683637 1704358 1537787 1642843 1655151 1618892 1657945 1574765 1682892 1793402
6538 1793402 1715426 1696148 1640344 1561191 1565868 1731110 1722222 1880541 1765121 1614369 1704110
6527A704110K993R9092q2752l9771J16942j5677q1528p7973R5036j7861K99223
6516B001834j40632o7119r1623L2379K1917q4506J23021N6023L7628m6829P4772
6505A916865j43933M3686l7085j9515p4301J15850O8543m7530l1373p3511k2704
6494A694992O5843p1876n0154Q3875j09299q9662K55226r7945N8368O7844k1667
6483A785545l6292o5637J01029N2402J22227j13347j21149l9547K6042j4399O6476
6472A763350J57494j37834J54274l5129j00856k4206K5550J31163o3773j6006
6462A854027L6113K6811P3892K8480j85294P5227J24981p9079j40824R7914J14559
6451B026807l6405j29815j5690J25019J3780Q9461J8483m1986J27430K2493r5842
$$ plain form
6527 1704110 1707103 1806195 1723443 1683672 1800614 1784937 1703409 1625436 1720472 1702611 2001834
6516 2001834 1861202 1794083 1702460 1734839 1756756 1672250 1795271 1851294 1888922 1842093 1916865
6505 1916865 1772932 1816618 1779533 1760018 1685717 1801567 1870110 1822580 1791207 1717696 1694992
6494 1694992 1760835 1688959 1638805 1722680 1613381 1523719 1778945 1681000 1739368 1807212 1785545
6483 1785545 1749253 1683616 1784645 1837047 1959274 1845927 1724778 1685231 1711273 1696874 1763350
6472 1763350 1920844 1783010 1937284 1902155 1801299 1777093 1802643 1933806 1870033 1854027
6462 1854027 1890140 1916951 1990843 2019323 1834029 1909256 2034237 1955158 1814334 1912248 2026807
6451 2026807 1990402 1860587 1844897 1969916 1983696 2073157 2091640 2049654 2177084 2199577 2103735
6440B103735P0870l8020J11123J5846m547j59347J9386J19276m2782P6185p2361
6429B199364j12956N9307J13902P9239m5183J6272K4152k9732J64505j85580k93143
6418A990147J08327P5975r1817n82N9965M4390O5594Q7239j2702k0262k2105j45313
6406B138856Q7372J01779l7695L6182o9160Q6312O4361n6468J1897o5439j16229
6395B181768M6632r1164J47658J81790k7036n9723p5621J05238K42813j60083
6385B492272k40889M3442L3353j04376L8293J8635j5072J55258n6282K2045L1504
6374B418183j93401N5200J26572L915J37263m2418j69738J30006j9720m8194R6015
6363B493683J4927J06224K1816q6433q2029j02237M7386j8320R9954k4186L644
$$ plain form
6440 2103735 2174605 2136585 2247708 2263554 2259007 2099660 2119046 2238322 2195540 2271725 2199364
6429 2199364 2086408 2145715 2259617 2338856 2293673 2309945 2334097 2304365 2468870 2283290 1990147
6418 1990147 2098474 2174449 2082632 2082050 2142015 2186405 2251999 2339238 2326536 2306274 2284169 2138856
6406 2138856 2226228 2328007 2290312 2326494 2257334 2343646 2408007 2351539 2363436 2297997 2181768
6395 2181768 2228400 2137236 2284894 2466684 2439648 2379925 2304304 2409542 2652355 2492272
6385 2492272 2251383 2294825 2328178 2223802 2262095 2280730 2265658 2420916 2364634 2386679 2418183
6374 2418183 2224782 2279982 2406554 2410469 2547732 2505314 2335576 2465582 2445862 2397668 2493683
6363 2493683 2508610 2614834 2636650 2550217 2468188 2365951 2413337 2395017 2494971 2470785 2474429
6352B474429J44388J6165K5725o1692K2208o1463J21334l821J55520P1492k5297
6341B878988o2861P2532j85119j00466O8539J0018L01362J0636j13716q0399J00278
6330B899792J39213J17773L815o5504k6889q348J66966l8730J4029j7199j03343
6319C081575n953l8609n7659J22803j7157P3994K88522N7054N0758j83065M8687
6308C420950L7961J52719n7934L4012J11972p4987N1447q1030J8838N1157L3747
6297C698852J36523J48344K3147p0358m6966L8776P6105O6493O1968K55584L6593
6286D425061j1711M4816O6911J58441K302J06294J71516K54217K19792o1541K1038
6275E397136J15932K27704K04111l2948J43426L31650J82398J06333k4599R4831
$$ plain form
6352 2474429 2618817 2634982 2660707 2599015 2621223 2559760 2681094 2677273 2832793 2904285 2878988
6341 2878988 2816127 2888659 2703540 2603074 2671613 2681631 2982993 2993629 2879913 2799514 2899792
6330 2899792 3039005 3156778 3160593 3095089 3068200 3059852 3226818 3188088 3202117 3184918 3081575
6319 3081575 3075622 3037013 2979354 3102157 3085000 3158994 3447516 3504570 3555328 3372263 3420950
6308 3420950 3458911 3611630 3553696 3587708 3699680 3624693 3676140 3595110 3613948 3665105 3698852
6297 3698852 3835375 3983719 4006866 3936508 3889542 3928318 4004423 4070916 4132884 4388468 4425061
6286 4425061 4413350 4458166 4525077 4683518 4685820 4792114 4963630 5217847 5437639 5376098 5397136
6275 5397136 5513068 5740772 5944883 5911935 6055361 6387011 6569409 6675742 6651143 6745974
6265F745974J70186J09573J7491J09960K3926j41853J07619m3363J97895P2656
6255G370064L7987J436J41853L2421K56151K14180K50278L56143l0017K2417J83631
6244H836544K02247Q6780O5157R7822k9408j44751p4062o7031j32985j20462J56226
6233H876077m54K9199j93j14647o5098O6005R1998J50555P1876p8820l1499J03804
6221I098803P6188J45406K9461k8496l0728j30325O4897m1327J3805J93589k1665
6210I369608j99071N6062q811k790l0458L0783Q6493j70582Q3062K23522J66334
6199I604152O6472N8425J0107J83915K00105J92854j00538N8412K25678J69366
6189A0668948J10278J88395J16963Q0935J57392J87211K14250J61278J82754K67682
$$ plain form
6265 6745974 6916160 7025733 7043224 7153184 7177110 7035257 7142876 7099513 7297408 7370064
6255 7370064 7408051 7409487 7551340 7583761 7839912 8054092 8304370 8660513 8630496 8652913 8836544
6244 8836544 9038791 9125571 9190728 9288550 9259142 9114391 9040329 8973298 8840313 8719851 8876077
6233 8876077 8875623 8904822 8904629 8789982 8724884 8790889 8882887 9033442 9105318 9026498 8994999 9098803
6221 9098803 9174991 9320397 9349858 9321362 9290634 9160309 9225206 9183879 9197684 9391273 9369608
6210 9369608 9170537 9226599 9217788 9214998 9184540 9215323 9301816 9131234 9214296 9437818 9604152
6199 9604152 9670624 9729049 9739156 9923071 10123176 10316030 10215492 10273904 10499582 10668948
6189 10668948 10779226 10967621 11084584 11165519 11322911 11510122 11724372 11885650 12068404 12336086
6179A2336086K05099K8731L80675K71036L14284R2019K40275L38090L06971M07039
6169A4920305N76696M77572L63439L75121L52362O49301N32389O85279O76146
6160A9608610O22956O13440Q00851P86656R00023R05020Q64698Q48942J207263
6151B7158459J232816J155160J207315J241052J416792J380317J210980R05489
6143C6908380R22633Q01643N58115N92402M64744L80049M58907L73123L40094
6134D1800090L58579N40320O55626O48641P20340R48717R49500J144825J217343
6125D8983981J286594J297663J269940R64089Q69187N63673J74287k4709k56297
6116E5128408l64583n48936p99030r64541r17488q65901q98770o39244o99430
$$ plain form
6179 12336086 12541185 12569916 12950591 13221627 13535911 13627930 13868205 14206295 14513266 14920305
6169 14920305 15497001 15974573 16338012 16713133 17065495 17714796 18247185 18932464 19608610
6160 19608610 20231566 20845006 21645857 22432513 23332536 24237556 25102254 25951196 27158459
6151 27158459 28391275 29546435 30753750 31994802 33411594 34791911 36002891 36908380
6143 36908380 37831013 38632656 39190771 39783173 40247917 40627966 41086873 41459996 41800090
6134 41800090 42158669 42698989 43354615 44003256 44723596 45672313 46621813 47766638 48983981
6125 48983981 50270575 51568238 52838178 53802267 54671454 55235127 55409414 55384705 55128408
6116 55128408 54763825 54214889 53415859 52451318 51533830 50667929 49769159 49129915 48430485
6107D8430485q83052n06436l38817k34563k29840l86010j23948r3333j12686m12862
6097D5108938k32195l3823l93776m12199n44673n08611q27713p24219o77271p51008
6087D0003450p29278n90119o81816q37340n73646m81282m11064m32867k51084
6078C5014954l60938k44578j34485l90361m1233O3912o9262j86747N1509J40309
6068C3843080J65616J36174N2315K31235K40706J49320L95196K06726K13218L45808
6058C5979394K30444N15493K74026L98740N33393N48560N52523M38447M92826
6049C9963846O72200O18684O56906P29095P71765O72343P49782Q22394Q69960
6040D6526975R01519R53172R82190R62563J072317R50246J272231J423943J363210
$$ plain form
6107 48430485 47547433 47040997 46702180 46467617 46237777 45851767 45727819 45634486 45521800 45108938
6097 45108938 44876743 44842920 44449144 44036945 43492272 42983661 42155948 41431729 40754458 40003450
6087 40003450 39274172 38684053 38002237 37164897 36591251 36109969 35698905 35266038 35014954
6078 35014954 34654016 34409438 34274953 33884592 33843359 33907271 33838009 33651262 33702771 33843080
6068 33843080 34008696 34144870 34197185 34428420 34669126 34818446 35213642 35420368 35633586 35979394
6058 35979394 36209838 36725331 36999357 37398097 37931490 38480050 39032573 39471020 39963846
6049 39963846 40636046 41254730 41911636 42640731 43412496 44084839 44834621 45657015 46526975
6040 46526975 47428494 48381666 49363856 50326419 51398736 52348982 53621213 55045156 56408366
6031E6408366J325208J384410J493676J425353J492397J602994J638880J749404
6023F8520688J925133J833806J847406J983475K106112K167023K336626K382595
6015H5102864K348335K712439K809990K893476K947282L123854L353937L457058
6007A08749235L743187L900272L923736M015275M286030M168682M528108M758520
5999A42073045M825265N045919N308968N337448N453969N868242O227053O323797
5991A86463706O548360O753846O614156O973300O991792P151529P222071P400268
5983B42119028P153643O939093O758846O369433N877232N532157N166032M520939
5975B90436403L785360L173303K467979J490614P79675O985o05212j665692k378661
$$ plain form
6031 56408366 57733574 59117984 60611660 62037013 63529410 65132404 66771284 68520688
6023 68520688 70445821 72279627 74127033 76110508 78216620 80383643 82720269 85102864
6015 85102864 87451199 90163638 92973628 95867104 98814386 101938240 105292177 108749235
6007 108749235 112492422 116392694 120316430 124331705 128617735 132786417 137314525 142073045
5999 142073045 146898310 151944229 157253197 162590645 168044614 173912856 180139909 186463706
5991 186463706 193012066 199765912 206380068 213353368 220345160 227496689 234718760 242119028
5983 242119028 249272671 256211764 262970610 269340043 275217275 280749432 285915464 290436403
5975 290436403 294221763 297395066 299863045 301353659 302133334 302140319 301535107 299869415 297490754
5966B97490754k924270l823656m387484m818835n041813n803317o122017o201075
5958B58368287o454167o492655o507320o662701o632223o571667o762182o481845
5950B05803527o104198o020757o060524n796092n544608n368385n390327n190219
5942A60328417m893701m749467m528044m316953m185496m141981l935201l845561
5934A25732013l701225l561617l224044l224282l331713l040229k878502k819305
5926I9951096k680102k586258k583812k364539k377026k109327k099320k195383
5918H0955329k157634k153831k120527j846704j793440j714905j632144j741393
5910F5794751j482009j554077j548978j509260j392266j224597j319718j317656
$$ plain form
5966 297490754 294566484 290742828 286355344 281536509 276494696 270691379 264569362 258368287
5958 258368287 251914120 245421465 238914145 232251444 225619221 219047554 212285372 205803527
5950 205803527 199699329 193678572 187618048 181821956 176277348 170908963 165518636 160328417
5942 160328417 155434716 150685249 146157205 141840252 137654756 133512775 129577574 125732013
5934 125732013 122030788 118469171 115245127 112020845 108689132 105648903 102770401 99951096
5926 99951096 97270994 94684736 92100924 89736385 87359359 85250032 83150712 80955329
5918 80955329 78797695 76643864 74523337 72676633 70883193 69168288 67536144 65794751
5910 65794751 64312742 62758665 61209687 59700427 58308161 57083564 55763846 54446190
5902E4446190j290297j204023j225311r86516j087340j201606j081575r83677
5894D5385845j033433j074142q63270q24475p86897q62853q67641o78303o62617
5885C7732214q22483o88498p13091o64701n76469p04000o71915n67338n45524
5876C1778195n35347o30412n65658m68449m98704o53729m36692l65962l51381
5867B7271861n56547n10535n94373n48714m63956k15861k25363k93834m85878
5858B3376800l14978j60880m65937k76040m44600l85655l28471k79259l37947
5849B0383033j57816j75349l24671l26105l03315k31807j77440m7193j74036k86670
5839A8178631k95647j94734L7058k50829j12435k8876K1561k75731j04782Q6772
$$ plain form
5902 54446190 53155893 51951870 50726559 49740043 48652703 47451097 46369522 45385845
5894 45385845 44352412 43278270 42415000 41590525 40803628 39940775 39073134 38394831 37732214
5885 37732214 36909731 36221233 35508142 34843441 34266972 33562972 32891057 32323719 31778195
5876 31778195 31242848 30612436 30046778 29578329 29079625 28425896 27989204 27623242 27271861
5867 27271861 26715314 26204779 25610406 25061692 24597736 24381875 24156512 23862678 23376800
5858 23376800 23061822 22900942 22435005 22158965 21714365 21328710 21000239 20720980 20383033
5849 20383033 20225217 20049868 19725197 19399092 19095777 18863970 18686530 18639337 18465301 18178631
5839 18178631 17882984 17688250 17725308 17474479 17362044 17333168 17354729 17078998 16974216 17060988
5829A7060988q1453o6906j84940M3931O9933j10810j47025k43691j27570j84939
5819A6027518k7710j98505k65362j77636j88296j61066r1718n1342q8029p1483
5809A4706371j47571m5509k66972r1185J10284j9381J4357k9239j6983j24872
5799A4089300k95252k18811j14233j70819r1947k05138m02398j11852k76886k28586
5789A1973378j95639j05104j38241k85317q1233j25647j33130k1136j36189j02129
5779A0649613p6166j09471k20542k31477j42125j60135k63618k83826k58584j82257
5769H721412j04898l71476j22061Q7639j57599n4353j67583l48680o7613j48127
5759G266661j77882J0435L9773j40471k65204k4109j19674O3472k04418j79658
$$ plain form
5829 17060988 16979535 16912629 16727689 16771620 16841553 16730743 16583718 16340027 16212457 16027518
5819 16027518 15999808 15801303 15535941 15358305 15170009 15008943 14917225 14865883 14777854 14706371
5809 14706371 14558800 14513291 14246319 14155134 14265418 14246037 14260394 14231155 14214172 14089300
5799 14089300 13794048 13575237 13461004 13290185 13198238 12993100 12590702 12478850 12201964 11973378
5789 11973378 11777739 11672635 11534394 11249077 11167844 11042197 10909067 10887931 10751742 10649613
5779 10649613 10573447 10463976 10243434 10011957 9869832 9709697 9446079 9162253 8903669 8721412
5769 8721412 8616514 8245038 8122977 8210616 8053017 7998664 7831081 7482401 7414788 7266661
5759 7266661 7088779 7099214 7138987 6998516 6733312 6709203 6589529 6653001 6448583 6268925
5749F268925o6223j03173J6657j62546q9775M74q1066j8855j14319q4297j53128
5738E412674j39983m4883N9132P1459k9640K8774j05024j98580l3201M7523j93624
5727D874627p4243L8496j55796j61185K28297l5060j24020r6592l318K1j96628
5716D294599j69770q833j7064M8567j56604l3079m2051j9010J4595j05399j02197
5705C703754l5554o64J3182l5737m7379n4154n9073l6906K0325P0305o5090N1345
5693C524354Q5708p826k80692m4364O3619R997Q045j65117q9683m4583J01496
5682C160954p424M651j35257o223K0358j48688M3267n6362j2063j03408k8578
5671B731227p7024N991r222j19523R2272J66729l3844j33062M6932j122j93079
$$ plain form
5749 6268925 6202702 6099529 6116186 5953640 5863865 5864339 5783273 5764418 5650099 5565802 5412674
5738 5412674 5272691 5227808 5286940 5358399 5328759 5357533 5252509 5053929 5020728 5068251 4874627
5727 4874627 4800384 4838880 4683084 4521899 4750196 4715136 4591116 4494524 4491206 4491227 4294599
5716 4294599 4124829 4115996 4098932 4147499 3990895 3957816 3915765 3896755 3911350 3805951 3703754
5705 3703754 3668200 3667536 3680718 3644981 3597602 3543448 3484375 3447469 3467794 3538099 3473009 3524354
5693 3524354 3610062 3602236 3321544 3277180 3340799 3350796 3358841 3193724 3104041 3059458 3160954
5682 3160954 3153530 3158181 3022924 3016701 3037059 2888371 2931638 2875276 2863213 2759805 2731227
5671 2731227 2654203 2660194 2650972 2531449 2623721 2790450 2756606 2623544 2670476 2669354 2476275
5660B476275r2793P8162K14767j71122o5662p6347l8551o6955j55820J01248J15471
5649B318673l7796Q4445l4091q0910r9244M7994J6990p7382l1543n6783m9047
5638B001306L2708P394j46285J10082J32288j23277J31144m1821j65018j8239
5628A920282Q6643o54j11290j14805j5428J0196J25825Q6593j53450N2601l0046
5617A856467q752r6940m8386l1730J58186L2567j60973Q8586J5757O8465j17166
5606A756081m0597J39939j88732q0845j24866j0449N8486J58534m3458m5320n3397
5595A525376n1141l5051j31396l1675O4569J11307n7788p7112M4366j46596j0149
5584A204710J49733J35115p0902j07087l0708K8772M5538J3606n8388N9984m0638
$$ plain form
5660 2476275 2383482 2461644 2676411 2505289 2439627 2363280 2324729 2257774 2101954 2203202 2318673
5649 2318673 2280877 2365322 2331231 2250321 2151077 2199071 2216061 2138679 2107136 2050353 2001306
5638 2001306 2034014 2041408 1895123 2005205 2137493 2014216 2145360 2103539 1938521 1920282
5628 1920282 2006925 2006271 1894981 1780176 1764748 1774944 1900769 1987362 1833912 1886513 1856467
5617 1856467 1847715 1750775 1702389 1670659 1828845 1861412 1700439 1789025 1804782 1873247 1756081
5606 1756081 1715484 1855423 1666691 1585846 1460980 1450531 1509017 1667551 1624093 1578773 1525376
5595 1525376 1474235 1439184 1307788 1276113 1340682 1451989 1394201 1317089 1361455 1214859 1204710
5584 1204710 1354443 1489558 1418656 1311569 1280861 1309633 1355171 1368777 1310389 1370373 1329735
5573A329735J91008J157j23026q3358M4846N6364J5157j35239k6064N695j9842
5562A256433J0823l9934o5122j2330K35949l0722j11461L6711J4973k11015n5151
5551A029154M1391J39222J193O3282R987J2105m5509K244l8288Q794j16624j2330
5539A094621j280j13360j13080j1978J03001j919P7626Q8392J06087J54569j45245
5528A237434j46908n711M0684J1522L0725q8520j65179P7992J32955M7384n7103
5517A115275m4658n5177R434n0975l7418N1674m3914J5529J459m4344L6264o4397
5505H88752Q4878j9816J00603R4353l2473j43322L4754N625m6923j68383J08627
5494I06675n504O7410J05696j51521J65630P5710J3345p9452R3704k54570l0396
$$ plain form
5573 1329735 1520743 1521900 1398874 1315516 1360362 1416726 1431883 1296644 1270580 1276275 1256433
5562 1256433 1267256 1227322 1162200 1149870 1385819 1355097 1243636 1280347 1295320 1084305 1029154
5551 1029154 1070545 1209767 1210960 1274242 1284229 1296334 1250825 1253069 1214781 1223575 1106951 1094621
5539 1094621 1093341 979981 866901 854923 957924 956005 1033631 1122023 1228110 1382679 1237434
5528 1237434 1090526 1084815 1125499 1137021 1167746 1079226 914047 992039 1124994 1172378 1115275
5517 1115275 1070617 1015440 1024874 973899 936481 988155 944241 959770 961229 916885 953149 888752
5505 888752 973630 953814 1054417 1148770 1116297 972975 1007729 1013354 966431 798048 906675
5494 906675 901171 968581 1074277 922756 1088386 1164096 1177441 1097989 1191693 937123 906727
5483I06727J66837m476R7608j9294l377J81952J08837J18144K6301J4237K25113
5472A818609K30963J09851J82729M9989K50588J79760L19648J63296K2272J03446
5462C431151l1497j63797n0100K4308M560j78774l14296j74337j65691m52286
5452A929241j31085j8826l0160m9171M0289N9129j08319l7667K5920j11024r4586
5441A473741K3083k2091k76649o6431R1698K701J10121N4659Q1509k19729r7108
5430A155504J02002j47543J029J71431j39720P2045O9444k1537r1236P1447q496
5419A234370m9446N597j3338m5169o9330Q192M4637j27809j15064r0965J75817
5408I57492N6355R606q1216q4783L9701R3468r8274j33768p0393j606j48390J05817
$$ plain form
5483 906727 1073564 1069088 1166696 1147402 1144025 1325977 1434814 1552958 1579259 1593496 1818609
5472 1818609 2049572 2159423 2342152 2392141 2642729 2822489 3142137 3305433 3327705 3431151
5462 3431151 3399654 3235857 3185757 3210065 3214625 3035851 2721555 2547218 2381527 1929241
5452 1929241 1798156 1779330 1749170 1699999 1740288 1799417 1691098 1653431 1679351 1568327 1473741
5441 1473741 1496824 1474733 1198084 1131653 1223351 1226052 1336173 1390832 1472341 1252612 1155504
5430 1155504 1257506 1109963 1110992 1282423 1142703 1214748 1284192 1262655 1171419 1242866 1234370
5419 1234370 1184924 1190521 1177183 1132014 1062684 1070876 1115513 987704 872640 781675 957492
5408 957492 1013847 1023453 942237 857454 897155 990623 892349 758581 688188 686582 538192 644009
5396F44009J58574k00317P8130Q3200K5102Q0010l7115o1722n2596m7558m7213
5385F22504L7493J07040m9831k8030j492l9104k4197o5491P4296n0436Q6662j7029
5373F52385M2150p1662j9678O52M26N9235n406J73573J0085J0400q6165o7682
5361F98313r97Q5178J41344j3952q0045M4625m5126n9817o2554j04986K9966J74312
5349H06261o4329N1083P7664R9341n161j18686J78106M6380q9797Q3929j5119
5338A049672n185K5755R5862K49660J31299k154J73935K8729J63235J85617M0741
5327B137166K11585K94963K01082R8158k4931K56653O4372p2480j32724k94382
5317B739462j11922l4326o5995k14808k19490j92699J38647j01533j43802j30344
$$ plain form
5396 644009 802583 602266 680396 763596 788698 868708 831593 769871 717275 669717 622504
5385 622504 659997 767037 717206 689176 687684 648580 624383 558892 633188 582752 669414 652385
5373 652385 694535 622873 603195 603847 604273 663508 658102 831675 841760 852160 765995 698313
5361 698313 697316 782494 923838 909886 829841 874466 829340 769523 706969 601983 631949 806261
5349 806261 741932 793015 870679 970020 964859 846173 1024279 1070659 980862 1064791 1049672
5338 1049672 1044487 1070242 1166104 1415764 1547063 1544909 1718844 1747573 1910808 2096425 2137166
5327 2137166 2348751 2643714 2844796 2942954 2918023 3174676 3239048 3166568 3033844 2739462
5317 2739462 2627540 2593214 2527219 2312411 2092921 1900222 2038869 1937336 1793534 1663190
5307A663190O621n4756j963j61883j04569J50675j55206J6996q110J9529k4756
5296A345768L8090k477j21790J33093J41323j60575p185J00111n2206j22594k0640
5285A270918K79827p0560j4854J30365M862k46551J29739N3070r0462j4439j52932
5274A278983O2780O1739J01925p1049j08374p7202K12308o1977l0948M2321O9471
5263A479977p1050l4348M5600n6073Q0200o5812j12390J26937j02481J43477R1530
5252A525567j45392R3412J07902M9889j25459k2235P5042l304l7210r069N6103
5241A565246q1656J03676R2607L8251n0523Q5732j18039m5676Q3639J34348l4013
5230A773592j81527P1047K12589J1885k0237j2364j59429K98137l2062j47008
$$ plain form
5307 1663190 1669811 1615055 1613092 1451209 1346640 1497315 1342109 1359105 1350995 1370524 1345768
5296 1345768 1383858 1381381 1259591 1392684 1534007 1373432 1366247 1466358 1414152 1291558 1270918
5285 1270918 1550745 1480185 1465331 1595696 1600558 1354007 1483746 1536816 1446354 1431915 1278983
5274 1278983 1341763 1403502 1505427 1434378 1326004 1248802 1461110 1399133 1368185 1410506 1479977
5263 1479977 1408927 1374579 1420179 1364106 1444306 1378494 1266104 1393041 1290560 1434037 1525567
5252 1525567 1380175 1473587 1581489 1631378 1505919 1483684 1558726 1555422 1518212 1509143 1565246
5241 1565246 1483590 1587266 1679873 1718124 1667601 1753333 1635294 1589618 1673257 1807605 1773592
5230 1773592 1592065 1663112 1875701 1887586 1867349 1854985 1695556 1993693 1961631 1814623
5220A814623l5754K02801K8002l8670K45959J59743o1990O2328N7471J50025Q2144
5209B666682N3553j14617L3257P2754r320J39756r4535N8485K15943J89002l740
5198C207220R524K57938Q7488q4491J039J7839J02464J66862J33141K20292J6442
5187D135758J39406K15316J20954K05437Q8833J74649J04679K55945L97047J66894
5177F004918L10569J62306K46084L24192K85590M12601M64225O51083P52820L64472
5167I978860N18476P22924Q24864P04958J090058J215367J460628J407613J729966
5158A9653714K083186K074313J744293Q27062J18049j40674K9731M44267K40208
5149B7074149m31299k26214l45681K3547J96135M42719P25271J017254J292260
$$ plain form
5220 1814623 1778869 1981670 2009672 1971002 2216961 2376704 2314714 2377042 2434513 2584538 2666682
5209 2666682 2720235 2605618 2638875 2711629 2702309 2842065 2747530 2806015 3021958 3210960 3207220
5198 3207220 3216744 3474682 3562170 3477679 3478718 3496557 3599021 3765883 3899024 4119316 4135758
5187 4135758 4275164 4490480 4611434 4816871 4905704 5080353 5185032 5440977 5838024 6004918
5177 6004918 6315487 6477793 6723877 7048069 7333659 7746260 8210485 8861568 9614388 9978860
5167 9978860 10497336 11220260 12045124 12750082 13840140 15055507 16516135 17923748 19653714
5158 19653714 21736900 23811213 25555506 26382568 26500617 26359943 26389674 26833941 27074149
5149 27074149 26642850 26416636 26070955 26094502 26290637 26733356 27458627 28475881 29768141
5140B9768141J598025J756180J848666J977624J969016J795721J975262K331399
5132D5020034K565063K440816K680926K251986J946125J744958J610073J816046
5124F2076027J887225J848665J679437J369222N59015r3655m30038m41768n03167
5115F7950963m79836r44858j168726j464378j919600k180021k340705k195897
5107E5256942k136441k317959k347422k111583k538884k572448k570895k359391
5099C6301919k356661k101983j847854k038625j838423j723500j451212j472136
5091B1471525j206091j050606j163980j016629o82047q22810o66075p25705n89928
5082A3547654n60846o18572m32468n47211m11641l44777k03559l99804k73644
$$ plain form
5140 29768141 31366166 33122346 34971012 36948636 38917652 40713373 42688635 45020034
5132 45020034 47585097 50025913 52706839 54958825 56904950 58649908 60259981 62076027
5124 62076027 63963252 65811917 67491354 68860576 69419591 69325936 68895898 68454130 67950963
5115 67950963 67471127 66526269 65357543 63893165 61973565 59793544 57452839 55256942
5107 55256942 53120501 50802542 48455120 46343537 43804653 41232205 38661310 36301919
5099 36301919 33945258 31843275 29995421 27956796 26118373 24394873 22943661 21471525
5091 21471525 20265434 19214828 18050848 17034219 16352172 15529362 14863287 14137582 13547654
5082 13547654 12986808 12368236 11935768 11388557 10976916 10632139 10428580 10028776 9755132
5073I755132l13923m96842k50064k40128k24060l10072k41761k33753j36993k30448
5063G077088j48023l30744k15507k62281l49446r1389j07123j59071j30560P9768
5053E362712r6677k16950l10471m2436j29751j27673j44972m2375j60029j78313
5043C913065j12547n1675k40461l6159P1855m6136j29793j83323j31579p0658
5033B982589N0967o2607j31046j59649J8372j0585l4324J7166j12933j38818O5001
5022B484133j93037L367k6428l8231o8208j52943J12995Q7517o3001l856K5910
5011B168218n2649O6083m9992J20257k08127j85448O96j13218j15869L8578J6398
5000A684927r2585j4211o451j43708j256Q7581N0698r0885N575J87216q470k546
$$ plain form
5073 9755132 9441209 8944367 8694303 8454175 8230115 7920043 7678282 7444529 7307536 7077088
5063 7077088 6929065 6598321 6382814 6120533 5771087 5679698 5572575 5413504 5282944 5362712
5053 5362712 5266035 5049085 4738614 4696178 4566427 4438754 4293782 4251407 4091378 3913065
5043 3913065 3800518 3748843 3508382 3472223 3544078 3497942 3368149 3184826 3053247 2982589
5033 2982589 3033556 2970949 2839903 2680254 2698626 2688041 2653717 2670883 2557950 2419132 2484133
5022 2484133 2291096 2294463 2268035 2229804 2161596 2008653 2121648 2209165 2146164 2142308 2168218
5011 2168218 2115569 2181652 2131660 2251917 2043790 1858342 1859038 1745820 1629951 1668529 1684927
5000 1684927 1592342 1578131 1571680 1427972 1426716 1514297 1564995 1474110 1479685 1666901 1658431 1655885
4988A655885j75358q6181P6068N5035p5696m7640k8524j28545M5686j47117R0160
4977A233773k0251j25276q7342N071J41130r1778M6329M934m6566Q022m2676j16288
4965I09082q7479j43604N0293J30519N7673k4239o0128j01787P0118p7295J07596
4954H30749J1900l8336j09745M3908K4240q1636K7242J06405r1492N9210L7214
4943H19659o8566j57830o8040o9467J37603J5389n1627O2293R9968K9593k1478
4932G27497l0615j39966J22696P4400o3949N2069O2641j46192n6217L158j25151
4921D80371O8273j16153K4787O8535j93162P2172O8428M0331k6310O4513j56341
4910C95444p506L2024k9357J4594N5471M0258K1602l0377R7786K4464m0153j20168
$$ plain form
4988 1655885 1480527 1394346 1470414 1525449 1449753 1402113 1373589 1245044 1290730 1143613 1233773
4977 1233773 1213522 1088246 1000904 1005975 1147105 1055327 1101656 1106590 1060024 1068046 1025370 909082
4965 909082 821603 677999 728292 858811 916484 892245 832117 730330 800448 723153 830749
4954 830749 842649 804313 694568 738476 762716 681080 708322 814727 723235 782445 819659
4943 819659 751093 593263 525223 455756 593359 608748 557121 619414 719382 748975 727497
4932 727497 696882 556916 679612 754012 690063 742132 804773 658581 602364 605522 480371
4921 480371 548644 432491 457278 525813 332651 404823 473251 513582 487272 551785 395444
4910 395444 387938 419962 390605 405199 460670 500928 522530 492153 589939 614403 574250 454082
4898D54082J42981j4728Q0090k4319J604J7616k39052j95139k01574n510K46145
4887B62196J84580K2817r2540j3609J75301J50739N3623o6906j1637k9812P3097
4876G07849j31441l2065J66297j89146j74276J48047O8125o3008j24159L1693
4866D07916R0682j41246J38042P687R361J61090R0720j09619J2031p1232L7658
4855F33090r705K0383K6038m4236J01185j35315Q3979J83201j11009N5974q0181
4844G23404k7623Q6961K9645r7773j30108J20266n8732J33546M215m188m7582
4833G32031n8551j15099J40272J59805O2630m891o744P8039j3046r2585K3430
4822I05291P52J23088K50p4264k7171K9236J04154N5203J9586q0004k9340n036
$$ plain form
4898 454082 597063 582335 662425 638106 639710 657326 418274 223135 21561 16051 262196
4887 262196 446776 469593 377053 363444 538745 689484 743107 676201 664564 634752 707849
4876 707849 576408 544343 710640 521494 347218 495265 563390 500382 376223 407916
4866 407916 498598 357352 495394 503081 512442 673532 764252 654633 666664 595432 633090
4855 633090 623385 643768 669806 625570 726755 591440 675419 858620 747611 803585 723404
4844 723404 695781 782742 812387 714614 584506 704772 646040 779586 783801 779613 732031
4833 732031 673480 558381 698653 858458 921088 916197 909453 987492 974446 881861 905291
4822 905291 906043 1029131 1029381 955117 927946 957182 1061336 1116539 1136125 1056121 1026781 1021745
4810A021745p6435o2197J25583J29190j08144j36954M9141J01083k7564o0915
4800I54533N2027o2035l7021q6530l9569m6243j28269O486J00858P0555j11214
4789F73578k5160Q6914p8401j01573N3978p890O9928m9164j75827J0739j47278
4778C09844R3101n4260j17085R7632O6256o1411J91077P3336q4736k48052q7029
4767A78673J19705J12851l7380J00585o0221N8077n5533O4931K08254j72247l4088
4756D83607j28727J10260J48092j41158q0122J27197m3436m6483n9142K4552L9478
4745D34118J37102O9871n927j22183q577j01185k0888L6349R5333J00631O9394
4734F84038o3503p4359k8913L1480j06858j24640J5872j0068j23738J05713L9629
$$ plain form
4810 1021745 945310 883113 1008696 1137886 1029742 892788 941929 1043012 1015448 954533
4800 954533 1006560 944525 907504 820974 781405 735162 606893 613379 714237 784792 673578
4789 673578 648418 735332 656931 555358 609336 601446 671374 622210 446383 457122 309844
4778 309844 402945 348685 231600 329232 395488 334077 525154 598490 513754 265702 178673
4767 178673 298378 411229 373849 474434 414213 472290 416757 481688 689942 517695 483607
4756 483607 354880 465140 613232 472074 391952 519149 475713 429230 370088 394640 434118
4745 434118 571220 641091 635164 512981 504404 403219 382331 418680 514013 614644 684038
4734 684038 620535 546176 517263 548743 441885 317245 333117 323049 199311 305024 344653
4723C44653m8965R0581j05388q9390J04253j00561J49581Q6854L6393J06581p553
4712E67039j03302k3600j28089k3901J51894r6401o657k6587k8716J46470o3619
4701C64531k5503J36830K35059Q129j70245l7711m8300q138M3557M7105J20866
4690F66180J53571k83563P2722M6063j36334l2970r810P6102j24304j14734K07755
4679E20678j3488J29651l8080j84816m0073J27317j46808j8217L6457R9056M6163
4668E17840Q1897l5050M3101R2545q462o6088K9815j03947j14099m1957m4577
4657C51018J62055m6165J15764J30421P6164j37360m7959Q3577L9220Q762J1096
4646G46593m9204N7131J29052M5439p021J76366o29K3810m5370M6148Q4308J5942
$$ plain form
4723 344653 295688 386269 280881 191491 295744 195183 344764 431618 468011 574592 567039
4712 567039 463737 440137 312048 288147 440041 343640 336983 310396 281680 428150 364531
4701 364531 339028 475858 710917 719046 548801 511090 462790 454652 498209 545314 666180
4690 666180 819751 536188 608910 654973 518639 485669 475859 551961 427657 312923 520678
4679 520678 507190 636841 598761 413945 373872 501189 354381 336164 372621 471677 517840
4668 517840 599737 564687 607788 700333 691871 625783 655598 551651 437552 395595 351018
4657 351018 513073 466908 582672 713093 789257 651897 603938 687515 726735 735497 746593
4646 746593 697389 754520 883572 929011 921990 1098356 1097727 1121537 1076167 1122315 1206623 1222565
4634A222565M5338p0040J9437N6546K02218P814L1698L7573n0875M2798K67112
4623A812184M1193O5934K9638J01844K34569J22700O0372O1317J84454l3104J23155
4612B804256O771R2027K50677J48632K6414L8477J54018Q8953M0825J47896K45578
4601D044524M17600J78849p6552K51638P1639O6869K7610J33857L3877j4831k2232
4590E112848O2626Q1476r7401N3206j64016j31416k8454l8553j23145j79459k7370
4579D520342k347l19655j31766K6552j27816k5784k86887j35094o4076k63560
4569C189909M8010N6090l0562j85929M9570N6333j27327k96564j03428o9074j94716
4558B392312p8109j05650k1731J7642j38001j9899k3536j39017r226N1640k33702
$$ plain form
4634 1222565 1267903 1197863 1217300 1273846 1476064 1483878 1515576 1553149 1502274 1545072 1812184
4623 1812184 1853377 1919311 1948949 2050793 2285362 2408062 2468434 2529751 2714205 2681101 2804256
4612 2804256 2811027 2903054 3153731 3302363 3328777 3367254 3521272 3610225 3651050 3798946 4044524
4601 4044524 4462124 4640973 4564421 4816059 4887698 4954567 4982177 5116034 5149911 5135080 5112848
4590 5112848 5175474 5256950 5159549 5212755 5048739 4917323 4888869 4850316 4727171 4547712 4520342
4579 4520342 4517995 4198340 4066574 4093126 3965310 3939526 3652639 3517545 3453469 3189909
4569 3189909 3237919 3294009 3263447 3077518 3127088 3183421 3056094 2759530 2656102 2587028 2392312
4558 2392312 2314203 2208553 2186822 2204464 2066463 2046564 2023028 1884011 1874785 1926425 1692723
4547A692723k7905L9790j7814l4884p1561p9979j01471k09666j7485R5668q5272
4536A182144J17817r2864N272J73789j08346k64149m0167R1007n7228Q170j03395
4525I12050k95748j3614J50205N3002Q9995R3024q3025p7358N2033r901L7956
4514I08619m3120j46659P949j79805J39103Q0391K4646j06155j47135m466p1044
4503D62324o5961R3955p6018Q2386q822N8522J1103r2689N5130o0035j11244Q7013
4491D35664P2198j40362P6453o9354k1066o2278M5433k8660k7925l5230K2625
4480B67498q5051q6775J11649j21862J38744J36277j03001K9263q3912K530J24393
4469C29753m4734L1286j25242J0327L2814j23726j7473J25321J04680j67703J955
$$ plain form
4547 1692723 1664818 1704608 1686794 1651910 1580349 1500370 1398899 1189233 1171748 1267416 1182144
4536 1182144 1299961 1207097 1212369 1386158 1277812 1013663 973496 1064503 1007275 1015445 912050
4525 912050 616302 602688 752893 805895 895890 988914 905889 828531 880564 870663 908619
4514 908619 865499 718840 726789 546984 686087 766478 791124 684969 537834 533368 462324
4503 462324 396363 490318 414300 496686 487864 546386 557489 464800 519930 459895 348651 435664
4491 435664 507862 367500 443953 374599 353533 291255 336688 308028 280103 244873 267498
4480 267498 182447 95672 207321 85459 224203 360480 257479 286742 202830 205360 329753
4469 329753 285019 316305 191063 201390 234204 110478 93005 218326 323006 155303 157258
4458A57258J25880j06952j78473Q0282R4986O0805J515M1305j15617M9361j3644
4447A96706R557K28091j94164j7837J3311p0732P9221K6210j4048j42322J7477
4436A31470J4460P5822j35597k6331Q7468m4507j2564L0610k8373o5912J67824
4425A94370j2354k25895p7910R1514O7057q51J12989j75257j8358j6243Q543R2805
4413D0410j70723M7164j0295J42434j22351K7068J01658l9276j3649o7725n3081
4402a18366J3641N3467N3017Q7467j31742J67011J45035j51514p8846J05861q8800
4391E6231j6292O1616j16461p8750o42L8504R6686j069q3429M8859K3039J21073
4379A49365K0192j44997J4390o0572p7968j2l6291m4032J53544J83293j42635
$$ plain form
4458 157258 283138 176186 -2287 77995 172981 233786 235301 276606 160989 210350 196706
4447 196706 206263 434354 240190 222353 235664 164932 244153 270363 256315 113993 131470
4436 131470 145930 221752 86155 59824 147292 102785 90221 120831 92458 26546 194370
4425 194370 182016 -43879 -121789 -30275 36782 35931 148920 -26337 -44695 -60938 -52395 40410
4413 40410 -130313 -83149 -93444 48990 -73361 -46293 55365 16089 2440 -65285 -118366
4402 -118366 -104725 -51258 1759 89226 -42516 124495 269530 118016 39170 145031 56231
4391 56231 39939 101555 -14906 -93656 -94298 -55794 40892 39823 -43606 5253 28292 149365
4379 149365 169557 24560 38950 -21622 -99590 -99602 -135893 -179925 -26381 156912 14277
4368A4277J1431p7439o0497P1533J48595p0358j3162k28492j1655R9159K46943
4357A30335r4811r0583P567k3282j2883K5801r0503Q0138n784j26563J87072N5894
4345D2398K5215L9537J38518n1440q8734J1106k0802Q3165N1505L3777j03583
4334A60662j40031R5235J09851k9817j27196m56j449j7780l0424O3339M8175M3990
4322A74099q0309K23009l8527j66938J4073N8855Q4166j013j08002P5754J7413
4311B52580o5888M5124J62531j45938r092O1072R6923J4703p1673k3079n8873
4300B58390l65r2354j23808R4696l6856q5352k4531J11729m7887M8688Q7870l41
4288A89879K1020K8552j26388l6147o4245K05990K3249L9686P5862j89797M3127
$$ plain form
4368 14277 25708 -51731 -112228 -40695 107900 37542 24380 -204112 -215767 -116608 130335
4357 130335 35524 -55059 -47492 -70774 -83657 -57856 -148359 -68221 -74005 -200568 -13496 42398
4345 42398 67613 107150 245668 194228 105494 116600 95798 178963 230468 264245 160662
4334 160662 20631 115866 225717 195900 68704 68248 66799 49019 18595 81934 130109 174099
4322 174099 93790 316799 278272 111334 125407 184262 268428 267415 159413 235167 252580
4311 252580 186692 231816 394347 248409 239317 300389 397312 412015 340342 317263 258390
4300 258390 258025 165671 41863 136559 99703 14351 -10180 101549 53662 102350 190220 189879
4288 189879 210899 239451 113063 76916 12671 218661 241910 281596 357458 167661 210788
4277B10788p3204M3807J8022q1629p9484j1324l1075J0639J2114L2830J39293
4266A90777n7893O5644L6862j61728k3145P3057j7986J3647P7839j79731j20702
4255a03359J24816J45460q9476q2525K8348J41773K9503O2407o3706M1038L915
4244B38194J5479o5034R8056n859J38664N2807j37741n9102O2203j16840j8235
4233B02592J23674Q620m1668N8182O2347j38548p9890R3548K8270J01189j06977
4222C11339q0721N3146M7619o4988l008J48099R0652j00876L3247p3450m5308
4211C15751K5590j6432M5967k8664J0482N793N2885n5558k3667J1899J91934n6871
4199D79109j35297q6122J13868J63236n8825p8400m5716P8267j03044k05376Q4703
$$ plain form
4277 210788 137584 181391 199413 117784 38300 26976 -4099 6540 18654 51484 190777
4266 190777 132884 198528 235390 73662 50517 123574 105588 119235 197074 17343 -103359
4255 -103359 21457 166917 77441 -5084 23264 165037 194540 256947 193241 234279 238194
4244 238194 253673 188639 286695 280836 419500 472307 334566 275464 337667 220827 202592
4233 202592 326266 334886 293218 351400 413747 275199 195309 288857 317127 418316 311339
4222 311339 230618 283764 331383 266395 263387 411486 502138 401262 434509 361059 315751
4211 315751 341341 324909 370876 342212 352694 358487 411372 355814 332147 344046 535980 479109
4199 479109 343812 257690 371558 534794 475969 397569 351853 430120 327076 121700 206403
4188B06403Q3935J06490M6625j02513m4128J39448J1724O6274Q5376j8232q1114
4177E00288j52480M3618J99940R3753j00245j50843k0578J06857N0347m2851l4598
4166D93208j75026j48454Q5093N8574R1324J03035l2154K8016m1073K08381j05029
4155E65895k6888l014j15413j3027M6594J40439j8180j61004j9777J00850J39898
4144F36373J25080o2161k74446m4661O4266J31629o4723j7882J8510j18172k0976
4133C72837M1347j36533o4667J81900J57250q0073J45016J85939k0451q7855j98676
4122D96034K9537o0715J68326k27341q0557J68958N0690l6966J25652n6089K62
4111E77791j09340j13048K8436J59176j27209m004L3696j5913N4039n2688J4542
$$ plain form
4188 206403 290338 396828 443453 340940 296812 436260 447984 514258 599634 581402 500288
4177 500288 347808 391426 591366 685119 584874 434031 413453 520310 570657 527806 493208
4166 493208 318182 169728 254821 313395 404719 507754 475600 503616 462543 670924 565895
4155 565895 539007 535993 420580 407553 454147 594586 576406 415402 395625 496475 636373
4144 636373 761453 699292 424846 380185 444451 576080 511357 493475 511985 393813 372837
4133 372837 414184 277651 212984 394884 552134 472061 617077 803016 782565 694710 496034
4122 496034 525571 464856 633182 405841 325284 494242 544932 507966 633618 577529 577791
4111 577791 468451 355403 383839 543015 415806 411802 445498 429585 483624 430936 445478
4100D45478n0862N9405j60758n2889N6575J24919O7801o9289N3016j40702j13541
4089B19153N0263M5072J35006m3619m095N8159p7548j5216M4061o6488J77354
4078E22102m8298q0227R1384p3625K199J19576m005J4198Q273K0194N1495o440
4066F16826j08389J9004J13157R6417j36194n0297N5349J24297k4400n5419N150
4055F55501j58312j6642o8428q137J0893J34315J03729N639Q6111n1473p4067
4044F19129J46264m2657O7628J08510j20324K1265P8153j1161M2170K9173j9703
4033I18447j02897O5236J2225J19827M8141J18052P6471Q166J1251j965m6397
4022A226557N1568K30963j66521j52272J43288J98447L4565J03258j26111j56827
$$ plain form
4100 445478 394616 454021 293263 240374 296949 421868 489669 420380 473396 332694 219153
4089 219153 269416 314488 449494 405875 401780 459939 382391 367175 411236 344748 522102
4078 522102 473804 393577 484961 411336 413535 533111 529106 543304 551577 571771 623266 616826
4066 616826 508437 527441 640598 737015 600821 550524 605873 730170 705770 650351 655501
4055 655501 497189 480547 412119 403982 414875 549190 652919 658558 744669 693196 619129
4044 619129 765393 722736 790364 898874 778550 799815 877968 866807 908977 938150 918447
4033 918447 815550 880786 893011 1012838 1060979 1179031 1255502 1263668 1274919 1272954 1226557
4022 1226557 1278125 1509088 1342567 1190295 1333583 1532030 1566595 1669853 1543742 1386915
4012A386915m855K32341J44022J9188j34325o9078K31133J74008K6019J27908
4002B133276K21645m2813j27673P8012J82963N7426J35451N8607L7972q863r0985
3991B635018L51749J00594j17117N8043j07266K39348J66857J40387L32018J23775
3981C923406K86274J55286K23478J41416J82462K88099N31052N40075L59246M11712
3971G042506L15908L85943M76029N65056M16226P09770Q20640P50929M89329L38998
3961A2311334N69135L72795J54241p126k75296k30668l48714n69888o18270m54522
3951A0903021o50252p52393m06446o13437o53064l78077n01875n27137m10014
3942F010326j64311k40336l27882l10155j54467m40470k44463k4980j99126r8053
$$ plain form
4012 1386915 1382060 1614401 1758423 1777611 1643286 1574208 1805341 1979349 2005368 2133276
4002 2133276 2354921 2312108 2184435 2262447 2445410 2502836 2638287 2696894 2734866 2726003 2635018
3991 2635018 2986767 3087361 2970244 3028287 2921021 3160369 3327226 3467613 3799631 3923406
3981 3923406 4209680 4364966 4588444 4729860 4912322 5200421 5731473 6271548 6630794 7042506
3971 7042506 7358414 7744357 8220386 8785442 9201668 9911438 10732078 11483007 11972336 12311334
3961 12311334 12880469 13253264 13407505 13400379 13125083 12894415 12545701 11975813 11357543 10903021
3951 10903021 10252769 9500376 9093930 8480493 7827429 7449352 6947477 6420340 6010326
3942 6010326 5846015 5605679 5277797 4967642 4813175 4372705 4128242 4103262 3904136 3806083
3932C806083k04227j76518k97430k01850j81058p8082j21751o8639j89402r4869
3922B192257K12932n8923j40973o6446j20592j70879P1113K09249j59586j80019
3912A788133j35382l4767j0902n1449j09375l5166J74838J1546j50982J3617r6630
3901A363481j74076j28701J7130J59343J0226l0580r653j02465l3888M4640m811
3890A110646L7557Q2833Q8791q856j17463k63799J06028R2176q1548n9570J53708
3879A140503J11764j15863J8221M398n4833Q8637o5156k46875k45166J92645l32
3868H27943j65652J059P9613p1391l5817J9208N1829M0093j90748K0549o8382
3857E08304n1942J05776o8784o9821J38340L9113N8583J17232M9211m2859M5594
$$ plain form
3932 3806083 3601856 3425338 3127908 2926058 2745000 2666918 2545167 2476528 2287126 2192257
3922 2192257 2405189 2346266 2205293 2138847 2018255 1847376 1918489 2127738 1968152 1788133
3912 1788133 1652751 1617984 1607082 1555633 1446258 1411092 1585930 1597476 1446494 1460111 1363481
3901 1363481 1189405 1060704 1077834 1237177 1247403 1216823 1207170 1104705 1070817 1115457 1110646
3890 1110646 1148203 1231036 1319827 1310971 1193508 929709 1035737 1127913 1046365 986795 1140503
3879 1140503 1252267 1136404 1154625 1159023 1104190 1192827 1127671 880796 635630 828275 827943
3868 827943 662291 663350 742963 671572 635755 654963 706792 746885 556137 576686 508304
3857 508304 456362 562138 493354 423533 561873 600986 659569 776801 826012 783153 828747
3846H28747k02432l7775R0884p5018n0770p7649j46162J72044k1605l9766j36801
3835C03697l521J04112m9967J46310j51193l9274J98662n130j21499n8894K6433
3824C49736p9874J00582j0179o4957K4024J22492m5725O817L6163J8845n4323
3813D03601j03701j562o5993L4938j753J44904P0797p4008j30499Q120m968j3526
3801B66350J06767O2662l8871N1570M4545L2109j07022r4955q9990Q3529n0820
3790B65874j81411J09842K377m629O2417j00928J28621p900m8443L5792l1224
3779B30388m9591J95238n1044p1669p212r7925J03866M3804M6815j13110m1912
3768A87648L5912p0737O7603O4622r185j554j20807m2243N553P2777M7669r7533
$$ plain form
3846 828747 626315 588540 679424 604406 553636 475987 329825 501869 480264 440498 303697
3835 303697 300176 404288 354321 500631 349438 310164 508826 503696 382197 323303 349736
3824 349736 269862 370444 360265 295308 319332 441824 396099 402916 439079 457924 403601
3813 403601 299900 298338 232345 267283 265530 410434 481231 407223 276724 284844 279876 266350
3801 266350 373117 435779 396908 448478 493023 525132 418110 323155 233165 316694 265874
3790 265874 84463 194305 196682 192053 254470 153542 282163 274263 225820 261612 230388
3779 230388 180797 376035 324991 253322 246110 148185 252051 295855 342670 229560 187648
3768 187648 223560 152823 220426 285048 275863 274309 153502 111259 116812 189589 237258 139725
3756A39725k1442M5953o263N8624J06664l0393n9302K2567M9871j48082j17861
3745D0061P0665m6917p2078q2155P1009J9214K921Q9346p2504M372J55026j59860
3733A9100q5872K02668J0824L3480r5064Q9750P7452J1300J0742R008M3071p4806
3721B51653O3940K4754k5932p0732j88945L3375K2414P3944J22993j78432k3025
3710A06007n54J45347m7644m6832J9662q3018N144j4331l7263j8864M048J33429
3698A65131o7966o5967M2407M644P5648n6197j5531R3358p8999J18358j7182j05242
3686I2462l3668M9129L7686Q322M1802j43356k2442Q7789K23682m5353r3493J25521
3674C28081p3525k771j18043j03695J71137L7944o1846j3356R0960o7617p5438
$$ plain form
3756 139725 118283 164236 157973 216597 323261 292868 233566 256133 306004 157922 40061
3745 40061 110726 63809 -8269 -90424 -19415 -201 2720 92066 19562 23934 178960 19100
3733 19100 -66772 135896 146720 180200 85136 174886 252338 263638 274380 283388 326459 251653
3721 251653 315593 340347 314415 243683 54738 88113 110527 184471 307464 129032 106007
3710 106007 105453 250800 203156 156324 175986 92968 98112 83781 46518 27654 31702 165131
3698 165131 97165 31198 73605 78249 153897 97700 82169 175527 96528 214886 197704 92462
3686 92462 58794 107923 145609 153931 195733 52377 29935 117724 341406 296053 202560 328081
3674 328081 254556 251785 133742 30047 201184 239128 177282 163926 254886 187269 111831
3663A11831N8918L0144J61885p4865J30180J53694j31717n7982j7932L8856j0315
3652C92697O2953L15570K29662k42523j19669J16527J97038r8117j92471L0637
3642F92304J06195J693J07398N0820K00565k3802j41737N1315p4113L4754l0326
3631I75066J82061M8516q2687J02724m9447j1272J55973K09556r3794N0175J4819
3620A501690J4909R9201O1247k9873O2330P8673j55454K7975J28921O05l704J098
3608A787618J2055l5758k6619l6197j01340p0066n9398j32876r9480j34673J2873
3597A116139o7304q0803N4903j43806m4429J5807R7392l5029J9659j16545j3174
3586H02810J33813k29065J0325M0986P7316j9954N8585O1715k31810j49552m3161
$$ plain form
3663 111831 170749 200893 362778 287913 418093 571787 440070 382088 364156 403012 392697
3652 392697 455650 771220 1000882 758359 638690 755217 952255 854138 661667 692304
3642 692304 798499 800192 907590 958410 1158975 1135173 993436 1044751 970638 1005392 975066
3631 975066 1157127 1205643 1122956 1225680 1176233 1164961 1320934 1530490 1436696 1486871 1501690
3620 1501690 1516599 1615800 1677047 1647174 1709504 1788177 1632723 1660698 1789619 1790224 1786520 1787618
3608 1787618 1799673 1763915 1737296 1701099 1599759 1529693 1470295 1337419 1237939 1103266 1116139
3597 1116139 1048835 968032 1022935 879129 834700 850507 947899 912870 932529 815984 802810
3586 802810 936623 707558 717883 758869 836185 816231 874816 936531 704721 555169 512008
3575E12008M8970m4686l3633p3080J15583M8219J04535j56389j08567j2444r9096
3564C01420n09j14034O919P6859N260O221j14367j09389j8776J06412p452Q3137
3552B21701Q198J57582J48699k65293n2639l6895l318N1738r2664J43153n3651
3541B26611j46106J04711q2204L8855l3248j192O4213j17653J55395k4705k8212
3530A56465m9419j2964P0773j62042l9717O3965R2766M7587l976J675j22388J13381
3518A56106l0233j48557j1076j5317n4117L0197M7277J67863m3379P553j1370
3507I4947j80619Q3879J75507j58122m5070j2354K0366R2985j51373l8225j30097
3496b48176O8786J88208n344j16646J34580P41m3739r0429K1020r8692J41383
$$ plain form
3575 512008 560978 516292 482659 409579 525162 573381 677916 521527 412960 400516 301420
3564 301420 300911 186877 193796 270655 275915 282136 167769 58380 39604 146016 138564 221701
3552 221701 229899 387481 536180 270887 218248 181353 178035 229773 137109 280262 226611
3541 226611 80505 185216 103012 141867 108619 107427 171640 53987 209382 184677 156465
3530 156465 107046 94082 164855 2813 -36904 27061 119827 167414 163438 165113 42725 156106
3518 156106 125873 -22684 -33760 -49077 -103194 -72997 -25720 142143 98764 106317 94947
3507 94947 -85672 -1793 173714 15592 -29478 -41832 -21466 71519 -79854 -118079 -248176
3496 -248176 -179390 8818 3474 -113172 21408 22149 -21590 -112019 -90999 -189691 -48308
3485d8308J8132J1559R9834J5255q9244p6722r2232O4779J7200J19432j3766N9636
3473H5555j32606q7637P1454m2617M9292J4305l8163k616j9807r5801J56282J06108
3461F3749j33577J00092j7400r5259N9433r1131p4172o4545K5413P371Q5166L45230
3449B10370r5155j72698P6663J1959j15248j40910J25757m8323L0388J17173N1533
3438E1509l4487o064j45875p6453j6117L7067M3084J76326R4864l4278m5296M1397
3426H5677p1633q6644k4387P1478Q8593n827j12319k9692m8353k387M8802J718
3414h4974m4843J25677M9335r5723j33545K6058J17686J0599K582k43358n3718
3403c24224J33736o1948n1035K91064P0992o3318J20146p1739q2021N2577m4758
$$ plain form
3485 -48308 -30176 -18617 81217 96472 7228 -69494 -161726 -96947 -79747 39685 25919 85555
3473 85555 -47051 -134688 -63234 -105851 -56559 -42254 -80417 -83033 -102840 -198641 -42359 63749
3461 63749 -69828 30264 12864 -82395 -22962 -114093 -188265 -252810 -227397 -220026 -134860 210370
3449 210370 115215 -57483 19180 31139 -84109 -225019 -99262 -147585 -117197 -24 51509
3438 51509 17022 10958 -134917 -211370 -227487 -190420 -147336 28990 123854 89576 44280 85677
3426 85677 14044 -72600 -96987 -25509 63084 57257 -55062 -84754 -133107 -135494 -86692 -84974
3414 -84974 -129817 -4140 45195 -50528 -184073 -158015 -40329 -29730 -27148 -270506 -324224
3403 -324224 -190488 -252436 -303471 -12407 58585 -4733 115413 43674 -38347 14230 -30528
3392c0528M4568M2121n9038j13060P5844p9731J5396O0904j0222m3957j15730
3381b13433J01195m155p6367O5653Q5380o139k4121r2473P7076R0280O2582k91196
3369b25718j1071J64614r2084N295J69768K08p3573o0623k3937k7353P3352J21209
3357B0087K2056j10813j49919o8534p8884K5099J16587M9535n4465O5164N1755
3346a12332q4691n5273J22078R3067j27891j9925N0182p8576J16609j32967r3053
3335c22772R6392J21999R2276o7365J09977p1248l8992R4422J4542N4896j40168
3324e6041M8631j24684K9402O1077j31802J13156J3825l9880r0426R5046o0843
3313a42539L3661O7803J4266p1327r974k7648r3457J4517O181m1809m8469K10648
$$ plain form
3392 -30528 14040 56161 -2877 -115937 -40093 -119824 -104428 -43524 -53746 -97703 -213433
3381 -213433 -112238 -116393 -192760 -127107 -41727 -47866 -71987 -164460 -87384 2896 65478 -225718
3369 -225718 -236789 -72175 -164259 -158964 10804 11012 -62561 -123184 -147121 -174474 -101122 20087
3357 20087 42143 -68670 -218589 -287123 -366007 -340908 -224321 -174786 -229251 -164087 -112332
3346 -112332 -197023 -252296 -130218 -37151 -165042 -184967 -134785 -213361 -96752 -229719 -322772
3335 -322772 -226380 -104381 -12105 -79470 30507 -40741 -79733 14689 29231 84127 -56041
3324 -56041 -7410 -132094 -102692 -41615 -173417 -60261 -46436 -86316 -176742 -81696 -142539
3313 -142539 -108878 -41075 -26809 -98136 -108110 -135758 -229215 -214698 -208517 -250326 -298795 -88147
3301h8147J0255J44945r2416j08606r8739q466J71936n7068l2193J08255j13721
3290a63965M2027Q1213m4708r688O1193l7571m2532m9962M6567M8744l1037m8336
3278a48055j04396L4638J11446J90967j01645q244p6569q7408K6206J92079j02994
3267g3975J30471R2395j87956J42258j1724j77024o5618K69142j6099r6290j13371
3256a07791N3243j33860Q1612J86599M9854r8911o6079J00476j03005j23354J00677
3245f0539Q5350M7930K7387p6002j58292j2280j10860J22944O7536Q2003J00383
3234A15560k73538q7710Q6221K0534N6068j6528r5525P7238o2123P9855J4555
3223h5393N2782o1988O5885q0725J10q6623o0963M3876o3712O4473J06633r7624
$$ plain form
3301 -88147 -77892 67053 -25363 -133969 -232708 -241174 -69238 -126306 -158499 -50244 -163965
3290 -163965 -121938 -40725 -85433 -95121 -33928 -71499 -114031 -163993 -117426 -68682 -99719 -148055
3278 -148055 -252451 -217813 -106367 84600 -17045 -25289 -101858 -189266 -163060 29019 -73975
3267 -73975 56496 148891 -39065 103193 91469 -85555 -151173 117969 101870 5580 -107791
3256 -107791 -54548 -188408 -106796 79803 129657 30746 -35333 65143 -37862 -161216 -60539
3245 -60539 24811 72741 100128 24126 -134166 -146446 -257306 -134362 -66826 15177 115560
3234 115560 -157978 -245688 -159467 -138933 -82865 -99393 -194918 -117680 -179803 -99948 -85393
3223 -85393 -32611 -94599 -28714 -109439 -109329 -195952 -256915 -213039 -276751 -212278 -105645 -203269
3211b03269o8806P7463K3069J03976M0165K9375m5061M506n2291j86057J96675
3200h0255K6165L2514J0712j05446n0366K3050r8293J14591n2290O1877k2592
3189a40333k5314L0995J90677J13530j45853k5580r8639L833J640J19074N3370
3178G7400j14452l8120J28843l6735o4357M0941k5355j79602O1040m2012J30625
3167f1784K9757Q9333j76274q1922J55954O7992M9471P3837j31260j04667o5885
3156a55448k1659K15187r3541n8686r276M3179m4723p1390j8440N94q7200K83003
3144a8400M6413r183l0158j39373j4847J12991j4218l0207L1525m3408R9192j04176
3132a13849k5818L2584J52972o4436n726j9706J5930R803l7164K33601o9991o7351
$$ plain form
3211 -203269 -272075 -194612 -171543 -67567 -27402 1973 -43088 -38582 -90873 -276930 -80255
3200 -80255 -54090 -21576 -10864 -116310 -166676 -143626 -241919 -127328 -179618 -117741 -140333
3189 -140333 -165647 -134652 56025 169555 23702 -1878 -100517 -96684 -95044 24030 77400
3178 77400 -37052 -75172 53671 16936 -47421 -6480 -31835 -211437 -150397 -192409 -61784
3167 -61784 -32027 57306 -118968 -200890 -44936 23056 72527 146364 15104 -89563 -155448
3156 -155448 -177107 38080 -55461 -114147 -123423 -80244 -124967 -196357 -214797 -214203 -301403 -18400
3144 -18400 28013 18830 -11328 -150701 -165548 -52557 -66775 -96982 -65457 -108865 -9673 -113849
3132 -113849 -139667 -107083 45889 -18547 -24273 -43979 -28049 -18246 -55410 178191 108200 40849
3120D0849p1083j3200j26427J36152N2522o4957p6070j03046M2207o1569J09677
3109a34945J12941k5293K1022O1683q7036j4830j67581L9740n0933Q9157J07115
3098d8960m1236O3839J42910k04432p0101k0173J34544J65296l5357j00504P3414
3087E9240P6765j20836K3642l1067J5303j54527M3723j2976o9032n9402J05515
3076a23652k6862Q6687p6899j38345N1707K02055R3507n6532j226q3501R1662
3065A8601l6558J53706j73490L8213k5439L5966M274K5145l6477K0269J36072
3054A60282m1007k03190L1896J4164j29299J00993J27378m8943r9807R9133m4141
3043c2541m3565M2174J8083R0604K8105n9865q3931J97663N6907j08249P9813
$$ plain form
3120 40849 -30234 -43434 -169861 -33709 18813 -46144 -122214 -225260 -183053 -244622 -134945
3109 -134945 -22004 -47297 -26275 35408 -51628 -66458 -234039 -194299 -245232 -156075 -48960
3098 -48960 -90196 -26357 116553 -87879 -157980 -178153 -43609 121687 86330 -14174 59240
3087 59240 136005 15169 38811 7744 23047 -131480 -87757 -100733 -169765 -229167 -123652
3076 -123652 -150514 -63827 -140726 -279071 -227364 -25309 68198 11666 10440 -73061 18601
3065 18601 -17957 135749 -37741 472 -24967 10999 15273 40418 3941 24210 160282
3054 160282 119275 -83915 -52019 -37855 -167154 -66161 61217 12274 -87533 11600 -32541
3043 -32541 -76106 -33932 -15849 74755 102860 42995 -40936 156727 213634 105385 185198
3032A85198j28623q8351m7491j39664j5437Q8434K0376J66764k9517J6314N8468
3021H6471r9551j19717m5817P2514J12778k26774K69704j10807r2286P8978j0815
3010h5322P511J31081J10152r4329j60722J0876J95191k0584k14013r2423j3583
2999b26165Q0093J14824K4927n7009o5272M9164J49548j31944j13543J55764L3062
2988A3449O7619j65073P532p313J95704J16982j1211k7217j43889P4806o7017
2977E4372j33637O39K2307l418L1633Q277O4469K177j36265Q3601j52889m9055
2965b07789J16673o7153J02698q6515J58985o9310O8694N9097q449l8915j13079
2954h5063N9071L6387J55676k81036j576J00391J49119J4819p6281K6791k34655
$$ plain form
3032 185198 56575 -31776 -79267 -218931 -234368 -145934 -125558 41206 11689 28003 86471
3021 86471 -13080 -132797 -178614 -106100 6678 -220096 49608 -61199 -153485 -74507 -85322
3010 -85322 -77811 53270 163422 69093 -91629 -80753 114438 93854 -120159 -212582 -226165
2999 -226165 -146072 -31248 -6321 -63330 -128602 -79438 70110 -61834 -175377 -19613 13449
2988 13449 81068 -84005 -76473 -83786 111918 228900 217689 190472 46583 121389 54372
2977 54372 -79265 -78626 -56319 -59737 -28104 -19827 44642 46819 -89446 -5845 -158734 -207789
2965 -207789 -91116 -158269 -55571 -142086 16899 -52411 16283 75380 66931 28016 -85063
2954 -85063 -25992 10395 166071 -114965 -116541 -16150 132969 147788 71507 98298 -136357
2943a36357q773p2197j20031P4343J87303J04202l03819Q4499P9083p7794J40380
2932d9161L285m8485j937j19430o0578M3053O8547M4066P9851n4472M815Q8219
2920b227Q3507R448n0992O673J4663K8051n2926l5358J31725k35485O5422j4193
2908e1692p3904J83134l8859n8420j11382M6146j4110j42667Q6619K01829L0241
2897E6935l1452r9763k4065j92034J38287P6892J64151o3599j06459o2374n7921
2886b01402K7110l4670J20858J38990Q2688j86404k3228Q5125J57463l1453K596
2875A37673j30627n1801j89370K11962J75101o0336r3311J4027Q8941n3006Q2228
2864A31481k0385r3784j20253R4308o421K7571J12854K20477Q4918k01473j04436
$$ plain form
2943 -136357 -145130 -217327 -337358 -263015 -75712 28490 -275329 -190830 -111747 -189541 -49161
2932 -49161 -45876 -94361 -96298 -215728 -276306 -233253 -164706 -120640 -40789 -95261 -90446 -2227
2920 -2227 81280 90728 39736 46409 61072 89123 36197 839 132564 -102921 -37499 -51692
2908 -51692 -125596 57538 18679 -39741 -151123 -104977 -119087 -261754 -175135 26694 56935
2897 56935 25483 -74280 -98345 -290379 -152092 -75200 88951 25352 -81107 -143481 -201402
2886 -201402 -174292 -208962 -88104 50886 133574 -52830 -76058 9067 166530 135077 137673
2875 137673 7046 -44755 -234125 -22163 152938 92602 -709 13318 102259 49253 131481
2864 131481 111096 17312 -102941 -8633 -15054 12517 125371 345848 430766 229293 124857
2853A24857J13746K56380L168J13848J47039L9565N9901j27345J198n2549J90838
$$ plain form
2853 124857 238603 494983 498151 611999 759038 798603 858504 731159 732357 679808 870646
$$ [...]
##END NTUPLES=NMR SPECTRUM
##END=
