##TITLE=1H_EC-3358(2)
 200.13MHz, CDCl3,
 8 sc
 
 25.8.2025
##JCAMPDX= 6.0         $$ Bruker NMR JCAMP-DX V2.0
##DATA TYPE= NMR SPECTRUM
##DATA CLASS= NTUPLES
##ORIGIN= UXNMR, Bruker Analytische Messtechnik GmbH
##OWNER= pz
$$ XWIN-NMR		Version 3.5
$$ Mon Aug 25 13:59:40 2025 Russian Standard Time (UT+4h)  she@DPX200
##.OBSERVE FREQUENCY= 200.1308
##.OBSERVE NUCLEUS= ^1H
##.ACQUISITION MODE= SIMULTANEOUS
##.ACQUISITION SCHEME= undefined
##.AVERAGES= 8
##.DIGITISER RES= 18
##SPECTROMETER/DATA SYSTEM= spect
##.PULSE SEQUENCE= zg30
##.SOLVENT NAME= CDCl3
##.SHIFT REFERENCE= (INTERNAL, CDCl3, 0, 15.434)
##AUDIT TRAIL= $$ (NUMBER, WHEN, WHO, WHERE, WHAT)
$$ ##TITLE= Audit trail, XWIN-NMR		Version 3.5
$$ ##JCAMPDX= 5.01
$$ ##ORIGIN= Bruker BioSpin GmbH
$$ ##OWNER= she
$$ F:/spectra/data/she/nmr/H-C/1/pdata/1/auditp.txt
$$ ##AUDIT TRAIL=  $$ (NUMBER, WHEN, WHO, WHERE, WHAT)
(   1,<2025-08-25 13:58:08.09 +0400>,<she>,<DPX200>,
      <created by zg, POWCHK disabled, PULCHK disabled
       configuration hash MD5:
       00 E9 B6 7A A2 85 ED C7 34 08 36 98 17 FE 4E 26
       data hash MD5: 16K
       78 96 C8 42 CE C4 3B 89 C4 C6 D6 94 A3 99 08 50>)
(   2,<2025-08-25 13:58:11.37 +0400>,<she>,<DPX200>,
      <Start of raw data processing
       efp BC_mod = 2 LB = 0.25 FT_mod = 6 PKNL = 1 PHC0 = -1557.856 PHC1 = 11.79229 SI = 16K 
       data hash MD5: 16K
       12 D0 31 F8 79 8D 65 BE C4 60 2B 1D E9 08 9F 68>)
(   3,<2025-08-25 13:58:29.59 +0400>,<she>,<DPX200>,
      <pk PHC0 = 0.164462 PHC1 = -6.200001 
       data hash MD5: 16K
       99 73 E1 B2 A7 3E CD 7D D7 50 CF 0F B7 0E 40 7F>)
(   4,<2025-08-25 13:58:33.67 +0400>,<she>,<DPX200>,
      <abs ABSG = 5 
       data hash MD5: 16K
       A3 D2 2D 65 5E 3B 9E D9 7B A7 B9 B3 06 5F 4E C7>)
$$ ##END=
$$ 
$$ hash MD5
$$ BA 58 50 AC 9D 87 69 79 37 73 2B 2C 67 DA 6F 4A
##$RELAX= 
##$RELAX= 
##$RELAX= 
##$RELAX= 
##$RELAX= 
##$RELAX= 
$$ Bruker specific parameters
$$ --------------------------
##$DU= <F:/spectra>
##$EXPNO= 1
##$NAME= <H-C>
##$PROCNO= 1
##$TYPE= <nmr>
##$USER= <she>
##$AMP= (0..31)
100 100 100 100 100 100 100 100 100 100 100 100 100 100 100 100 100 100 
100 100 100 100 100 100 100 100 100 100 100 100 100 100 
##$AQSEQ= 0
##$AQ_mod= 1
##$AUNM= <au_zg>
##$AUTOPOS= <>
##$BF1= 200.13
##$BF2= 200.13
##$BF3= 200.13
##$BF4= 200.13
##$BF5= 200.13
##$BF6= 200.13
##$BF7= 200.13
##$BF8= 200.13
##$BYTORDA= 1
##$CFDGTYP= 0
##$CFRGTYP= 5
##$CHEMSTR= <none>
##$CNST= (0..31)
1 1 145 1 1 1 1 1 1 1 1 1 1 1 1 1 1 1 1 1 1 1 1 1 1 1 1 1 1 1 1 1 
##$CPDPRG= <>
##$CPDPRG1= <>
##$CPDPRG2= <>
##$CPDPRG3= <>
##$CPDPRG4= <mlev>
##$CPDPRG5= <mlev>
##$CPDPRG6= <mlev>
##$CPDPRG7= <mlev>
##$CPDPRG8= <mlev>
##$CPDPRGB= <>
##$CPDPRGT= <>
##$D= (0..31)
0 0.7 0 0 0 0 0 0 0 0 0 0.03 0 0 0 0 0 0 0 0 0 0 0 0 0 0 0 0 0 0 0 0 
##$DATE= 1756115887
##$DBL= (0..7)
120 120 120 120 120 120 120 120 
##$DBP= (0..7)
150 150 150 150 150 150 150 150 
##$DBP07= 0
##$DBPNAM0= <>
##$DBPNAM1= <>
##$DBPNAM2= <>
##$DBPNAM3= <>
##$DBPNAM4= <>
$$ [...]
##$SUBNAM3= <"">
##$SUBNAM4= <"">
##$SUBNAM5= <"">
##$SUBNAM6= <"">
##$SUBNAM7= <"">
##$SUBNAM8= <"">
##$SUBNAM9= <"">
##$SW= 18.0517779522481
##$SWIBOX= (0..15)
0 0 2 0 0 0 0 0 0 0 0 0 0 0 0 0 
##$SW_h= 3612.71676300578
##$TD= 16384
##$TD0= 1
##$TE= 0
##$TE2= 300
##$TE3= 300
##$TEG= 300
##$TL= (0..7)
0 120 120 120 120 120 120 120 
##$TP= (0..7)
150 150 150 150 150 150 150 150 
##$TP07= 0
##$TPNAME0= <>
##$TPNAME1= <>
##$TPNAME2= <>
##$TPNAME3= <>
##$TPNAME4= <>
##$TPNAME5= <>
##$TPNAME6= <>
##$TPNAME7= <>
##$TPOAL= (0..7)
0.5 0.5 0.5 0.5 0.5 0.5 0.5 0.5 
##$TPOFFS= (0..7)
0 0 0 0 0 0 0 0 
##$TUNHIN= 0
##$TUNHOUT= 0
##$TUNXOUT= 0
##$USERA1= <user>
##$USERA2= <user>
##$USERA3= <user>
##$USERA4= <user>
##$USERA5= <user>
##$V9= 5
##$VALIST= <valist>
##$VCLIST= <CCCCCCCCCCCCCCC>
##$VD= 0
##$VDLIST= <DDDDDDDDDDDDDDD>
##$VPLIST= <PPPPPPPPPPPPPPP>
##$VTLIST= <TTTTTTTTTTTTTTT>
##$WBST= 1024
##$WBSW= 4
##$XGAIN= (0..3)
0 0 0 0 
##$XL= 0
##$YL= 0
##$YMAX_a= 244857
##$YMIN_a= -331750
##$ZGOPTNS= <>
##$ZL1= 120
##$ZL2= 120
##$ZL3= 120
##$ZL4= 120
##$ABSF1= 16.00586
##$ABSF2= -2.046045
##$ABSG= 5
##$ABSL= 3
##$ALPHA= 0
##$AQORDER= 0
##$ASSFAC= 0
##$ASSFACI= 0
##$ASSFACX= 0
##$ASSWID= 0
##$AUNMP= <proc_1d>
##$AZFE= 0.1
##$AZFW= 0.1
##$BCFW= 0
##$BC_mod= 2
##$BYTORDP= 0
##$COROFFS= 0
##$CY= -3
##$DATMOD= 1
##$DC= 0
##$DFILT= <>
##$DTYPP= 0
##$F1P= 0
##$F2P= 0
##$FCOR= 1
##$FTSIZE= 16384
##$FT_mod= 6
##$GAMMA= 0
##$GB= 0
##$INTBC= 1
##$INTSCL= 3.241238e-09
##$ISEN= 128
##$LB= 0.25
##$LEV0= 0
##$LPBIN= 0
##$MAXI= 10000
##$MC2= 0
##$MEAN= 0
##$ME_mod= 0
##$MI= 1.114404
##$NCOEF= 0
##$NC_proc= -7
##$NLEV= 6
##$NOISF1= 3.799351
##$NOISF2= 2.8
##$NSP= 0
##$NTH_PI= 0
##$NZP= 0
##$OFFSET= 15.43402
##$PC= 1
##$PHC0= -1557.692
##$PHC1= 5.592289
##$PH_mod= 1
##$PKNL= yes
##$PPARMOD= 0
##$PSCAL= 0
##$PSIGN= 0
##$REVERSE= no
##$SF= 200.129517556012
##$SI= 16384
##$SIGF1= 3
##$SIGF2= 2
##$SINO= 0.751879
##$SIOLD= 32768
##$SREGLST= <19F.Aceton>
##$SSB= 0
##$STSI= 16384
##$STSR= 0
##$SW_p= 3612.71676300577
##$SYMM= 0
##$S_DEV= 0
##$TDeff= 16384
##$TDoff= 0
##$TI= <>
##$TILT= no
##$TM1= 0
##$TM2= 0
##$TOPLEV= 0
##$USERP1= <user>
##$USERP2= <user>
##$USERP3= <user>
##$USERP4= <user>
##$USERP5= <user>
##$WDW= 1
##$XDIM= 16384
##$YMAX_p= 385889247
##$YMIN_p= -5414309
$$ End of Bruker specific parameters
$$ ---------------------------------
##NTUPLES= NMR SPECTRUM
##VAR_NAME=  FREQUENCY,     SPECTRUM/REAL,   SPECTRUM/IMAG
##SYMBOL=    X,             R,               I
##VAR_TYPE=  INDEPENDENT,   DEPENDENT,       DEPENDENT
##VAR_FORM=  AFFN,          ASDF,            ASDF
##VAR_DIM=   16384,         16384,           16384
##UNITS=     HZ,            ARBITRARY UNITS, ARBITRARY UNITS
##FACTOR=    0.220516191357247, 1,           1
##FIRST=     3088.80298503922, 0,            0
##LAST=      -523.913777966549, 0,           0
##MIN=       -523.913777966549, -5414309,    0
##MAX=       3088.80298503922, 385889247,    0
$$ Real data points
##PAGE= N=1
##DATA TABLE= (X++(R..R)), XYDATA
$$ [...]
$$ plain form
11889 -286603 -351435 -291222 -143082 222656 165263 -62774 -151986 -97090 -18677 290952 85217
11878 85217 22033 150364 108602 -122289 -277568 -346327 -564765 -258081 202675 252036
11868 252036 -76425 130038 327406 345084 253727 306899 333855 117878 -173501 -164265 -109433
11857 -109433 -34409 -256113 -12304 113834 -77079 -245958 -456147 -458239 -257049 -9425
11847 -9425 73843 -13736 -127578 -69732 -319575 -145253 193478 115693 147753 81757 177067
11836 177067 121440 125 -70291 -309586 -598257 -286698 31240 353875 193772 239992
11826 239992 151259 -30233 -108266 -53465 39110 72087 237677 272349 156932 39663 -291573
11815 -291573 -156886 406046 445070 58204 -136697 -171512 -242732 -513684 -450598 -196102
$$ packed form
11889b86603o4832O0213J48140L65738n7393k28037q9212N4896P8413L09629k05735
11878H5217o3184J28331m1762k30891j55279o8759k18438L06684M60756M9361
11868B52036l28461K06463J97368J7678r1357N3172K6956k15977k91379R236N4832
11857a09433P5024k21704K43809J26138j90913j68879k10189k092K01190K47624
11847i425Q3268q7579j13842N7846k49843J74322L38731p7785L2060o5996R5310
11836A77067n5627j21315p0416k39295k88671L11559L17938L22635j60103M6220
11826B39992q8733j81492p8033N4801R2575L2977J65590L4672j15417j17269l31236
11815b91573J34687N62932L9024l86866j94901l4815p1220k70952O3086K54496
$$ plain form
11805 -196102 -463 300891 172359 228209 160335 -92608 12340 -31511 155537 212060
11795 212060 68484 -83764 85191 114856 183364 -24289 -296168 -326603 -188375 -149321
11785 -149321 -61840 -145788 -168189 -105155 -438908 -300706 -123264 110580 113225 -13173 -48259
11774 -48259 46454 73346 -56566 52569 151947 82773 168895 21993 291533 156735 32626
11763 32626 51740 -214619 -243558 -27295 116786 7729 -183500 11984 301960 341777
11753 341777 67491 -46891 89266 218672 265520 197947 -16180 -120859 -104016 -18770
11743 -18770 -107855 -274462 -59396 25273 83180 240208 185465 94535 -15612 -269081 -184330
11732 -184330 -206163 163000 250150 44018 185677 205252 -175664 -53105 203613 120150
$$ packed form
11805a96102J95639L01354j28532N5850o7874k52943J04948m3851J87048N6523
11795B12060j43576j52248J68955K9665O8508k07653k71879l0435J38228L9054
11785a49321Q7481q3948k2401O3034l33753J38202J77442K33844K645j26398l5086
11774d8259R4713K6892j29912J09135R9378o9174Q6122j46902K69540j34798j24109
11763C2626J9114k66359k8939K16263J44081j09057j91229J95484K89976L9817
11753C41777k74286j14382J36157J29406M6848o7573k14127j04679J6843Q5246
11743a8770q9085j66607K15066Q4669N7907J57028n4743r0930j10147k53469Q4751
11732a84330k1833L69163Q7150k06132J41659J9575l80916J22559K56718q3463
$$ plain form
11722 120150 56395 -111481 22506 -97833 -233612 -68967 67574 125159 165458 3131
11712 3131 -34466 139993 41839 -21411 51953 162198 50680 -231901 -205502 -165301 -265825
11701 -265825 -351701 -99999 -88517 -269329 -324987 -508181 -426425 -4683 9545 -10190 -271838
11690 -271838 -7373 -81184 -358334 -214151 -63068 -295117 -308830 33212 14978 -96922
11680 -96922 -122755 -224505 -399599 -432778 -373948 -317423 -436978 -167342 211737 305857 261702
11669 261702 9048 72668 -2362 -158541 -171987 -169283 -110362 -50409 540064 424093 233985
11658 233985 80578 -200160 -195558 -114164 -31783 16794 -132535 -272167 -366407 -553178 -322167
11647 -322167 -249797 113226 264470 -228410 -290331 -243947 -93512 -449511 -274218 -9625
$$ packed form
11722A20150o3755j67876J33987j20339j35779J64645J36541N7585M0299j62327
11712C131l7597J74459r8154o3250P3364J10245j11518k82581K6399M0201j00524
11701b65825q5876K51702J1482j80812n5658j83194Q1756M21742J4228j9735k61648
11690b71838K64465p3811k77150J44183J51083k32049j3713L42042j8234j11900
11680i6922k5833j01750j75094l3179N8830N6525j19555K69636L79079R4120m4155
11669B61702k52654O3620p5030j56179j3446K704N8921N9953N90473j15971j90108
11658B33985j53407k80738M602Q1394Q2381M8577j49329j39632r4240j86771K31011
11647c22167P2370L63023J51244m92880o1921M6384J50435l55999J75293K64593
$$ plain form
11637 -9625 -165063 -181002 -165993 -320685 -361150 -97141 -397774 -321668 -70775 -62915 -322355
11626 -322355 -366646 -240273 -197112 -378592 -292717 -241173 32271 -166788 -239673 -198860 -118700
11615 -118700 -47543 -142857 150488 64314 129187 -57393 -73786 -67294 -67006 -165932 -344403
11604 -344403 -173020 -197134 -141707 244265 96413 427790 150926 -79482 157740 124429
11594 124429 359464 -116404 -318121 24396 -36211 67417 61835 -213076 -430277 -344901
11584 -344901 -28753 203758 -67928 44331 244514 551255 245006 -331002 -12306 -120582
11574 -120582 -58426 220797 124695 37927 -127829 84051 41848 110343 -77882 -11704 119277
11563 119277 187206 442536 265701 86565 117943 9429 28969 111448 100052 537337
$$ packed form
11637i625j55438j5939J5009j54692m0465K64009l00633P6106K50893P860k59440
11626c22355m4291J26373M3161j81480Q5875N1544K73444j99059p2885M0813Q0160
11615a18700P1157r5314K93345q6174O4873j86580j6393O492K88r8926j78471
11604c44403J71383k4114N5427L85972j47852L31377k76864k30408K37222l3311
11594A24429K35035m75868k01717L42517o0607J03628n582k74911k17201Q5376
11584c44901L16148K32511k71686J12259K00183L06741l06249n76008L18696j08276
11574a20582O2156K79223r6102q6768j65756K11880m2203O8495j88225O6178J30981
11563A19277O7929K55330j76835j79136L1378j08514J9540Q2479j1396M37285
$$ plain form
11553 537337 401372 -133598 82255 470450 582215 439095 73736 51323 44231 -36292
11543 -36292 220778 353504 178050 492597 347084 11411 -219711 201840 376913 242062
11533 242062 -223624 -401245 -132435 51949 46774 53187 73844 98135 -10767 -225603 43814
11522 43814 -131082 -280469 -52241 -98178 280425 116405 118058 -103656 -335958 -331758 -118279
11511 -118279 108968 -97599 -234347 -258147 119652 218851 107899 92878 24975 -334440
11501 -334440 -222423 -63554 -139263 -31095 87448 -317405 -475397 -77753 -371831 -405451
11491 -405451 -125612 -131357 -251494 -210631 -76620 120637 -74732 -367393 -177036 189852
11481 189852 -45775 -315396 19232 -69435 -24261 -203516 -162967 -289205 -412141 -509442
$$ packed form
11553E37337j35965n34970K15853L88195J11765j43120l65359k2413p092q0523
11543c6292K57070J32726j75454L14547j45513l35673k31122M21551J75073j34851
11533B42062m65686j77621K68810J84384n175O413K0657K4291j08902k14836K69417
11522D3814j74896j49387K28228m5937L78603j64020J653k21714k32302M200K13479
11511a18279K27247k06567j36748k3800L77799R9199j10952j5021o7903l59415
11501c34440J12017J58869p5709J08168J18543m04853j57992L97644k94078l3620
11491d05451K79839n745j20137M0863J34011J97257j95369k92661J90357L66888
11481A89852k35627k69621L34628q8667M5174j79255M0549j26238j22936r7301
$$ plain form
11471 -509442 -319352 -84737 -167910 8963 122058 70150 91242 -332279 -322967 -170348
11461 -170348 28622 -174146 -206268 155849 -32202 122852 26885 -132604 -104621 -131823
11451 -131823 139371 -197037 -140492 14598 -27538 -112920 1415 86982 -154732 -382333
11441 -382333 -55564 -10718 -351847 -170876 -531242 -299616 -192978 -323348 -206834 -205361
11431 -205361 -195756 -85580 -252438 -214963 -309865 -380308 -332988 -271211 -561456 -527854 -652953
11420 -652953 -19313 258617 -8865 155367 195530 376286 131078 54603 -83958 9338
11410 9338 39593 123740 -178638 -305903 -93345 170589 296664 -156881 -278172 -461002
11400 -461002 -199003 -194813 -655278 -619553 -107776 -353761 -601748 -212776 -205818 -213619 -133452
$$ packed form
11471e09442J90090K34615q3173J76873J13095n1908K1092m23521R312J52619
11461a70348J98970k02768l2122L62117j88051J55054r5967j59489K7983k7202
11451a31823K71194l36408N6545J55090m2136q5382J14335Q5567k41714k27601
11441c82333L26769M4846l41129J80971l60366K31626J06638j30370J16514J473
11431b05361R605J10176j66858L7475r4902p0443M7320O1777k90245L3602j25099
11420f52953O33640K77930k67482J64232M0163J80756k45208p6475j38561R3296
11410I338L0255Q4147l02378j27265K12558K63934J26075m53545j21291j82830
11400d61002K61999M190m60465L5725N11777k45985k47987L88972O958p801Q0167
$$ plain form
11389 -133452 218067 259792 -116784 -376850 128585 219969 467465 585062 60837 -30507
11379 -30507 -136615 115526 -11903 117716 321072 -11636 -246568 -182886 -95788 125908
11369 125908 102062 -78984 44261 -203559 -82539 93912 15281 -64914 -81656 -104065
11359 -104065 137421 -38521 163393 -307110 -84569 127169 -34760 -229253 -519340 -218133
11349 -218133 -56743 117984 -81436 111235 -71406 -15204 40427 -333944 -463310 -462795
11339 -462795 -247901 -173983 24449 149908 6740 -21675 -171450 -464345 -402010 -264395
11329 -264395 -256448 -159291 -187663 -133498 -289597 -212006 44302 -62615 -221974 -55622 -37602
11318 -37602 170600 8787 -146187 -256409 -303803 -16558 -24213 -172962 -89211 -106141 -162809
$$ packed form
11389a33452L51519M1725l76576k60066N05435R1384K47496J17597n24225r1344
11379c0507j06108K52141j27429J29619K03356l32708k34932O3682Q7098K21696
11369A25908k3846j81046J23245k47820J21020J76451p8631q0195j6742k2409
11359a04065K41486j75942K01914m70503K22541K11738j61929j94493k90087L01207
11349b18133J61390J74727j99420J92671j82641N6202N5631l74371j29366N15
11339d62795K14894P3918J98432J25459j43168k8415j49775k92895O2335J37615
11329b64395P947R7157k8372N4165j56099P7591K56308j06917j59359J66352J8020
11318c7602K08202j61813j54974j10222m7394K87245p655j48749Q3751j6930n6668
$$ plain form
11307 -162809 -7645 29473 -2365 -326221 -470177 -220863 -20255 -174071 -152913 -353577
11297 -353577 -451690 -44625 -224738 -244971 -103066 72131 372416 271758 -78423 206411
11287 206411 221089 271253 142607 -95835 -181598 -304591 -293862 -147983 -34317 -208768
11277 -208768 -147410 -179784 -32495 -38251 170239 311742 411203 338175 -69413 -285699 -35415
11266 -35415 138867 52401 -201215 32644 301615 390422 422801 -42173 -88615 -181870 -229097
11255 -229097 12452 172488 45040 95595 133905 465140 235487 142627 305826 256863
11245 256863 402341 166290 64635 578510 340412 -116645 281680 258157 42569 -221242
11235 -221242 -387936 -117366 84084 166045 256830 167734 119441 -30431 -164284 51283
$$ packed form
11307a62809J55164L7118l1838l23856j43956K49314K00608j53816K1158k00664
11297c53577r8113M07065j80113k0233J41905J75197L00285j00658l50181K84834
11287B06411J4678N0164j28646k38442q5763j22993J0729J45879J13666j74451
11277b08768O1358l2374J47289n756K08490J41503R9461p3028m07588k16286K50284
11266c5415J74282q6466k53616K33859K68971Q8807L2379m64974m6442r3255m7227
11255b29097K41549J60036j27448N0555L8310L31235k29653r2860J63199m8963
11245B56863J45478k36051j01655N13875k38098m57057L98325k3523k15588k63811
11235b21242j66694K70570K01450Q1961R0785q9096m8293j49872j33853K15567
$$ plain form
11225 51283 177958 -36945 -40044 109152 255667 169178 94694 -78681 121711 -97626
11215 -97626 -107045 105046 43595 277224 290918 -159234 -181661 59907 37687 16024 214125
11204 214125 456532 394512 100004 182531 203385 300555 197738 -63966 -45643 31682 351469
11193 351469 678661 328657 -94265 -25673 -257617 -25629 45455 114611 131893 -269031
11183 -269031 -79649 166311 123420 148682 -108175 -253759 -121635 -91436 25887 57217
11173 57217 100170 136791 157649 272686 362188 106723 -35815 147790 164773 -108959 20696
11162 20696 -111085 41347 142729 -165038 -249732 -89220 -25638 -317698 -110377 14066
11152 14066 162471 -20473 92645 198452 102309 48229 124503 288723 271049 -52549
$$ packed form
11225E1283J26675k14903l099J49196J46515q6489p4484j73375K00392k19337
11215i7626r419K12091o1451K33629J3694m50152k2427K41568k2220k1663J98101
11204B14125K42407o2020k94508Q2527K0854R7170j02817k61704J8323P7325L19787
11193C51469L27192l50004m22922O8592k31944K31988P1084O9156J7282m00924
11183b69031J89382K45960m2891K5262k56857j45584J32124L0199J17323L1330
11173E7217M2953L6621K0858J15037Q9502k55465j42538J83605J6983k73732J29655
11162B0696j31781J52432J01382l07767q4694J60512O3582k92060K07321J24443
11152A4066J48405j82944J13118J05807r6143n4080P6274J64220j7674l23598
$$ plain form
11142 -52549 211656 43681 13875 -200268 -72828 -53816 11249 146522 188959 156794 -318706
11131 -318706 -328439 91865 144890 -109583 -52993 -205324 97470 -238882 -46461 -83060
11121 -83060 177886 338974 -124688 -395699 -199178 -167655 -290390 -161016 -207171 39245
11111 39245 158219 206663 26761 31118 182373 299693 335166 327965 73342 -388687 -328131
11100 -328131 -359238 -414308 -87565 175577 22714 -205158 -374814 -271913 -236283 -217996
11090 -217996 -249014 142542 365784 235315 603427 146415 -15758 -266546 -286174 -53277
11080 -53277 43258 132990 -11900 -22973 199191 172293 34641 -22639 20930 228702 176809
11069 176809 29305 -50698 17798 -56995 -87522 -191869 -47751 -172036 -253694 -37013
$$ packed form
11142e2549K64205j67975k9806k14143J27440J9012O5065J35273M2437l2165m75500
11131c18706r733M20304N3025k54473N6590j52331L02794l36352J92421l6599
11121h3060K60946J61088m63662k71011J96521L1523j22735J29374m6155K46416
11111C9245J18974M8444j79902M357J51255J17320L5473p201k54623m62029O0556
11100c28131l1107n5070L26743K63142j52863k27872j69656J02901L5630J8287
11090b17996l1018L91556K23242j30469L68112m57012j62173k50788j9628K32897
11080e3277R6535Q9732j44890j1073K22164k6898j37652n7280M3569K07772n1893
11069A76809j47504q0003O8496p4793l0527j04347J44118j24285q1658K16681
$$ plain form
11059 -37013 87667 -281968 -359335 -222071 -148662 54737 -95062 3133 -39507 -3929 -32735
11048 -32735 182198 136031 -41532 -28951 -145757 -187319 -45008 -204202 -264349 -383866
11038 -383866 -244545 -58511 -14833 60229 -164362 -150115 -179685 -55163 144199 142655 -441426
11027 -441426 -565469 -515862 -68237 273975 461157 154708 -120240 -115480 -360502 -352189
11017 -352189 19077 187929 -171249 -99852 -214886 -2407 65763 -92437 -149545 -74108
11007 -74108 182543 147778 200422 216103 -78896 -251395 -79597 97301 228347 378562
10997 378562 57856 49685 45723 -116576 -238025 -310542 -36695 30031 -242876 -237751 -95521
10986 -95521 236196 372243 37984 16166 -101472 -332671 -217568 -144809 -50185 253637
$$ packed form
11059c7013J24680l69635p7367J37264P3409K03399j49799R8195m2640L5578k8806
11048c2735K14933m6167j77563J2581j16806m1562J42311j59194o0147j19517
11038c83866J39321J86034M3678P5062k24591J4247k9570J24522J99362j544n84081
11027d41426j24043M9607M47625L42212J87182l06449k74948M760k45022Q313
11017c52189L71266J68852l59178P1397j15034K12479O8170j58200n7108P5437
11007g4108K56651l4765N2644J5681k94999j72499J71798J76898J31046J50215
10997C78562l20706q171l962j62299j21449p2517K73847O6726k72907N125J42230
10986i5521L31717J36047l34259k1818j17638k31199J15103P2759R4624L03822
$$ plain form
10976 253637 211937 82253 -56111 -92826 287979 508723 392811 -103372 -546894 -60419
10966 -60419 -18430 -1957 142243 220814 -113426 -156139 -30661 81560 -187890 -136485 -33423
10955 -33423 -44569 18322 96272 192322 123780 379233 -51918 -328713 -141145 -65998 62510
10944 62510 4101 247232 -119785 -470466 -375857 -215943 -230429 -387599 -284457 -53617
10934 -53617 -178428 -469436 -343610 -60804 287789 -35356 -119889 -226537 -254446 -184527
10924 -184527 -109711 -127967 -272381 -359547 -60981 26780 97263 -185298 -397709 -182333
10914 -182333 -241343 -102351 61076 170166 200873 -54092 -449708 -481041 -470452 -247475
10904 -247475 -98586 -386922 -109423 180339 -37215 -135669 -106707 -53166 -190602 -77634
$$ packed form
10976B53637m1700j29684j38364l6715L80805K20744j15912m96183m43522M86475
10966f0419M1989J6473J44200P8571l34240m2713J25478J12221k69450N1405J03062
10955c3423j1146O2891P7950R6050o8542K55453m31151k76795J87568P5147J28508
10944F2510n8409K43131l67017l50681R4609J59914j4486j57170J03142K30840
10934e3617j24811k91008J25826K82806L48593l23145q4533j06648k7909O9919
10924a84527P4816j8256j44414q7166K98566Q7761P0483k82561k12411K15376
10914a82333n9010J38992J63427J09090L0707k54965l95616l1333J0589K22977
10904b47475J48889k88336K77499K89762k17554r8454K8962N3541j37436J12968
$$ plain form
10894 -77634 -159468 -193874 132595 6052 129613 219227 178857 -93826 -227392 -74025
10884 -74025 -77226 -466809 -321282 -583914 -470830 -316531 -386678 -214320 -218107 -96480 179985
10873 179985 -99256 -154636 -290986 -242151 -228536 -195868 -22222 -178106 -456702 -649658
10863 -649658 -113886 -130887 151399 18771 -323670 -366233 -135867 107486 -213396 -224976
10853 -224976 141588 -189887 -451800 -284565 -49804 205050 115266 74292 -77976 -109074
10843 -109074 -83069 19538 -104586 -311308 -516777 -373848 -201578 -179491 -74143 -150051
10833 -150051 -192529 -277637 -303472 -211309 -327164 -328919 49241 260284 100848 13558 -91679
10822 -91679 -30804 27634 -93127 -168999 -142535 58521 -88577 -295379 -88759 -307796
$$ packed form
10894g7634q1834l4406L26469j26543J23561Q9614m0370k72683j33566J53367
10884g4025l201l89583J45527k62632J13084J54299p0147J72358l787J21627K76465
10873A79985k79241n5380j36350M8835J3615L2668J73646j55884k78596j92956
10863f49658N35772j7001K82286j32628l42441m2563K30366K43353l20882j1580
10853b24976L66564l31475k61913J67235K34761K54854q9784m0974j52268l1098
10843a09074K6005J02607j24124k06722k05469J42929J72270K2087J05348p5908
10833a50051m2478q5108k5835R2163j15855j755L78160K11043j59436q7290j05237
10822i1679O0875N8438j20761p5872K6464K01056j47098k06802K06620k19037
$$ plain form
10812 -307796 -311226 -236440 -442980 -144826 -243285 -64653 124825 292875 -250343 -41582
10802 -41582 -146732 65602 247609 699 159643 44185 -200698 -126858 -163263 -296456
10792 -296456 -143867 134102 -100443 -243487 -439212 -410430 -183704 -401679 -149770 -126712
10782 -126712 -96729 55242 81562 212862 -47948 -102003 173199 256811 105845 147072
10772 147072 131715 152727 306019 167336 -67719 -260282 -45654 -15407 -179062 -2525
10762 -2525 180975 124352 -57360 236799 310358 -135902 57584 -96236 -202107 -144655
10752 -144655 -302238 103290 166253 -219943 -267733 -290800 -164967 -38431 -25338 -55276
10742 -55276 -130063 -246426 -42298 -44623 14436 -121234 -170448 -367263 -155072 20569 8149
$$ packed form
10812c07796l430P4786k06540K98154r8459J78632J89478J68050n43218K08761
10802d1582j05150K12334J82007k46910J58944j15458k44883P3840l6405j33193
10792b96456J52589K77969k34545j43044j95725K8782K26726k17975K51909K3058
10782a26712K9983J51971K6320J31300k60810n4055K75202Q3612j50966M1227
10772A47072j5357K1012J53292j38683k35055j92563K14628L0247j63655J76537
10762b525J83500n6623j81712K94159P3559m46260J93486j53820j05871N7452
10752a44655j57583M05528O2963l86196m7790k3067J25833J26536J3093k9938
10742e5276p4787j16363K04128k325N9059j35670m9214j96815K12191J75641j2420
$$ plain form
10731 8149 210611 63173 114017 335615 -79657 -164043 -21422 66024 139694 260795 303316
10720 303316 -104678 -251355 153972 377751 90566 -100347 -81576 -99348 -222652 14141
10710 14141 19373 31512 1970 28067 -124076 -14031 -262864 -257156 -87238 -339526 -340314
10699 -340314 -238933 -115791 -75335 101109 -37807 -71188 -61633 171717 -2680 -205188
10689 -205188 -220086 -338864 -156479 71375 -107304 -202231 102311 131098 -238208 -322484
10679 -322484 -209120 -172771 -101680 269158 -179016 -313321 -373315 -427720 -57483 40898
10669 40898 97442 119273 203414 226302 153551 151631 -24579 -31613 -124346 -208890 -203765 -54004
10657 -54004 -54340 -28871 -43494 -26098 386052 226000 187042 334176 126585 -119519 -157769
$$ packed form
10731H149K02462j47438N0844K21598m15272q4386J42621Q7446P3670J21101M2521
10720C03316m07994j46677M05327K23779k87185j90913J8771j7772j23304K36793
10710A4141N232J2139k9542K6097j52143J10045k48833N708J69918k52288p88
10699c40314J01381J23142M0456J76444j38916l3381R555K33350j74397k02508
10689b05188j4898j18778J82385K27854j78679r4927L04542K8787l69306q4276
10679c22484J13364L6349P1091L70838m48174j34305n9994n4405L70237R8381
10669D0898N6544K1831Q4141K2888p2751j920j76210p034r2733q4544N125J49761
10657e4004l36K5469j4623J7396M12150j60052l8958J47134k07591k46104l8250
$$ plain form
10646 -157769 20919 276168 37220 -76302 -321920 -336364 68464 -10287 -162383 -127945
10636 -127945 -121488 -191730 -304857 -55438 133559 -19682 -117148 23453 49217 -359769
10626 -359769 -451656 -120702 -62819 -23521 -109149 -123687 -65782 -362573 -160196 -4522 -23839
10615 -23839 -38172 3172 -84241 -293449 75171 75243 151483 -203077 -67677 -19979 -205505
10604 -205505 -10474 -97750 -143575 -117222 -153800 -155948 -136620 100550 26017 -108621 -328925
10593 -328925 228335 33292 -204942 -55033 217646 22561 -201377 -54513 166871 -61746
10583 -61746 -139238 -135136 -151836 151647 70531 55039 -62491 -225725 -230667 -33740 -55699
10572 -55699 -43753 147011 131070 -163928 -140263 -228153 -175007 -68777 -174941 -189995 -11902
$$ packed form
10646a57769J78688K55249k38948j13522k45618j4444M04828p8751j52096L4438
10636a27945O457p0242j13127K49419J88997j53241r7466J40601K5764m08986
10626c59769r1887L30954N7883L9298q5628j4538N7905k96791K02377J55674j9317
10615b3839j4333M1344q7413k09208L68620P2P6240l54560J35400M7698j85526
10604b05505J95031q7276m5825K6353l6578k148J9328K37170p4533j34638k20304
10593c28925N57260j95043k38234J49909K72679j95085k23938J46864K21384k28617
10583f1746p7492M102j6700L03483q1116j5492j17530j63234m942J96927k1959
10572e5699J1946J90764j5941k94998K3665q7890N3146J06230j06164j5054J78093
$$ plain form
10561 -11902 -258047 -228033 -194965 -48559 -113808 28216 31452 114919 -28075 -229035 -306663
10550 -306663 187264 -115313 -190708 -234894 -310685 -339954 -465288 -474438 -241937 -197393 -112746
10539 -112746 229490 -17918 -19610 -375573 -306951 -270703 -277386 -366495 -171847 -438454 -455301
10528 -455301 -122471 -33176 13125 -278929 -519152 -302785 -183317 -438566 -555969 -254117
10518 -254117 -123932 116310 326699 -80405 -55658 -203646 -115144 -265398 -522465 -277482
10508 -277482 -195327 -126290 -359015 -468122 -174239 -227506 -76229 -73087 -356980 -245214
10498 -245214 45634 -20776 30483 138917 -70276 -193831 -179985 112615 517821 310577
10488 310577 45474 -26324 -225018 -232363 -252092 -283540 -502816 -59610 150588 144688 -140222
$$ packed form
10561a1902k46145L0014L3068J46406o5249J42024L236Q3467j42994k00960p7628
10550c06663M93927l02577p5395m4186p5791k9269j25334r150K32501M4544Q4647
10539a12746L42236k47408j692l55963O8622L6248o683q9109J94648k66607j6847
10528d55301L32830Q9295M6301k92054k40223K16367J19468k55249j17403L01852
10518b54117J30185K40242K10389m07104K4747j47988Q8502j50254k57067K44983
10508b77482Q2155O9037k32725j09107K93883n3267J51277L142k83893J11766
10498b45214K90848o6410N1259J08434k09193j23555J3846K92600M05206k07244
10488C10577k65103p1798j98694p345j9729l1448k19276M43206K10198n900k84910
$$ plain form
10477 -140222 -142586 -56029 -180265 -120425 170242 34079 -243609 71553 353840 228983
10467 228983 -159255 14460 70837 4200 210222 181410 -56150 -316661 -425414 -369137
10457 -369137 -290581 -465523 -521767 -53987 89957 95160 104390 104992 -57702 -93167 -43648
10446 -43648 158343 -107743 -312757 -321339 -68276 61848 -212776 -269259 11309 -41936
10436 -41936 -78523 -60864 -401659 -185816 -181228 93893 38152 -119258 57211 6875 24751
10425 24751 129699 -94915 -63503 185054 272996 381469 307883 280066 318703 134688 -27494
10414 -27494 -133155 -226002 -254678 -249809 102778 1352 -20916 89148 170314 176691 134014
10403 134014 128566 180611 -168969 -222423 -218796 -421951 -487296 -130048 552 -306639 -153575
$$ packed form
10477a40222k364Q6557j24236N9840K90667j36163k77688L15162K82287j24857
10467B28983l88238J73715N6377o6637K06022k8812k37560k60511j08753N6277
10457c69137P8556j74942n6244M67780J43944N203R230O02j62694l5465M9519
10446d3648K01991k66086k05014q582K53063J30124k74624n6483K80568n3245
10436d1936l6587J7659l40795K15843M588K75121n5741j57410J76469n0336J7876
10425B4751J04948k24614L1412K48557Q7942J08473p3586k7817L8637j84015j62182
10414b7494j05661r2847k8676M869L52587j01426k2268J10064Q1166O377m2677
10403A34014n448N2045l49580n3454L627k03155o5345L57248J30600l07191J53064
$$ plain form
10392 -153575 -1607 81010 -86862 -95590 148959 302911 294675 227158 -63976 -19282 -223479
10381 -223479 -52433 261853 307536 130449 -2137 -238726 -347383 -427257 -400416 128747
10371 128747 96547 50072 181106 302155 422898 -8295 -241160 -140397 -363565 -547031
10361 -547031 -342688 -194381 -211917 -222461 104645 19741 -233613 -363369 -309781 -222071
10351 -222071 -268614 -472953 -550831 -383175 -258635 -311460 -257392 -198654 -343040 -221860
10341 -221860 -402929 -292297 -162049 149606 -60511 -222900 -61728 29637 -198526 -53720
10331 -53720 -237219 -337255 37272 -246190 -256324 -80553 -138240 -276269 -229918 -210788
10321 -210788 -190240 -43850 259475 -185889 -272548 -295974 -60345 158537 107627 191899
$$ packed form
10392a53575J51968Q2617j67872q728K44549J53952q236o7517k91134M4694k04197
10381b23479J71046L14286M5683j77087j32586k36589j08657p9874K6841N29163
10371A28747l2200m6475J31034J21049J20743m31193k32865J00763k23168j83466
10361e47031K04343J48307j7536j0544L27106q4904k53354j29756N3588Q7710
10351b22071m6543k04339p7878J67656J24540n2825N4068N8738j44386J21180
10341b21860j81069J10632J30248L11655k10117j62389J61172R1365k28163J44806
10331e3720j83499j00036L74527k83462j0134J75771n7687j38029M6351J9130
10321b10788K0548J46390L03325m45364q6659k3426K35629K18882n0910Q4272
$$ plain form
10311 191899 389775 193159 -48942 51603 -212743 -118335 -197393 -290119 -175754 72744
10301 72744 -363375 -295582 -122845 118872 310486 128552 7542 -36076 41543 3692
10291 3692 -26693 -199687 -151703 -137304 28714 26350 2151 17847 3582 79412 56643 -144202
10279 -144202 -269259 -426008 -64538 -3670 -198630 -104538 193728 217380 -124568 -244412
10269 -244412 -302402 -180686 -169069 -387685 -349456 -318852 -263427 -168856 -252321 -483811 -252141
10258 -252141 -74151 -346499 -269055 -273247 -204898 -142655 284978 276034 347148 113287 -3499
10247 -3499 39248 48801 73816 -146063 133239 233585 -46997 -212943 -209943 -261356 -251053
10236 -251053 -173584 106917 14803 -27928 20140 126739 63236 30738 175647 17107 -14167
$$ packed form
10311A91899J97876j96616k42101J00545k64346R4408p9058r2726J14365K48498
10301G2744m36119O7793J72737K41717J91614j81934j21010m3618P7619l7851
10291C692l0385j72994M7984J4399J66018k364k4199J5696j4265P5830k2769k00845
10279a44202j25057j56749L61470O0868j94960R4092K98266K3652l41948j19844
10269b44412n7990J21716J1617k18616L8229L0604N5425R4571q3465k31490K31670
10258b52141J77990k72348P7444m192O8349O2243M27633q944P1114k33861j16786
10247c499M2747R553K5015k19879K79302J00346k80582j65946L000n1413J0303
10236b51053P7469K80501r2114m2731M8068J06599o3503l2498J44909j58540l1274
$$ plain form
10225 -14167 79013 -127890 12748 -255864 -67032 70890 -374535 -519345 -320001 -330079
10215 -330079 -357178 -64130 198326 -7429 -37260 410998 211716 384507 263609 383500
10205 383500 341609 262908 101663 374171 537239 658733 626617 606429 364318 235937
10195 235937 82983 -128641 76427 99054 -131333 -227322 -207851 -275412 -432989 -320038
10185 -320038 44260 -64249 -27422 37423 -253916 -403691 -411824 -66947 -251799 -48468
10175 -48468 284910 334122 115309 -446434 -225685 -125873 191089 9623 -3910 -133540
10165 -133540 217277 188049 86775 -70253 -164638 -480874 -434577 -302551 -128772 -66848
10155 -66848 97195 323225 229071 255876 -88589 -126632 18933 -127819 -106148 -47576 -184221
$$ packed form
10225a4167R3180k06903J40638k68612J88832J37922m45425j44810J99344j0078
10215c30079k7099K93048K62456k05755k9831M48258j99282J72791j20898J19891
10205C83500m1891p8701j61245K72508J63068J21494l2116k0188k42111j28381
10195B35937j52954k11624K05068K2627k30387r5989J9471o7561j57577J12951
10185c20038L64298j08509L6827O4845k91339j49775q133L44877j84852K03331
10175d8468L33378M9212k18813n61743K20749R9812L16962j81466j3533j29630
10165a33540L50817k9228j01274j57028r4385l16236M6297J32026J73779O1924
10155f6848J64043K26030r4154K6805l44465l8043J45565j46752K1671N8572j36645
$$ plain form
10144 -184221 -42239 73955 221508 440067 484236 387445 440602 470360 550674 332781
10134 332781 32412 267888 360768 384035 472444 91920 53075 70860 -24543 -90447 -114881
10123 -114881 55187 -58578 -134631 11341 286317 484922 28040 -64404 12523 105942
10113 105942 210908 279488 262696 554963 550457 378271 322888 455706 473673 612607 784730
10102 784730 502471 166372 398359 869539 940206 625509 652609 860215 586395 556615
10092 556615 704230 701216 682956 634285 448485 748007 594258 666247 510363 316806
10082 316806 531236 498575 380412 528054 497754 361348 317587 395733 153332 160707 316166
10071 316166 479320 332113 375385 608572 719559 634562 731614 804763 1082278 886282
$$ packed form
10144a84221J41982J16194J47553K18559M4169r6791N3157K9758Q0314k17893
10134C32781l00369K35476R2880K3267Q8409l80524l8845J7785r5403o5904k4434
10123a14881J70068j13765p6053J45972K74976J98605m56882r2444P6927R3419
10113A05942J04966O8580j6792K92267m506j72186n5383J32818J7967J38934J72123
10102G84730k82259l36099K31987M71180P0667l14697K7100K07606k73820k9780
10092E56615J47615l014j8260m8671j85800K99522j53749P1989j55884j93557
10082C16806K14430l2661j18163J47642l0300j36406m3761P8146k42401P375J55459
10071C16166J63154j47207M3272K33187J10987q4997R7052P3149K77515j95996
$$ plain form
10061 886282 544621 896946 989513 1038142 1011840 964808 1257660 1586185 1189280 910610
10051 910610 734969 659380 455217 668389 621991 859718 845347 394715 351529 -61477
10041 -61477 83313 135692 96339 211552 194401 187632 49050 45783 81090 325839 375397
10030 375397 345432 419403 468267 699701 487780 314568 283310 320658 734663 529991
10020 529991 477655 370821 477606 298296 298671 270788 255815 263776 310646 165643 429866
10009 429866 237326 150990 232054 5917 126194 346069 516543 506667 354455 327497
9999 327497 570629 456832 21393 -312872 285364 365039 546448 318371 258819 514220
9989 514220 485242 588725 325420 341355 495372 638166 597770 455062 234362 429674
$$ packed form
10061H86282l41661L52325R2567M8629k6302m7032K92852L28525l96905k78670
10051I10610j75641p5589k04163K13172m6398K37727j4371m50632m3186m13006
10041f1477J44790N2379l9353J15213j7151o769j38582l267L5307K44749M9558
10030C75397k9965P3971M8864K31434k11921j73212l1258L7348M14005k04672
10020E29991n2336j06834J06785j79310L75k7883j4973P961M6870j45003K64223
10009D29866j92540q6336Q1064k26137J20277K19875J70474r876j52212k6958
9999C27497K43132j13797m35439l34265N98236P9675J81409k28077n9552K55401
9989E14220k8978J03483k63305J5935J54017J42794m0396j42708k20700J95312
$$ plain form
9979 429674 392254 302551 236221 224372 303269 353820 599704 554859 590711 532454 395069
9968 395069 405482 528786 421817 212804 484690 728193 869233 1101937 771277 592022
9958 592022 742083 819302 973392 852243 741262 612558 474041 652113 755351 766667
9948 766667 927188 677175 726777 640752 304374 542524 761237 841856 626608 754207
9938 754207 567835 642750 496175 477639 575390 524523 529455 532908 663924 649465 554047
9927 554047 584285 429976 698523 743903 791695 1106697 1173878 981771 729847 731817 686534
9916 686534 671564 575675 658608 1026082 649570 733345 906047 649282 681413 577418 561742
9905 561742 871716 671665 483166 611949 855765 661925 551851 539543 530595 697131
$$ packed form
9979D29674l7420q9703o6330j1849P8897N0551K45884m4845L5852n8257j37385
9968C95069J0413J23304j06969k09013K71886K43503J41040K32704l30660j79255
9958E92022J50061P7219J54090j21149j10981j28704j38517J78072J03238J1316
9948G66667J60521k50013M9602q6025l36378K38150K18713Q0619k15248J27599
9938G54207j86372P4915j46575j8536R7751n0867M932L453J31016j4459r5418
9927E54047L0238j54309K68547M5380M7792L15002O7181j92107k51924J970m5283
9916F86534j4970r5889Q2933L67474l76512Q3775J72702k56765L2131j03995j5676
9905E61742L09974k00051j88499J28783K43816j93840j10074j2308q948J66536
$$ plain form
9895 697131 1061485 1295772 1230321 1066201 786224 845423 720229 644162 708887 828065
9885 828065 741118 718819 711861 734628 777183 1049931 927240 914422 915547 876411 757833
9874 757833 825935 914462 1248081 1307042 1042624 963078 1018415 1208450 1116821 1253349 1457646
9863 1457646 1165294 1042371 1098459 1050464 1143878 1231925 1474128 1364890 1415647 1513030 1282936
9852 1282936 1316461 1285226 1481184 1561939 1673763 1732772 1615121 1574161 1523191 1656322 1493019
9841 1493019 1247587 1512875 1673337 1988459 1805810 2012936 2127802 1989186 1571832 1663172
9831 1663172 1727994 1654885 1829893 1894670 2135239 2177801 2200710 2322324 2288961 2079185 1996307
9820 1996307 2223580 2734722 2898091 2815450 2654886 2981309 2911304 2677467 2555291 2689410
$$ packed form
9895F97131L64354K34287o5451j64120k79977N9199j25194p6067O4725J19178
9885H28065q6947k2299o958K2767M2555K72748j22691j2818J125l9136j18578
9874G57833O8102Q8527L33619N8961k64418p9546N5337J90035r1629J36528K04297
9863A457646k92352j22923N6088m7995R3414Q8047K42203j09238N0757R7383k30094
9852A282936L3525l1235J95958Q0755J11824N9009j17651m0960n0970J33131j63303
9841A493019k45432K65288J60462L15122j82649K07126J14866j38616m17354R1340
9831A663172O4822p3109J75008O4777K40569M2562K2909J21614l3363k09776q2878
9820A996307K27273N11142J63369q2641j60564L26423p0005k33837j22176J34119
$$ plain form
9810 2689410 2918861 2677310 2657355 2778098 2593330 2626203 2855585 3113950 3132037 3293139
9800 3293139 3487015 3241074 3441364 3753690 3404338 3489535 3960256 4421577 4718972 4515154
9790 4515154 4317494 4408606 4839028 4710616 4677250 4953046 5158481 5319796 5485399 5879679
9780 5879679 5807688 6210998 6441134 6774289 7107843 7386052 7670268 8139184 8648524 9209903
9770 9209903 9502876 9910703 10471060 11105661 12063215 12572691 13322107 14290679 15264836 16521806
9760 16521806 17873442 19429288 20811351 22735772 24710534 26562292 28573086 30430150
9752 30430150 32919728 35310178 38024958 40730552 43560312 46705583 50228368 54526085
9744 54526085 60065572 66451904 73608942 82435714 92487219 103650925 114208556 123845505
$$ packed form
9810B689410K29451k41551j9955J20743j84768L2873K29382K58365J8087J61102
9800C293139J93876k45941K00290L12326l49352Q5197M70721M61321K97395k03818
9790D515154j97660R1112M30422j28412l3366K75796K05435J61315J65603L94280
9780E879679p1991M03310K30136L33155L33554K78209K84216M68916N09340N61379
9770I209903K92973M07827N60357O34601R57554N09476P49416R68572R74157J256970
9760A6521806J351636J555846J382063J924421J974762J851758K010794J857064
9752C0430150K489578K390450K714780K705594K829760L145271L522785M297717
9744E4526085N539487O386332P157038Q826772J0051505J1163706J0557631R636949
$$ plain form
9736 123845505 133069570 141024107 146411626 148987966 149191779 146142386 141261947 134817817
9728 134817817 127197202 118818918 110412858 102190218 95251639 89993718 85793146 82436569
9720 82436569 80064497 78710732 77704830 76968833 76779978 76980134 77495580 78426405 79748356
9711 79748356 81574241 84602220 88350095 93236773 99582502 107112362 116146515 126437682
9703 126437682 136558593 146063697 154888204 161387832 166084250 168113216 167056087 162902933
9695 162902933 157199638 149194912 139353014 128602708 117849488 107291529 97190645
9688 97190645 88567764 82101672 76198825 71001975 66524812 62679026 59394172 56454475
9680 56454475 53893224 51274304 48887546 46922559 45398197 43402333 41920399 40844444
$$ packed form
9736A23845505R224065P954537N387519K576340K03813l049393m880439o444130
9728A34817817p620615q378284q406060q222640o938579n257921m200572l356577
9720H2436569k372072j353765j005902p35997j88855K00156N15446R30825J321951
9711G9748356J825885L027979L747875M886678O345729P529860R034153J0291167
9703A26437682J0120911R505104Q824507O499628M696418K028966j057129m153154
9695A62902933n703295q004726r841898j0750306j0753220j0557959j0100884
9688I7190645q622881o466092n902847n196850m477163l845786l284854k939697
9680E6454475k561251k618920k386758j964987j524362j995864j481934j075955
$$ plain form
9672 40844444 39708225 38948788 38802381 38467986 38611146 39380539 40415922 41283047 42731950
9663 42731950 44138964 45679340 47019075 48259822 49234063 49498371 49425966 48726458 47431400
9654 47431400 45471448 43518612 41270150 39025209 36557552 34328595 32648862 30582388
9646 30582388 29170635 28038197 27200363 26828306 26370289 26165559 25948392 25846236 25736579
9637 25736579 25811271 26667311 27268902 28382867 29755721 30926486 32480407 34516596 37008623
9628 37008623 39366066 41397362 42925800 44551720 45567427 45906994 46063836 44833640
9620 44833640 43378919 41471815 38924610 36436305 34189557 31431453 29012748 26893813
9612 26893813 24856801 23178397 21554628 20294971 19205675 18240381 17406155 16643305 16304791
$$ packed form
9672D0844444j136219p59437j46407l34395J43160P69393J035383Q67125J448903
9663D2731950J407014J540376J339735J240747R74241K64308p2405o99508j295058
9654D7431400j959952j952836k248462k244941k467657k228957j679733k066474
9646C0582388j411753j132438q37834l72057m58017k04730k17167j02156j09657
9637B5736579P4692Q56040O01591J113965J372854J170765J553921K036189K492027
9628C7008623K357443K031296J528438J625920J015707L39567J56842j230196
9620D4833640j454721j907104k547205k488305k246748k758104k418705k118935
9612B6893813k037012j678404j623769j259657j089296r65294q34226p62850l38514
$$ plain form
9603 16304791 15799436 15008307 14981380 14697644 14493357 13951856 13277806 12752523 12713088 12424124
9593 12424124 12106013 11815872 11264721 11019266 10792311 10229307 9761549 9365510 8959802
9584 8959802 8976237 8715768 8112580 7706534 7158478 7147675 7302306 7496779 7354316 7464923
9574 7464923 7473538 7353342 6863185 6280841 6170908 6169933 5944909 6131594 6339027 6095562
9564 6095562 6145514 5997159 5817258 5540325 5537005 5415983 5588699 5603946 5029455 4970625
9554 4970625 5084246 4784204 4911803 4580970 4502496 4593968 4324799 4206911 4183072 4128045
9544 4128045 4140225 3902587 3925373 3842472 3844211 4097093 3992443 4124148 4307012 4089317
9534 4089317 4250073 4059282 4170692 4259947 4388362 4603925 4469903 4485436 4411938 4186390
$$ packed form
9603A6304791n05355p91129k6927k83736k04287n41501o74050n25283l9435k88964
9593A2424124l18111k90141n51151k45455k26955n63004m67758l96039m05708
9584H959802J6435k60469o03188m06046n48056j0803J54631J94473j42463J10607
9574G464923Q615j20196m90157n82344j09933r75k25024J86685K07433k43465
9564F095562M9952j48355j79901k76933l320j21022J72716J5247n74491n8830
9554D970625J13621l00042J27599l30833p8474R1472k69169j17888k3839n5027
9544D128045J2180k37638K2786q2901J739K52882j04650J31705J82864k17695
9534D089317J60756j90791J11410Q9255J28415K15563j34022J5533p3498k25548
$$ plain form
9524 4186390 4008532 3756880 3714631 3846957 3570169 3768000 3626328 3365986 3258137 3385276
9514 3385276 3114691 3278474 3230237 2928948 3080094 3371662 3417538 3363373 3247936 3228451
9504 3228451 3489296 3472900 3239602 3142974 3036237 2971771 3255359 3201702 3208381 3172239 2957444
9493 2957444 3034037 3014532 2945903 2662068 2692881 2731105 2785405 2889037 2795463 2514976 2614511
9482 2614511 2601779 2545671 2809656 2812196 2764911 2526868 2453384 2546771 2556044 2375965 2191246
9471 2191246 2090552 2284942 2416822 2171187 2052282 2317335 2341561 2366843 2533039 2230776
9461 2230776 2103008 2167370 2338809 2927480 2295831 2228696 2594615 2297472 1834616 2002831
9451 2002831 2170358 2215611 2420339 2491788 2429289 2712095 2727469 2288525 2294482 2292925 2188826
$$ packed form
9524D186390j77858k51652m2249J32326k76788J97831j41672k60342j07849J27139
9514C385276k70585J63783m8237l01289J51146K91568M5876n4165j15437j9485
9504C228451K60845j6396k33298r6628j06737o4466K83588n3657O679l6142k14795
9493B957444P6593j9505o8629k83835L0813L8224N4300J03632r3574k80487R9535
9482B614511j2732n6108K63985K540m7285k38043p3484R3387R273j80079j84719
9471B191246j00694J94390J31880k45635j18905K65053K4226K5282J66196l02263
9461B230776j27768O4362J71439N88671o31649o7135L65919k97143m62856J68215
9451B002831J67527M5253K04728P1449o2499K82806J5374m38944N957j557j04099
$$ plain form
9440 2188826 2235593 2128512 2129309 2508857 2560231 2257537 2419449 2430567 2278781 2406761 2410070
9429 2410070 2722020 3041204 3355942 3520107 3424822 3336331 3110598 2891898 3293208 2920545
9419 2920545 2632972 2635985 2663991 2665830 2657177 2343548 2301039 2698107 2826795 2674833 2656018
9408 2656018 2721848 2274027 2095688 2149509 2414265 2741138 2844517 2742246 2756677 2882902
9398 2882902 2699308 2668977 2731515 2747181 2848783 2757567 2558458 2726844 2598095 2727451
9388 2727451 2928011 3173287 3383629 2968249 3008757 3008417 3263175 3540594 3782954 3677037
9378 3677037 3828832 4078746 3794684 4097942 4344765 4058430 3961239 4124387 3955946 4044724
9368 4044724 3904411 3846644 4025334 4062804 3885416 3888597 3588018 3375147 3339356 3376112 3549425
$$ packed form
9440B188826M6767j07081P97L79548N1374l02694J61912J1118j51786J27980L309
9429B410070L11950L19184L14738J64165r5285q8491k25733k18700M01310l72663
9419B920545k87573L013K8006J839q653l13629m2509L97068J28688j51962j8815
9408B656018O5830m47821j78339N3821K64756L26873J03379j02271J4431J26225
9398B882902j83594l0331O2538J5666J01602r1216j99109J68386j28749J29356
9388B727451K00560K45276K10342m15380M0508l40K54758K77419K42360j05917
9378C677037J51795K49914k84062L03258K46823k86335r7191J63148j68441Q8778
9368D044724j40313n7767J78690L7470j77388L181l00579k12871l5791L6756J73313
$$ plain form
9357 3549425 3473904 3391496 3592254 3360818 3086987 3133294 3098229 3310320 2974359 3311270
9347 3311270 3160963 3375650 3648047 3604192 3773749 4036770 4155417 4113397 4010760 3931436
9337 3931436 3931942 3927505 3888426 3920290 4104376 3857903 3814275 4054517 3754447 3611658 3659429
9326 3659429 3521558 3742363 3874777 3812836 3922244 4092752 3991373 3893005 3863978 4000006
9316 4000006 4202203 4271587 4516243 4530317 4523459 4613543 4242967 4175339 4229836 4435483 4385923
9305 4385923 4339219 4375435 4397322 4186854 4206151 4264141 4458213 4557322 4256580 4392407 4567870
9294 4567870 4605471 4754189 4478091 4376912 4375556 4340727 4903747 4808339 4722665 4301104 4503418
9283 4503418 4898704 4922654 4806758 4603972 4867982 5002734 5141708 5114189 4966446 4908997
$$ packed form
9357C549425p5521q2408K00758k31436k73831M6307l5065K12091l35961L36911
9347C311270j50307K14687K72397m3855J69557K63021J18647m2020j02637p9324
9337C931436N06m437l9079L1864J84086k46473m3628K40242l00070j42789M7771
9326C659429j37871K20805J32414o1941J09408J70508j01379r8368k9027J36028
9316D000006K02197O9384K44656J4074o858R0084l70576o7628N4497K05647m9560
9305D385923m6704L6216K1887k10468J9297N7990J94072R9109l00742J35827J75463
9294D567870L7601J48718k76098j01179j356l4829N63020r5408q5674m21561K02314
9283D503418L95286K3950j15896k02786K64010J34752J38974k7519j47743n7449
$$ plain form
9273 4908997 5132103 5377593 5503617 5674967 5549142 5494671 5447199 5464145 5719711 5894378
9263 5894378 6077634 5990901 5834304 6199246 6408892 6088205 6130131 6260333 6626836 6722627
9253 6722627 6970618 7225895 7714696 7998752 8005329 7916550 8202389 8439032 8683857 9029983
9243 9029983 9512525 9911179 10204738 10286768 10435952 11044921 11217292 11595059 12353150 12601152
9233 12601152 12696011 13687844 14307439 14845708 15500846 16210014 17131197 18239698 19483457
9224 19483457 20840338 21880203 23573148 25661621 27797979 30341192 32807606 35928801
9216 35928801 39243995 42580210 46209817 49492933 52773205 55478884 57965588 60712583
9208 60712583 63365926 65555814 66799606 67846590 68237056 67436021 65824514 63961707
$$ packed form
9273D908997K23106K45490J26024J71350j25825n4471m7472J6946K55566J74667
9263E894378J83256q6733j56597L64942K09646l20687M1926J30202L66503R5791
9253F722627K47991K55277M88801K84056O577q8779K85839K36643K44825L46126
9243I029983M82542L98654K93559Q2030J49184O08969J72371L77767P58091K48002
9233A2601152R4859R91833O19595N38269O55138P09168R21183J108501J243759
9224A9483457J356881J039865J692945K088473K136358K543213K466414L121195
9216C5928801L315194L336215L629607L283116L280272K705679K486704K746995
9208F0712583K653343K189888J243792J046984L90466q01035j611507j862807
$$ plain form
9200 63961707 62054551 60134746 58819983 58081943 58296828 58867618 59793589 61279954 63593248
9191 63593248 66147092 69293879 73560406 78592846 84518445 91411018 99543976 109427753
9183 109427753 120429201 133478008 148688480 166096020 185208868 204496450 222466646
9176 222466646 239366835 255380175 269316812 281670867 293580875 305352601 315726614
9169 315726614 323151109 327025424 326369746 320041566 308695555 294262904 277316483 257845906
9161 257845906 238117697 218358855 199357146 182757369 169203722 157955767 148218916
9154 148218916 140189046 133972851 128916625 125180216 122088020 120308850 120069190 120782599
9146 120782599 122921662 126751884 132396506 139502964 147611069 157113205 167091803 175443122
$$ packed form
9200F3961707j907156j919805j314763p38040K14885N70790R25971J486365K313294
9191F3593248K553844L146787M266527N032440N925599O892573Q132958R883777
9183A09427753J1001448J3048807J5210472J7407540J9112848J9287582J7970196
9176B22466646J6900189J6013340J3936637J2354055J1910008J1771726J0374013
9169C15726614P424495L874315o55678o328180j1346011j4432651j6946421j9470577
9161B57845906j9728209j9758842j9001709j6599777j3553647j1247955r736851
9154A48218916q029870o216195n056226l736409l092196j779170k39660P13409
9146A20782599K139063L830222N644622P106458Q108105R502136R978598Q351319
$$ plain form
9138 175443122 181133411 184525483 185358507 184650972 183007423 178999601 172796313 164866218
9130 164866218 154943207 145142330 136094393 127835164 120763961 114326970 108539528 103107842
9122 103107842 97713828 93072934 88905059 85282752 81968104 78950198 76257495 73812967
9114 73812967 72291054 71632942 71195901 71223084 71968278 72917938 74446348 76719240 79597266
9105 79597266 83260475 87886926 92567841 97272861 100948972 104033747 106254494 108104116
9097 108104116 110568261 112411705 113309437 114466434 114429198 113718471 113628254 113353519 113080138
9088 113080138 112990398 113241114 113637163 113977069 113973302 113513534 111902632 109143350 105346026
9079 105346026 101675959 97074770 92278248 87819668 83155209 78510264 74799036 71854426
$$ packed form
9138A75443122N690289L392072Q33024p07535j643549m007822o203288p930095
9130A64866218r923011r800877r047937q259229p071203o436991n787442n431686
9122A03107842n394014m640894m167875l622307l314648l017906k692703k444528
9114G3812967j521913o58112m37041K7183P45194R49660J528410K272892K878026
9105G9597266L663209M626451M680915M705020L676111L084775K220747J849622
9097A08104116K464145J843444Q97732J156997l7236p10727r0217k74735k73381
9088A13080138q9740K50716L96049L39906l767m59768j610902k759282l797324
9079A05346026l670067m601189m796522m458580m664459m644945l711228k944610
$$ plain form
9071 71854426 68936240 66584007 64825867 63189554 62155416 60941592 59401016 58381292
9063 58381292 57858515 56840204 55866309 55681586 55695014 56109873 56945922 57997613 59203056
9054 59203056 60661148 61583116 62213718 62163864 61734478 61004981 59929697 58896916 57314041
9045 57314041 55099654 52781920 50763116 49577396 48200347 47332427 46825248 46280952 45878505
9036 45878505 45618983 45523249 45417399 45454824 45697485 45498577 45535102 45399050 45059355 44627538
9026 44627538 44236668 43846035 44009378 44175196 44363865 44926425 45599859 46701492 48122733
9017 48122733 49301863 49988847 50785674 51581303 51696231 51724374 51493905 51361000 50905184
9008 50905184 49824863 49345134 48976142 48465668 48044041 47304196 47022010 46894714 47178941
$$ packed form
9071G1854426k918186k352233j758140j636313j034138j213824j540576j019724
9063E8381292n22777j018311r73895j84723J3428M14859Q36049J051691J205443
9054E9203056J458092R21968O30602m9854m29386p29497j075284j032781j582875
9045E7314041k214387k317734k018804j185720j377049q67920n07179n44296m02447
9036D5878505k59522r5734j05850L7425K42661j98908L6525j36052l39695m31817
9026D4627538l90870l90633J63343J65818J88669N62560O73434J101633J421241
9017D8122733J179130O86984P96827P95629J14928K8143k30469j32905m55816
9008E0905184j080321m79729l68992n10474m21627p39845k82186j27296K84227
$$ plain form
8999 47178941 47249333 47598026 48280639 49343051 50579463 51363772 52993394 54992431 57822117
8990 57822117 61142317 64952533 69294776 74970639 81202218 88226025 95872057 104007866
8982 104007866 111640242 117508591 121594138 124261125 125991987 127728460 130139186 133829924
8974 133829924 137681434 139325814 139553661 138691805 136697027 134860442 134129243 134713316 136758424
8965 136758424 141007165 146969863 154306793 164190264 176084381 191707557 212031524 236910469
8957 236910469 264875688 295622464 330363753 362838967 380760711 385889247 382697159
8950 382697159 366479335 348410842 336484590 330270812 327224642 327080478 328688424 330652169
8942 330652169 332841436 334107229 335442040 335735829 331579305 322337807 308222485 289186436
$$ packed form
8999D7178941P0392L48693O82613J062412J236412P84309J629622J999037K829686
8990E7822117L320200L810216M342243N675863O231579P023807P646032Q135809
8982A04007866P632376N868349M085547K666987J730862J736473K410726L690738
8974A33829924L851510J644380K27847q61856j994778j836585p31199N84073K045108
8965A36758424M248741N962698P336930R883471J1894117J5623176K0323967K4878945
8957B36910469K7965219L0746776L4741289L2475214J7921744N128536l192088
8950C82697159j6217824j8068493j1926252o213778l046170j44164J607946J963745
8942C30652169K189267J265793J334811K93789m156524r241498j4115322j9036049
$$ plain form
8934 289186436 267237691 245354252 224792012 206096483 190039513 176274432 164600130
8927 164600130 154715723 146585900 139787491 134332626 130059168 127316999 126034308 125626550
8919 125626550 126359693 127897374 129290763 130170486 129788765 128664080 127019176 125679988
8911 125679988 124462614 123266247 120978526 117186612 112457967 107462666 101649135 95929179
8903 95929179 90453343 84979197 80120062 75365607 71412669 67661246 64334641 61370193
8895 61370193 58745450 56348813 54696789 52991700 51548544 50396765 49854055 49580737
8887 49580737 49384148 49253488 49781701 50527197 51058008 51800310 52552659 53346191 53444674 53856675
8877 53856675 54692285 54647090 54486433 53958430 52841915 51552931 50286803 48849570 47431598
$$ packed form
8934B89186436k1948745k1883439k0562240j8695529j6056970j3765081j1674302
8927A64600130r884407q129823o798409n454865m273458k742169j282691m07758
8919A25626550P33143J537681J393389Q79723l81721j124685j644904j339188
8911A25679988j217374j196367k287721l791914m728645m995301n813531n719956
8903I5929179n475836n474146m859135m754455l952938l751423l326605k964448
8895F1370193k624743k396637j652024j705089j443156j151779n42710k73318
8887D9580737j96589j30660N28213P45496N30811P42302P52349P93532R8483M12001
8877E3856675Q35610m5195j60657n28003j116515j288984j266128j437233j417972
$$ plain form
8868 47431598 45878991 43942195 41614298 39384208 37541880 35781241 34700748 32964279
8860 32964279 31904563 31409611 30636896 29812546 29603408 28842337 28462036 28242128 27923982
8851 27923982 28011890 28657635 29062686 29253330 29420783 29688960 29606578 29470995 29487922 29408224
8841 29408224 29077098 28532071 27941862 27216769 26371187 25431376 23979434 22930280 22109346
8832 22109346 20952542 20124700 19721217 19094872 18301390 17835131 17305669 16930300 16623896
8823 16623896 16289912 16079578 15766413 15236886 14821282 14401172 14361488 14597313 14522834 14280619
8813 14280619 14337392 14184005 14093806 13967574 13787587 13894537 13558437 13215501 13120692 12901433
8803 12901433 12589590 12403766 12361824 12214913 11891750 11453562 10956175 10504110 10348962 9952934
$$ packed form
8868D7431598j552607j936796k327897k230090j842328j760639j080493j736469
8860C2964279j059716m94952p72715q24350k09138p61071l80301k19908l18146
8851B7923982Q7908O45745M05051J90644J67453K68177q2382j35583J6927p9698
8841B9408224l31126n45027n90209p25093q45582r39811j451942j049154q20934
8832B2109346j156804q27842m03483o26345p93482m66259n29462l75369l06404
8823A6623896l33984k10334l13165n29527m15604m20110l9684K35825p4479k42215
8813A4280619N6773j53387r0199j26232j79987J06950l36100l42936r4809k19259
8803A2901433l11843j85824m1942j46911l23163m38188m97387m52065j55148l96028
$$ plain form
8793 9952934 9353034 9182620 9152791 9153970 9088324 8920362 8705968 8829365 8771560 8483170
8783 8483170 8538438 8648316 8660444 8658320 8689042 8672763 9032340 8816889 9212086 9269279 9137017
8772 9137017 9415763 9232334 8911467 8771084 8813313 8718359 8488893 7994402 7933348 7491708
8762 7491708 6846083 6777258 6705900 6803027 6607537 6130328 5920072 5816301 5571605 5360809
8752 5360809 5153258 5418865 5203597 5053648 4940661 5053145 4693524 4999766 5166464 4759035
8742 4759035 4653730 4317637 4759358 4710391 4388530 4746291 4880754 4824507 4666431 4539609
8732 4539609 4289613 4331526 4177478 4174503 4336985 4124029 4021131 3899120 3909634 3858657
8722 3858657 3696977 3283290 3068418 3350651 3601965 3393444 3205254 3228913 3112037 3083440
$$ packed form
8793I952934n99900j70414k9829J179o5646j67962k14394J23397n7805k88390
8783H483170N5268J09878J2128k124L0722j6279L59577k15451L95197N7193j32262
8772I137017K78746j83429l20867j40383M2229r4954k29466m94491o1054m41640
8762G491708o45625o8825p1358R7127j95490m77209k10256j03771k44696k10796
8752E360809k07551K65607k15268j49949j12987J12484l59621L06242J66698m07429
8742D759035j05305l36093M41721m8967l21861L57761J34463n6247j58076j26822
8732D539609k49996M1913j54048k975J62482k12956j02898j22011J0514n0977
8722C858657j61680m13687k14872K82233K51314k08521j88190K3659j16876k8597
$$ plain form
8712 3083440 3223231 3385326 3361373 3373903 2997074 2751836 2757693 2580315 2576860 2474997 2747053
8701 2747053 2882487 2841151 2998201 2847886 2574155 2740582 2957700 2797292 2928318 2692749
8691 2692749 2607672 2891437 2573636 2609077 2694347 2606278 2395886 2669578 2325290 2191184
8681 2191184 2579258 2709210 2696377 2752019 2274619 2234648 2110296 2069191 1845054 1875845
8671 1875845 2264598 2124689 2347939 2544445 2642251 2597875 2446615 2285750 2391964 2241548
8661 2241548 2196669 2250547 2331192 2467431 2488574 2489921 2252600 2385043 2616482 2615669 2506339
8650 2506339 2463962 2861966 2940033 2810146 2708975 2716533 2927624 2780637 2696387 2676123 2764824
8639 2764824 3006993 3008152 3240645 3424277 3506145 3359587 3370223 3705190 3756531 3688300 3643566
$$ packed form
8712C083440J39791J62095k3953J2530l76829k45238N857j77378l455j01863K72056
8701B747053J35434m1336J57050j50315k73731J66427K17118j60408J31026k35569
8691B692749q5077K83765l17801L5441Q5270q8069k10392K73692l44288j34106
8681B191184L88074J29952j2833N5642m77400l9971j24352m1105k24137L0791
8671A875845L88753j39909K23250J96506R7806m4376j51260j60865J06214j50416
8661B241548m4879N3878Q0645J36239K1143J347k37321J32443K31439q13j09330
8650B506339m2377L98004P8067j29887j01171P558K11091j46987q4250k0264Q8701
8639B764824K42169J159K32493J83632Q1868j46558J0636L34967N1341o8231m4734
$$ plain form
8628 3643566 3675042 3395236 3258684 3098242 3016020 2888792 2729871 2610458 2573543 2501476
8618 2501476 2382897 2273723 2363269 2455686 2282578 2080955 1907856 1660110 2027893 1964801
8608 1964801 1750670 1747233 1710759 1876181 2031510 1845278 1973867 1842743 1750103 1782476
8598 1782476 1545863 1415842 1561731 1805009 2064643 1916604 1415281 1677234 1428709 1384656
8588 1384656 1442482 1256755 1372360 1903070 1795771 1874876 1656201 1602468 1795538 1702148
8578 1702148 1593331 1920129 1830658 1582693 1400109 1674289 1963725 2071300 1625456 1535404
8568 1535404 1649472 1265830 1491405 1510796 1417131 1541683 1728927 1584338 1337961 1405854
8558 1405854 1624344 1705834 1576201 1276635 1080610 1298508 1608390 1717492 1573275 1659591
$$ packed form
8628C643566L1476k79806j36552j60442q2222j27228j58921j19413l6915p2067
8618B501476j18579j09174Q9546R2417j73108k01623j73099k47746L67783o3092
8608A964801k14131l437l6474J65422J55329j86232J28589j31124r2640L2373
8598A782476k36613j30021J45889K43278K59634j48039n01323K61953k48525m4053
8588A384656N7826j85727J15605N30710j07299P9105k18675n3733J93070r3390
8578A702148j08817L26798q9471k47965j82584K74180K89436J07575m45844r0052
8568A535404J14068l83642K25575J9391r3665J24552J87244j44589k46377O7893
8558A405854K18490Q1490j29633k99566j96025K17898L09882J09102j44217Q6316
$$ plain form
8548 1659591 1743898 1739760 2045022 1733147 1874133 1805314 1688503 1715198 1679913 1663362 1688609
8537 1688609 1722140 1758949 1842431 1880369 2060218 1863954 1570030 1600168 1786181 1829414 1711457
8526 1711457 1958217 2350861 2258353 2527935 2394625 2439737 2371950 2480965 2703450 2780238
8516 2780238 2826733 2849496 2942932 3250806 3297702 3348378 3370539 3102114 3242712 3747943 3735306
8505 3735306 3844747 4399566 4505650 4704457 4922440 5186787 5407982 5724404 6331010 6798373
8495 6798373 7056092 7816108 8232168 8910575 9648160 10501688 11722111 12928406 14210540
8486 14210540 15850048 18083348 20259122 23076472 26413250 29252767 32597490 35153215
8478 35153215 36576569 37424103 37292495 35805463 33509554 30396459 27014744 24089957
$$ packed form
8548A659591Q4307m138L05262l11875J40986o8819j16811K6695l5285j6551K5247
8537A688609L3531L6809Q3482L7938J79849j96264k93924L0138J86013M3233j17957
8526A711457K46760L92644r2508K69582j33310M5112o7787J09015K22485P6788
8516B780238M6495K2763R3436L07874M6896N0676K2161k68425J40598N05231j2637
8505C735306J09441N54819J06084J98807K17983K64347K21195L16422O06606M67363
8495F798373K57719P60016M16060O78407P37585Q53528J220423J206295J282134
8486A4210540J639508K233300K175774K817350L336778K839517L344723K555725
8478C5153215J423354Q47534j31608j487032k295909l113095l381715k924787
$$ plain form
8470 24089957 21535577 19356580 17367724 15593358 14271550 13026303 11823607 11097065
8462 11097065 9961998 9217577 8506226 7867626 7437232 6529172 6155980 5920847 5462301
8453 5462301 5111017 5118552 4983357 4485292 3860696 4054218 4047148 3636756 3489839 3114461
8443 3114461 2854935 2967247 2859648 2852059 3004236 2910767 2643932 2641088 2427562 2294511
8433 2294511 2018579 1633624 1800165 1562014 1641864 1804837 1567157 1463330 1622258 1797245
8423 1797245 2015034 1944209 1644191 1338160 1420763 1407654 1197956 1081283 1129798 1736805
8413 1736805 1736215 1690747 1608152 1272800 1402435 1187443 1410876 1126896 1193307 1335868 1243352
8402 1243352 1300218 1187174 1177212 996751 1155116 1448900 1341357 1197629 1251660 1265867
$$ packed form
8470B4089957k554380k178997j988856j774366j321808j245247j202696p26542
8462A1097065j135067p44421p11351o38600m30394r08060l73192k35133m58546
8453E462301l51284P535j35195m98065o24596J93522p070m10392j46917l75378
8443C114461k59526J12312j07599p589J52177r3469k66835k844k13526j33051
8433B294511k75932l84955J66541k38151P9850J62973k37680j03827J58928J74987
8423A797245K17789p0825l00018l06031Q2603j3109k09698j16673M8515O07007
8413A736805n90m5468q2595l35352J29635k14992K23433k83980O6411J42561r2516
8402A243352N6866j13044r962j80461J58365K93784j07543j43728N4031J4207
$$ plain form
8392 1265867 1030703 873686 836920 932328 1209620 995830 838564 1327593 1257920 1102297
8382 1102297 1103225 1015017 912252 590861 487173 433299 379390 261358 362235 431159 483929
8371 483929 762517 509329 478163 627987 921069 1043629 796933 497295 326887 603365
8361 603365 718683 667336 676247 379897 188620 347492 529296 498389 166958 494159
8351 494159 568289 430264 181153 143591 159382 310501 325927 297139 276594 374222 520811
8340 520811 301728 355715 810127 678365 528265 332332 -28542 256284 441452 212640
8330 212640 247701 347376 431804 173657 -48324 -239898 -93963 196212 373823 232723
8320 232723 264313 483607 293671 111362 -58276 157203 364807 154686 54895 253104
$$ packed form
8392A265867k35164j57017l6766R5408K77292k13790j57266M89029o9673j55623
8382A102297R28q8208j02765l21391j03688n3874n3909j18032J00877O8924N2770
8371D83929K78588k53188l1166J49824K93082J22560k46696k99638j70408K76478
8361F03365J15318n1347Q911k96350j91277J58872J81804l0907l31431L27201
8351D94159P4130j38025k49111l7562J5791J51119J5426k8788k0545R7628J46589
8340E20811k19083N3987M54412j31762j50100j95933l60874K84826J85168k28812
8330B12640L5061R9675Q4428k58147k21981j91574J45935K90175J77611j41100
8320B32723L1590K19294j89936j82309j69638K15479K07604k10121r9791J98209
$$ plain form
8310 253104 4809 -138281 -21495 79478 160176 -37056 58703 244214 83493 -95288
8300 -95288 -374836 -103129 119029 17826 -296934 -37296 212571 287907 -95513 301268
8290 301268 172544 29011 -88495 -119181 -381387 -251963 -357144 -456236 -276640 -202812
8280 -202812 264661 224690 87064 87651 33069 110870 215522 -139105 -537435 -241453 -46619
8269 -46619 -187725 37248 78637 -53782 -395634 -135094 -156367 -134476 -321270 -115113
8259 -115113 209534 126755 114941 396404 233108 -3931 36469 56059 235680 607296
8249 607296 438329 459370 400138 451910 91593 13145 10845 -56317 215956 -4878 -116804
8238 -116804 -14180 55721 116795 -190964 119819 408468 292808 283353 396640 -16007
$$ packed form
8310B53104k48295j43090J16786J00973Q0698j97232R5759J85511j60721j78781
8300i5288k79548K71707K22158j01203l14760K59638K49867P5336l83420L96781
8290C01268j28724j43533j17506l0686k62206J29424j05181r9092J79596P3828
8280b02812M67473l9971j37626N87n4582P7801J04652l54627l98330K95982J94834
8269d6619j41106K24973M1389j32419l41852K60540k1273K1891j86794K06157
8259a15113L24647q2779j1814K81463j63296k37039M0400J9590J79621L71616
8249F07296j68967K1041n9232N1772l60317p8448k300o7162K72273k20834j11926
8238a16804J02624O9901O1074l07759L10783K88649j15660r455J13287m12647
$$ plain form
8228 -16007 97290 298500 436123 224000 -286550 -274793 -86219 -233851 -29846 219489
8218 219489 219926 269796 60154 221270 307210 351331 390117 185825 124436 356426 331201
8207 331201 247956 173555 265868 315626 435439 524033 516406 393196 243707 48084 396622
8196 396622 300136 475765 891865 416328 -5414309 -3902796 -1004026 -1116291 -689496
8187 -689496 -392848 -190489 -454250 -359437 -621643 -232017 -780219 -337503 -131101 -185552
8177 -185552 -411505 -191787 5864 323347 226435 109181 -300888 -156075 -112022 -117719
8167 -117719 -379341 -18230 -371887 -288753 171271 178539 -54912 -18983 -44570 32106 -120650
8156 -120650 -185689 -502658 -444196 -317252 188998 49696 242525 39799 -281441 -259834
$$ packed form
8228a6007J13297K01210J37623k12123n10550J1757J88574j47632K04005K49335
8218B19489M37M9870k09642J61116Q5940M4121L8786k04292o1389K31990k5225
8207C31201q3245p4401R2313M9758J19813Q8594p627j23210j49489j95623L48538
8196C96622r6486J75629M16100m75537n830637J511513K898770j12265M26795
8187f89496K96648K02359k63761R4813k62206L89626n48202M42716K06402n4451
8177a85552k25953K19718J97651L17483r6912j17254m10069J44813M4053n697
8167a17719k61622L61111l53657Q3134M60024P268k33451L5929k5587P6676j52756
8156a20650o5039l16969N8462J26944N06250j39302J92829k02726l21240K1607
$$ plain form
8146 -259834 -106368 -184694 -80398 97362 171518 179382 -281673 -76390 356732 100110
8136 100110 50885 363080 350198 433617 -58501 -181966 -103054 -24482 -90984 357469 519110
8125 519110 224596 -55651 64421 143951 216230 8207 271282 78086 177543 237190
8115 237190 282951 229612 276219 209714 96482 102083 297837 92706 72376 -34053 176544
8104 176544 531646 681320 648319 722244 1211690 973973 612587 1082357 1354301 1287091
8094 1287091 1544046 1648346 1895452 2181640 2388661 2682424 2858445 3178449 3239898 3689773
8084 3689773 4038945 3894826 3976032 3682511 3361165 2754381 2431399 2077973 2073952 1994638
8074 1994638 1813159 1448633 1628537 1121379 873534 1072691 1117643 1090145 977132 749689
$$ packed form
8146b59834J53466p8326J04296J77760P4156P864m61055K05283M33122k56622
8136A00110m9225L12195j2882Q3419m92118j23465P8912P8572o6502M48453J61641
8125E19110k94514k80247J20072P9530P2279k08023K63075j93196R9457N9647
8115B37190M5761n3339M6607o6505j13232N601J95754k05131k0330j06429K10597
8104A76544L55102J49674l3001P3925M89446k37717l61386M69770K71944o7210
8094A287091K56955J04300K47106K86188K07021K93763J76021L20004O1449M49875
8084C689773L49172j44119Q1206k93521l21346o06784l22982l53426m021p9314
8074A994638j81479l64526J79904n07158k47845J99157M4952k7498j13013k27443
$$ plain form
8064 749689 604464 611683 611731 672485 585020 477098 115117 513392 463289 368644 502205
8053 502205 466929 462747 162604 -30807 87066 362539 199264 -228733 -216920 7005
8043 7005 296891 59187 3461 199106 143999 80119 243249 208158 269489 245765 197230
8032 197230 247585 423817 312261 64832 -38715 -263123 -174400 -96107 139752 263017
8022 263017 128249 167768 56289 -242467 -351416 -84963 -233456 -288917 -201123 32151
8012 32151 -13710 -115976 -2977 -88207 -288066 -239813 -279862 -346078 -308129 -286671 66025
8001 66025 -12229 -2233 -192955 -228952 -167706 -351815 117397 99259 -310615 -35516 78194
7990 78194 -11326 -81507 13842 79834 -14455 146945 97137 644 309906 120050 -116188
$$ packed form
8064G49689j45225P219M8O0754q7465j07922l61981L98275n0103r4645J33561
8053E02205l5276m182l00143j93411J17873K75473j63275m27997J1813K23925
8043G005K89886k37704n5726J95645n5107o3880J63130l5091O1331k3724m8535
8032A97230N0355J76232j11556k47429j03547k24408Q8723P8293K35859J23265
8022B63017j34768L9519j11479k98756j08949K66453j48493n5461Q7794K33274
8012C2151m5861j02266J12999q5230j99859M8253m0049o6216L7949K1458L52696
8001F6025p8254R996j90722l5997O1246j84109M69212j8138m09874K75099J13710
7990G8194q9520p0181R5349O5992r4289J61400m9808r6493L09262j89856k36238
$$ plain form
7979 -116188 -336783 -350248 -182754 -184268 14559 -29404 -211587 -302251 -414503 -197690 -154177
7968 -154177 159760 81429 -95497 -254892 -234264 -322015 -125683 -223500 -289526 -237128 -154988
7957 -154988 15710 -16778 8153 122485 246418 149810 -38320 16110 188341 572720
7947 572720 225012 -6732 267087 297784 393032 64545 -512977 -309642 -151715 -422870
7937 -422870 -88749 27403 -288883 -357256 -272942 -304170 -377234 -219794 -164605 -572628 -688852
7926 -688852 -618030 -110501 74201 -29011 141476 186629 -361702 -458146 -303155 -182780
7916 -182780 -63434 90571 65640 -172627 -134163 -43518 -231080 -100725 -118375 -213391 -245246
7905 -245246 -353651 -302591 -518654 -468757 -335359 -389217 -362824 -505098 -246909 -211303 61406
$$ packed form
7979a16188k20595j3465J67494j514J98827m3963j82183r0664j12252K16813M3513
7968a54177L13937p8331j76926j59395K0628q7751J96332r7817o6026N2398Q2140
7957a54988J70698l2488K4931J14332J23933r6608j88130N4430J72231L84379
7947E72720l47708k31744K73819L0697R5248l28487n77522K03335J57927k71155
7937d22870L34121J16152l16286o8373Q4314l1228p3064J57440N5189m08023j16224
7926f88852P0822N07529J84702j03212J70487M5153n48331r6444J54991J20375
7916a82780J19346J54005k4931k38267L8464R0645j87562J30355j7650r5016l1855
7905b45246j08405N1060k16063M9897J33398n3858K6393j42274K58189L5606K72709
$$ plain form
7894 61406 -238811 -131478 174806 -60540 -172137 -260547 -90765 -139098 -153037 -52238
7884 -52238 -283626 -514019 -362482 -342047 -257643 -269849 -264394 -55092 -119071 -180098 -372863
7873 -372863 -174645 -111884 -180875 -146886 -181873 14539 -23458 261502 246521 141446 336141
7862 336141 -4980 -308856 -41422 -56425 72789 288862 -139725 -380205 112955 165158
7852 165158 148397 107874 -174273 21778 -262098 -256421 -346254 -321790 -67171 -62333 -279087
7841 -279087 -111196 -211574 16727 -6966 -83553 151168 -206363 -94418 -136030 -33465
7831 -33465 177237 21647 -337994 -292074 -55947 33728 491862 485235 189369 305707 545463
7820 545463 358739 -22799 117856 215395 194530 -86282 -69452 -62850 205119 -117061 6473
$$ packed form
7894F1406l00217J07333L06284k35346j11597q8410J69782m8333j3939J00799
7884e2238k31388k30393J51537K0435Q4404j2206N455K09302o3979o1027j92765
7873c72863J98218O2761o8991L3989l4987J96412l7997K84960j4981j05075J94695
7862C36141l41121l03876K67434j5003J29214K16073m28587k40480M93160N2203
7852A65158j6761m0523k82147J96051k83876N677q9833K4464K54619M838k16754
7841b79087J67891j00378K28301k3693p6587K34721l57531J11945m1612J02565
7831c3465K10702j55590l59641M5920K36127Q9675M58134o627k95866J16338K39756
7820E45463j86724l81538J40655R7539k0865k80812J6830O602K67969l22180J23534
$$ plain form
7809 6473 336332 608347 442074 16880 184653 317487 131430 200032 227669 266653 613039
7798 613039 480019 38366 24855 -11546 -53519 209487 672418 593480 601069 565882 1003456
7787 1003456 782542 520066 799518 1095627 1079485 1089300 1096778 868883 1075306 1514610
7777 1514610 1715557 1530388 1701967 1410416 1235708 1412386 1280523 946699 929658 841928
7767 841928 574822 523076 405392 343328 487393 351077 619908 285203 472188 374920
7757 374920 -59747 125220 -17967 -91393 -10772 323515 464278 246948 503017 375682
7747 375682 437650 326026 174262 91909 407885 180721 181288 15501 8010 232691 163477
7736 163477 317153 230998 316525 425394 218133 183768 313717 507521 913869 601653
$$ packed form
7809F473L29859K72015j66273m25194J67773J32834j86057O8602K7637L8984L46386
7798F13039j33020m41653j3511l6401m1973K63006M62931p8938P589l5187M37574
7787A003456k20914k62476K79452K96109j6142R815P478k27895K06423M39304
7777A514610K00947j85169J71579k91551j74708J76678j31863l33824j7041q7730
7767H41928k67106n1746j17684o2064J44065j36316K68831l34705J86985r7268
7757C74920m34667J84967j43187p3426Q0621L34287J40763k17330K56069j27335
7747C75682O1968j11624j51764q2353L15976k27164N67j65787p491K24681o9214
7736A63477J53676q6155Q5527J08869k07261l4365J29949J93804M06348l12216
$$ plain form
7726 601653 399641 160024 320607 383446 467501 746798 554951 265702 380411 502276
7716 502276 562577 681440 665751 828980 942415 380711 216781 706024 407080 95408
7706 95408 218500 450423 530768 572974 592941 398593 215934 389371 613024 649980 613783
7695 613783 569826 663063 493171 647506 733568 721314 775030 764695 646992 658747 760296
7684 760296 813202 708003 817616 554891 785022 846113 588398 969069 825600 671137
7674 671137 846438 1011490 909166 934940 912536 950845 865249 728949 712239 518842 607967
7663 607967 456446 428113 590791 882480 886316 407531 634341 719602 906649 1106271
7653 1106271 1063538 1019423 929580 1227365 1151529 692243 911951 1315837 1182007 838646
$$ packed form
7726F01653k02012k39617J60583O2839Q4055K79297j91847k89249J14709J21865
7716E02276O0301J18863j5689J63229J13435n61704j63930M89243k98944l11672
7706I5408J23092K31923Q0345M2206J9967j94348j82659J73437K23653L6956l6197
7695F13783m3957R3237j69892J54335Q6062j2254N3716j0335j17703J1755J01549
7684G60296N2906j05199J09613k62725K30131O1091k57715L80671j43469j54463
7674F71137J75301J65052j02324K5774k2404L8309q5596j36300j6710j93397Q9125
7663F07967j51521k8333J62678K91689L836m78785K26810Q5261J87047J99622
7653A106271m2733m4115q9843K97785p5836m59286K19708M03886j33830l43361
$$ plain form
7643 838646 829543 744233 687968 789947 853283 654589 471610 922153 1061338 1128358 1109708
7632 1109708 1075487 1028323 933540 927760 1048329 1075362 1116333 1322883 1275028 968093 912126
7621 912126 858878 1103474 1306682 1375475 1332839 1001179 928037 947383 1295068 1290349 1065781
7610 1065781 1219122 1193713 1011915 1209838 1288116 968970 1019215 1472633 1483642 1473374
7600 1473374 1185597 1141796 1234891 1237582 1335889 1448273 1555168 1372218 1656615 1459452
7590 1459452 1334440 1347368 1348328 1663808 1678218 1860024 1489834 1271420 1571747 1530856 1655630
7579 1655630 1876473 1800144 1427139 1437799 1870947 1955799 2103000 1694887 1537796 1586087
7569 1586087 2070949 2229970 2047819 2218303 2154643 2377754 2299493 2267083 2440097 2289663
$$ packed form
7643H38646r103q5310n6265J01979O3336j98694j82979M50543J39185O7020j8650
7632A109708l4221m7164r4783n780J20569K7033M0971K06550m7855l06935n5967
7621I12126n3248K44596K03208O8793m2636l31660p3142J9346L47685m719k24568
7610A065781J53341k5409j81798J97923P8278l19146N0245M53418J1009j0268
7600A473374k87777m3801R3095K691R8307J12384J06895j82950K84397j97163
7590A459452j25012J2928R60L15480J4410J81806l70190k18414L00327m0891J24774
7579A655630K20843p6329l73005J0660M33148Q4852J47201m08113j57091M8291
7569A586087M84862J59021j82151J70484o3660K23111p8261l2410J73014j50434
$$ plain form
7559 2289663 2199001 2218588 2384516 2642744 2777842 2606097 2607539 3069626 3188457 3193260 2822959
7548 2822959 2854723 3319197 3346961 3534468 3460506 3496805 3575299 3578883 3612859 3817598 3849390
7537 3849390 4001910 4061646 4211484 4692412 4729794 4710675 4718335 5037044 4790499 4995665
7527 4995665 5120183 5354149 5585029 5681550 5767990 5984151 6586102 6652533 6748486 7165698
7517 7165698 7512777 7945270 8103765 8369599 8734534 8823432 9166776 9533952 9768995 10609378
7507 10609378 10953963 11181062 11785353 12699485 13408155 14061896 14733822 15734150 16854234
7498 16854234 17563081 18860044 19859220 21074397 21961605 23010709 24630199 26368311 28269704
7489 28269704 30415000 32747051 35104620 38051966 41203798 44169434 47985521 52013337
$$ packed form
7559B289663r0662J9587J65928K58228J35098j71745J442M62087J18831M803l70301
7548B822959L1764M64474K7764J87507p3962L6299P8494L584L3976K04739L1792
7537C849390J52520N9736J49838M80928L7382j9119P660L18709k46545K05166
7527D995665J24518K33966K30880R6521Q6440K16161O01951O6431R5953M17212
7517G165698L47079M32493J58495K65834L64935Q8898L43344L67176K35043Q40383
7507A0609378L44585K27099O04291R14132P08670O53741O71926J000328J120084
7498A6854234P08847J296963R99176J215177Q87208J049104J619490J738112J901393
7489B8269704K145296K332051K357569K947346L151832K965636L816087M027816
$$ plain form
7481 52013337 56795721 62303539 68550715 75445690 83242318 91802267 101964433 113658450
7473 113658450 126573517 141929303 159771518 180086741 203004956 228254052 255128792
7466 255128792 281761125 304690084 321403602 330403897 329456184 318133341 299600648
7459 299600648 275978087 249838240 223912808 200713757 180786196 163743310 148857284
7452 148857284 135888238 124013947 113383479 103865752 95237479 87500154 80606634 74936188
7444 74936188 69728561 64919343 60592943 56918440 53661602 50669053 47999406 45660014
7436 45660014 43828294 42251525 40627519 39060489 37796176 36557984 35750701 34902573
7428 34902573 34019879 33291495 32847106 32476948 32025472 32221441 32227684 32378126 32593693 33201272
$$ packed form
7481E2013337M782384N507818O247176O894975P796628Q559949J0162166J1694017
7473A13658450J2915067J5355786J7842215K0315223K2918215K5249096K6874740
7466B55128792K6632333K2928959J6713518R000295r47713j1322843j8532693
7459B99600648k3622561k6139847k5925432k3199051j9927561j7042886j4886026
7452A48857284j2969046j1874291j0630468r517727q628273p737325o893520n670446
7444G4936188n207627m809218m326400l674503l256838k992549k669647k339392
7436D5660014j831720j576769j624006j567030j264313j238192q07283q48128
7428C4902573q82694p28384m44389l70158m51476J95969O243J50442K15567O07579
$$ plain form
7418 33201272 33941387 35245096 36930112 38596685 40263762 42748295 45798879 49219477
7410 49219477 53279500 57691849 62686319 67664171 72276840 76039773 78268605 78859030
7402 78859030 77124841 73675556 69244391 63908327 58626113 53530982 49354926 45781809
7394 45781809 42332481 39070237 36185747 33835290 31699997 29167310 27291457 26016150
7386 26016150 24605169 23399886 22207504 21242946 20640831 19975246 19577216 19325729 18874801
7377 18874801 18615825 18668737 18522757 18730275 18601628 18844455 19048328 18774388 18272348 17543820
7367 17543820 16851537 16331849 15563355 14592735 13699931 13102715 12507838 11769674 11281075
7358 11281075 10830247 10866247 10310217 9840748 9548194 9106154 8818384 8754875 8708294 8543681
$$ packed form
7418C3201272P40115J303709J685016J666573J667077K484533L050584L420598
7410D9219477M060023M412349M994470M977852M612669L762933K228832N90425
7402G8859030j734189l449285m431165n336064n282214n095131m176056l573117
7394D5781809l449328l262244k884490k350457k135293k532687j875853j275307
7386B6016150j410981j205283j192382r64558o02115o65585l98030k51487m50928
7377A8874801k58976N2912j45980K07518j28647K42827K03873k73940n02040p28528
7367A7543820o92283n19688p68494r70620q92804n97216n94877p38164m88599
7358A1281075m50828L6000n56030m69469k92554m42040k87770o3509m6581j64613
$$ plain form
7348 8543681 8087305 7767596 7408082 7347665 7125597 6950109 6697366 6442363 6480622 6434701
7338 6434701 6169042 6172038 6130541 6117951 6233369 6418801 6665770 6762676 6948606 7117826
7328 7117826 7223956 7388578 7768363 8240129 8172810 8026898 8485769 8493529 8277845 7639681
7318 7639681 7068567 6755741 6519759 6079880 5864541 5465310 5349212 5276794 4741841 4539673
7308 4539673 4477072 4437059 4201707 3937330 3481820 3405295 3493840 3533852 3366044 3226314
7298 3226314 3062120 3195093 2911333 2870436 2833446 2932115 3097677 2870620 2747309 3015258
7288 3015258 3089373 2690882 2654770 2632411 2665273 2437109 2461331 2423215 2302766 2332298 2059579
7277 2059579 1815963 1935698 2032464 1851127 1804940 2077219 2064865 1876669 1596380 1697100
$$ packed form
7348H543681m56376l19709l59514o0417k22068j75488k52743k55003L8259m5921
7338F434701k65659K996m1497j2590J15418J85432K46969R6906J85930J69220
7328G117826J06130J64622L79785M71766o7319j45912M58871P760k15684o38164
7318G639681n71114l12826k35982m39879k15339l99231j16098p2418n34953k02168
7308D539673o2601m0013k35352k64377m55510p6525Q8545M0012j67808j39730
7298C226314j64194J32973k83760m0897l6990R8669J65562k27057j23311K67949
7288C015258P4115l98491l6112k2359L2862k28164K4222l8116j20449K9532k72719
7277B059579k43616J19735R6766j81337m6187K72279j2354j88196k80289J00720
$$ plain form
7267 1697100 1961317 2034548 1827217 1395933 1296285 1432550 1606488 1804939 1712468 1663069
7257 1663069 1487775 1563270 1177220 1370156 1360979 1547804 1438313 892047 1431262 1575162
7247 1575162 1751378 1730209 1742482 1945713 2026649 1984588 1720767 2140473 2440358 2554020
7237 2554020 2427458 2090729 2229157 2189276 2173673 2165273 2164793 2099047 1956438 1708766 1567089
7226 1567089 1716388 1438683 1458179 1516439 1418511 1312092 1071995 988301 1067499 1045124 1110770
7215 1110770 1150293 938555 1096669 1144742 1344746 1262696 1019575 780117 867721 924778
7205 924778 703033 643500 817185 1107347 936284 689450 854364 863994 984625 1005997
7195 1005997 893401 797059 845106 695486 551604 802333 595793 790250 646952 483324
$$ packed form
7267A697100K64217P3231k07331m31284r9648J36265J73938J98451r2471m9399
7257A663069j75294P5495l86050J92936r177J86825j09491n46266N39215J43900
7247A575162J76216k1169J2273K03231Q0936m2061k63821M19706K99885J13662
7237B554020j26562l36729J38428l9881j5603q400m80o5746j42609k47672j41677
7226A567089J49299k77705J9496N8260r7928j06419k40097q3694P9198k2375O5646
7215A110770L9523k11738J58114M8073K00004q2050k43121k39458Q7604N7057
7205I24778k21745n9533J73685K90162j71063k46834J64914R630J20631K1372
7195A005997j12596r6342M8047j49620j43882K50729k06540J94457j43298j63628
$$ plain form
7185 483324 804428 596073 503142 513172 810504 684286 747796 595593 458244 780622
7175 780622 649135 749192 675124 491336 256219 462661 563676 468199 666809 777644
7165 777644 706315 710404 779590 754184 772868 963596 991224 891326 1094658 1484348 1996030
7154 1996030 1572432 1457711 1751076 2091474 2082739 2044701 1981746 2345575 2431215 2263317
7144 2263317 2381758 2102627 2201515 2092378 1817298 1648477 1595654 1434561 1199269 1128322
7134 1128322 1291013 1508951 1198414 946063 951832 835021 575131 368556 299947 469148
7124 469148 422106 323841 371281 393461 427687 493215 503064 220892 475904 617180 756118
7113 756118 732304 467096 508593 562555 381369 373614 668441 784707 326042 272603 786540
$$ packed form
7185D83324L21104k08355r2931J0030K97332j26218O3510j52203j37349L22378
7175G80622j31487J00057p4068j83788k35117K06442J01015r5477J98610J10835
7165G77644p1329M089O9186k5406J8684J90728K7628r9898K03332L89690N11682
7154A996030m23598j14721K93365L40398q735l8038o2955L63829Q5640j67898
7144B263317J18441k79131R8888j09137k75080j68821n2823j61093k35292p0947
7134A128322J62691K17938l10537k52351N769j16811k59890k06575o8609J69201
7124D69148m7042r8265M7440K2180L4226O5528R849k82172K55012J41276J38938
7113G56118k3814k65208M1497N3962j81186p755K94827J16266m58665n3439N13937
$$ plain form
7102 786540 792753 720308 1034989 1106434 936903 818563 917548 856551 766160 829218 1300257
7091 1300257 1319719 1184192 1382898 1569601 1787197 1820511 1812492 1859371 1528478 1093159
7081 1093159 1163119 1073416 1026792 1236833 1097357 740232 631138 890489 644556 702899
7071 702899 716317 512193 506094 414274 474967 399808 121645 178957 -44751 189267 182057
7060 182057 88680 172116 70382 354583 704775 551720 368713 512165 303095 164984
7050 164984 373835 386939 255934 456170 482612 235902 470199 993575 472813 750258
7040 750258 698388 313274 89355 229683 31828 306090 333504 333351 369948 457367 438793
7029 438793 409326 571010 297966 -12812 416995 601526 427185 305230 615608 895061
$$ packed form
7102G86540O213p2445L14681P1445j69531j18340R8985o0997r0391O3058M71039
7091A300257J9462j35527J98706J86703K17596L3314q019M6879l30893m35319
7081A093159O9960q9703m6624K10041j39476l57125j09094K59351k45933N8343
7071G02899J3418k04124o099r1820O0693p5159k78163N7312k23708K34018p210
7060A82057r3377Q3436j01734K84201L50192j53055j83007J43452k09070j38111
7050A64984K08851J3104j31005K00236K6442k46710K34297N23376n20762K77445
7040G50258n1870l85114k23919J40328j97855K74262K7414j53L6597Q7419j8574
7029D38793k9467J61684k73044l10778M29807J84531j74341j21955L10378K79453
$$ plain form
7019 895061 623860 655564 609334 560314 599516 636140 560794 527931 536930 604664 296829
7008 296829 216351 318554 81038 -245049 93644 352267 667167 467897 694264 872934
6998 872934 441177 201162 421677 418227 488497 991709 1089933 1150940 1254036 1073384 1442195
6987 1442195 1579833 1941569 2143719 2504690 2916478 3030578 2931036 2941706 3365553 4220991
6977 4220991 4359251 4410301 4264681 3978069 3817316 3905469 3589317 3150394 3155296 2567795
6967 2567795 2184089 1887197 1754735 1700289 1614264 1187606 1337800 1303389 1380130 1178619
6957 1178619 933744 809734 547828 495831 423858 209864 259639 536161 463851 451632
6947 451632 575133 648049 481042 379122 95179 -175397 222154 459554 507286 365828
$$ packed form
7019H95061k71201L1704m6230m9020L9202L6624p5346l2863Q999O7734l07835
7008B96829q0478J02203k37516l26087L38693K58623L14900j99270K26367J78670
6998H72934m31757k40015K20515l450P0270N03212R8224O1007J03096j80652L68811
6987A442195J37638L61736K02150L60971M11788J14100r9542J0670M23847Q55438
6977D220991J38260N1050j45620k86612j60753Q8153l16152m38923M902n87501
6967B567795l83706k96892j32462n4446q6025m26658J50194l4411P6741k01511
6957A178619k44875j24010k61906n1997p1973k13994M9775K76522p2310j2219
6947D51632J23501P2916j67007j01920k83943k70576L97551K37400M7732j41458
$$ plain form
6937 365828 79309 208999 225954 174470 324549 134354 116892 323932 404831 403491 670151
6926 670151 756960 484002 305337 183873 207837 476553 422600 540014 686438 709668
6916 709668 851841 703608 481500 632582 494273 404513 357858 184616 361838 574785
6906 574785 268492 368271 380275 51628 166129 199319 292955 223950 80418 338042 389466
6895 389466 683955 487328 675927 541251 40111 73839 275825 394877 349441 77816
6885 77816 306935 -18169 -224742 -236434 26018 118278 211679 105401 -51616 -2718 -218439
6874 -218439 219637 64305 115163 -163493 -116840 -65220 -234562 -169443 -169599 -205510 43625
6863 43625 98030 201497 58908 391766 242457 -247071 -432823 -10114 -87476 -263357
$$ packed form
6937C65828k86519J29690J6955n1484J50079j90195j7462K07040Q0899j340K66660
6926F70151Q6809k72958j78665j21464K3964K68716n3953J17414J46424K3230
6916G09668J42173j48233k22108J51082j38309q9760m6655j73242J77222K12947
6906E74785l06293R9779J2004l28647J14501L3190R3636o9005j43532K57624N1424
6895C89466K94489j96627J88599j34676n01140L3728K01986J19052m5436k71625
6885G7816K29119l25104k06573j1692K62452R2260R3401j06278j57017M8898k15721
6874b18439M38076j55332N0858k78656M6653N1620j69342O5119j56l5911K49135
6863D3625N4405J03467j42589L32858j49309m89528j85752M22709p7362j75881
$$ plain form
6853 -263357 -518380 -378008 -133427 -281419 -413049 -172397 -141148 -70359 -262586 123215
6843 123215 180875 197743 -58631 7015 420269 436680 483587 357871 140050 -218175 159498
6832 159498 -19506 -71091 77728 39789 147902 4789 -294749 -332843 -299102 30099
6822 30099 -294715 150576 298419 34900 47182 131838 -242991 -93607 222021 13414
6812 13414 -159196 190032 466037 645832 603498 254775 127262 223780 52022 -217828
6802 -217828 -175116 154664 61700 -80529 127260 138812 223259 209074 24376 -131147 28242
6791 28242 -133770 -223774 -136667 -127921 -548602 -181874 -127451 -287474 36643 191877 -3130
6780 -3130 -407228 -490650 -445250 -209290 -359822 -332899 -57758 34494 215677 -207812 -369565
$$ packed form
6853b63357k55023J40372K44581j47992j31630K40652L1249P0789j92227L85801
6843A23215N7660J6868k56374O5646M13254J6411M6907j25716k17821l58225L77673
6832A59498j79004n1585J48819l7939J08113j43113k99538l8094L3741L29201
6822C0099l24814M45291J47843k63519J2282Q4656l74829J49384L15628k08607
6812A3414j72610L49228K76005J79795m2334l48723j27513R6518j71758k69850
6802b17828M2712L29780r2964j42229K07789J1552Q4447j4185j84698j55523J59389
6791B8242j62012r0004Q7107Q746m20681L66728N4423j60023L24117J55234j95007
6780c130m04098q3422M5400K35960j50532K6923K75141R2252J81183m23489j61753
$$ plain form
6769 -369565 -365449 -23732 141412 -152386 -407205 -451680 41232 352511 165542 -64601
6759 -64601 -307846 -243421 94925 166066 55340 116398 190485 290165 375116 416104 208620
6748 208620 201627 302935 4752 133 92736 269080 214732 -114564 -287519 -240986 31008
6737 31008 203652 215523 68226 36819 205796 76372 100205 -66084 -12408 3011 -75601
6726 -75601 -86639 94306 140031 49200 381383 633409 456994 307449 404964 69627 -106018
6715 -106018 -98699 -406539 -27093 162432 411181 206923 98639 121316 -63765 176550
6705 176550 153219 -82321 81754 -27626 -127410 437888 624610 391928 15244 -37153
6695 -37153 37895 236642 857246 525509 408531 407397 116118 -36859 -84992 -15803 -36767
$$ packed form
6769c69565M116L41717J65144k93798k54819m4475M92912L11279j86969k30143
6759f4601k43245O4425L38346P1141j10726O1058P4087R9680Q4951M0988k07484
6748B08620o993J01308k98183m619R2603J76344n4348l29296j72955M6533K71994
6737C1008J72644J1871j47297l1407J68977j29424K3833j66289N3676J5419p8612
6726g5601j1038J80945M5725r0831L32183K52026j76415j49545R7515l35337j75645
6715a06018P319l07840L79446J89525K48749k04258j08284K2677j85081K40315
6705A76550k3331k35540J64075j09380r9784N65298J86722k32682l76684n2397
6695c7153P5048J98747O20604l31737j16978j134k91279j52977m8133O9189k0964
$$ plain form
6684 -36767 -21158 24003 217196 378429 337318 390760 349510 230580 95598 95118 131676
6673 131676 323651 373409 550276 505129 208178 236268 388777 298279 379114 224679 -79473
6662 -79473 407721 497289 796417 580245 696926 984248 680248 559659 952585 1103232
6652 1103232 913084 665494 605249 629369 647469 831608 663229 686307 674144 553890
6642 553890 695907 996013 1011784 964999 1280515 1241591 1118669 1244333 1515097 1203387
6632 1203387 1138772 1310955 1281667 948965 1104102 1015659 762061 864136 964831 1082144
6622 1082144 1315205 1241277 1267720 1095956 1180711 1340590 1570293 1436477 1072178 1055420
6612 1055420 1427934 1682893 1440983 1411626 1389455 1250618 895862 931675 1022385 859730
$$ packed form
6684c6767J5609M5161J93193J61233m1111N3442m1250j18930j34982m80L6558
6673A31676J91975M9758J76867m5147k96951K8090J52509r0498Q0835j54435l04152
6662g9473M87194Q9568K99128k16172J16681K87322l04000j20589L92926J50647
6652A103232j90148k47590o0245K4120J8100J84139j68379K3078j2163j20254
6642E53890J42017L00106J5771m6785L15516l8924j22922J25664K70764l11710
6632A203387o4615J72183k9288l32702J55137q8443k53598J02075J00695J17313
6622A082144K33061p3928K6443j71764Q4755J59879K29703j33816l64299j6758
6612A055420L72514K54959k41910k9357k2171j38837l54756L5813R0710j62655
$$ plain form
6602 859730 490907 709185 509984 495201 809399 625781 918792 1097389 1150466 1071655
6592 1071655 1263185 1136305 795681 783493 790965 643909 837748 879450 666820 950727
6582 950727 1066034 877043 639958 688718 779675 783917 715699 641418 501110 364700 520408
6571 520408 529631 638155 987751 974553 848286 833446 752851 453094 554688 936848 789718
6560 789718 690551 838496 802586 997568 802495 1226420 1322208 1396073 1230873 1110239
6550 1110239 1165023 1176123 1101646 1353972 1303155 1189987 1031449 710185 1039278 1329554
6540 1329554 1310824 768153 852703 996150 1251797 1317687 1137502 977927 1073919 855502
6530 855502 685683 876464 998869 1131051 751612 797629 879735 956838 1246801 1137921
$$ packed form
6602H59730l68823K18278j99201j4783L14198j83618K93011J78597N3077p8811
6592A071655J91530j26880l40624j2188P472j47056J93839M1702k12630K83907
6582I50727J15307j88991k37085M8760R0957M242o8218p4281j40308j36410J55708
6571E20408R223J08524L49596j3198j26267j4840q0595k99757J01594L82160j47130
6560G89718r9167J47945l5910J94982j95073M23925R5788P3865j65200j20634
6550A110239N4784J1100p4477K52326n0817j13168j58538l21264L29093K90276
6540A329554j8730n42671Q4550J43447K55647O5890j80185j59575R5992k18417
6530H55502j69819J90781J22405J32182l79439M6017Q2106P7103K89963j08880
$$ plain form
6520 1137921 969877 941333 1159560 1223348 1008265 857253 949714 938950 880043 876200 1058021
6509 1058021 1139837 1080005 1096919 1207077 1476567 1283515 1066866 710627 704816 1075059
6499 1075059 1139815 1186518 1419695 1366536 1134321 1118083 1181989 961802 902066 961672 1188565
6488 1188565 1057714 1382302 1400131 1478513 1672784 1752954 1598070 1434267 1666522 1634413
6478 1634413 1636893 1798726 1995118 2049745 1998723 1836338 1559160 1748705 1964828 2325985
6468 2325985 2341450 2214689 2348882 1960082 2176734 2382227 2640199 2887420 3581712 3945756
6458 3945756 4057117 4127372 4267266 4639382 4917376 5174106 5637601 5969125 6312520 6238435
6448 6238435 6565321 6730219 6342981 5991758 6139939 6254162 6235407 6633662 6310672 6208705
$$ packed form
6520A137921j68044k8544K18227O3788k15083j51012R2461j0764n8907l843J81821
6509A058021Q1816n9832J6914J10158K69490j93052k16649l56239n811L70243
6499A075059O4756M6703K33177n3159k32215j6238O3906k20187n9736N9606K26893
6488A188565j30851L24588J7829P8382J94271Q0170j54884j63803K32255l2109
6478A634413K480J61833J96392N4627n1022j62385k77178J89545K16123L61157
6468B325985J5465j26761J34193l88800K16652K05493K57972K47221O94292L64044
6458C945756J11361P0255J39894L72116K77994K56730M63495L31524L43395p4085
6448F238435L26886J64898l87238l51223J48181J14223j8755L98255l22990j01967
$$ plain form
6438 6208705 6597097 6836543 7374631 7856720 7941392 8208270 8663215 9412812 9759103 10235915
6428 10235915 10859997 10967093 10646497 10402274 10546361 10093305 9629718 9130684 8638577
6419 8638577 8216192 7976051 7573594 7397185 7423342 7632208 7304912 7144043 7363017 7659143
6409 7659143 8056153 8277980 8331658 8337488 8639999 8792525 8910639 8746293 8480757 7700495
6399 7700495 7397638 7278370 7096879 6810200 6418492 6566417 6626755 6411345 6367771 6289336
6389 6289336 6473222 6509617 6639478 6649296 6401569 6619037 6931007 7030210 6911108 7008439
6379 7008439 7057355 7255978 7187497 7384406 7594083 8009053 7959140 8407951 8769376 9201531
6369 9201531 9679865 10044781 10138786 10741746 11380716 11756007 12562001 13040679 13677790 14322605
$$ packed form
6438F208705L88392K39446N38088M82089Q4672K66878M54945P49597L46291M76812
6428A0235915O24082J07096l20596k44223J44087m53056m63587m99034m92107
6419H638577m22385k40141m02457j76409K6157K08866l27296j60869K18974K96126
6409G659143L97010K21827N3678N830L02511J52526J18114j64346k65536p80262
6399G700495l02857j19268j81491k86679l91708J47925O0338k15410m3574p8435
6389F289336J83886L6395J29861R818k47727K17468L11970R9203j19102R7331
6379G008439M8916J98623o8481J96909K09677M14970m9913M48811L61425M32155
6369I201531M78334L64916R4005O02960O38970L75291Q05994M78678O37111O44815
$$ plain form
6359 14322605 15321275 16486494 17433256 18233854 19505032 21240188 23080775 24894912 26997103
6350 26997103 29296151 31769398 34433892 37621498 41668991 46468346 52056942 57942797
6342 57942797 64641580 71939873 79266275 86790485 92897630 96897459 98781854 98172311
6334 98172311 95306757 91734342 87869789 84597039 82296331 81575831 81243192 82328594
6326 82328594 84082045 87005473 91061003 96227235 102445249 110824778 120244568 130696607
6318 130696607 141710247 151493680 159450724 164761557 166285871 164123561 159513107 152553621
6310 152553621 144360292 135240519 126244713 117952986 110871785 104929385 100007231 96227295
6302 96227295 93990998 92596223 92375185 93215934 95713410 99206980 103649417 108551865
$$ packed form
6359A4322605R98670J165219R46762Q00598J271178J735156J840587J814137K102191
6350B6997103K299048K473247K664494L187606M047493M799355N588596N885855
6342E7942797O698783P298293P326402P524210O107145L999829J884395o09543
6334I8172311k865554l572415l864553l272750k300708p20500l32639J085402
6326H2328594J753451K923428M055530N166232O218014Q379529R419790J0452039
6318A30696607J1013640R783433P957044N310833J524314k162310m610454o959486
6310A52553621q193329r119773q995806q291727p081201n942400m922154l779936
6302I6227295k236297j394775k21038Q40749K497476L493570M442437M902448
$$ plain form
6294 108551865 113389399 117376591 119063436 118118241 114298036 107843970 99290305 90468606
6286 90468606 82466640 75255634 68667316 63136602 58222384 54031828 50078731 46336795
6278 46336795 42661965 39884490 37003894 34432710 32465495 30444290 28656014 26926174
6270 26926174 25597585 24191983 22725670 21401740 20683647 19943818 18907469 18076087 17069710
6261 17069710 15913983 15453347 15190820 14892134 14276483 13602066 12929654 12467460 12433838
6252 12433838 12124033 11776640 11001573 10417259 10366549 9889086 9698397 9654706 9318245 9267122
6242 9267122 9066540 8805292 8781886 8450957 7887539 7546203 7609126 7452550 7397358 7151877
6232 7151877 7108958 6841903 6894250 6809823 6681503 6557635 6451725 6337715 5902919 5767661
$$ packed form
6294A08551865M837534L987192J686845r45195l820205o454066q553665q821699
6286I0468606q001966p211006o588318n530714m914218m190556l953097l741936
6278D6336795l674830k777475k880596k571184j967215k021205j788276j729840
6270B6926174j328589j405602j466313j323930p18093p39829j036349q31382j006377
6261A7069710j155727m60636k62527k98686o15651o74417o72412m62194l3622
6252A2433838l09805l47393p75067n84314n0710m77463j90689m3691l36461n1123
6242I267122k00582k61248k3406l30929n63418l41336O2923j56576n5192k45481
6232G151877m2919k67055N2347q4427j28320j23868j05910j14010m34796j35258
$$ plain form
6222 5767661 5714336 5611412 5611434 5916214 5545474 5523915 5718025 5377233 5344557 5001574 5105993
6211 5105993 4969742 4957789 5145647 5264461 5148944 4925217 4731883 5124896 4742351 4515092
6201 4515092 4940709 5112428 4889739 4760809 4529274 4871125 4868910 4794606 4708071 4636506
6191 4636506 5025874 4881575 4765372 4846269 4993825 4777224 4784597 4396284 4281727 4157060
6181 4157060 3944783 4017650 4018326 4037591 4273747 4336091 4182899 4179046 4426541 4486773 4292608
6170 4292608 4248070 4679484 5024050 4605938 4496314 4809584 4633117 4257497 3904836 4103859
6160 4103859 3852643 3650620 3641281 3623715 3472764 3777155 3699662 3651970 3390249 3383553 3325853
6149 3325853 3362157 3348246 3144361 3167230 3539003 3527126 3657604 3413558 3405293 3544633 2988917
$$ packed form
6222E767661n3325j02924K2L04780l70740k1559J94110l40792l2676l42983J04419
6211E105993j36251j1953J87858J18814j15517k23727j93334L93013l82545k27259
6201D515092M25617J71719k22689j28930k31535L41851k215p4304q6535p1565
6191D636506L89368j44299j16203Q0897J47556k16601P373l88313j14557j24667
6181D157060k12277P2867O76J9265K36156O2344j53192l853K47495O0232j94165
6170D292608m4538M31414L44566m18112j09624L13270j76467l75620l52661J99023
6160D103859k51216k02023r339j7566j50951L04391p7493m7692k61721o696n7700
6149C325853L6304j3911k03885K2869L71773j1877J30478k44046q265J39340n55716
$$ plain form
6138 2988917 2890792 2750622 2758034 2420787 2172459 2319560 2444910 2140071 2158129 2287515
6128 2287515 2540050 2389155 2078658 1700609 2213044 2396850 2047303 2113976 1700448 1930909
6118 1930909 2073969 1731522 1740176 1797986 1811884 2127523 2168076 2189618 2405723 2251751 1882154
6107 1882154 1840484 1768260 1600183 1811723 1817930 1827315 2132767 2046259 2123570 2101454 1917290
6096 1917290 2138983 2193312 2166655 2151034 2213592 2321602 2013960 2114650 2196682 2138780 2044801
6085 2044801 2200604 2511372 2662180 2647769 2473545 2537523 2468539 2131700 2077470 2331237
6075 2331237 2432740 2529748 2645799 2737080 2676354 3108443 3159902 3335561 3245187 3341318 3507254
6064 3507254 3445176 3222900 3238336 3470984 3281445 3042653 3322070 3217867 3343170 3574786
$$ packed form
6138B988917r8125j40170P412l37247k48328J47101J25350l04839J8058J29386
6128B287515K52535j50895l10497l78049N12435J83806l49547O6673m13528K30461
6118A930909J43060l42447Q654N7810J3898L15639M0553K1542K16105j53972l69597
6107A882154m1670p2224j68077K11540O207R385L05452q6508P7311k2116j84164
6096A917290K21693N4329k6657j5621O2558J08010l07642J00690Q2032n7902r3979
6085B044801J55803L10768J50808j4411j74224O3978o8984l36839n4230K53767
6075B331237J01503R7008J16051R1281o0726M32089N1459J75659r0374R6131J65936
6064C507254o2078k22276J5436K32648j89539k38792K79417j04203J25303K31616
$$ plain form
6054 3574786 3225861 3423794 3376859 3443552 3311199 3554146 3848755 3937586 3954984 4403070
6044 4403070 4541392 4581940 4747187 4551086 4338918 4276944 4633312 4304993 3762100 4040299
6034 4040299 3899085 3821711 3861332 3603779 3450234 3438217 3724396 3691006 3646563 3732515 3816193
6023 3816193 3838637 3862282 4003232 3993549 3980540 4115258 3932050 4199164 4029091 3816382
6013 3816382 3732564 3618174 3675926 3579651 3546611 2962919 2909026 3113294 2991981 2946192 3199162
$$ packed form
6054C574786l48925J97933m6935O6693j32353K42947K94609Q8831J7398M48086
6044D403070J38322M0548J65247j96101k12168o1974L56368l28319n42893K78199
6034D040299j41214p7374L9621k57553j53545j2017K86179l3390m4443Q5952Q3678
6023C816193K2444K3645J40950r683j3009J34718j83208K67114j70073k12709
6013C816382q3818j14390N7752r6275l3040n83692n3893K04268j21313m5789K52970
$$ [...]
##END NTUPLES=NMR SPECTRUM
##END=
