##TITLE=1H_EC-3358(1)
 200.13MHz, CDCl3,
 8 sc
 
 25.8.2025
##JCAMPDX= 6.0         $$ Bruker NMR JCAMP-DX V2.0
##DATA TYPE= NMR SPECTRUM
##DATA CLASS= NTUPLES
##ORIGIN= UXNMR, Bruker Analytische Messtechnik GmbH
##OWNER= pz
$$ XWIN-NMR		Version 3.5
$$ Mon Aug 25 14:05:54 2025 Russian Standard Time (UT+4h)  she@DPX200
##.OBSERVE FREQUENCY= 200.1308
##.OBSERVE NUCLEUS= ^1H
##.ACQUISITION MODE= SIMULTANEOUS
##.ACQUISITION SCHEME= undefined
##.AVERAGES= 8
##.DIGITISER RES= 18
##SPECTROMETER/DATA SYSTEM= spect
##.PULSE SEQUENCE= zg30
##.SOLVENT NAME= CDCl3
##.SHIFT REFERENCE= (INTERNAL, CDCl3, 0, 15.3944)
##AUDIT TRAIL= $$ (NUMBER, WHEN, WHO, WHERE, WHAT)
$$ ##TITLE= Audit trail, XWIN-NMR		Version 3.5
$$ ##JCAMPDX= 5.01
$$ ##ORIGIN= Bruker BioSpin GmbH
$$ ##OWNER= she
$$ F:/spectra/data/she/nmr/H-C/1/pdata/1/auditp.txt
$$ ##AUDIT TRAIL=  $$ (NUMBER, WHEN, WHO, WHERE, WHAT)
(   1,<2025-08-25 14:04:34.37 +0400>,<she>,<DPX200>,
      <created by zg, POWCHK disabled, PULCHK disabled
       configuration hash MD5:
       00 E9 B6 7A A2 85 ED C7 34 08 36 98 17 FE 4E 26
       data hash MD5: 16K
       63 45 32 BD AA 45 37 C1 50 16 D1 3C 90 E4 6B 21>)
(   2,<2025-08-25 14:04:38.18 +0400>,<she>,<DPX200>,
      <Start of raw data processing
       efp BC_mod = 2 LB = 0.25 FT_mod = 6 PKNL = 1 PHC0 = -1557.692 PHC1 = 5.592289 SI = 16K 
       data hash MD5: 16K
       B8 BE 52 27 E0 1B 11 01 3E 74 74 86 D0 0A 3D 3F>)
(   3,<2025-08-25 14:04:59.85 +0400>,<she>,<DPX200>,
      <pk PHC0 = -10.3096 PHC1 = 14.4 
       data hash MD5: 16K
       F3 FE D7 06 29 5A 83 F6 2D 27 26 27 7B 5C EC 54>)
(   4,<2025-08-25 14:05:03.78 +0400>,<she>,<DPX200>,
      <abs ABSG = 5 
       data hash MD5: 16K
       AA 22 CD 4F 7D 80 37 94 75 A3 27 80 CD 03 0D 0A>)
$$ ##END=
$$ 
$$ hash MD5
$$ 28 70 18 9B 7F 64 24 A1 E1 91 E2 F3 59 6D 23 AA
##$RELAX= 
##$RELAX= 
##$RELAX= 
##$RELAX= 
##$RELAX= 
##$RELAX= 
$$ Bruker specific parameters
$$ --------------------------
##$DU= <F:/spectra>
##$EXPNO= 1
##$NAME= <H-C>
##$PROCNO= 1
##$TYPE= <nmr>
##$USER= <she>
##$AMP= (0..31)
100 100 100 100 100 100 100 100 100 100 100 100 100 100 100 100 100 100 
100 100 100 100 100 100 100 100 100 100 100 100 100 100 
##$AQSEQ= 0
##$AQ_mod= 1
##$AUNM= <au_zg>
##$AUTOPOS= <>
##$BF1= 200.13
##$BF2= 200.13
##$BF3= 200.13
##$BF4= 200.13
##$BF5= 200.13
##$BF6= 200.13
##$BF7= 200.13
##$BF8= 200.13
##$BYTORDA= 1
##$CFDGTYP= 0
##$CFRGTYP= 5
##$CHEMSTR= <none>
##$CNST= (0..31)
1 1 145 1 1 1 1 1 1 1 1 1 1 1 1 1 1 1 1 1 1 1 1 1 1 1 1 1 1 1 1 1 
##$CPDPRG= <>
##$CPDPRG1= <>
##$CPDPRG2= <>
##$CPDPRG3= <>
##$CPDPRG4= <mlev>
##$CPDPRG5= <mlev>
##$CPDPRG6= <mlev>
##$CPDPRG7= <mlev>
##$CPDPRG8= <mlev>
##$CPDPRGB= <>
##$CPDPRGT= <>
##$D= (0..31)
0 0.7 0 0 0 0 0 0 0 0 0 0.03 0 0 0 0 0 0 0 0 0 0 0 0 0 0 0 0 0 0 0 0 
##$DATE= 1756116274
##$DBL= (0..7)
120 120 120 120 120 120 120 120 
##$DBP= (0..7)
150 150 150 150 150 150 150 150 
##$DBP07= 0
##$DBPNAM0= <>
##$DBPNAM1= <>
##$DBPNAM2= <>
##$DBPNAM3= <>
##$DBPNAM4= <>
$$ [...]
##$SUBNAM3= <"">
##$SUBNAM4= <"">
##$SUBNAM5= <"">
##$SUBNAM6= <"">
##$SUBNAM7= <"">
##$SUBNAM8= <"">
##$SUBNAM9= <"">
##$SW= 18.0517779522481
##$SWIBOX= (0..15)
0 0 2 0 0 0 0 0 0 0 0 0 0 0 0 0 
##$SW_h= 3612.71676300578
##$TD= 16384
##$TD0= 1
##$TE= 0
##$TE2= 300
##$TE3= 300
##$TEG= 300
##$TL= (0..7)
0 120 120 120 120 120 120 120 
##$TP= (0..7)
150 150 150 150 150 150 150 150 
##$TP07= 0
##$TPNAME0= <>
##$TPNAME1= <>
##$TPNAME2= <>
##$TPNAME3= <>
##$TPNAME4= <>
##$TPNAME5= <>
##$TPNAME6= <>
##$TPNAME7= <>
##$TPOAL= (0..7)
0.5 0.5 0.5 0.5 0.5 0.5 0.5 0.5 
##$TPOFFS= (0..7)
0 0 0 0 0 0 0 0 
##$TUNHIN= 0
##$TUNHOUT= 0
##$TUNXOUT= 0
##$USERA1= <user>
##$USERA2= <user>
##$USERA3= <user>
##$USERA4= <user>
##$USERA5= <user>
##$V9= 5
##$VALIST= <valist>
##$VCLIST= <CCCCCCCCCCCCCCC>
##$VD= 0
##$VDLIST= <DDDDDDDDDDDDDDD>
##$VPLIST= <PPPPPPPPPPPPPPP>
##$VTLIST= <TTTTTTTTTTTTTTT>
##$WBST= 1024
##$WBSW= 4
##$XGAIN= (0..3)
0 0 0 0 
##$XL= 0
##$YL= 0
##$YMAX_a= 586513
##$YMIN_a= -717394
##$ZGOPTNS= <>
##$ZL1= 120
##$ZL2= 120
##$ZL3= 120
##$ZL4= 120
##$ABSF1= 15.43402
##$ABSF2= -2.617873
##$ABSG= 5
##$ABSL= 3
##$ALPHA= 0
##$AQORDER= 0
##$ASSFAC= 0
##$ASSFACI= 0
##$ASSFACX= 0
##$ASSWID= 0
##$AUNMP= <proc_1d>
##$AZFE= 0.1
##$AZFW= 0.1
##$BCFW= 0
##$BC_mod= 2
##$BYTORDP= 0
##$COROFFS= 0
##$CY= -3
##$DATMOD= 1
##$DC= 0
##$DFILT= <>
##$DTYPP= 0
##$F1P= 0
##$F2P= 0
##$FCOR= 1
##$FTSIZE= 16384
##$FT_mod= 6
##$GAMMA= 0
##$GB= 0
##$INTBC= 1
##$INTSCL= 3.241238e-09
##$ISEN= 128
##$LB= 0.25
##$LEV0= 0
##$LPBIN= 0
##$MAXI= 10000
##$MC2= 0
##$MEAN= 0
##$ME_mod= 0
##$MI= 1.114404
##$NCOEF= 0
##$NC_proc= -5
##$NLEV= 6
##$NOISF1= 3.799351
##$NOISF2= 2.8
##$NSP= 0
##$NTH_PI= 0
##$NZP= 0
##$OFFSET= 15.39435
##$PC= 1
##$PHC0= -1568.002
##$PHC1= 19.99229
##$PH_mod= 1
##$PKNL= yes
##$PPARMOD= 0
##$PSCAL= 0
##$PSIGN= 0
##$REVERSE= no
##$SF= 200.129525494824
##$SI= 16384
##$SIGF1= 3
##$SIGF2= 2
##$SINO= 0.751879
##$SIOLD= 32768
##$SREGLST= <19F.Aceton>
##$SSB= 0
##$STSI= 16384
##$STSR= 0
##$SW_p= 3612.71676300577
##$SYMM= 0
##$S_DEV= 0
##$TDeff= 16384
##$TDoff= 0
##$TI= <>
##$TILT= no
##$TM1= 0
##$TM2= 0
##$TOPLEV= 0
##$USERP1= <user>
##$USERP2= <user>
##$USERP3= <user>
##$USERP4= <user>
##$USERP5= <user>
##$WDW= 1
##$XDIM= 16384
##$YMAX_p= 358287326
##$YMIN_p= -538807
$$ End of Bruker specific parameters
$$ ---------------------------------
##NTUPLES= NMR SPECTRUM
##VAR_NAME=  FREQUENCY,     SPECTRUM/REAL,   SPECTRUM/IMAG
##SYMBOL=    X,             R,               I
##VAR_TYPE=  INDEPENDENT,   DEPENDENT,       DEPENDENT
##VAR_FORM=  AFFN,          ASDF,            ASDF
##VAR_DIM=   16384,         16384,           16384
##UNITS=     HZ,            ARBITRARY UNITS, ARBITRARY UNITS
##FACTOR=    0.220516191357247, 1,           1
##FIRST=     3080.86397118394, 0,            0
##LAST=      -531.85279182183, 0,            0
##MIN=       -531.85279182183, -538807,      0
##MAX=       3080.86397118394, 358287326,    0
$$ Real data points
##PAGE= N=1
##DATA TABLE= (X++(R..R)), XYDATA
$$ [...]
9077F612705J80036J59465N1556J27128R6691J61536L1167O4627P4830j01565
$$ 6612705 6792741 6952206 7003762 7130890 7227581 7389117 7420284 7484911 7559741 7458176
9067G458176o2945j16557l7157j09302j11805j44205j32256j68462j65177m0807
$$ 7458176 7395231 7278674 7241517 7132215 7020410 6876205 6743949 6575487 6410310 6369503
9057F369503J3814L9173Q2463m2265l2273P1362J3859L772N5641J21544j9581
$$ 6369503 6383317 6422490 6504953 6462688 6430415 6501777 6515636 6519408 6575049 6696593 6677012
9046F677012P7756Q1641R4791J16676J06635J17774J28208J59754J77854J61345
$$ 6677012 6754768 6836409 6931200 7047876 7154511 7272285 7400493 7560247 7738101 7899446
9036G899446J42485J80417K97360K68174K43425K53516K76231L31202M22538N07635
$$ 7899446 8041931 8222348 8519708 8787882 9031307 9284823 9561054 9892256 10314794 10822429
9026A0822429N91853M79970N04731O24590Q05176P93513Q96178J022469J421913
$$ 10822429 11414282 11894252 12398983 13023573 13828749 14622262 15518440 16540909 17962822
9017A7962822J914525K389849L361509L971696L746156L993786M486049L801926
$$ 17962822 19877347 22267196 25628705 29600401 33346557 37340343 41826392 45628318
9009D5628318J822167O8283k851240n652628m673693l519375k926467k441575
$$ 45628318 47450485 47518768 44667528 39014900 34341207 30821832 27895365 25453790
9001B5453790j794336j476782j197192j077054r60087r34795j027812q57822q03127
$$ 25453790 23659454 22182672 20985480 19908426 18948339 18013544 16985732 16127910 15324783
8992A5324783p47192p16430n46426l95095k92735l31209l78161l52678l70911
$$ 15324783 14577591 13861161 13314735 12919640 12626905 12295696 11917535 11564857 11193946
8983A1193946l86487k16231j41501j13185M1950J20952O1388J01635O1994L4670
$$ 11193946 10807459 10591228 10449727 10336542 10378492 10499444 10560832 10662467 10724461 10759131
8973A0759131j08080m14930m25609m61718m85072l96664k89888j15267q4912j18471
$$ 10759131 10651051 10236121 9810512 9348794 8863722 8467058 8177170 8061903 7976991 7858520
8963G858520j08826n7703m3904Q394k53889k55550j93519k04173k8891O9249J6059
$$ 7858520 7749694 7691991 7648087 7656481 7402592 7147042 6953523 6749350 6720459 6789708 6805767
8952F805767J19308l4342k2641j51698k28700j92010j76143j58718o1026j2598
$$ 6805767 6925075 6890733 6868092 6716394 6487694 6295684 6119541 5960823 5899797 5887199
8942E887199P2027J319q7652r0719o5657j40100k87753k64207k92575k80538k82953
$$ 5887199 5959226 5960545 5872893 5782174 5716517 5576417 5288664 5024457 4731882 4451344 4168391
8931D168391j76210p3200j45385j46105p2391j76337l5410k3258p6252j24889
$$ 4168391 3992181 3918981 3773596 3627491 3555100 3378763 3343353 3320095 3243843 3118954
8921C118954o1941R210r039J8217j3783j1531o5531n2291J8787j8909N1827j09482
$$ 3118954 3057013 3066223 3057184 3075401 3061618 3050087 2984556 2932265 2951052 2932143 2983970 2874488
8909B874488l3091m7817m8526q3594j17074q1575p1664j20756N092r012j22025
$$ 2874488 2841397 2793580 2745054 2661460 2544386 2462811 2391147 2270391 2275483 2266471 2144446
8898B144446l2767l0104j5201L3825L94l9053M194m8441L3032m0069q322k0392
$$ 2144446 2111679 2081575 2066374 2100199 2100593 2061540 2065734 2017293 2050325 2010256 2001934 1981542
8886A981542o5989o6413Q5927P060j43600M6335l1555J03269O3134P2497n4997
$$ 1981542 1915553 1849140 1935067 1942127 1798527 1844862 1813307 1916576 1979710 2052207 1997210
8875A997210R160J8208q9540L7085l8519j3937L7974q2372O1246O1539l5736N7216
$$ 1997210 2006370 2024578 1935038 1972123 1933604 1919667 1957641 1875269 1936515 1998054 1962318 2019534
8863B019534R1211M0854L9517K4779k9649l850k8235M9428L1526L7243N559R6984
$$ 2019534 2110745 2151599 2191116 2215895 2186246 2182396 2154161 2203589 2235115 2272358 2277917 2374901
8851B374901J00843J31330R1117J7304Q8876m6847q8894j5526n6696m7590k40859
$$ 2374901 2475744 2607074 2698191 2715495 2804371 2757524 2668630 2653104 2596408 2548818 2307959
8840B307959j37728j23489M3214l1066k00050j05678K4465j5730n7738j20901
$$ 2307959 2170231 2046742 2089956 2058890 1858840 1753162 1777627 1761897 1704159 1583258
8830A583258O112M6634q4540M8260j05585O1349L6195M544o4487o685N9638j7218
$$ 1583258 1589370 1636004 1551464 1599724 1494139 1555488 1591683 1596227 1531740 1525055 1584693 1567475
8818A567475Q8322J14532O1907R7774P5029J06462O9044Q6090J9305l1183q6539
$$ 1567475 1655797 1770329 1832236 1930010 2005039 2111501 2180545 2266635 2285940 2254757 2168218
8807B168218o9487m8111l4806j1132o9889j93340j23313J8598r942j18867r7512
$$ 2168218 2098731 2050620 2015814 2004682 1934793 1741453 1618140 1636738 1626796 1507929 1410417
8796A410417k10K3816O245n7243p9348r336l7416n5574J14602m5199j4835m6695
$$ 1410417 1410207 1434023 1440268 1383025 1303677 1294341 1256925 1201351 1315953 1270754 1255919 1209224
8784A209224n1584n8957r674K8936L7179j1419j0800L840K0256M3379l6769j7107
$$ 1209224 1157640 1098683 1089009 1117945 1155124 1143705 1132905 1136745 1157001 1200380 1163611 1146504
8772A146504l5379k9737k5443K2396M1483p3065l3160k3509L8282n6045j3007
$$ 1146504 1111125 1081388 1055945 1078341 1119824 1046759 1013599 990090 1028372 972327 959320
8761I59320l5126K4518L6135p3993O8243k5509j9029n8895N4242P4097L8155L9699
$$ 959320 924194 948712 984847 910854 979097 953588 934559 875664 929906 1004003 1042158 1081857
8749A081857r6979r0044m3364K0691J0145L8977m2678N6412K1648k7271o4241
$$ 1081857 984878 894834 851470 872161 882306 921283 878605 935017 956665 929394 865153
8738H65153J6825O3772k9711J650j06494M2946Q994o1261J5402O6762k5583p990
$$ 865153 881978 945750 916039 917689 811195 854141 863135 801874 817276 884038 858455 850465
8726H50465n1560Q1084o161o5355J449L2687l2917l263K7329m3785n6603l7127
$$ 850465 798905 879989 873828 808473 809922 842609 809692 806429 833758 789973 733370 696243
8714F96243N0342n0187l3975K0598L988M4826J0606r043l211n3103L0106n8708
$$ 696243 746585 696398 662423 683021 687009 731835 742441 733398 730187 677084 707190 648482
8702F48482k061p7162M554O3518l651n4559j7957L3727o5698J252J03767k1818
$$ 648482 646421 569259 573813 637331 633680 579121 561164 594891 529193 530445 634212 612394
8690F12394k2694L8623M1296r9204m7724L3598l6188o83L672O0529O7551n8846
$$ 612394 589700 628323 669619 570415 522691 556289 520101 519418 523090 583619 651170 592324
8678E92324l4427n0687M3818k7033j04760k6773N5365K8225p9648K6192m6319
$$ 592324 557897 507210 551028 523995 419235 392462 447827 476052 396404 422596 376277
8667C76277o6277Q014M5394j4705j6068l8788k8157l0964M5519j9530O1636K7510
$$ 376277 310000 318014 363408 348703 332635 293847 265690 234726 280245 260715 322351 349861
8655C49861k0809O9175M5527k7808N276j4825n2900o0365k0301O5837J6075k5232
$$ 349861 329052 398227 443754 415946 421222 406397 353497 293132 272831 338668 354743 329511
8643C29511O3282m2566l6322J8614o2919j0184R7221l7407l8809L6709J3395k9039
$$ 329511 392793 350227 313905 332519 269600 259416 356637 319230 280421 317130 330525 301486
8631C01486N881m7260l8398l9503O0110J03508j7302N4050o0494m5q859q955L8693
$$ 301486 307367 260107 221709 182206 242316 345824 328522 382572 322078 322033 313174 304219 342912
8618C42912M7457N2178o6120J797K790r8314j5254Q2158L3496L2079n1038k1657
$$ 342912 390369 442547 376427 378224 381014 282700 267446 349604 383100 415179 364141 342484
8606C42484q9499L3033O4281p232J474k1521O1006Q4590k9803r2119L3776q2356
$$ 342484 252985 286018 350299 343067 344541 323020 384026 468616 438813 346694 380470 298114
8594B98114K2421O4044K9522L1457N4011m9445J1011Q134Q7808J4363q7052L943
$$ 298114 320535 384579 414101 445558 499569 450124 461135 469269 557077 571440 484388 488331
8582D88331j2612K0871K2638J929P7650O5599L7356R3436Q1876k4571k9723J01128
$$ 488331 475719 496590 519228 521157 598807 664406 701762 795198 877074 852503 822780 923908
8570I23908M758k3001J13874L0381N1326l8235j5755Q6407l0546m8995m3789q6461
$$ 923908 928666 905665 1019539 1049920 1101246 1063011 1047256 1133663 1103117 1054122 1010333 923872
8558I23872k6018j0655m1047k0535O6025K1379q6673p7420j09664q4803k4544
$$ 923872 897854 887199 846152 825617 891642 913021 826348 748928 639264 554461 529917
8547E29917P326K2622p5376J1080P5508j9940j0559l4539o2198M4898K2791r2037
$$ 529917 537243 559865 484489 495569 571077 551137 540578 506039 443841 488739 511530 419493
8535D19493N3221K8442O98M1700n2136k500o1034j09387k7386J2725j3851j3222
$$ 419493 472714 501156 501854 543554 491418 488918 427884 318497 291111 303836 289985 276763
8523B76763j07947r997R7584k6644j6106j3693q962K7174j3816j11822n0823P3371
$$ 276763 168816 158819 256403 229759 213653 199960 190998 218172 204356 92534 41711 115082
8511A15082m6448n2934N8361J03522M8910p3746M5074l4918j37956l3435L8606
$$ 115082 68634 15700 74061 177583 226493 152747 197821 162903 24947 -8488 30118
8500C0118L6299P9087J8438l1450n4729N2716n5616N3960L8578l524k3968O203
$$ 30118 66417 145504 163942 132492 77763 130479 74863 128823 167401 163877 139909 146112
8488A46112J8795n0618j4570O276j8525K562n1005J3116K1390K8880L1754K5321
$$ 146112 164907 114289 99719 105995 87470 90032 39027 52143 73533 102413 134167 159488
8476A59488j4369m2909Q0243q0548J6099K6961l2851J1852k2084K7355n1385n5474
$$ 159488 145119 102210 182453 101905 118004 144965 112114 123966 101882 129237 77852 22378
8464B2378O5784L6455M725k9180m6367m0239J1255K5605L1309n9630m0826l9623
$$ 22378 88162 124617 129342 100162 53795 13556 24811 50416 81725 22095 -18731 -58354
8452e8354L2634J7108M765m1946J08226r039K5776j3558K8648L777l9281J983
$$ -58354 -25720 -8612 -3847 -45793 62433 53394 79170 65612 94260 98037 58756 60739
8440F0739J6498P7882j00270m9404k4878J7324q834o0336q026J7040K7343O9589
$$ 60739 77237 155119 54849 5445 -19433 -2109 -10943 -71279 -79305 -62265 -34922 34667
8428C4667l865J613L6575L7366J4588K8912m7369n3587k4679l733l779R4302J0417
$$ 34667 30802 32415 68990 106356 120944 149856 102487 48900 24221 20488 16709 111011 121428
8415A21428l8914k4041l4981k8420m6659r810L0485K7829M8340o2745l146M0296
$$ 121428 82514 58473 23492 -4928 -51587 -61397 -30912 -3083 45257 -17488 -20634 19662
8403A9662K0047K9656L1493r0763k5810J9805Q4166M4617p8566P1136q9171l6129
$$ 19662 39709 69365 100858 10095 -15715 4090 88256 132873 54307 125443 36272 143
8391A43k3582j3070O6750m2933m751K1627N5485O4039r317O984o7558j6295j56
$$ 143 -23439 -36509 30241 -12692 -17443 4184 59669 123708 114391 121375 53817 37522 37366
8378C7366K7446L4664n7570k3050m6084m3708Q300Q19N3343K0700m1420J7267
$$ 37366 64812 99476 41906 18856 -27228 -70936 -62636 -61817 -8474 12226 -29194 -11927
8366a1927k1536n2833j5160N1204o2092O299Q7215J9025n582K2447p471o8956
$$ -11927 -33463 -86296 -101456 -50252 -112344 -106045 -18830 195 -5387 17060 9589 -59367
8354e9367R1148j665m2443l4959K1669M4487K5333n4961J4875K5184K0725m7427
$$ -59367 31781 30116 -12327 -47286 -25617 18870 44203 -10758 4117 29301 50026 2599
8342B599o9662l6047L2275o152J06021j2476l2179k1345j5703l3559M8914l2290
$$ 2599 -67063 -103110 -70835 -76987 29034 16558 -15621 -36966 -52669 -86228 -37314 -69604
8330f9604p4383P8517m8744K9856l3652m8576K7545J05713l4568n145K9831J581
$$ -69604 -143987 -65470 -114214 -84358 -118010 -166586 -139041 -33328 -67896 -73041 -43210 -41629
8318d1629n9776m6465K2593K957L6834M5244j6125l7074l4125K3744j096N4842
$$ -41629 -101405 -147870 -125277 -122320 -85486 -40242 -56367 -93441 -127566 -103822 -104918 -50076
8306e0076k8194j8006p9984L2211J15004n3524n2998P5403j4102J0436N6132n2823
$$ -50076 -78270 -96276 -176260 -144049 -29045 -82569 -135567 -60164 -74266 -63830 -7698 -60521
8294f0521P665J7592o2679J362K7450k7580q4242J0205J27899j8959K1894P7527
$$ -60521 -52856 -35264 -97943 -96581 -69131 -96711 -180953 -170748 -42849 -61808 -39914 37613
8282C7613m2817n0093o2546j4225J3496K7858M264m887O1543j2937j8987j0907
$$ 37613 -5204 -55297 -117843 -132068 -118572 -90714 -86450 -91337 -29794 -42731 -61718 -72625
8270g2625l5185N1946M5627J0071m2428q6590j05180p646J00589O3922n2458J5100
$$ -72625 -107810 -55864 -10237 -166 -42594 -129184 -234364 -242010 -141421 -77499 -129957 -114857
8258a14857j0234k2279l4244q3651O1114M6166R3871J0087j2605N7645K2546m0930
$$ -114857 -125091 -147370 -181614 -265265 -204151 -157985 -64114 -54027 -66632 -8987 13559 -27371
8246b7371J0726J7399j2355o7249M2061o006k5523m5547J6872K6286m0900M0469
$$ -27371 -16645 754 -11601 -78850 -36789 -42795 -68318 -113865 -96993 -70707 -111607 -71138
8234g1138M7498l4993J5874J5099p3745J0218o2866l3246Q8856q9709O9671Q421
$$ -71138 -23640 -58633 -42759 -27660 -101405 -91187 -154053 -187299 -98443 -188152 -118481 -110060
8222a10060j2146N8017K713n8308l4112P3597K6787L0386r017o0417N5684K6117
$$ -110060 -122206 -64189 -61476 -119784 -153896 -80299 -53512 -23126 -32143 -92560 -36876 -10759
8210a0759m9758Q2378K2520k5256j0695k3577K0157j3575n8037j1251j5182R0406
$$ -10759 -60517 21861 44381 19125 8430 -15147 5010 -8565 -66602 -77853 -93035 -2629
8198b629p167n9839M468J13504R6216J33188o58316j58232L62190J41928M1938
$$ -2629 -9796 -69635 -65167 48337 144553 277741 -380575 -538807 -176617 -34689 7249
8187G249m2602N3606k6086L5924k0938j4270K8718P0787o0497N9907m8210k4301
$$ 7249 -35353 18253 -7833 28091 7153 -7117 21601 92388 31891 91798 43588 19287
8175A9287j7712J422q165n6695k1139R4034k7216j9685L1905j08936j2144j1114
$$ 19287 1575 2997 -5168 -61863 -83002 11032 -16184 -35869 -3964 -112900 -125044 -136158
8163a36158M6386Q704k8123P4815J23468R9128n2139n4832l5851L1398r62l5734
$$ -136158 -89772 -81068 -109191 -34376 89092 188220 136081 81249 45398 76796 75834 40100
8151D0100n668K7649L1864j5800n145J2881Q755m383j0719K0206N0916n6347o5029
$$ 40100 34432 62081 93945 78145 73000 85881 94636 90253 79534 99740 150656 94309 29280
8138B9280K7285q2319O7600k0876l1736K7254l7882M3986k9852m6550L2384K9241
$$ 29280 56565 -25754 41846 20970 -10766 16488 -21394 22592 -7260 -53810 -21426 7815
8126G815K5014J4361p9369J9938l7408k7096J1417P7019M1372l6579O298k4986
$$ 7815 32829 47190 -32179 -12241 -49649 -76745 -65328 11691 53063 16484 22782 -2204
8114b204n5473J612N1833o410J0262L6861j35122L595N300O872Q0189M9745l4740
$$ -2204 -57677 -56065 -4232 -10642 -380 36481 -98641 -95046 -89746 -82874 -2685 47060 12320
8101A2320j26388M7456J6973j3016k9223M2571M1J04313J5871j7683m2689o368
$$ 12320 -114068 -66612 -49639 -62655 -91878 -49307 -49266 55047 70918 53235 10546 4178
8089D178L7688j9507M2711j1769K0143k3377m7244Q521O191n47N1793Q146l7606
$$ 4178 41866 22359 65070 53301 73444 50067 2823 11344 17535 16988 68781 76927 39321
8076C9321q5479N2499L4047N8839j76l1891k4486k3994j5576k421O7460P471j12789
$$ 39321 -46158 6341 40388 99227 99051 67160 42674 18680 3104 683 68143 75614 -37175
8063c7175k5201K0429k3555J26181k28k6008J1985K9892m3258p449K6053K3576
$$ -37175 -62376 -41947 -65502 60679 60451 34443 46428 76320 33062 25613 51666 75242
8051G5242O6221p525Q1222P617p3922r3958k3887M6457q2449m4629k916J610M5369
$$ 75242 141463 133938 215160 222777 148855 54897 31010 77467 -4982 -49611 -52527 -50917 -5548
8038e548l8286M4840q347j2843K4547j9374n847O9796M40j0650n5389N6137Q222
$$ -5548 -43834 1006 -7341 -20184 4363 -15011 -20858 48938 49378 38728 -16661 39476 47698
8025D7698O025K9784L407O7756n5620l6814j6511m1902k9729J40M0293q189l7162
$$ 47698 53723 83507 86914 154670 99050 62236 45725 3823 -25906 -25766 14527 6338 -30824
8012c0824N4920J9886m3865J661J9300r0244N082L4684J5987K6118M3765l9162
$$ -30824 24096 43982 117 1778 21078 -69166 -64084 -29400 -13413 12705 56470 17308
8000A7308m2096J2992K3468n220p6346L1300L0878j8306R160P952m410R077M448
$$ 17308 -24788 -11796 11672 6452 -69894 -38594 -7716 -26022 -16862 -8910 -13320 -4243 205
7987B05m3343J2901J16313L565p2971K6237L8775J2472q7801j7063P438J09689
$$ 205 -43138 -30237 86076 89641 16670 42907 81682 94154 6353 -10710 -3272 106417
7975A06417q8801j08656M9645M0141P3358K2035n2873k9393n995P0946M6784l6006
$$ 106417 17616 -91040 -41395 -1254 72104 94139 41266 11873 5878 76824 123608 87602
7963H7602L2381J0235K7533r0498m415k6238N4041L9192l6599M8188l5384k5439
$$ 87602 119983 130218 157751 67253 62838 36600 90641 129833 93234 141422 106038 80599
7951H0599K4191O2512L4510n1032J0270R2686J3964P7010Q0070J0372Q4927l775
$$ 80599 104790 167302 201812 150780 161050 253736 267700 344710 424780 435152 520079 516304
7939E16304l7053M2154L1485L1817n038N3988J3386O4313M6202M7144J10495l1210
$$ 516304 479251 521405 552890 584707 579669 633657 647043 711356 757558 804702 915197 883987
7927H83987j04350m5243q7190K8881J6743q436p856j2421j046k6812o1803j11495
$$ 883987 779637 734394 647204 676085 692828 684392 676536 664115 663069 636257 574454 462959
7915D62959j20897O4418K7815m9625j05551N719k523p6068K739l5500o8549j9224
$$ 462959 342062 406480 434295 384670 279119 284838 282315 206247 208986 173486 104937 85713
7903H5713L4707M5185O1334n4215o5727j19151k694N6261Q4163p2579j06108M2231
$$ 85713 120420 165605 226939 172724 106997 -12154 -14848 41413 125576 52997 -53111 -10880
7891a0880j1625j6511N6084n027O3677n5563o8950P5866J25118q8197l5423J2186
$$ -10880 -22505 -39016 17068 12041 75718 20155 -48795 27071 152189 63992 28569 40755
7879D0755m2360N7901o1939n914M2882m3656k6827K6061M2494m6160O7210N5044
$$ 40755 -1605 56296 -5643 -11557 31325 -12331 -39158 -13097 29397 -16763 50447 105491
7867A05491j5477n0168k3128J7819K5353r568j0450K6971n5988J0117Q1999m3028
$$ 105491 90014 39846 16718 34537 59890 50322 39872 66843 10855 20972 102971 59943
7855E9943m2090L8594J3992J8201m5124m4688L3410J01616l1053m4302p0167l1506
$$ 59943 17853 56447 70439 88640 43516 -1172 32238 133854 102801 58499 -11668 -43174
7843d3174N4373N2280O0102p1183j3793n928k1851O6357Q060l1903l286r0453
$$ -43174 11199 63479 123581 52398 38605 32677 10826 77183 85243 53340 50054 -40399
7831d0399O910m1628K6375L5141M1419L2211m633o2128N5431p5000K6761P4124
$$ -40399 -33489 -75117 -48742 -13601 27818 60029 55396 -6732 48699 -26301 460 74584
7819G4584r2668O9654m6123K6081O1044q256n5890m9152K5361q384M5372M2560
$$ 74584 -18084 51570 5447 31528 92572 84316 28426 -20726 4635 -3749 41623 84183
7807H4183n1450q8840N4205L9434k6890j8580o5456k1976j61622J41136N4913
$$ 84183 32733 -56107 -1902 37532 10642 -7938 -73394 -95370 -256992 -115856 -60943
7796f0943O5739J9616o8166O2968J14318m9832p2112j9191J4197o4656r6153J06456
$$ -60943 4796 24412 -43754 19214 133532 83700 11588 -7603 6594 -58062 -154215 -47759
7784d7759R0293q20m9709m5444n1301N8840O0197j6704L5565n7194J2576L3581
$$ -47759 42534 41714 -7995 -53439 -104740 -45900 14297 -2407 33158 -24036 -11460 22121
7772B2121p763p9247q964L0468o7017J3665M1906q1014p406o021P5093K3818j5716
$$ 22121 14358 -64889 -73853 -43385 -110402 -96737 -54831 -135845 -143251 -149272 -74179 -50361 -66077
7759f6077M7766O6886r198j26950N6143L5529l8466j6785o3246J628J03859q786
$$ -66077 -18311 48575 39377 -87573 -31430 4099 -34367 -51152 -114398 -112770 -8911 -17697
7747a7697J053k381k8416m413J3023J3128o2076J4601L7952j11017O7223K1715
$$ -17697 -16644 -19025 -47441 -51854 -38831 -25703 -87779 -73178 -35226 -146243 -79020 -57305
7735e7305o5875k0849O6665j2365M8979o707k2432o7317J4037J03309m4889m462
$$ -57305 -123180 -144029 -77364 -89729 -40750 -47457 -69889 -137206 -123169 -19860 -64749 -69211
7723f9211J1325L0580M639O49L3799J2811K719q1511r0627O6321j9305O8948k8486
$$ -69211 -57886 -27306 -22667 -22018 11781 24592 27311 -54200 -144827 -78506 -97811 -28863 -57349
7710e7349j4321j3918O3156P0648p1023L2175o4828k3753Q2823r7848R5869j5333
$$ -57349 -71670 -85588 -22432 48216 -22807 9368 -55460 -79213 3610 -94238 1631 -13702
7698a3702r7441l8472M7124Q6986k5576N531p3484k3396j8594k0505q545P6855
$$ -13702 -111143 -149615 -102491 -15505 -41081 -35550 -109034 -132430 -151024 -171529 -180074 -103219
7686a03219l6388j4745j4025L9022P4418K192k6567J1506R467J4203l9788L9142
$$ -103219 -139607 -154352 -168377 -129355 -54937 -52745 -79312 -67806 -58339 -44136 -83924 -44782
7674d4782K994p493J7414p2354M0140L6421l1415j7913Q2720j8214j24836n0786
$$ -44782 -41788 -49281 -31867 -104221 -64081 -27660 -59075 -76988 5732 -12482 -137318 -188104
7662a88104J399J07330K7318l575j4197n1948j8964N4381k0413o0863M4073J9103
$$ -188104 -186705 -79375 -52057 -55632 -69829 -121777 -140741 -86360 -106773 -167636 -123563 -104460
7650a04460m799M0029j2729M6128O5057o1787L7908K7624n1557k0493j3745k8482
$$ -104460 -109259 -69230 -81959 -35831 29226 -32561 5347 32971 -18586 -39079 -52824 -81306
7638h1306K5336K2058k262L4693j00240L0709P5959J199l4668M5330K1237J00020
$$ -81306 -55970 -33912 -36174 -1481 -101721 -71012 4947 6146 -28522 16808 38045 138065
7626A38065J5650q4718M598j5478J8743M6996J7040K290K858o2156p5991k3073
$$ 138065 153715 68997 73595 58117 76860 123856 140896 143186 146044 83888 7897 -15176
7614a5176O9987K6088Q139J5005J16311Q771o1994L79J6904n349k2280j56m9435
$$ -15176 54811 80899 89038 104043 220354 229125 167131 167510 184414 179065 156785 156629 107194
7601A07194O159Q282j6104j5333j01032O2938L2748l2438K0681k4158J5220J3944
$$ 107194 113353 121635 105531 90198 -10834 52104 84852 52414 73095 48937 64157 78101
7589G8101P934m0611J6515P8551K2177l3153j13941K7385Q8096K0789J566P1682
$$ 78101 86035 45424 61939 140490 162667 129514 15573 42958 131054 151843 153409 225091
7577B25091O958O4052M555q1302l2207J8971p8449p5679q1357K700N2499P9389
$$ 225091 232049 296101 300656 219354 187147 206118 127669 51990 -29367 -26667 25832 105221
7565A05221K8644n8339l1228k0869j4210j0112l1700p628N851N5239m2383k5412
$$ 105221 133865 75526 44298 23429 9219 -893 -32593 -40221 -34370 20869 -21514 -46926
7553d6926k854j948O1976l074k3015l8661L8419J5524m0181k3049J3259j3150
$$ -46926 -49780 -51728 10248 7174 -15841 -54502 -16083 -559 -40740 -63789 -50530 -63680
7541f3680J01722m1875o0934K9562m3064o621O8522r526o0742K6880m7547p3185
$$ -63680 38042 -3833 -64767 -35205 -78269 -84890 -16368 -25894 -86636 -59756 -107303 -180488
7529a80488O6896J1402J9136k0384K6623J6036o661K014k811o5962l0435L8066
$$ -180488 -113592 -102190 -83054 -103438 -76815 -60779 -67440 -65426 -68237 -134199 -164634 -126568
7517a26568P4887j9823k4758O4674M4366j24228m9779J02350M018j1423K0739
$$ -126568 -51681 -71504 -96262 -31588 12778 -111450 -161229 -58879 -54861 -66284 -45545
7506d5545L3084J5262L4286m4764O5548P664j2478l7105q7279M8966m3838l5362
$$ -45545 -12461 2801 37087 -7677 57871 65535 53057 15952 -71327 -22361 -66199 -101561
7494a01561m049q1827O3857M4947l8495R6287J5318n7481O1067k1599L1153J0135
$$ -101561 -105610 -187437 -123580 -78633 -117128 -20841 -5523 -63004 -1937 -23536 7617 17752
7482A7752k8744j03595n8576K5678J06621l3152k2914K6419r1055m4854N7114
$$ 17752 -10992 -114587 -173163 -147485 -40864 -74016 -96930 -70511 -161566 -206420 -149306
7471a49306J31470J7732n3406K222o1746j6114l4740J0423K5537q886k8698N1373
$$ -149306 -17836 -104 -53510 -51288 -113034 -129148 -163888 -153465 -127928 -136814 -165512 -114139
7459a14139R1044L931n7310k8455k176m2334M7598j2985K4657l9851R0893l709
$$ -114139 -23095 -19164 -76474 -104929 -107105 -149439 -101841 -114826 -90169 -130020 -39127 -42836
7447d2836M3485M692n560j692k7061L4933k4322j7461m4977R434m4211J8046N0604
$$ -42836 649 5341 -219 -1911 -28972 5961 -18361 -35822 -80799 -71365 -115576 -97530 -46926
7434d6926o8138j3267K4082m5673L2451O0247n0695k3946K081P3722m0107k2928
$$ -46926 -115064 -128331 -104249 -149922 -117471 -57224 -107919 -131865 -129784 -56062 -96169 -119097
7422a19097l8275j7859Q0819Q3110j7520L7726n7838j3797m0628P6868N9667O031
$$ -119097 -157372 -175231 -94412 -11302 -28822 8904 -48934 -62731 -103359 -26491 33176 39207
7410C9207n654o0908P286P9267r6937M084l4796J0513K1578M3597J6340m2856
$$ 39207 33553 -27355 -20069 59198 -37739 -33655 -68451 -57938 -36360 7237 23577 -19279
7398a9279J1270j02262N3383K1359N007o6153L9216N3544j1403j00987L1510k5744
$$ -19279 -8009 -110271 -56888 -35529 -30522 -96675 -57459 -3915 -15318 -116305 -84795 -110539
7386a10539J48843q120o7228J4658O432J7052L5803j13062l0655P6256O6748p668
$$ -110539 38304 30184 -37044 -22386 -15954 1098 36901 -76161 -106816 -30560 36188 28520
7374B8520K6171q7172l63p407q5002J06507O962N1088J840o4217j3853j06267
$$ 28520 54691 -32481 -32844 -40251 -125253 -18746 -11784 39304 41144 -23073 -36926 -143193
7362a43193O2363N6227Q4123n9183j8p43R838K7001l2924L72n7609M1140J7029
$$ -143193 -80830 -24603 59520 337 319 -424 9414 36415 3491 3863 -53746 -12606 4423
7349D423l6464K5867j879l4219Q2096m5687J002m31M9473k3915o5745K602q84
$$ 4423 -32041 -6174 -8053 -42272 39824 -5863 -4861 -5292 44181 20266 -45479 -42877 -43761
7336d3761k8073o338K9379N4938K6322M671m3530m9901k4317N1116Q1076m8139
$$ -43761 -71834 -78172 -48793 6145 32467 37138 -6392 -56293 -80610 -29494 51582 3443
7324C443j3181K8006q7190N3980l762K0977J4130J6908k780k673o5621m7716K5533
$$ 3443 -9738 18268 -68922 -14942 -18704 2273 16403 33311 30531 27858 -37763 -85479 -59946
7311e9946K994J09324m4565j1859P561j46138J2848R8602J6081k1739o2562Q2285
$$ -59946 -56952 52372 7807 -4052 3509 -142629 -129781 -31179 -15098 -36837 -99399 -17114
7299a7114L5060q3094l714o60L8412m5656L3785L1292J5017j0326n5401N180k2703
$$ -17114 17946 -65148 -68862 -69522 -31110 -76766 -42981 -11689 3328 -6998 -62399 -57219 -79922
7286g9922N6861P5919m4410n4657O4570n6834K3356P1019q5017k9441l4719j4187
$$ -79922 -23061 52858 8448 -46209 18361 -38473 -15117 55902 -29115 -58556 -93275 -107462
7274a07462P4089O1919m121m8938O0234j03369L9476J21188p5950m7844O5336
$$ -107462 -33373 28546 24425 -24513 35721 -67648 -28172 93016 17066 -30778 34558
7263C4558L0741l184l7027P3680j8588n7206J7473o8409j6507l1698J8063N5235
$$ 34558 65299 62115 25088 98768 80180 22974 40447 -27962 -44469 -76167 -58104 -2869
7251b869M5393J5337l5887M3377Q4237o7180n7730l7759r70L1796R3014r181o3863
$$ -2869 42524 57861 21974 65351 149588 82408 24678 -13081 -14051 17745 110759 101578 37715
7238C7715N5712M7636m5038j7190o3290N060K2583L3429N9935k3845R3882P1293
$$ 37715 93427 141063 96025 78835 15545 20605 43188 76617 136552 112707 206589 277882
7226B77882K9000Q2913N5641P3062J09507M6026L5253j4351j1411j19003q4730
$$ 277882 306882 389795 445436 518498 628005 674031 709284 694933 683522 564519 479789
7215D79789M0276p3736j8599p4328r137N4029p9999j59076K2722L3078J4993o663
$$ 479789 520065 446329 427730 353402 344265 398294 318295 159219 181941 215019 230012 223349
7203B23349j8449K723J01398L155m5151j1151l1306O496K1878J15056o9884p1946
$$ 223349 204900 207623 309021 312176 267025 255874 224568 231064 252942 367998 298114 226168
7191B26168Q5804M8690p9030L1206N5208Q977N0607q965q9173l9424J401J5349
$$ 226168 311972 360662 281632 312838 368046 377023 427630 418665 329492 290068 291469 306818
7179C06818M817l0290m3062m5151n4548p450M1163L8962m9325M4158k1683o2193
$$ 306818 311635 281345 238283 193132 138584 131134 172297 211259 161934 206092 184409 122216
7167A22216l7973P1505N2707O4124K2213q5642k5742n1619O7522k7101L7895Q41
$$ 122216 84243 155748 208455 272579 294792 209150 183408 131789 199311 172210 210105 210946
7155B10946m9632r0123m0876O7183M4847R2263j43118j14958M2257O4434M6395
$$ 210946 161314 71191 30315 97498 142345 234608 91490 -23468 18789 83223 129618
7144A29618q4848q792q09n2945M1874K2841R757k2112N559q634l6725O2414M2070
$$ 129618 44770 35978 35169 -17776 24098 46939 56696 34584 40143 31509 -5216 57198 99268
7131I9268m9048l720k6535K1119r501q2512J8563Q1818o3071l5837J2837M917
$$ 99268 50220 46500 19965 41084 31583 -50929 -32366 49452 -13619 -49456 -36619 -31702
7119c1702j1709K3126M1442n0074j7342j3267J10461j6830k9253p000l7189N824
$$ -31702 -43411 -20285 21157 -28917 -46259 -59526 50935 34105 4852 -2148 -39337 -33513
7107c3513L7874O343J8386k5380q0520J2521l477M9387q921R5944M4146p7326
$$ -33513 4361 10704 29090 3710 -76810 -64289 -67766 -18379 -27300 68644 112790 35464
7095C5464M0504r2509l9182M1401L9535k4842M494n5546j4097j2121M6900M9772
$$ 35464 75968 -16541 -55723 -14322 25213 371 4865 -50681 -64778 -76899 -29999 19773
7083A9773l8841N8691L5654q6379j107p9852l0824J8531K6997P3560O568k010
$$ 19773 -19068 39623 75277 -11102 -12209 -92061 -122885 -104354 -77357 -3797 2771 761
7071G61P407L4472P872k2981j18495j3256r878N8342Q5337O321p0028M842J9591
$$ 761 8168 42640 50512 27531 -90964 -104220 -114098 -55756 29581 35902 -34126 -29284 -9693
7058i693k6355o7255n736J7790L5065M4196k6346l3644J15790q32J2217l479n6930
$$ -9693 -36048 -103303 -109039 -91249 -56184 -11988 -38334 -71978 43812 42980 55197 51718 -5212
7045e212n8884l3801K7612L5554M8080k495l473l1564L5978l7574K4880o672m1663
$$ -5212 -64096 -97897 -70285 -34731 13349 10854 7381 -24183 11795 -25779 -899 -7571 -49234
7032d9234j6757m982J9637J02484q03q6860L7237j2915J4571p961p319j9366O4527
$$ -49234 -65991 -70973 -51336 51148 50345 -36515 722 -12193 2378 -5583 -12902 -32268 32259
7019C2259O7143L9243k3910m8859m3393l9390j1535P5691J7959m7177n3341k2552
$$ 32259 99402 138645 114735 65876 22483 -16907 -28442 47249 65208 18031 -35310 -57862
7007e7862M8025k7446M4173M925o0239J09583J5605J3037L9650p4979j5229L9391
$$ -57862 -9837 -37283 6890 11815 -48424 61159 76764 89801 129451 54472 39243 78634
6995G8634q606m2716M7729l3781k3999l1285P8353O2521o432J4738n0622q8044
$$ 78634 70028 27312 75041 41260 17261 -14024 64329 126850 120418 135156 84534 -3510
6983c510q085N2108l7287l887L5341L3013q3421o2189P7908O3667p4885n8338
$$ -3510 -11595 40513 3226 -661 34680 67693 -15728 -77917 -9 63658 -11227 -69565
6971f9565L4646J05830O0476p530j4997o1952K4907K3061j8467l6253K3332l0303
$$ -69565 -34919 70911 131387 123857 108860 46908 71815 94876 76409 40156 63488 33185
6959C3185L2479N4476M390M6266Q5385q6436J9984M1321J788r3255J1386j8081
$$ 33185 65664 120140 124530 170796 256181 169745 189729 231050 232838 139583 150969 132888
6947A32888N298P7338o127q005l7470q541m9797K3464r604J2898M66K3717K0384
$$ 132888 138186 215524 209397 201392 163922 155381 105584 129048 119444 132342 132808 156525 176909
6934A76909P281o6357l5473P8967n8195o592n8058M7141M463j875j9310j1629
$$ 176909 184190 117833 82360 161327 103132 96540 38482 85623 90086 88211 68901 57272
6922E7272J4868j6297J9208K8264j2141L0301k9514N885l1563m7950M8055J3254
$$ 57272 72140 55843 75051 103315 91174 121475 91961 97846 66283 18333 66388 79642
6910G9642M0516r783L9266m417J9793o8405j6516N3947O0274n5830j8843l7220
$$ 79642 120158 110375 149641 145224 165017 96612 80096 134043 194317 138487 119644 82424
6898H2424J1794N3639L3943r7251J6388K6268j1833k6719Q326Q821L0072j7456
$$ 82424 94218 147857 181800 84549 100937 127205 115372 88653 96979 105800 135872 118416
6886A18416N2323O343j8451n8412k3754j5133l8574M760J2707j3274o3364N3731
$$ 118416 170739 177082 158631 100219 76465 61332 22758 27518 40225 26951 -36413 17318
6874A7318j8155K6962J7691m6610N1692L9183p4115l443J3345j7297o3651k6878
$$ 17318 -837 26125 43816 -2794 48898 88081 13966 10523 23868 6571 -57080 -83958
6862h3958P5341j5088j4405P7750r408o0630n742M6206k6379J3864m7674L880
$$ -83958 -8617 -23705 -38110 39640 30232 -30398 -36140 10066 -16313 -2449 -50123 -46243
6850d6243m757k6975M1583K9514Q112j8351j6737k3218Q8332N9163q7014o4308
$$ -46243 -51000 -77975 -36392 -6878 1234 -17117 -33854 -57072 31260 90423 3409 -60899
6838f0899K4106o0607l760J05661p3089Q4565k7841o9797K4141j7188M8808m7089
$$ -60899 -36793 -97400 -101160 4501 -68588 15977 -11864 -81661 -57520 -74708 -25900 -72989
6826g2989J09305L5473o7647P8243K1986p7910P7074r7717R152n966O1713o3718
$$ -72989 36316 71789 4142 82385 104371 26461 103535 5818 14970 9004 70717 6999
6814F999j1549R965J4496l2012p2887o6J6040J05995m8860l7562m146J3159J6336
$$ 6999 -4550 5415 19911 -12101 -84988 -85054 -69014 36981 -11879 -49441 -53587 -40428 -24092
6801b4092m0513r722J03864L5959q0785m7150Q8851K4249m4112J1374J5516J7392
$$ -24092 -64605 -74327 29537 65496 -15289 -62439 26412 50661 6549 17923 33439 50831
6789E0831M6921k4137L8176n8971l1469r038n700L281J4783L5815k8175o0762
$$ 50831 97752 73615 111791 52820 21351 12313 6613 9894 24677 60492 32317 -28445
6777b8445R3990o7047k209Q189L5620J026j8194K2045L4670o4421M3096K547l7915
$$ -28445 65545 -1502 -3711 4478 40098 41124 22930 44975 79645 15224 58320 60867 22952
6764B2952J3631j4654k4684M0980L5859R2588r6286k1604M4612L9182K9039n6485
$$ 22952 36583 21929 -2755 38225 74084 166672 70386 48782 93394 132576 161615 105130
6752A05130j9018k0155J5131Q606j12536K516L9580R293J1112m1046l2781L6615
$$ 105130 86112 65957 81088 89694 -22842 -20326 19254 28547 39659 -1387 -34168 2447
6740B447M3100l1376M3918N6806O4127p6278o9282J3734J05129j15156N1609j2008
$$ 2447 45547 14171 58089 114895 179022 102744 33462 47196 152325 37169 88778 76770
6728G6770n8539L5685P7895j3337n7185N9689m5847n8600P898o8264k1969L3706
$$ 76770 18231 53916 131811 118474 61289 120978 75131 16531 24429 -43835 -65804 -32098
6716c2098M7952Q767R460l4525J2850k965L7668L4612j0193K3592n4726L1195
$$ -32098 15854 24621 34081 -444 12406 9441 47109 81721 71528 95120 40394 71589
6704G1589j8899r7192M1381n951K8717M3390q507k2912M2900O5916j7375n9800
$$ 71589 52690 -44502 -3121 -9072 19645 63035 54528 31616 74516 140432 123057 63257
6692F3257j8690L2107K2301m4474J39253M0559J6873j22789p2816j7126J3054
$$ 63257 44567 76674 98975 54501 193754 234313 251186 128397 55581 38455 51509
6681E1509N7018N8724J0994l7716J9342o6668n1705J5997K8018o8923N4738k480
$$ 51509 108527 167251 178245 140529 159871 93203 41498 57495 85513 16590 71328 68848
6669F8848k4520l656q765k7047M0978J5920j8933p9376N6059Q4351N5321n5130
$$ 68848 44328 40672 31907 4860 45838 61758 42825 -36551 19508 103859 159180 104050
6657A04050m7706N5615k9188k0529n542m075O561N9391o8944k3228J5875N11K3143
$$ 104050 56344 111959 82771 62242 56700 52625 59186 118577 49633 26405 42280 42791 65934
6644F5934Q7117n0534l1694J0745j3103k5361l0331M2618P0625J2211r857L504
$$ 65934 153051 102517 70823 81568 68465 43104 12773 55391 126016 138227 128370 131874
6632A31874l4216K4535k8393n117j5149J1235j8851l6675l5154M9703L0799m668
$$ 131874 97658 122193 93800 88683 73534 84769 65918 29243 -5911 43792 74591 69923
6620F9923o2625k2797L8684M5231p068l9455k5674n7917Q5366L6411m519o076
$$ 69923 7298 -15499 23185 68416 61348 21893 -3781 -61698 23668 60079 55560 49484
6608D9484r3124L7145K9813N4877n517K0798p5500j7866K3975P933q68K9227j1378
$$ 49484 -43640 -6495 23318 78195 72678 93476 17976 110 24085 32018 31150 60377 48999
6595D8999r4714p9788K4065Q5919J2608L3937m9023k7352M1026m8520N915N3682
$$ 48999 -45715 -125503 -101438 -15519 -2911 31026 -17997 -45349 -4323 -52843 -46928 6754
6583F754o9432k938j1230R9091L6770j44110R0580P0848J9794k4218j6103K1835
$$ 6754 -62678 -65616 -76846 22245 59015 -85095 5485 76333 96127 71909 55806 77641
6571G7641J1652m387m8777K0727l7281J7561L6789r4561M5911N9871L0713r223
$$ 77641 89293 84906 36129 56856 19575 37136 73925 -20636 25275 85146 115859 106636
6559A06636l5914r752m5249M7224J3024O681r602J0010M6357N4996j20389q281
$$ 106636 70722 60970 15721 62945 75969 82650 73048 83058 129415 184411 64022 55741
6547E5741R920R054o1955n0441k5752N6856J0065N1799l8529j1559M695j3856
$$ 55741 65661 74715 12760 -37681 -63433 -6577 3488 55287 16758 5199 9894 -3962
6535c962L7073M8795k6855Q427L5386n2216M681j7658P4462l7216N132N946k357
$$ -3962 33111 81906 55051 63478 98864 46648 51329 33671 108133 70917 76049 81995 79638
6522G9638p8503M0188l5184R368L9393j4818L6567k0669N0437l0094p484K6005
$$ 79638 1135 41323 6139 15507 54900 40082 76649 55980 106417 76323 68839 94844
6510I4844k4453j8396o3693k7012n0454O9945R3443k4889j8438J9572k6823l0479
$$ 94844 70391 51995 -11698 -38710 -89164 -19219 74224 49335 30897 50469 23646 -6833
6498f833K7669k5167m130N0439k1324L4978r356M4908p63n9079L2456o9260M2052
$$ -6833 20836 -4331 -8461 41978 20654 55632 46276 91184 90421 31342 63798 -5462 36590
6485C6590L863j1919p8549R0550Q5425k6761m2735k4388Q3112N3481K5010r771
$$ 36590 40453 28534 -50015 40535 125960 99199 56464 32076 115188 168669 193679 183908
6473A83908r343k3511K1163m1892l1625K8909k0765k4813N7328K0654m8252n5609
$$ 183908 174565 151054 172217 130325 98700 127609 106844 82031 139359 160013 111761 56152
6461E6152K1656J7122L3425n2914k83l1664l533j4267O933M6624q9844K8875M6903
$$ 56152 77808 94930 128355 75441 75158 43494 39961 25694 32627 79251 -10593 18282 65185
6448F5185l1136p512N2083J0865l5367r3225M1056J51291m6894o3982l7396Q608
$$ 65185 34049 26537 78620 89485 54118 -39107 1949 153240 106346 42364 4968 13576
6436A3576O4825P1063L2765p1647p3112j11J31761J2396M0049L0003p0513n6706
$$ 13576 78401 149464 182229 110582 37470 37359 169120 181516 221565 251568 181055 124349
6424A24349l7307O1268J20487R172l6270l4565J1089K0763k1192J5653k1603q9563
$$ 124349 87042 148310 268797 277969 241699 207134 218223 238986 217794 233447 211844 122281
6412A22281O9386Q6872l3839p4338M9537P5647m7748o7790k2598K0578m235q0363
$$ 122281 191667 278539 244700 170362 219899 295546 247798 180008 157410 177988 173753 93390
6400I3390k1862Q3155o1873R665O83O5145N4664j11125k154n7039m7831L7197
$$ 93390 71528 154683 92810 102475 103158 168303 222967 111842 109688 52649 4818 42015
6388D2015J5104O537k7664m741J5695K6763J8341L1871O7651l9123j9015l6631
$$ 42015 57119 63656 35992 31251 46946 73709 92050 123921 191572 152449 133434 96803
6376I6803n3012K1672Q6863j8478l9160N0203r793l3398O912o7322O170r4834
$$ 96803 43791 65463 152326 133848 94688 144891 135098 101700 108612 41290 47460 -47374
6364d7374N8460K5347o2965J02593P475J8008j5923J0123n0558o301j4976M4700
$$ -47374 11086 36433 -26532 76061 83536 101544 85621 95744 45186 38885 23909 68609
6352F8609l7833L2832J49242q1506n0090l5541j2160O2337n8353L8139L5303O94
$$ 68609 30776 63608 212850 131344 81254 45713 33553 95890 37537 75676 110979 111673
6340A11673J852j09454L282N8207n4793J36221K0518J5709l8946j03785J3699
$$ 111673 113525 4071 7353 65560 10767 146988 167506 183215 144269 40484 54183
6329E4183J10964M213n7435J1789R427M7728j0713J3429K837o6356q2642R8002
$$ 54183 165147 169360 111925 123714 133141 180869 170156 183585 186422 120066 37424 135426
6317A35426J17460J9613r4819n2174L6304J2641J8383m9442K060j7043M3729J9845
$$ 135426 252886 272499 177680 125506 161810 174451 192834 143392 145452 128409 172138 191983
6305A91983j01598K7914L7869P0656k8589j06567M8740O4201K7213L1344j2291
$$ 191983 90385 118299 156168 226824 198235 91668 140408 204609 231822 263166 250875
6294B50875p564K0510m7019j9427P3828k6487j09287L0922J3581K5084J4381p0251
$$ 250875 243311 263821 216802 197375 271203 244716 135429 166351 179932 205016 219397 149146
6282A49146N0497k5499K6575j449J14460K2602j09806j1752L8266O417J2908k7479
$$ 149146 199643 174144 200719 199270 313730 336332 226526 214774 253040 259457 272365 244886
6270B44886n0899k6617J6061Q389K9610j6856K0032O3902o1286m4895k944L9076
$$ 244886 193987 167370 183431 191820 221430 204574 224606 288508 227222 182327 179383 218459
6258B18459o0434K2103j7969J8535Q435J2791M4420R6338o2125j4905J6480q5680
$$ 218459 158025 180128 162159 180694 189129 201920 246340 342678 280553 265648 282128 196448
6246A96448n4511N0738K3651L928o8198n5997R7872M9332l382o1334j3847O321
$$ 196448 141937 192675 216326 220254 152056 96059 193931 243263 239881 178547 164700 171021
6234A71021L1249P6587M2961q0042M646m1485j1719K1748J194k1115P5747k8395
$$ 171021 202270 278857 321818 241776 246422 204937 193218 214966 216160 195045 270792 242397
6222B42397q6951j4074K1412o5859L8389K7458l5543J11045r540n7820l3022O3636
$$ 242397 155446 141372 162784 96925 135314 162772 127229 238274 228734 170914 137892 201528
6210B01528K0099o7652Q531N4925n0134L5625M8346n3934N3048L2428K2263n9296
$$ 201528 221627 153975 162506 217431 167297 202922 251268 197334 250382 282810 305073 245777
6198B45777l0179O826j09213J411O7860J2198p4776J78K5743O4248L1452j785
$$ 245777 215598 222424 113211 114622 182482 194680 119904 120082 145825 210073 241525 239740
6186B39740j06552l4322J03301O663o5244q810M4860L7794j4208m3417m6527l472
$$ 239740 133188 98866 202167 208830 143586 134776 179636 217430 203222 159805 113278 109806
6174A09806L9137L836M3622L3666m6004K5413M2278k3453k9441P162L089K6958
$$ 109806 148943 152779 196401 230067 184063 209476 251754 228301 198860 206022 209111 236069
6162B36069J8572l2343Q074n5325L2122k0622J2735J03251L0192m9519O206k7156
$$ 236069 254641 222298 230372 175047 207169 186547 199282 302533 332725 283206 289412 262256
6150B62256m671J7988l0227J2863p24J1190O9347m5181m2170K8861k7423k0537
$$ 262256 257585 275573 245346 258209 257485 268675 338022 292841 250671 279532 252109 231572
6138B31572j6317R3386M090m0853P7480k3024n779o806O8548K6088k3793O119
$$ 231572 215255 308641 312731 271878 349358 326334 320555 313749 382297 408385 384592 390711
6126C90711L0426o1712J8866m4884k6948Q1240J3563m3673j7111J07139M604o607
$$ 390711 421137 359425 378291 333407 306459 387699 401262 357589 340478 447617 452221 445614
6114D45614n740N3720L8231o7952J2960L9537j9654K1503o4825Q1920Q9345n923
$$ 445614 439874 493594 531825 463873 476833 516370 496716 518219 453394 535314 624659 618736
6102F18736l39R8150M7785M7756N121L6550R6764N6021O9690J74357J02475J11498
$$ 618736 618397 716547 764332 812088 817209 853759 950523 1006544 1076234 1250591 1353066 1464564
6090A464564P8404l908L9712k0507j4639p9496p3167l6041q2084j2560O7046L1930
$$ 1464564 1542968 1539060 1578772 1558265 1543626 1464130 1390963 1354922 1272838 1260278 1327324 1359254
6078A359254R0943j4585m9873J34315K4998K07620J58853O4607J36418R1337J69094
$$ 1359254 1450197 1435612 1385739 1520054 1545052 1752672 1911525 1976132 2112550 2203887 2372981
6067B372981K3745l1569l135j02466n2132p0077j84092k9203n6573k9723r9086
$$ 2372981 2396726 2365157 2362022 2259556 2207424 2137347 1953255 1924052 1867479 1837756 1738670
6056A738670l2097r563n2418M1113m2490K5219O7331Q4064J0133K4294Q9327P5435
$$ 1738670 1706573 1697010 1644592 1685705 1643215 1668434 1735765 1819829 1829962 1854256 1943583 2019018
6044B019018k3277l7719p985p8778j12500j30675r5669p1874m3434o8782j24703
$$ 2019018 1995741 1958022 1950037 1871259 1758759 1628084 1532415 1460541 1417107 1348325 1223622
6033A223622o702P7653o2357l8447q8884N174l8757K5650N1962j30151n217m121
$$ 1223622 1216920 1294573 1232216 1193769 1104885 1110059 1071302 1096952 1148914 1018763 1013546 1009425
6021A009425M9604k5667k8332L6353Q525J4028l4584P6647J7326m1376L850o3020
$$ 1009425 1059029 1033362 1005030 1041383 1049908 1063936 1029352 1105999 1123325 1081949 1085799 1022779
6009A022779N6269J4107r4417m4550N1252L2170L6119m3854J06371j9840K4629
$$ 1022779 1079048 1093155 998738 954188 1005440 1037610 1073729 1029875 1136246 1116406 1141035
5998A141035P6606l0425K51k9279Q5945j02060j0556N5839P4020J9256m6364o8991
$$ 1141035 1217641 1187216 1187467 1158188 1244133 1142073 1131517 1187356 1261376 1280632 1234268 1165277
5986A165277L7829K1914j8501K1255J8361k6098Q727N3354J8570J2386m8075r2668
$$ 1165277 1203106 1225020 1206519 1227774 1246135 1220037 1228764 1282118 1300688 1313074 1264999 1172331
5974A172331O0890R6039Q6708m8178M647R6088J735k4248k4762L1362M9273M0137
$$ 1172331 1233221 1329260 1415968 1367790 1372437 1468525 1470260 1446012 1421250 1452612 1501885 1542022
5962A542022O5412M2174l1160j5344K2975J9755o84k9515L4552J5007M6565o866
$$ 1542022 1607434 1649608 1618448 1603104 1626079 1645834 1645150 1615635 1650187 1665194 1711759 1704893
5950A704893M2879n7910m6607O2947J8445L2622l9669N8590Q2974J1747l4351
$$ 1704893 1747772 1689862 1643255 1706202 1724647 1757269 1717600 1776190 1859164 1870911 1836560
5939A836560K2986O3286r902J0497n4256k9003m7761k3806R4758J21075N6126
$$ 1836560 1859546 1922832 1912930 1923427 1869171 1840168 1792407 1768601 1863359 1984434 2040560
5928B040560q5628j0594O7481N5093l2455M5806K0053J18326L8807m6029N3313
$$ 2040560 1954932 1944338 2011819 2066912 2034457 2080263 2100316 2218642 2257449 2211420 2264733
5917B264733m0814J0878Q2523J758P1246o084N0211Q2094O1002l1389l9088M749
$$ 2264733 2223919 2234797 2317320 2319078 2390324 2384240 2434451 2516545 2577547 2546158 2507070 2511819
5905B511819L2949k4114P6123O9426R3204o9405j3247J23453N9006J3171L2241
$$ 2511819 2544768 2520654 2596777 2666203 2759407 2690002 2676755 2800208 2859214 2872385 2904626
5894B904626m762j4607P7727J023n712P810R7823P4883l6835J30282Q5785q987
$$ 2904626 2899864 2885257 2962984 2964007 2958295 2966105 3063928 3138811 3101976 3232258 3318043 3309056
5882C309056n4946k3364J68732K1422p6583J5747N2782Q4112J16915M3801p90
$$ 3309056 3254110 3230746 3399478 3420900 3344317 3360064 3412846 3496958 3613873 3657674 3656884
5871C656884L2886O6655N7211R2073J22929J38225P2628R2844N6885O1841J03929
$$ 3656884 3689770 3756425 3813636 3905709 4028638 4166863 4239491 4332335 4389220 4451061 4554990
5860D554990J7343N5641J27762N2007J63260Q3901J07566J11489J68814j8824
$$ 4554990 4572333 4627974 4755736 4807743 4971003 5054904 5162470 5273959 5442773 5423949
5850E423949J77653K08774Q9814O1892Q7472R4496R4076J67441J41595J26996
$$ 5423949 5601602 5810376 5900190 5962082 6049554 6144050 6238126 6405567 6547162 6674158
5840F674158J34622J71168J17376J25179J48856J43390K21765K53820J97352K42239
$$ 6674158 6808780 6979948 7097324 7222503 7371359 7514749 7736514 7990334 8187686 8429925
5830H429925L10490K33856J65193K39817K29010J92158J88587K62709L11514K80886
$$ 8429925 8740415 8974271 9139464 9379281 9608291 9800449 9989036 10251745 10563259 10844145
5820A0844145J90435K14585K51181L13427K32443K86946K74465L05724M51107
$$ 10844145 11034580 11249165 11500346 11813773 12046216 12333162 12607627 12913351 13364458
5811A3364458M83635M84587M91185N32504O32952N75165O61524P04236N91780
$$ 13364458 13848093 14332680 14823865 15356369 15989321 16564486 17226010 17930246 18522026
5802A8522026N53144P66599O92654O82082P34582Q42608R54561J131086J155025
$$ 18522026 19075170 19841769 20534423 21216505 21951087 22793695 23748256 24879342 26034367
5793B6034367J278245J544140J672704J906915K104712K387139K561979K824728
$$ 26034367 27312612 28856752 30529456 32436371 34541083 36928222 39490201 42314929
5785D2314929L071581L449541L789834M109350M656159N281606O208577P591710
$$ 42314929 45386510 48836051 52625885 56735235 61391394 66673000 72881577 80473287
5777H0473287R630566J1948795J4079811J5783275J6884910J6964700J5478263
$$ 80473287 90103853 102052648 116132459 131915734 148800644 165765344 181243607
5770A81243607J2598522P197873O05074m697298p970173q087749n968525l919859
$$ 181243607 193842129 201040002 201645076 196947778 188977605 180889856 174921331 171001472
5762A71001472k239157j013858q8137J213826L205160N695119R007115J3370554
$$ 171001472 168762315 167748457 167660320 168874146 172079306 177774425 186781540 200152094
5754B00152094J7834597K1239153K4186384K6045532K5591234K2330647J6095331
$$ 200152094 217986691 239225844 263412228 289457760 315048994 337379641 353474972
5747C53474972M812354o719698j2708010j4718132j4852980j4312674j5738764
$$ 353474972 358287326 351567628 338859618 324141486 309288506 294975832 279237068
5740B79237068j7919793j6420594j3145949j0198773p927481n642278l114102
$$ 279237068 261317275 244896681 231750732 221551959 213624478 207982200 204868098
5733B04868098j77497L382222P566506J1187102J3630887J4549699J4523077J3320423
$$ 204868098 204690601 208072823 215639329 226826431 240457318 255007017 269530094 282850517
5725B82850517R398568K636595p279777j7888539k4388457k4420985k1069120
$$ 282850517 292249085 294885680 287605903 269717364 245328907 220907922 199838802
5718A99838802j7960263j5521970j3330194j1621489j0357687r386357q665402
$$ 199838802 181878539 166356569 153026375 141404886 131047199 121660842 112995440
5711A12995440q121814p662835p053211o123070n381346n008817m520189m185385
$$ 112995440 104873626 97210791 90157580 84034510 78653164 73644347 69124158 64938773
5703F4938773l658342l386768k993088k716851k463690k354051k197669j956478
$$ 64938773 61280431 57893663 54900575 52183724 49720034 47365983 45168314 43211836
5695D3211836j736672j616793j510741j462580j320119j238059j209090j003559
$$ 43211836 41475164 39858371 38347630 36885050 35564931 34326872 33117782 32114223
5687C2114223r79765r98251r30028q51758q19085p66924q54757p52177q06026
$$ 32114223 31134458 30136207 29206179 28354421 27535336 26768412 25913655 25161478 24355452
5678B4355452p06995o91314n88926n78780o15943m09284m51947n45530m00193
$$ 24355452 23648457 22957143 22368217 21789437 21173494 20764210 20312263 19766733 19366540
5669A9366540m03016l51492l69364k66086l58680l56978k65486k95653l48615
$$ 19366540 18963524 18612032 18242668 17976582 17617902 17260924 16995438 16699785 16351170
5660A6351170k76136j99233k90947k55918j58121j42573k18971k09311j41753
$$ 16351170 16075034 15875801 15584854 15328936 15170815 15028242 14809271 14599960 14458207
5651A4458207j17508j05001j99304j05724m0421K0776L0689M125P6324m7394m0280
$$ 14458207 14340699 14235698 14036394 13930670 13890249 13911025 13941714 13945839 14022163 13974769 13934489
5640A3934489q3935q7571k54231l61878k25703k23763j67030l22821k21333j41916
$$ 13934489 13850554 13762983 13508752 13146874 12921171 12697408 12530378 12207557 11986224 11844308
5630A1844308n7724q5460j80003j22023m009n5884j23539N2882j09776q6878q4751
$$ 11844308 11786584 11701124 11521121 11399098 11395089 11339205 11215666 11268548 11158772 11071894 10987143
5619A0987143J15844k2021j2901j2870J03932O267j9449M5335j6615R0126L1246
$$ 10987143 11102987 11080966 11068065 11055195 11159127 11165394 11145945 11191280 11174665 11264791 11296037
5608A1296037M8872O7665K2777j4898q0015p7283j4715q267n1528J6885M6581
$$ 11296037 11344909 11412574 11435351 11420453 11340438 11263155 11248440 11240173 11188645 11205530 11252111
5597A1252111M837k4502l2940J4811J29387J13166Q9777J06180J3066R1038J24184
$$ 11252111 11256948 11232446 11199506 11214317 11343704 11456870 11546647 11652827 11665893 11756931 11881115
5586A1881115K6217P6527K32132J72600R5539J63998K55513K78840K74071K44769
$$ 11881115 11907332 11983859 12215991 12388591 12484130 12648128 12903641 13182481 13456552 13701321
5576A3701321K72459K73552K23206K86863K99060L87524M30477L81598M58903
$$ 13701321 13973780 14247332 14470538 14757401 15056461 15443985 15874462 16256060 16714963
5567A6714963M61175N70033N61174O15290O56725O08142O67066Q51081Q50224
$$ 16714963 17176138 17746171 18307345 18922635 19579360 20187502 20854568 21705649 22555873
5558B2555873Q63430Q09809J029957J127227J185793J237747J363247J474728
$$ 22555873 23419303 24229112 25259069 26386296 27572089 28809836 30173083 31647811
5550C1647811J618523J801130J953063K239303K363307K651876L017936L242616
$$ 31647811 33266334 35067464 37020527 39259830 41623137 44275013 47292949 50535565
5542E0535565L507104L851763M187917M630380N156704N637111O217778O920452
$$ 50535565 54042669 57894432 62082349 66712729 71869433 77506544 83724322 90644774
5534I0644774P788794Q995964J0201356J1727143J3154396J4395466J5096109
$$ 90644774 98433568 107429532 117630888 129358031 142512427 156907893 172004002
5527A72004002J5363705J4701399J2818196R970984O319308K360351j245712l739709
$$ 172004002 187367707 202069106 214887302 224858286 231177594 233537945 232292233 228552524
5519B28552524m947988n059757m482108l672589k447116r22158P71690K577723
$$ 228552524 223604536 218544779 214062671 210390082 207942966 207020808 207792498 210370221
5511B10370221M321430O107597P884523R722942J1087057J2031305J2139762J1579488
$$ 210370221 214691651 220799248 228683771 238406713 249493770 261525075 273664837 285244325
5503B85244325R966121P740478N081544J623991k307187o569350r962221j2444266
$$ 285244325 295210446 302950924 308032468 309656459 307349272 300779922 290817701 278373435
5495B78373435j3414061j3081355j2065901j0744073r209990p568566o129865
$$ 278373435 264959374 251878019 239812118 229068045 219858055 212289489 206159624
5488B06159624m597059l322830j904036o97059L82768J151444J573302J592284
$$ 206159624 201562565 198239735 196335699 195638640 196021408 197172852 198746154 200338438
5480B00338438P06622q21593k986807n368727p588349r288285j0296426j0547337
$$ 200338438 201045060 200223467 197236660 191867933 184279584 174991299 164694873 154147536
5472A54147536j0063174r443294q745991q138269p526891o858650o407216n886011
$$ 154147536 144084362 134641068 125895077 117756808 110229917 103371267 96964051 91078040
5464I1078040n450177n145029m695061m354475l926270l632183l380002l053851
$$ 91078040 85627863 80482834 75787773 71433298 67507028 63874845 60494843 57440992
5456E7440992k830116k582399k498240k363425k091175j884409j698354j529088
$$ 57440992 54610876 52028477 49530237 47166812 45075637 43191228 41492874 39963786
5448C9963786j478773j357325j264744j280477j063925r63338r61064q36318q59115
$$ 39963786 38485013 37127688 35862944 34582467 33518542 32555204 31594140 30757822 29898707
5439B9898707r33678q56841q99156q88974q33233p84077p72193p59965o82793
$$ 29898707 28965029 28108188 27209032 26320058 25486825 24702748 23930555 23170590 22487797
5430B2487797o18517n85647n57190m93882m27160k83789m08668l50885m00987
$$ 22487797 21869280 21283633 20726443 20232561 19805401 19521612 19112944 18762059 18361072
5421A8361072l31572l63645l68308l65926l40691l02374l82652m20288l07318
$$ 18361072 18029500 17665855 17297547 16931621 16590930 16288556 15905904 15485616 15178298
5412A5178298l56223l13502l09033l19604k65125l04119k59357l28289k24161
$$ 15178298 14822075 14508573 14199540 13879936 13614811 13310692 13051335 12723046 12498885
5403A2498885k17408j99215j19830k67478j46138j33257j61541j88815j79694
$$ 12498885 12281477 12082262 11962432 11694954 11548816 11415559 11254018 11065203 10885509
5394A0885509j60615k37609j81006k44424j26569k55797k54295j75402j66951
$$ 10885509 10724894 10487285 10306279 10061855 9935286 9679489 9425194 9249792 9082841
5385I082841j66467k23971j75203j22863j09349j18104r7230j06973j54660k03011
$$ 9082841 8916374 8692403 8517200 8394337 8284988 8166884 8069654 7962681 7808021 7605010
5375G605010o2241o4733j86706j84428j67202j02294j1898o3991j26917j03046
$$ 7605010 7542769 7478036 7291330 7106902 6939700 6837406 6825508 6761517 6634600 6531554
5365F531554q8223j67513j36895j28599o3310n3792j28242j34949q1263k7114
$$ 6531554 6443331 6275818 6138923 6010324 5947014 5893222 5764980 5630031 5548768 5521654
5355E521654p5258q3290p7930n9958o4799p9638j19266q1473j23595o5551K85
$$ 5521654 5446396 5363106 5285176 5225218 5160419 5080781 4961515 4880042 4756447 4690896 4691181
5344D691181j50246L4405p7741j31399j7752j31913o3556l4840l6865k4262j35266
$$ 4691181 4540935 4575340 4497599 4366200 4348448 4216535 4152979 4118139 4081274 4057012 3921746
5333C921746j34042Q407O1648j6489j15866n0510j15230m5320l9394j9018m2063
$$ 3921746 3787704 3796111 3857759 3841270 3725404 3674894 3559664 3514344 3474950 3455932 3413869
5322C413869j4083j05121L3154j5758q6723m8684M3376j07094r7772l9512p237
$$ 3413869 3399786 3294665 3327819 3312061 3225338 3176654 3220030 3112936 3015164 2975652 2968415
5311B968415l0751o8631r2383p0251k4561M3682l7643l1266k6927q6998N694L3620
$$ 2968415 2937664 2869033 2776650 2706399 2681838 2725520 2687877 2656611 2629684 2542686 2548380 2582000
5299B582000l9376m0880J4848m3950j3428k4689L8851l0929m4611q541l3640k7638
$$ 2582000 2542624 2501744 2516592 2472642 2459214 2434525 2473376 2442447 2397836 2389295 2355655 2328017
5287B328017o7172j06674J04700K8099o6132j8723J4081q590m3998l2950M8473
$$ 2328017 2260845 2154171 2258871 2286970 2220838 2202115 2216196 2207606 2163608 2130658 2179131
5276B179131j3811j20419k6040o1019k3470J7838o5104O8938K2412J3210J4962
$$ 2179131 2165320 2044901 2018861 1957842 1934372 1952210 1887106 1956044 1978456 1991666 2006628
5265B006628K9451k2779l095L9754q362o3922J1132M6651q7129J7694O9298o9051
$$ 2006628 2036079 2013300 2010205 2049959 2041597 1977675 1988807 2035458 1948329 1966023 2035321 1966270
5253A966270o6203L6805K3512k1481Q7032j09869r370J6126j0213r8327j9392
$$ 1966270 1900067 1936872 1960384 1938903 2025935 1916066 1906696 1922822 1912609 1814282 1794890
5242A794890R4118K374J5882M9584l9507j2287J8911M7440L7384N8344J9019r2851
$$ 1794890 1889008 1891382 1907264 1956848 1917341 1905054 1923965 1971405 2008789 2067133 2086152 1993301
5230A993301K1030P8540R5659k0726L7051R9204m9128Q662j0421J7548N8129n7405
$$ 1993301 2014331 2092871 2188530 2167804 2204855 2304059 2254931 2263593 2253172 2270720 2328849 2271444
5218B271444r197K292J1103R6218P6519j8188p2527L5877Q7152j4057n5631L3307
$$ 2271444 2262247 2264539 2275642 2371860 2448379 2430191 2357664 2393541 2480693 2466636 2411005 2444312
5206B444312L6872J00130J28905n2481P4200Q2342k4810j02298M8374R306j4043
$$ 2444312 2481184 2581314 2710219 2657738 2731938 2814280 2789470 2687172 2735546 2744852 2730809
5195B730809J9341q519J803J2863p625Q517O7140J03886j03398K3991P0012J08878
$$ 2730809 2750150 2741631 2743434 2756297 2748672 2757189 2824329 2928215 2824817 2848808 2918820 3027698
5183C027698R1970J4502m9401M7894O1431P991Q265l2394j23124j09007j16074
$$ 3027698 3119668 3134170 3084769 3132663 3194094 3202085 3210350 3177956 3054832 2945825 2829751
5172B829751j39800n3220n5962m9910j47996p6653m2020o9115r5204K9281P4684
$$ 2829751 2689951 2636731 2580769 2530859 2382863 2306210 2264190 2195075 2099871 2129152 2203836
5161B203836j04841m4532N3284L3993j5128l0077J31682l8805j41216j15727p8173
$$ 2203836 2098995 2054463 2107747 2141740 2126612 2096535 2228217 2189412 2048196 1932469 1854296
5150A854296j39630k2422n1132m4468n7432n1204k1396k9726o8829m1015o4765
$$ 1854296 1714666 1692244 1641112 1596644 1539212 1488008 1466612 1436886 1368057 1327042 1262277
5139A262277n9165J8077j06630m8425l9115l5300j2966Q9672L9988l4893q0119
$$ 1262277 1203112 1221189 1114559 1066134 1027019 991719 978753 1068425 1108413 1073520 993401
5128I93401l6606l1959k9171j6678J1308K7670p0953m7961M8721J13974N5354
$$ 993401 956795 924836 895665 878987 890295 917965 847012 799051 847772 961746 1017100
5117A017100j22078p0420p2323J905J24518j65068j7084r351J1068P7348k8342
$$ 1017100 895022 824602 752279 754184 878702 713634 696550 687199 698267 775615 747273
5106G47273k8971j562M2251o5150J9699l3841L7332p9472p276l0114L3352M1245
$$ 747273 718302 716740 758991 693841 713540 679699 717031 637559 630283 600169 633521 674766
5094F74766j7068o241M8431N6043j6700j6989j14113l1776m6265K8426r056L3805
$$ 674766 657698 651457 699888 755931 739231 722242 608129 576353 530088 558514 549458 583263
5082E83263M429N7168N899l4187l5317k640l2043m6705J3237L2779n5814k8037
$$ 583263 587692 644860 650759 616572 581255 578615 546572 499867 513104 545883 490069 462032
5070D62032N9214m6624J2408N6875j8142M6855l4596m2977N3496M0158p5854o5834
$$ 462032 521246 474622 487030 543905 525763 572618 538022 495045 548541 588699 512845 447011
5058D47011N2637k500n5573l1033J867M8335N5014m877J2300P2143p2656q4584
$$ 447011 499648 497148 441575 410542 412409 460744 515758 510881 523181 595324 522668 438084
5046D38084K2383O1656J3031p8828K2125m3411L5112J6811l3641p665j649P9209
$$ 438084 460467 522123 535154 456326 478451 435040 470152 486963 453322 445657 444008 523217
5034E23217K945l3343j9680N5044k6984k2606m3567j7961R2926L8591N696m3698
$$ 523217 526162 492819 473139 528183 501199 478593 435026 417065 509991 548582 554278 510580
5022E10580j5083q6442o6798l9309R6126Q3567o282k8554L0543J3870J2360R496
$$ 510580 495497 409055 342257 302948 399074 482641 476359 447805 478348 492218 504578 514074
5010E14074J5069o3517m7135m929L3941J9182o9357J4395j9929Q6112k0722o755
$$ 514074 529143 465626 418491 413562 447503 466685 397328 411723 391794 477906 457184 450429
4998D50429R2926Q552K2687j3436m9875O0462P585R17M5455o793K8859P8404P4513
$$ 450429 543355 551907 574594 561158 511283 571745 579330 580247 625702 618909 647768 726172 800685
4985H00685M1302N4524N9283J19857o0892n6852Q7343K9521P53o2078m6422L6821
$$ 800685 841987 896511 955794 1075651 1014759 957907 1045250 1074771 1075524 1013446 967024 1003845
4973A003845N2642L5921k4474K9663P0606k486p4849k2721M2884M5881J3118k4915
$$ 1003845 1056487 1092408 1067934 1097597 1168203 1165717 1090868 1068147 1111031 1156912 1170030 1145115
4961A145115o6677o2890J24343R2686k8462q3589k9182k5533P8149P1552K9190
$$ 1145115 1078438 1015548 1139891 1232577 1204115 1120526 1091344 1065811 1143960 1215512 1244702
4950A244702K7245J17959K8621J002R1927M2235J10219K0887o2149j3344J40665
$$ 1244702 1271947 1389906 1418527 1419529 1511456 1553691 1663910 1684797 1622648 1609304 1749969
4939A749969N373j04107J39430Q6104P9210J06263P7056J23106J31084R8514J31899
$$ 1749969 1755342 1651235 1790665 1876769 1955979 2062242 2139298 2262404 2393488 2492002 2623901
4928B623901J20653m929J07857R8588K0282L7507j08492L9476o1134j48658j40818
$$ 2623901 2744554 2739625 2847482 2946070 2966352 3003859 2895367 2934843 2873709 2725051 2584233
4917B584233j45208o8495l8210j49604p8112k6658p3841p8702j36140n5630j15439
$$ 2584233 2439025 2370530 2332320 2182716 2104604 2077946 2004105 1925403 1789263 1733633 1618194
4906A618194m6847n4507p3736L5857K9862J770l9783j01890L123n0381j5129l9995
$$ 1618194 1571347 1516840 1443104 1478961 1508823 1510593 1470810 1368920 1372043 1321662 1306533 1266538
4894A266538l7106j28796l7332K7358k5388m0778p4426l6054J6n2470M903q5096
$$ 1266538 1229432 1100636 1063304 1090662 1065274 1024496 950070 914016 914032 861562 866465 781369
4882G81369R2466J0629n5201q0060l8973J1857J12731n0393r4769J06347l2079
$$ 781369 873835 884464 829263 749203 710230 722087 834818 784425 689656 796003 763924
4871G63924j4270N5140K7076J8480p0679n1926r3290j05347J11673M5946k0315
$$ 763924 749654 804794 831870 850350 779671 727745 634455 529108 640781 686727 666412
4860F66412M0956L0596k7533R719q7908J27177k3904m548M8748l2738l5124N9882
$$ 666412 707368 737964 710431 720150 632242 759419 735515 730967 779715 746977 711853 771735
4848G71735R6854r4877j06422K6811P6795K8746n9863j0526M4557Q2803J9349
$$ 771735 868589 773712 667290 694101 770896 799642 739779 729253 773810 856613 875962
4837H75962l5590l7884o5566L947Q94j9949P7567o917n0159J1849L5355n0841
$$ 875962 840372 802488 736922 740869 741763 721814 799381 792464 742305 754154 789509 738668
4825G38668J1326O6034k5408m8344k0561M0184Q6737L7858r1682O4680Q210n5273
$$ 738668 749994 816028 790620 742276 721715 761899 848636 886494 794812 859492 867702 812429
4813H12429q7861L9843M3327K907J8813r681Q3011j1167j0523K6193l027k2116
$$ 812429 724568 764411 807738 810645 829458 819777 902788 891621 881098 907291 904264 882148
4801H82148J8849l6827O9655k1332M1909L6394n8417l6293J9138J9276J3441l3623
$$ 882148 900997 864170 933825 912493 954402 990796 932379 896086 915224 934500 947941 914318
4789I14318N3989K4890o3676q9250j1043N3663N0140j6310j5974K7599k6507r998
$$ 914318 968307 993197 929521 840271 829228 882891 933031 916721 900747 928346 901839 891841
4777H91841j0024l9954j8067J04299J3373L4853j4000j2032J1267m1877L5807
$$ 891841 881817 841863 823796 928095 941468 976321 962321 950289 961556 919679 955486
4766I55486L9226L245o5117J507K4426K194M4971j329J8566M4155o1369j08924
$$ 955486 994712 997957 932840 934347 958773 960967 1005938 1004609 1023175 1067330 1005961 897037
4754H97037Q0020O8440j09734M1928Q7683k4532k5587L842O389j8369j1839K364
$$ 897037 977057 1045497 935763 977691 1065374 1040842 1015255 1019097 1025486 1007117 995278 997642
4742I97642J12580j3346n8523o3217O363P590M6926p0015K3831J9308j2395j2329
$$ 997642 1110222 1096876 1038353 975136 981499 989089 1036015 966000 989831 1009139 996744 984415
4730I84415p181k2805Q2001M1347j1622p6474j3710r606N3729l4207Q550K9709
$$ 984415 977234 954429 1036430 1077777 1066155 989681 975971 966365 1020094 985887 994437 1024146
4718A024146j0310J0524j7008l2493m9082N1024m4039K098n025M812J0122M8399
$$ 1024146 1013836 1024360 1007352 974859 925777 976801 932762 934860 929835 934647 944769 993168
4706I93168O6704M8849K3868L4842n4922r182O4985n1471l2124L2573j2007L7119
$$ 993168 1059872 1108721 1132589 1167431 1112509 1103327 1168312 1116841 1084717 1117290 1105283 1142402
4694A142402N2529N0847K3617Q936M2942m8284o5945m7250n4421P7362l3948o849
$$ 1142402 1194931 1245778 1269395 1278331 1321273 1272989 1207044 1159794 1105373 1182735 1148787 1141938
4682A141938n1165j9171k1133r0594K4522R9025K235K7208J0938l4580o5433M6110
$$ 1141938 1090773 1071602 1050469 959875 984397 1083422 1085657 1112865 1123803 1089223 1023790 1069900
4670A069900k2372j7132J0820J8497N5442p316j4741o5961l2275o5904k6134P2164
$$ 1069900 1047528 1030396 1041216 1059713 1115155 1107839 1093098 1027137 994862 928958 902824 974988
4658I74988P6065L436r6276j2535M396J02259k4819n3555q774l3796J3483j9467
$$ 974988 1051053 1054489 958213 945678 950074 1052333 1027514 973959 965185 931389 944872 925405
4646I25405K098m1477k776j03977O6783J0747j1923k6328l4072L6923l4507j1397
$$ 925405 927503 886026 883250 779273 846056 856803 844880 818552 784480 821403 786896 775499
4634G75499L8578l5081k4391m3093M906R3976K7690n2330j03736j1815P7071J5500
$$ 775499 814077 778996 754605 711512 716418 810394 838084 785754 682018 670203 747274 762774
4622G62774j7158n768k7840l311K6587l4803L824J4723K8825J9958r377Q6670
$$ 762774 745616 739848 712008 708697 735284 700481 704305 719028 747853 767811 758434 845104
4610H45104N901n0826m3974L2001n7007k945j0496R87k6926N4099r0878q1286
$$ 845104 851005 800179 756205 788206 731199 728254 717758 718745 691819 745918 655040 573754
4598E73754Q5380N139p8614K4587L9897k6076k9655k401L1425j6550J4596L823
$$ 573754 659134 664273 585659 610246 650143 624067 594412 592011 623436 606886 621482 625305
4586F25305j2819q2671L7102q645k4385N040p072R7052m7027K2841N2278r8763
$$ 625305 612486 529815 566917 558272 533887 538927 531855 628907 581880 604721 656999 558236
4574E58236r4519j6216L3331M9619j0697n3246k2067L5147q299O7415O3008j18755
$$ 558236 463717 447501 480832 530451 519754 466508 444441 479588 471289 538704 601712 482957
4562D82957J5517O0390n419o3472K3602j136q880O6850J0445p548O6918m1442
$$ 482957 498474 558864 553445 489973 513575 512439 503559 570409 580854 573306 640224 598782
4550E98782J6871q718k1143J2216l5969m1759j8117P239k1963J3724L2164l8586
$$ 598782 615653 606935 585792 598008 562039 520280 502163 509402 487439 501163 533327 494741
4538D94741J7350K8046j5626J06465J14887R390j2273j15129K8029O6028L9327
$$ 494741 512091 540137 524511 630976 745863 755253 742980 627851 655880 721908 761235
4527G61235J6722k0858J3263L5494N6901N2029l4699j1479J2724K3586M7488K1781
$$ 761235 777957 757099 770362 805856 862757 914786 880087 868608 881332 904918 952406 974187
4515I74187J989j9822j4959N7266L562k912l5680J4517L5162N5738Q2522K6021
$$ 974187 976176 956354 941395 998661 1002223 999311 963631 978148 1013310 1069048 1151570 1177591
4503A177591j6990n3784k6066K1748M2341J550j2331J21341J4241o563o4925O4494
$$ 1177591 1160601 1106817 1080751 1102499 1144840 1146390 1134059 1255400 1269641 1263078 1198153 1262647
4491A262647J22528m9418l5065l6391L9209m2283K9394R544J16514L8127l2672
$$ 1262647 1385175 1335757 1300692 1264301 1303510 1261227 1290621 1300165 1416679 1454806 1422134
4480A422134r0040K3448M6126K7132R0048Q684m3114K7300n827J9761R6635O8205
$$ 1422134 1332094 1355542 1401668 1428800 1518848 1527532 1484418 1511718 1505891 1525652 1622287 1690492
4468A690492J53571J38212J39408J72010N8993L060k9551o6840j03369j45145
$$ 1690492 1844063 1982275 2121683 2293693 2352686 2355746 2326195 2259355 2155986 2010841
4458B010841j29456q749O802j40303j14379o7336j5423K0322q6883k8488o2307
$$ 2010841 1881385 1872636 1879438 1739135 1624756 1557420 1541997 1562319 1475436 1446948 1384641
4447A384641K361J8999p6535m8825K7927l7427o904q7032K0497m9457O323m4818
$$ 1384641 1387002 1406001 1329466 1280641 1308568 1271141 1264237 1177205 1197702 1148245 1154568 1109750
4435A109750j3965L2942j3788o2158J2355P0704m893k7685J0059o8192r4853o391
$$ 1109750 1095785 1128727 1114939 1052781 1065136 1135840 1130947 1103262 1113321 1045129 950276 943885
4423I43885m3350J6611R676J7353j6808K6185n6757l1822J6504R7928M8100l3220
$$ 943885 900535 917146 926822 944175 927367 953552 896795 864973 881477 979405 1027505 994285
4411I94285o7666j9011N6753P2775P7689J35556l4398J0735P823k0636N4216k878
$$ 994285 926619 907608 964361 1037136 1114825 1250381 1215983 1226718 1234541 1213905 1268121 1265243
4399A265243l7824l054n7741p1233j20094m5940O318P922M5554j3168J0607l425
$$ 1265243 1227419 1224365 1166624 1095391 975297 929357 935675 943597 989151 975983 986590 983165
4387I83165n6375k1750N6029J9244Q1144Q2951O7082k1987j0807j2841k3453n2872
$$ 983165 926790 905040 961069 980313 1061457 1144408 1211490 1189503 1178696 1165855 1142402 1089530
4375A089530j16761k2324l3054n4203J0333o3348k1137K876q1619K1351K1919
$$ 1089530 972769 950445 917391 863188 873521 810173 789036 791912 710293 731644 753563
4364G53563q1375j13162N8479k6044K448k6985Q1668q276r880j0884r3334k3958
$$ 753563 672188 559026 617505 591461 593909 566924 648592 640316 630436 619552 526218 502260
4352E02260j2600N0383J379N6438L7910m6752j16453N6700q995q3701K9311J3367
$$ 502260 489660 540043 541422 597860 635770 589018 472565 529265 520270 436569 465880 479247
4340D79247m3285J5229Q602o9246N6367J12172J9335p5628L907m331l8709k4856
$$ 479247 435962 451191 459793 390547 446914 559086 578421 502793 506700 502369 463660 438804
4328D38804M4373q7108R6868Q5068j16716o4942J3123L9749m1539k9212k390L034
$$ 438804 483177 396069 492937 578005 461289 396347 409470 449219 407680 378468 376078 379112
4316C79112N4684j102n664o202N2492j2290m3057K0681k2872j7959n6051J9302
$$ 379112 433796 432694 427030 420828 473320 461030 417973 438654 415782 397823 341772 361074
4304C61074j7431l9045J14816l7922r0109K2616O2142O2380o667L7575j3734j0723
$$ 361074 343643 304598 419414 381492 291383 313999 376141 438521 431854 469429 455695 444972
4292D44972p0513l419O7468O827k2971L5467K0417L3335j07837o7694p130m3129
$$ 444972 374459 371040 438508 445335 422364 457831 478248 511583 403746 336052 328922 285793
4280B85793N774Q1990o677j5635k5131M7092N2804k6376o2852L0648l6411Q0885
$$ 285793 291567 373557 366880 351245 326114 373206 426010 399634 336782 367430 331019 411904
4268D11904J38067J0789j03177N131N8519j8775P3258L1857m691k8235k0325o8562
$$ 411904 549971 560760 457583 462714 521233 502458 575716 607573 602882 574647 554322 485760
4256D85760k3397Q1704j463n5494m9457k136Q6294N3679j5789j8385n3043j6365
$$ 485760 462363 544067 542604 487110 437653 435517 521811 575490 559701 541316 488273 471908
4244D71908J566j1886M0273Q3841l7039k1825Q611o6242k7934o3328J03530J11148
$$ 471908 473474 461588 501861 585702 548663 526838 535449 469207 441273 377945 481475 592623
4232E92623K4462o1675K2194m1859l7528N2049J7080J2397K3228K1653k3055K7918
$$ 592623 617085 555410 577604 535745 498217 550266 567346 579743 602971 624624 601569 629487
4220F29487l4530L4326Q517K6691p6824l297J8530P4717L3591j9677R464P687
$$ 629487 594957 629283 637800 664491 587667 584370 602900 677617 711208 691531 700995 708682
4208G08682l8806K36O3872n7483m6554m2690P1292j5094j7703m0635M500Q1239
$$ 708682 669876 670112 733984 676501 629947 587257 658549 643455 625752 585117 589617 670856
4196F70856j8772n3123J68886J0589j4098n9485j3086M0152N6150k3908r3340
$$ 670856 652084 598961 767847 778436 764338 704853 691767 731919 788069 764161 670821
4185F70821l7209L4711K1306K1113j2469k1893K9718J9350K1838l3636j4670P888
$$ 670821 633612 668323 689629 710742 698273 676380 706098 725448 747286 713650 698980 706868
4173G06868O499k7170P6375J12491l651l3838j277j2116j31523N4600J8031p9345
$$ 706868 713367 686197 762572 875063 871412 837574 836297 824181 692658 747258 765289 685944
4161F85944K2033L3584J653L8876N3963j3913J0272M03k4123Q1954K2579L8693
$$ 685944 707977 741561 743214 782090 836053 822140 832412 832815 808692 890646 913225 951918
4149I51918L4374l9468m3802r0726J17920K0174k7973m8854k1159K7108N6772
$$ 951918 986292 946824 903022 812296 930216 950390 922417 873563 852404 879512 936284
4138I36284l6243r009k5049j4809N0330J473K9287L4216J9944J8741j5894K9479
$$ 936284 900041 891032 865983 851174 901504 902977 932264 966480 986424 1005165 989271 1018750
4126A018750L3191n2205m5645K2171M1225l2775P89m9123M1579p615O7804J7187
$$ 1018750 1051941 999736 954091 976262 1017487 984712 985501 936378 977957 970342 1038146 1055333
4114A055333j2337p0217j631O2356l2369K9472L2414P5043l6896p6032K1180L9800
$$ 1055333 1042996 972779 971148 1033504 1001135 1030607 1063021 1138064 1101168 1025136 1046316 1086116
4102A086116p5106M6023Q7859m8923p3784N9441M3385o0843J1929j2663J1091
$$ 1086116 1011010 1057033 1144892 1095969 1022185 1081626 1125011 1064168 1076097 1063434 1074525
4091A074525P9760m911K8513o1044Q7157K5432j15392p633P8590j4720M3883Q5201
$$ 1074525 1154285 1149374 1177887 1116843 1204000 1229432 1114040 1106407 1184997 1170277 1214160 1299361
4079A299361j8657l8881l861l623l2098l9041N2086J9225O2620J7930L0777k3102
$$ 1299361 1280704 1241823 1237962 1234339 1202241 1163200 1215286 1234511 1297131 1315061 1345838 1322736
4067A322736l9639L4986O410p1472m0332J03803K5582l0871M7116K3366K6227
$$ 1322736 1283097 1318083 1324493 1253021 1212689 1316492 1342074 1311203 1358319 1381685 1407912
4056A407912M9831n9693L2374K6829Q98l4404M850O2032J9811N9524j5385m0890
$$ 1407912 1457743 1398050 1430424 1457253 1458151 1423747 1428597 1490629 1510440 1569964 1554579 1513689
4044A513689J02365l5619l9756O8633J9432l6336p917L045J4108Q1976K9810m078
$$ 1513689 1616054 1580435 1540679 1609312 1628744 1592408 1584491 1587536 1601644 1683620 1713430 1709352
4032A709352j3219l883J12247O4208l2800j01494L6328O6087P3036J3337j1149
$$ 1709352 1696133 1692250 1804497 1868705 1835905 1734411 1770739 1836826 1909862 1923199 1912050
4021A912050R8464N764n0191n3670Q3477M0300K2093J40650K6360j3955n516k0314
$$ 1912050 2010514 2016278 1966087 1912417 1995894 2036194 2058287 2198937 2225297 2211342 2205826 2185512
4009B185512M3347J0842M5854O3104N7568J5948M5060L2075l401M2182L6461J09826
$$ 2185512 2228859 2239701 2285555 2348659 2406227 2422175 2467235 2499310 2495909 2538091 2574552 2684378
3997B684378n399K0206N5295J10793Q5853L4034k414J41158M0696R3031P3460
$$ 2684378 2678979 2699185 2754480 2865273 2951126 2985160 2982746 3123904 3164600 3257631 3331091
3986C331091O0515J30137R0421J14594J38745J00568J76783J69769J83941K58797
$$ 3331091 3391606 3521743 3612164 3726758 3865503 3966071 4142854 4312623 4496564 4755361
3976D755361K38207K74281K95156L18456L26118L99516M98254N54395M42518N38124
$$ 4755361 4993568 5267849 5563005 5881461 6207579 6607095 7105349 7659744 8102262 8640386
3966H640386Q46342Q93222J058898J289836J471914J761958J925818K106266J876955
$$ 8640386 9486728 10379950 11438848 12728684 14200598 15962556 17888374 19994640 21871595
3957B1871595O69192n19580n38503L2453L04587p34547j853016j943361j640724
$$ 21871595 22540787 22021207 21482704 21515157 21819744 21085197 19232181 17288820 15648096
3948A5648096j377040j225174j223276q93958p11721o65697o01892n07921m14248
$$ 15648096 14271056 13045882 11822606 10928648 10216927 9551230 8949338 8441417 8027169
3939H027169l56515l62933k79516j84837k59278l00843k34795j63191j31784k14309
$$ 8027169 7670654 7307721 7028205 6843368 6584090 6283247 6048452 5885261 5753477 5539168
3929E539168q9349j69684j47914j15559p3833q3739q0569q2182j20928l3917m0495
$$ 5539168 5449819 5280135 5132221 5016662 4942829 4859090 4778521 4696339 4575411 4541494 4500999
3918D500999q6234n7730K549o1092m9116o3377j3947j45509o0557p796M7451P002
$$ 4500999 4414765 4357035 4359584 4298492 4249376 4185999 4172052 4026543 3965986 3958190 4005641 4012643
3906D012643r2612j02051m4032M594r035j18987l7807p1539J1593l3510o8214
$$ 4012643 3920031 3817980 3773948 3778542 3769507 3650520 3612713 3541174 3552767 3519257 3451043
3895C451043n9905j5688K9297l92J4828l4186k8330k6287m5953k9580J1769k586
$$ 3451043 3391138 3375450 3404747 3404355 3419183 3384997 3356667 3330380 3284427 3254847 3266616 3264030
3883C264030J1J6274n6108M1187L3414o9589L0587q497m7110r9235L7305L7951
$$ 3264030 3264041 3280315 3224207 3265394 3298808 3229219 3259806 3251309 3204199 3104964 3142269 3180220
3871C180220o9806n8076R8377P6524J5298p9919k0401O0708K824P821l7038L6806
$$ 3180220 3110414 3052338 3150715 3227239 3242537 3162618 3142217 3202925 3205749 3213570 3176532 3213338
3859C213338q951q9045J1799N5489L0550m5561M6214k3278K4155P979j7671q5297
$$ 3213338 3204387 3115342 3127141 3182630 3213180 3167619 3213833 3190555 3214710 3222689 3205018 3119721
3847C119721J1372K0621J07114j9599P233L1382r8131j8661n5843L0242J04938
$$ 3119721 3131093 3151714 3258828 3239229 3246462 3277844 3179713 3161052 3105209 3135451 3240389
3836C240389Q3348m4938N1134L5168m8148o522L4940N37n1146P682N3497q951
$$ 3240389 3323737 3278799 3329933 3365101 3316953 3310431 3345371 3345908 3294762 3302444 3355941 3346990
3824C346990M3166N8l1813J6996L8587m4222m6250N9494Q2820j06219j4898k0361
$$ 3346990 3390156 3390214 3358401 3375397 3413984 3369762 3323512 3383006 3465826 3359607 3344709 3324348
3812C324348P8134O85j9981M345l3138R310R4902J284j1837l2472K0108j5535
$$ 3324348 3402482 3403167 3383186 3387531 3354393 3363703 3458605 3459889 3448052 3415580 3435688 3420153
3800C420153l4537Q808L7376O6489k959l0323k3305M780P2040R6078P6681M9969
$$ 3420153 3385616 3394424 3431800 3498289 3495330 3465007 3441702 3446482 3518522 3614600 3691281 3741250
3788C741250l2981m2966o187P2627l1483k6745p9995Q313J8225k8308R2154k4935
$$ 3741250 3708269 3665303 3659116 3731743 3700260 3673515 3593520 3601833 3620058 3591750 3683904 3658969
3776C658969j41005j2051m5615M8638K7005L5671J20562J07342K2363p3011N0949
$$ 3658969 3517964 3505913 3460298 3508936 3535941 3571612 3692174 3799516 3821879 3748868 3799817
3765C799817N5594l618n8671m0170j1225N2438J6107j6149o2415P319J3838L0058
$$ 3799817 3855411 3851793 3793122 3752952 3741727 3794165 3810272 3794123 3731708 3739027 3752865 3782923
3753C782923L3419m2732l7630L8878N5978o4775l9240p1435n1408R2660J44946
$$ 3782923 3816342 3773610 3735980 3774858 3830836 3766061 3726821 3655386 3603978 3696638 3841584
3742C841584K3682n2953r5959P597L3654M430O5646m9850o6489l2561L7500J52809
$$ 3841584 3865266 3812313 3716354 3723951 3757605 3762035 3827681 3777831 3711342 3678781 3716281 3869090
3730C869090J6448j5888q1982L9713L5004j0361K5729L3134p202p8772N818N1165
$$ 3869090 3885538 3869650 3787668 3827381 3862385 3852024 3877753 3910887 3903685 3824913 3830731 3881896
3718C881896q7837N3070K8401N3831L5169l6719J4215L8344J07192m865k5574
$$ 3881896 3794059 3847129 3875530 3929361 3964530 3927811 3942026 3980370 4087562 4082697 4057123
3707D057123J4895L1395J33986l4250n0273O2519L1128L5027l9710l279J12635
$$ 4057123 4072018 4103413 4237399 4203149 4152876 4215395 4246523 4281550 4241840 4238561 4351196
3696D351196M9600j5923j916M2808L4862J0812J8736j9654j4424K1761N8164N655
$$ 4351196 4400796 4384873 4382957 4425765 4460627 4471439 4490175 4470521 4456097 4477858 4536022 4541677
3684D541677L9592o0075R9515J6732L3145N6253P8735M0179L5582j6434R26N3407
$$ 4541677 4581269 4521194 4620709 4637441 4670586 4726839 4805574 4845753 4881335 4864901 4865827 4919234
3672D919234l3538M0065M0643L0770K5033J03022k4616O9142P0569n5738o5297
$$ 4919234 4885696 4925761 4966404 4997174 5022207 5125229 5100613 5169755 5240324 5184586 5119289
3661E119289R3811J05688J290m4378K0620L2589R3304P8810J00581L038J4532
$$ 5119289 5213100 5318788 5320078 5275700 5296320 5328909 5422213 5501023 5601604 5604642 5619174
3650E619174M4813K6095J24111L0790Q8504N0609L0048O1111J7077j8467R9119
$$ 5619174 5663987 5690082 5814193 5844983 5933487 5984096 6014144 6075255 6092332 6073865 6172984
3639F172984J12054J03224K4429j8459O8899J76993P2686M1612k3992J05193N5708
$$ 6172984 6285038 6388262 6412691 6394232 6463131 6640124 6712810 6754422 6730430 6835623 6891331
3628F891331P9426N0180K8297J42920P3186P4879J7750N7348J08283q4304J44138
$$ 6891331 6970757 7020937 7049234 7192154 7265340 7340219 7357969 7415317 7523600 7439296 7583434
3617G583434J60050O5964J31782J5022K1082J57628K01139L0861m242J73496J95522
$$ 7583434 7743484 7809448 7941230 7956252 7977334 8134962 8336101 8366962 8362720 8536216 8731738
3606H731738M6953R3171J61568J13539J13804J26239R8471J00479R8873J14724
$$ 8731738 8778691 8871862 9033430 9146969 9260773 9387012 9485483 9585962 9684835 9799559
3596I799559J68186J41974J52779J49070N0197K33815J82646O3914J48444J91282
$$ 9799559 9967745 10109719 10262498 10411568 10461765 10695580 10878226 10942140 11090584 11281866
3586A1281866J99298J33144K46506L53886K49921J19296K88818J81671J92628
$$ 11281866 11481164 11614308 11860814 12214700 12464621 12583917 12872735 13054406 13247034
3577A3247034L72320L29163L51939K52929L90747L94555L94066M90097M82757
$$ 13247034 13619354 13948517 14300456 14553385 14944132 15338687 15732753 16222850 16705607
3568A6705607M64161N51171N12883O47500O86115O55376P12971Q03297O86640
$$ 16705607 17169768 17720939 18233822 18881322 19567437 20222813 20935784 21739081 22425721
3559B2425721Q57619Q64805P63850P56576Q62510P62990O32876M45345L38802
$$ 22425721 23283340 24148145 24911995 25668571 26531081 27294071 27926947 28372292 28711094
3550B8711094K24165k9376j97776m91819n35812p18292p63068p80860q32380o82744
$$ 28711094 28935259 28905883 28708107 28216288 27680476 26962184 26199116 25418256 24585876 23903132
3540B3903132p65762o75468p02139o55275n90441n50815n72943n91714m32910
$$ 23903132 23137370 22461902 21759763 21104488 20514047 19963232 19390289 18798575 18365665
3531A8365665n09510m50449m29776m37271l35970k51714l43622l96868k63357
$$ 18365665 17856155 17405706 16975930 16538659 16202689 15950975 15607353 15210485 14947128
3522A4947128k74057k79137j66936k19824k66747k49272j26791j25727l66581
$$ 14947128 14673071 14393934 14226998 14007174 13740427 13491155 13364364 13238637 12872056
3513A2872056k85639j29111j71336j59195j66051j60177k33513k28974r9114j24450
$$ 12872056 12586417 12457306 12285970 12126775 11960724 11800547 11567034 11338060 11238946 11114496
3503A1114496k36581k28103j46785j3216p1968j11210j21216j38507j33362j06029
$$ 11114496 10877915 10649812 10503027 10489811 10417843 10306633 10185417 10046910 9913548 9807519
3493I807519q5830r1309j43878j16895r8046n9286n4928o6271j30640p5010j64533
$$ 9807519 9721689 9630380 9486502 9369607 9271561 9212275 9157347 9091076 8960436 8885426 8720893
3482H720893j9212q0470p9974l1724n1436o0448p3235j05267j43772p5221J1586
$$ 8720893 8701681 8621211 8541237 8509513 8458077 8397629 8324394 8219127 8075355 8000134 8011720
3471H011720n3851K72n0682o3282j38169k4951P530q1900n4426r519L7771k7796
$$ 8011720 7957869 7958141 7907459 7844177 7706008 7681057 7688587 7606687 7552261 7542742 7580513 7552717
3459G552717l5315k17875n6662j9562j6773l6739l0892k4854j06653k9010n4283
$$ 7552717 7517402 7299527 7242865 7223303 7206530 7169791 7138899 7114045 7007392 6978382 6924099
3448F924099k2259l6712r3117p1778k0425l5177n6232K5062j09258j8218J8208
$$ 6924099 6901840 6865128 6772011 6700233 6679808 6644631 6588399 6613461 6504203 6485985 6504193
3437F504193j10323p8173P082n4717l7097k3396m9695J0769o5726k3948m5975
$$ 6504193 6393870 6315697 6322779 6268062 6230965 6207569 6157874 6168643 6102917 6078969 6032994
3426F032994j15990k6727j8596k2726p8484l0419n35L3488n3052p1636r7614k2283
$$ 6032994 5917004 5890277 5871681 5848955 5770471 5740052 5739517 5773005 5719953 5648317 5550703 5528420
3414E528420r5943N7200m5338n7365j7331L6390Q543j42754j9504L0876J6731
$$ 5528420 5432477 5489677 5444339 5386974 5369643 5406033 5414576 5271822 5252318 5283194 5299925
3403E299925l4101n1573j09643k246M2048l0865J107j30228P7059j1741q5729
$$ 5299925 5265824 5214251 5104608 5102362 5144410 5113545 5114652 4984424 5061483 5049742 4964013
3392D964013q0639M8546n1457k2725l3008r257P8715m6491m7576m0421J6658q325
$$ 4964013 4883374 4931920 4880463 4857738 4824730 4815473 4894188 4847697 4800121 4759700 4776358 4768033
3380D768033O0297q8914j6847N3077j2398r7092J9131n6603m3010J0501J3217
$$ 4768033 4828330 4739416 4722569 4775646 4763248 4666156 4685287 4628684 4585674 4596175 4609392
3369D609392j288Q791j17916J2419l7478K2765R733j3004M5290r9505l9075Q7125
$$ 4609392 4608104 4616895 4498979 4511398 4473920 4496685 4506418 4493414 4538704 4439199 4400124 4487249
3357D487249M7821n1726m2271R170k4014n3239k1104L0503l667k6114o0218n9963
$$ 4487249 4535070 4483344 4441073 4450243 4426229 4372990 4351886 4382389 4378722 4352608 4292390 4232427
3345D232427M8212l9217j4174j2136n5307K611L9815n4364m554L2475l2321M8961
$$ 4232427 4280639 4241422 4227248 4215112 4159805 4162416 4202231 4147867 4143313 4175788 4143467 4192428
3333D192428j386l5379j20284J9140l2180P102O1222K4118L4621k6263M6553O9015
$$ 4192428 4191042 4155663 4035379 4054519 4022339 4029441 4090663 4114781 4149402 4123139 4169692 4238707
3321D238707k0302R1101j1754k7600J5218L2315O0697K6944p0118K0189J5229
$$ 4238707 4218405 4309506 4297752 4270152 4285370 4317685 4378382 4405326 4335208 4355397 4370626
3310D370626K126O3989j8126K1994L4183L1210J8057P7558N8521M5203K1650k5792
$$ 4370626 4372752 4436741 4418615 4440609 4474792 4506002 4524059 4601617 4660138 4705341 4726991 4701199
3298D701199P0690J14945J365n381P3012L8631R2265M376K6736J26512R2961Q4205
$$ 4701199 4771889 4886834 4888199 4882818 4955830 4994461 5086726 5091102 5117838 5244350 5337311 5421516
3286E421516M2493j1956j0300N9066L6111N2975M0165Q6583N9848J3602j4263
$$ 5421516 5464009 5452053 5441753 5500819 5536930 5589905 5630070 5716653 5776501 5790103 5775840
3275E775840J15947L7263J3399n568L4024k547O5789P6349Q3643J03234R9013
$$ 5775840 5891787 5929050 5942449 5936881 5970905 5968358 6034147 6110496 6194139 6297373 6396386
3264F396386K8933Q6299J04628N9173J00557J01986J15788R8639J12924J08938
$$ 6396386 6425319 6511618 6616246 6675419 6775976 6877962 6993750 7092389 7205313 7314251
3254G314251J43194J88273P4118J40618J63670K20790J47016J37679J33331K23891
$$ 7314251 7457445 7645718 7719836 7860454 8024124 8244914 8391930 8529609 8662940 8886831
3244H886831J22378J35859J97505J62854J56682J24062J17584J50858K30240J29818
$$ 8886831 9009209 9145068 9342573 9505427 9662109 9786171 9903755 10054613 10284853 10414671
3234A0414671N7033J52619J25746J04402J86178J52456J92216J33544J88624J98898
$$ 10414671 10471704 10624323 10750069 10854471 11040649 11193105 11385321 11518865 11707489 11906387
3224A1906387K97657K86599K31719L48421L26295M24917N75843L92384M62274
$$ 11906387 12204044 12490643 12722362 13070783 13397078 13821995 14397838 14790222 15252496
3215A5252496N07948N09587M07365L28102L18937N3391j7412j93697k40835j64685
$$ 15252496 15760444 16270031 16677396 17005498 17324435 17377826 17360414 17166717 16925882 16761197
3205A6761197j73896k53702j47012k86968j66408R6930j17749r8539L0711P5647
$$ 16761197 16587301 16333599 16186587 15899619 15733211 15830141 15712392 15613853 15644564 15720211
3195A5720211N3585K31622J22115J94162K26767J84674K07144K98493J89616R6430
$$ 15720211 15773796 16005418 16127533 16321695 16548462 16733136 16940280 17238773 17428389 17524819
3185A7524819R7280J27481J5109n4096j46167k18036k98679k19244l27476l95207
$$ 17524819 17622099 17749580 17764689 17710593 17564426 17346390 17047711 16828467 16500991 16105784
3175A6105784l97766l47364l75878l41777l20041k31500j45039k33781j82734
$$ 16105784 15708018 15360654 14984776 14642999 14322958 14091458 13946419 13712638 13529904
3166A3529904j82718j65494j25510r8240j37967r7019j91873j47797j84846k49890
$$ 13529904 13347186 13181692 13056182 12957942 12819975 12722956 12531083 12383286 12198440 11948550
3156A1948550j95840k03762k56555k94057k68627j97672j94122k96254l10612
$$ 11948550 11752710 11548948 11292393 10998336 10729709 10532037 10337915 10041661 9731049
3147I731049k82529k80383j15028j76599k16296j92725j69796j60183j84209j39558
$$ 9731049 9448520 9168137 9053109 8876510 8660214 8467489 8297693 8137510 7953301 7813743
3137G813743j09108j54625j52001j93410q7049o1849j08843j14968n3459j42513
$$ 7813743 7704635 7550010 7398009 7204599 7117550 7055701 6946858 6831890 6778431 6635918
3127F635918j77651j16017q5765q7892j52937m8674r7517o3755j11310p6786q1382
$$ 6635918 6458267 6342250 6256485 6168593 6015656 5966982 5869465 5805710 5694400 5617614 5536232
3116E536232j05074j13248j20839o2188m7947p1166o1005r1688j12901n1119P077
$$ 5536232 5431158 5317910 5197071 5134883 5086936 5015770 4954765 4863077 4750176 4699057 4706134
3105D706134k4759j46789j36577o8604j17025j19406K8697o9491l3690o528o5248
$$ 4706134 4681375 4534586 4398009 4329405 4212380 4092974 4121671 4052180 4018490 4011962 3946714
3094C946714o1294K5441o0324p2440j04731j11578J8472n39n1996r3797o1738
$$ 3946714 3885420 3910861 3850537 3778097 3673366 3561788 3580260 3579721 3527725 3433928 3372190
3083C372190k4389o7329p2851j15147j4186o4141j9498L706j13574L4624n3230
$$ 3372190 3347801 3280472 3207621 3092474 3078288 3014147 2994649 2998355 2884781 2919405 2866175
3072B866175M1659o6165j67350o5206m2017O9515n5682M850l9463J3664L5744
$$ 2866175 2907834 2841669 2674319 2609113 2567096 2636611 2580929 2585779 2546316 2559980 2595724
3061B595724j05535p7183l9569L3654j03329q3479m5601j4290K6092n4090l6072
$$ 2595724 2490189 2413006 2373437 2407091 2303762 2220283 2174682 2160392 2186484 2132394 2096322
3050B096322M7144n6700n4095j00953j4000J0755m1761n1002j4812k34n1285K8136
$$ 2096322 2143466 2086766 2032671 1931718 1917718 1928473 1886712 1835710 1820898 1820664 1769379 1797515
3038A797515j6776J6298m0437o6466q0283o5956K1516k6446R510K3066m1877O341
$$ 1797515 1780739 1797037 1756600 1690134 1609851 1543895 1565411 1538965 1548475 1571541 1529664 1536005
3026A536005r0741n12q952q694n2368q1636K9712k8800q2067K3938O6087M7896
$$ 1536005 1445264 1444752 1435800 1427106 1374738 1293102 1322814 1294014 1211947 1235885 1301972 1349868
3014A349868o3543q038m1454n4359K7326p883J3851L9853j1530o8957K8249o6496
$$ 1349868 1286325 1278287 1236833 1182474 1209800 1201917 1215768 1255621 1244091 1175134 1203383 1136887
3002A136887k001J9812o3787p6325p845Q0380J7405l6513q399k5024k644O470
$$ 1136887 1134886 1154698 1090911 1014586 1006741 1087121 1104526 1068013 1059614 1034590 1031946 1038416
2990A038416j5404j218j6053J8940l4245k2395J6863r827J5427p8925k6745N368
$$ 1038416 1023012 1021794 1005741 1024681 990436 968041 984904 975077 990504 911579 884834 890202
2978H90202r8209j1701R6366j6844L3743p423J170n4443l1535j8611l6319J6908
$$ 890202 791993 780292 876658 859814 893557 886134 887304 832861 801326 782715 746396 763304
2966G63304N0663q4185J4964L9117j15362n292o01P661Q5588n7861l6194M1720
$$ 763304 813967 729782 744746 783863 668501 663209 662608 670269 755857 697996 661802 703522
2954G03522J3889l4554r096p693K8604l0959j35487O6003L9522P2415K2119K5900
$$ 703522 717411 682857 673761 666068 694672 663713 528226 594229 633751 706166 728285 754185
2942G54185r1511k7460p9747P65L0680k7009k4018k6620K6198K9796K4447k7498
$$ 754185 662674 635214 555467 556232 586912 559903 535885 509265 535463 565259 589706 562208
2930E62208M4026j2269n2001L8955Q9052o0840n9925m4300J6540M9368N268r5764
$$ 562208 606234 593965 541964 580919 669971 609131 549206 504906 521446 570814 576082 480318
2918D80318p163O2999L5394p3954n0806O4400n916j2157P156Q883M1350m2395
$$ 480318 473155 536154 571548 497594 446788 511188 505272 493115 500271 509154 550504 508109
2906E08109N5729R309j18796K2260O688k0297l7739Q302M3627k6257l1956M2332
$$ 508109 563838 573147 454351 476611 483299 463002 425263 433565 477192 450935 418979 461311
2894D61311n7845n7285O0577O5980N773l2436l5853j5381R2484m2086o4962R3882
$$ 461311 403466 346181 406758 472738 478511 446075 410222 394841 487325 445239 380277 474159
2882D74159k7714j1543K8945K1465n5566o125J06321Q901q9367m6473N680l3908
$$ 474159 446445 434902 463847 485312 429746 423621 529942 538843 449476 403003 408683 374775
2870C74775r3000L1006J9215k3345J4856m676j3539J4837N543o1369k9727N6323
$$ 374775 281775 312781 331996 308651 323507 318831 305292 320129 325672 264303 234576 290899
2858B90899O6240J6566k2824o2193J5693L5184k4935N9287p63n1865j2354L0757
$$ 290899 357139 373705 350881 288688 304381 339565 314630 373917 373154 321289 308935 339692
2846C39692k0772r2275K8440K9761P2374o4725p8748L1451Q3538k9861o8294l0859
$$ 339692 318920 226645 255085 284846 357220 292495 213747 245198 328736 298875 230581 199722
2834A99722j5646L0359J33679j1234r8099O6331l8366q4913o4799J59443l8390
$$ 199722 184076 214435 348114 336880 238781 305112 266746 181833 117034 276477 238087
2823B38087k1180N2963j37487l101O9557j4656q64M5120L1536j6242l0336n4774
$$ 238087 216907 269870 132383 129282 198839 184183 183319 228439 259975 243733 213397 158623
2811A58623K1278N0206r5315M2742J9087p3841N8390K1199K7713P225k9398p6679
$$ 158623 179901 230107 134792 177534 196621 122780 181170 202369 230082 237307 207909 131230
2799A31230l6772P3923o068n3492P3581N7312l9959n9856J9908K0032k2422q637
$$ 131230 94458 168381 162313 108821 182402 239714 199755 139899 159807 179839 157417 148780
2787A48780J4735q985M5383k342l5728j17904j6745J05804l3571M3221p739m8669
$$ 148780 163515 154530 199913 197571 161843 43939 27194 132998 99427 142648 134909 86240
2775H6240K7220l237m6690k5221Q0260L752o1790j774k7039M9885O591L9332N1759
$$ 86240 113460 110223 63533 38312 118572 122324 60534 58760 31721 81606 88197 127529 179288
2762A79288J4311j4899R110l740l8862r4118p759Q263O065N7105k2309l4021O4464
$$ 179288 193599 178700 187810 184070 145208 51090 43331 51594 57659 114764 92455 58434 122898
2749A22898P929k1681N8172m2261j42211P1288m6326M377J13091k6543L5292L8393
$$ 122898 130827 109146 167318 125057 -17154 54134 7808 12185 125276 98733 134025 172418
2737A72418r9396l1638J05243p5129p0528K6756P72O2134M6457k0004K1511k2839
$$ 172418 73022 41384 146627 71498 970 27726 28498 90632 137089 117085 138596 115757
2725A15757l8695J7115j9960M7454m0931k556m2570J315j2223M6003j2062p0325
$$ 115757 77062 94177 74217 121671 80740 78184 35614 36929 24706 70709 58647 -11678
2713a1678N5942M6887K0064N69n1174r0687N8146k699q0972n3972k7453J7891
$$ -11678 44264 91151 111215 111784 60610 -30077 28069 25370 -55602 -109574 -137027 -119136
2701a19136J24559j9406k4765M8649L6263K0084J0498j3818l0049L0792N5418
$$ -119136 5423 -13983 -38748 9901 46164 66248 76746 62928 32879 63671 119089
2690A19089k8874k9928K5683N5360n0687Q459q981K4601k674k3114K9699R6031
$$ 119089 90215 60287 85970 141330 90643 99102 90121 114722 112048 88934 118633 214664
2678B14664o080j22916p2023K6493O6247p5424j828p291M8400M4778L1282m1329
$$ 214664 208584 85668 13645 40138 106385 30961 29133 21842 70242 115020 146302 104973
2666A04973o6021K7385K6537o2158n2605L3295N3742R722J5462J4031q8015l6629
$$ 104973 38952 66337 92874 30716 -21889 11406 65148 74870 90332 104363 16348 -20281
2654b0281J9166j7993n286L1449o1118M3320p461p8289P388Q3870K5288k4319
$$ -20281 -1115 -19108 -24394 7055 -54063 -10743 -18204 -96493 -89105 -5235 20053 -4266
2642d266q893Q1652m1813O2859L1127q8506k3684M0074L8511k3272k6972N967
$$ -4266 -13159 68493 26680 89539 120666 32160 8476 48550 87061 63789 36817 42784
2630D2784K678K4400j9377M977J1284p7200j4295L7624P527J1569k2020k4123
$$ 42784 45462 69862 50485 55462 66746 -10454 -24749 12875 20402 31971 9951 -14172
$$ [...]
##END NTUPLES=NMR SPECTRUM
##END=
