##TITLE=1H_EC-3357
 200.13MHz, CDCl3,
 8 sc
 
 21.8.2025
##JCAMPDX= 6.0         $$ Bruker NMR JCAMP-DX V2.0
##DATA TYPE= NMR SPECTRUM
##DATA CLASS= NTUPLES
##ORIGIN= UXNMR, Bruker Analytische Messtechnik GmbH
##OWNER= pz
$$ XWIN-NMR		Version 3.5
$$ Thu Aug 21 13:57:22 2025 Russian Standard Time (UT+4h)  she@DPX200
##.OBSERVE FREQUENCY= 200.1313
##.OBSERVE NUCLEUS= ^1H
##.ACQUISITION MODE= SIMULTANEOUS
##.ACQUISITION SCHEME= undefined
##.AVERAGES= 8
##.DIGITISER RES= 18
##SPECTROMETER/DATA SYSTEM= spect
##.PULSE SEQUENCE= zg30
##.SOLVENT NAME= CDCl3
##.SHIFT REFERENCE= (INTERNAL, CDCl3, 0, 14.5757)
##AUDIT TRAIL= $$ (NUMBER, WHEN, WHO, WHERE, WHAT)
$$ ##TITLE= Audit trail, XWIN-NMR		Version 3.5
$$ ##JCAMPDX= 5.01
$$ ##ORIGIN= Bruker BioSpin GmbH
$$ ##OWNER= she
$$ F:/spectra/data/she/nmr/H-C/1/pdata/1/auditp.txt
$$ ##AUDIT TRAIL=  $$ (NUMBER, WHEN, WHO, WHERE, WHAT)
(   1,<2025-08-21 13:56:18.07 +0400>,<she>,<DPX200>,
      <created by zg, POWCHK disabled, PULCHK disabled
       configuration hash MD5:
       00 E9 B6 7A A2 85 ED C7 34 08 36 98 17 FE 4E 26
       data hash MD5: 16K
       82 6A E0 3D D4 53 9A 12 51 75 7A A9 7B 19 69 A9>)
(   2,<2025-08-21 13:56:22.20 +0400>,<she>,<DPX200>,
      <Start of raw data processing
       efp BC_mod = 2 LB = 0.25 FT_mod = 6 PKNL = 1 PHC0 = -1560.777 PHC1 = 10.59229 SI = 16K 
       data hash MD5: 16K
       0C 38 0A C8 40 BD A7 84 A1 0D 87 D5 1A 4B A0 EA>)
(   3,<2025-08-21 13:56:38.57 +0400>,<she>,<DPX200>,
      <pk PHC0 = -0.8855503 PHC1 = 0 
       data hash MD5: 16K
       A5 68 14 C9 D7 00 62 87 54 39 48 DF 73 A1 3F 0C>)
(   4,<2025-08-21 13:56:42.29 +0400>,<she>,<DPX200>,
      <abs ABSG = 5 
       data hash MD5: 16K
       14 2F DD 5A AE 92 0D 7B EF C4 4A DD C7 10 4B 4B>)
$$ ##END=
$$ 
$$ hash MD5
$$ 7A 2D 8C 89 21 92 48 2D 77 EA 78 AF 66 6F 82 04
##$RELAX= 
##$RELAX= 
##$RELAX= 
##$RELAX= 
##$RELAX= 
##$RELAX= 
$$ Bruker specific parameters
$$ --------------------------
##$DU= <F:/spectra>
##$EXPNO= 1
##$NAME= <H-C>
##$PROCNO= 1
##$TYPE= <nmr>
##$USER= <she>
##$AMP= (0..31)
100 100 100 100 100 100 100 100 100 100 100 100 100 100 100 100 100 100 
100 100 100 100 100 100 100 100 100 100 100 100 100 100 
##$AQSEQ= 0
##$AQ_mod= 1
##$AUNM= <au_zg>
##$AUTOPOS= <>
##$BF1= 200.13
##$BF2= 200.13
##$BF3= 200.13
##$BF4= 200.13
##$BF5= 200.13
##$BF6= 200.13
##$BF7= 200.13
##$BF8= 200.13
##$BYTORDA= 1
##$CFDGTYP= 0
##$CFRGTYP= 5
##$CHEMSTR= <none>
##$CNST= (0..31)
1 1 145 1 1 1 1 1 1 1 1 1 1 1 1 1 1 1 1 1 1 1 1 1 1 1 1 1 1 1 1 1 
##$CPDPRG= <>
##$CPDPRG1= <>
##$CPDPRG2= <>
##$CPDPRG3= <>
##$CPDPRG4= <mlev>
##$CPDPRG5= <mlev>
##$CPDPRG6= <mlev>
##$CPDPRG7= <mlev>
##$CPDPRG8= <mlev>
##$CPDPRGB= <>
##$CPDPRGT= <>
##$D= (0..31)
0 0.7 0 0 0 0 0 0 0 0 0 0.03 0 0 0 0 0 0 0 0 0 0 0 0 0 0 0 0 0 0 0 0 
##$DATE= 1755770177
##$DBL= (0..7)
120 120 120 120 120 120 120 120 
##$DBP= (0..7)
150 150 150 150 150 150 150 150 
##$DBP07= 0
##$DBPNAM0= <>
##$DBPNAM1= <>
##$DBPNAM2= <>
##$DBPNAM3= <>
##$DBPNAM4= <>
##$DBPNAM5= <>
$$ [...]
##$SUBNAM3= <"">
##$SUBNAM4= <"">
##$SUBNAM5= <"">
##$SUBNAM6= <"">
##$SUBNAM7= <"">
##$SUBNAM8= <"">
##$SUBNAM9= <"">
##$SW= 18.0517328524113
##$SWIBOX= (0..15)
0 0 2 0 0 0 0 0 0 0 0 0 0 0 0 0 
##$SW_h= 3612.71676300578
##$TD= 16384
##$TD0= 1
##$TE= 0
##$TE2= 300
##$TE3= 300
##$TEG= 300
##$TL= (0..7)
0 120 120 120 120 120 120 120 
##$TP= (0..7)
150 150 150 150 150 150 150 150 
##$TP07= 0
##$TPNAME0= <>
##$TPNAME1= <>
##$TPNAME2= <>
##$TPNAME3= <>
##$TPNAME4= <>
##$TPNAME5= <>
##$TPNAME6= <>
##$TPNAME7= <>
##$TPOAL= (0..7)
0.5 0.5 0.5 0.5 0.5 0.5 0.5 0.5 
##$TPOFFS= (0..7)
0 0 0 0 0 0 0 0 
##$TUNHIN= 0
##$TUNHOUT= 0
##$TUNXOUT= 0
##$USERA1= <user>
##$USERA2= <user>
##$USERA3= <user>
##$USERA4= <user>
##$USERA5= <user>
##$V9= 5
##$VALIST= <valist>
##$VCLIST= <CCCCCCCCCCCCCCC>
##$VD= 0
##$VDLIST= <DDDDDDDDDDDDDDD>
##$VPLIST= <PPPPPPPPPPPPPPP>
##$VTLIST= <TTTTTTTTTTTTTTT>
##$WBST= 1024
##$WBSW= 4
##$XGAIN= (0..3)
0 0 0 0 
##$XL= 0
##$YL= 0
##$YMAX_a= 88288
##$YMIN_a= -157176
##$ZGOPTNS= <>
##$ZL1= 120
##$ZL2= 120
##$ZL3= 120
##$ZL4= 120
##$ABSF1= 17.92027
##$ABSF2= -0.1316223
##$ABSG= 5
##$ABSL= 3
##$ALPHA= 0
##$AQORDER= 0
##$ASSFAC= 0
##$ASSFACI= 0
##$ASSFACX= 0
##$ASSWID= 0
##$AUNMP= <proc_1d>
##$AZFE= 0.1
##$AZFW= 0.1
##$BCFW= 0
##$BC_mod= 2
##$BYTORDP= 0
##$COROFFS= 0
##$CY= -3
##$DATMOD= 1
##$DC= 0
##$DFILT= <>
##$DTYPP= 0
##$F1P= 0
##$F2P= 0
##$FCOR= 1
##$FTSIZE= 16384
##$FT_mod= 6
##$GAMMA= 0
##$GB= 0
##$INTBC= 1
##$INTSCL= 3.241238e-09
##$ISEN= 128
##$LB= 0.25
##$LEV0= 0
##$LPBIN= 0
##$MAXI= 10000
##$MC2= 0
##$MEAN= 0
##$ME_mod= 0
##$MI= 1.114404
##$NCOEF= 0
##$NC_proc= -9
##$NLEV= 6
##$NOISF1= 3.799351
##$NOISF2= 2.8
##$NSP= 0
##$NTH_PI= 0
##$NZP= 0
##$OFFSET= 14.57567
##$PC= 1
##$PHC0= -1561.662
##$PHC1= 10.59229
##$PH_mod= 1
##$PKNL= yes
##$PPARMOD= 0
##$PSCAL= 0
##$PSIGN= 0
##$REVERSE= no
##$SF= 200.130189326975
##$SI= 16384
##$SIGF1= 3
##$SIGF2= 2
##$SINO= 0.751879
##$SIOLD= 32768
##$SREGLST= <19F.Aceton>
##$SSB= 0
##$STSI= 16384
##$STSR= 0
##$SW_p= 3612.71676300578
##$SYMM= 0
##$S_DEV= 0
##$TDeff= 16384
##$TDoff= 0
##$TI= <>
##$TILT= no
##$TM1= 0
##$TM2= 0
##$TOPLEV= 0
##$USERP1= <user>
##$USERP2= <user>
##$USERP3= <user>
##$USERP4= <user>
##$USERP5= <user>
##$WDW= 1
##$XDIM= 16384
##$YMAX_p= 331441143
##$YMIN_p= -2679998
$$ End of Bruker specific parameters
$$ ---------------------------------
##NTUPLES= NMR SPECTRUM
##VAR_NAME=  FREQUENCY,     SPECTRUM/REAL,   SPECTRUM/IMAG
##SYMBOL=    X,             R,               I
##VAR_TYPE=  INDEPENDENT,   DEPENDENT,       DEPENDENT
##VAR_FORM=  AFFN,          ASDF,            ASDF
##VAR_DIM=   16384,         16384,           16384
##UNITS=     HZ,            ARBITRARY UNITS, ARBITRARY UNITS
##FACTOR=    0.220516191357247, 1,           1
##FIRST=     2917.03164516097, 0,            0
##LAST=      -695.685117844811, 0,           0
##MIN=       -695.685117844811, -2679998,    0
##MAX=       2917.03164516097, 331441143,    0
$$ Real data points
##PAGE= N=1
##DATA TABLE= (X++(R..R)), XYDATA
$$ [...]
6956B2322408M42166N93294J06073J210248K089533L10942J83494J369134K228038
6947C0855330J614717O04112J732212K935135J730944J459128J679941J683984
6939D4295503J647419J031782L596103K077960Q58096L714612M510816J952934
6931F3685225M545406N275381M713911N118921N917680O271967N966717O522614
6923A08017822O879201N695161L244761K533433J622845R1764R57902J61352j675448
6914A27528793K77903N83269l60456J179547K091174M243387M231358M925855
6906A44700830O722733O982720P616344R607874Q886031P665952O959455N327922
6898B04469861K002977O8972r67970l559532m433821p331382o926118o733987
$$ y = [22322408, 22764574, 23357868, 23463941, 24674189, 26763722, 27074664, 27258158, 28627292, 30855330, 32470047, 33074159, 34806371, 37741506, 39472450, 40931578, 42611519, 44295503, 45942922, 46974704, 50570807, 52648767, 53506863, 57221475, 61732291, 63685225, 68230631, 73506012, 78219923, 83338844, 89256524, 95528491, 101495208, 108017822, 114897023, 120592184, 123836945, 126370378, 127993223, 128084987, 129042889, 129204241, 127528793, 127806696, 128389965, 128029509, 129209056, 131300230, 135543617, 139774975, 144700830, 151423563, 158406283, 166022627, 175630501, 184516532, 192182484, 199141939, 204469861, 206472838, 206541810, 205573840, 202014308, 197580487, 190249105, 183322987, 176589000]
6890A76589000o713173n295527n785902m575645k881675l135791l046763K00334
6882A45354858J220324M44477P27750J500067J995566Q89371l48391j554493k323304
6873A47906225l665580n336831o471541p121382o454266o587559o374295n834850
6865A00059921o138433o812999m174013l079590m356491m329830l198178l765819
6857F4204568k739767l478964k723719k659410k370825k248599j043036j159829
6849D5780419j558360j325266j199698q06949k094339j771138p67270o71430K3324
6840C5609293n83645k54677p32081j350800K34875j281211J53934p27992k8532
6831C1039164J413391j276497m58717k60309p3932o57190m4445J64164J38851
$$ y = [176589000, 169875827, 164580300, 158794398, 154218753, 151337078, 148201287, 145154524, 145354858, 146575182, 147019659, 147747409, 149247476, 151243042, 152132413, 151784022, 150229529, 147906225, 144240645, 138903814, 132432273, 125310891, 118856625, 112269066, 105894771, 100059921, 93921488, 87108489, 82934476, 79854886, 75498395, 71168565, 67970387, 64204568, 61464801, 57985837, 55262118, 52602708, 50231883, 47983284, 46940248, 45780419, 44222059, 42896793, 41697095, 40890146, 38795807, 37024669, 36257399, 35585969, 35609293, 35025648, 34770971, 34038890, 32688090, 32922965, 31641754, 31795688, 31067696, 31039164, 32452555, 31176058, 30717341, 30457032, 30383100, 29725910, 29681465, 29845629, 29984480]
6822B9984480R49328M36665J409069P69913J295269K36398N43327o39216L01742
6813C5286975K689373J028353J403053J683565J891652K356737L426625K170104
6805E1936437K792521M575756N201495M650696M005353O654359O385374N302283
6797I1504274O195394O698114N543191N006805L653472K090710J499309L45849
6789A22537118l64129K59016j690775o29952P7388J435021J539141L003542L544006
6780A29710376L653394N815275O689152Q668059Q851599Q604452Q833163Q642692
6772A89468162Q442894O669733K613450k10332j273145l745208o482194n428736
6764A90054624o693837p685686o980709p240285o320727m405492k705255l346265
$$ y = [29984480, 30933808, 31370473, 32779542, 33549455, 34844724, 35081122, 35624449, 34985233, 35286975, 37976348, 39004701, 40407754, 42091319, 43982971, 46339708, 49766333, 51936437, 54728958, 59304714, 64506209, 69156905, 73162258, 79816617, 86201991, 91504274, 97699668, 104397782, 109940973, 114947778, 118601250, 120691960, 122191269, 122537118, 122172989, 122432005, 120741230, 120111278, 120188666, 121623687, 123162828, 126166370, 129710376, 133363770, 139179045, 145868197, 154536256, 163387855, 171992307, 180825470, 189468162, 197911056, 204580789, 207194239, 206983907, 205710762, 201965554, 195483360, 190054624, 183360787, 175675101, 168694392, 161454107, 155133380, 150727888, 148022633, 144676368]
6756A44676368k632372k90972J024696M16877Q84042K728694K124569J058067
6748A49989969Q94533p41001j807076l870140m648359n188810n655682q802782
6740A20170652p779846n833456o913697n712738n237766n759166m218322m211183
6732G4504478m950362k891369l554802l774069m444934k823729k671940k014309
6724D7378964k205824j160787k102961j770723j268120k261641M3586j896938
6716C4755556j437742j122291j656343l47524K39087j724419j406059j223314
6708B6076951K76226m17695K61454M0577r59668k084877j336384j259691n74533
6699B0022360k91869k15071r60744r9202P95303k011252r38891P6102O50125M8429
$$ y = [144676368, 142043996, 141753024, 142777720, 143194597, 144078639, 146807333, 148931902, 149989969, 150884502, 150143501, 148336425, 144466285, 139817926, 134629116, 128973434, 120170652, 112390806, 106557350, 99643653, 93930915, 88693149, 82933983, 78715661, 74504478, 69554116, 66662747, 63107945, 59333876, 54888942, 52065213, 49393273, 47378964, 45173140, 44012353, 41909392, 40138669, 38870549, 36608908, 36652494, 34755556, 33317814, 32195523, 30539180, 30191656, 30430743, 28706324, 27300265, 26076951, 26353177, 25935482, 26196936, 26237513, 25277845, 23192968, 21856584, 20596893, 20022360, 19730491, 19515420, 18554676, 18455474, 19250777, 17239525, 16300634, 16376736, 17026861, 17075290]
6689A7075290n82539j036146m63401M65097k47991j702247Q2963K9140N37446
6680A4157612r60457L01199M77152n21642j320168q53866M36923J0866Q34563
6671A2562182m64613r01247o30943Q9899J99364r02592j50310Q11009k15596l10736
6661A0086417R10124K89400M36083j849549l9126J28543j63069j39200Q64675
6652A0524298l91783j339857k59999L74700P4550J98244J14820m31327M3924m54568
6642H453002Q13482m6753n25308P32941o82398Q3751K83878p32225R8600m1867
6632H437103n61530O5730K34322m95198n14479K85859J3134j081960m68713P61522
6622F675790M02034N82586j56553n41621n15652l18348O88648l20036J07892o22608
$$ y = [17075290, 16492751, 15456605, 14993204, 15458301, 15210310, 13508063, 13591026, 13620166, 14157612, 13197155, 13498354, 13975506, 13453864, 12133696, 11279830, 11716753, 11727619, 12562182, 12097569, 11196322, 10565379, 10655278, 10854642, 9952050, 9801740, 10612749, 10397153, 10086417, 10996541, 11285941, 11722024, 9872475, 9833349, 9961892, 9798823, 9659623, 10524298, 10132515, 8792658, 8532659, 8907359, 8981909, 9180153, 9294973, 8863646, 8907570, 8453002, 9266484, 9219731, 8694423, 9427364, 8744966, 8828717, 9112595, 8380370, 8478970, 8437103, 7875573, 7941303, 8175625, 7680427, 7165948, 7451807, 7464941, 6382981, 5914268, 6675790, 7077824, 7660410, 7503857, 6962236, 6446584, 6128236, 6816884, 6496848, 6604740, 5982132]
6612E982132R9955N27665k08695n79326J1496n21364o69737J398791J221371n01940
6602F760348q85175M56999M15479p0407k88098J00735n83098j184101N73711Q27424
6592F123817J97541k25954l31160j11938K55421l34782L04597o47134N95173P7744
6582E903325m5985m6429K04521O95601O8894n41159O062j69697j20550L81637
6572F336220m60297p96698R27615q6644r6813M36827j88299O31847q4439k05853
6562F413466L50251j2170o05488m28664M59756M14613l23571m28769P58859P51701
6552G349984J13918J51552o92679n66025J4075R41117K39757q2022l53881k43138
6542F872658L35627L91383j8841K97316m92164P83011j045837n8519p3178J46313
$$ y = [5982132, 6082087, 6609752, 6401057, 5821731, 5833227, 5311863, 4642126, 6040917, 7262288, 6760348, 5875173, 6332172, 6747651, 6677244, 6389146, 6489881, 5906783, 4722682, 5296393, 6123817, 6321358, 6095404, 5764244, 5652306, 5907727, 5572945, 5877542, 5230408, 5825581, 5903325, 5857340, 5810911, 6015432, 6711033, 6779927, 6238768, 6244830, 6075133, 5954583, 6336220, 5875923, 5079225, 6006840, 5920196, 5823383, 6260210, 6071911, 6703758, 6619319, 6413466, 6763717, 6751547, 6146059, 5717395, 6177151, 6591764, 6268193, 5839424, 6598283, 7349984, 7463902, 7615454, 6922775, 6356750, 6370825, 7311942, 7551699, 7469677, 7115796, 6872658, 7208285, 7599668, 7580827, 7878143, 7385979, 8168990, 7123153, 7064634, 6991456, 7137769]
6532G137769k56929n11502l62321L14750K50463r85240Q61861N62284K92799M63200
6522G767134j237137q18537J357797L0422r24307L11559J58256N5829O49894q22960
6512F527950L47616P61473M07204k08358L42436j82021J26747M68510q34694q66338
6502F890525O98534L98258K87582o66537p43455j39450O40363L17434p2070l68778
6492G242406L99109L74016K56106o2665k65427k40603O34932j49097Q0242n42440
6482G726579P31248k91694j17015O92127J10473m36377N40666L57991j91387Q46954
6472I969565q15606l24575L65051L2734p00961K69578M95865Q81741n24081J68479
6462I817790j41513M68296L10082l47717l44870K09929p36476K70010J091609
$$ y = [7137769, 6880840, 6369338, 6007017, 6321767, 6572230, 5586990, 6448851, 7011135, 7303934, 7767134, 6529997, 5711460, 7069257, 7099679, 6175372, 6486931, 6645187, 6701016, 7350910, 6527950, 6875566, 7637039, 8044243, 7835885, 8178321, 7996300, 8123047, 8591557, 7756863, 6890525, 7589059, 7987317, 8274899, 7608362, 6864907, 6725457, 7365820, 7683254, 7611184, 7242406, 7641515, 8015531, 8271637, 8208972, 7943545, 7702942, 8337874, 8188777, 8269019, 7726579, 8457827, 8166133, 8049118, 8741245, 8851718, 8415341, 8956007, 9313998, 9122611, 9969565, 9153959, 8829384, 9194435, 9227169, 8526208, 8795786, 9291651, 10173392, 9649311, 9817790, 9676277, 10144573, 10454655, 10106938, 9762068, 9971997, 9235521, 9505531, 10597140]
6453A0597140P1136M73809m39819R9604r1688L96075J256792m41925j63329M95465
6443A2253260J004029j11803J19666o68599M75619J107478j039900J80856R37882
6434A4258488L7131N38494R93649j35603j178218J198324J220503K2741J016342
6425A7971851O93803J008156R29087O12209J326571O16752j187738J35433O22116
6416B2728240q93373K93026P81499K88557n99066O61350j36585r80282N35623
6407B2678989J223991J552209m75833R92854J259446N46188J570168O40983J771094
6398C1760089J444655k58889j85257L36664n73754J158522J495032l95560j027384
6389C3754118J01107r7172M89919j91285J749651J287987P91316O27572J082045
$$ y = [10597140, 10668276, 11142085, 10702266, 10801870, 10710182, 11106257, 12363049, 11921124, 11757795, 12253260, 13257289, 13145486, 13265152, 12596553, 13072172, 14179650, 13139750, 13320606, 14258488, 14295619, 14834113, 15827762, 15692159, 14513941, 15712265, 16932768, 16955509, 17971851, 18665654, 19673810, 20602897, 21215106, 22541677, 23158429, 21970691, 22106124, 22728240, 21834867, 22127893, 22909392, 23197949, 22598883, 23260233, 23123648, 22143366, 22678989, 23902980, 25455189, 24979356, 25972210, 27231656, 27777844, 29348012, 29988995, 31760089, 33204744, 32945855, 32760598, 33097262, 32523508, 33682030, 35177062, 34781502, 33754118, 33855225, 33758053, 34247972, 34056687, 35806338, 37094325, 37885641, 38513213, 39595258]
6380C9595258j32620J154221J915511K313543K773072J045816J936474J756683
6372E2357958K485759K661353L754390J974611K754248L460253L576283N265618
6364G8290473O246531P145555P329595P585001P871061P935582P133483P483716
6356A37020997O655812M812573M933024K584712O04715k38599M61920l86000N30828
6347A56979982J345920J168936J759155K867017N212972P210231P720972R940633
6339A94205818J0704032J3158010J4741573J4387587J4128094J3660335J2414812
6332B87400261J0831582R768935O520018K185137L01174l425038l952534n210775
6324C04418760p181454p130081p148267p345447o109720n691908k753269l71672
$$ y = [39595258, 39462638, 40616859, 42532370, 44845913, 47618985, 48664801, 50601275, 52357958, 54843717, 57505070, 61259460, 63234071, 65988319, 69448572, 73024855, 78290473, 84537004, 91682559, 99012154, 106597155, 114468216, 122403798, 129537281, 137020997, 143676809, 148489382, 153422406, 156007118, 156611833, 156373234, 156835154, 156449154, 156979982, 158325902, 159494838, 161253993, 164121010, 169333982, 176544213, 184265185, 194205818, 204909850, 218067860, 232809433, 247197020, 261325114, 274985449, 287400261, 298231843, 308000778, 314520796, 316705933, 317007107, 313582069, 309629535, 304418760, 297237306, 290107225, 282958958, 275613511, 269503791, 263811883, 261058614, 260686942]
6316B60686942L92394J103241M821397M701661O124420O973845O804296P367267
6308B98975463P013816N978601M420813J915609r79071l942902o540204q473096
6300B98369029j1496895j1282701j2219948j3679885j2418948j0943923j1943931
6293B14382798r329899q775517o661873n820672m938340m988027k767997j588283
6285A69512190q04560K14658m39914k015876p27851j836276k866993m721656o078430
6276A50235292o198646p177553q558246p435805n763812n698086n947755o266126
6268I7189263n337284o195416n271417m319110l084541l936837k923493l339128
6260F2782037k611000k118271k973738k536810j750441m71916m28666j967268
$$ y = [260686942, 261079336, 262182577, 267003974, 271705635, 277830055, 284803900, 291608196, 298975463, 305989279, 311967880, 316388693, 318304302, 317325231, 313382329, 306842125, 298369029, 286872134, 275589433, 263369485, 249689600, 237270652, 226326729, 214382798, 205052899, 196277382, 189615509, 183794837, 178856497, 173868470, 171100473, 169512190, 168707630, 168922288, 168482374, 166466498, 165738647, 163902371, 161035378, 156313722, 150235292, 144036646, 136859093, 128300847, 120865042, 115101230, 109403144, 103455389, 97189263, 91851979, 85656563, 80385146, 76066036, 72981495, 69044658, 66121165, 62782037, 60171037, 58052766, 55079028, 52542218, 50791777, 50319861, 49891195, 47923927]
6252D7923927k091425k645596j728296j183602p17368k818167j308946j80005
6244C5250522j878691p46865m30309j068582n80816O3032j276726j134210q48740
6235B7348615j80956m82731o18645l03004p77965l81941o31911P99937k48752
6226B4522647j595219r09241p25721l70452R2635J52807j802421M75538r61685
6217A8878888k89691o87764M04967J72751j16698j231693j235898Q57977n20642
6208A6232197m76034p86196J05183O16508l20113r03086q49562O02699k33712
6199A3987884J6381m58425L24441p32848m88210m75069p7258M47730o34255k86491
6189A1623880M07712N91934m01658p83526q17912l01892m40483n813j78736r32833
$$ y = [47923927, 45832502, 43186906, 41458610, 40275008, 39557640, 36739473, 35430527, 35250522, 33371831, 32624966, 32194657, 31126075, 30545259, 30608291, 29331565, 28197355, 27348615, 27167659, 26684928, 26066283, 25763279, 24985314, 24603373, 23971462, 24771399, 24522647, 22927428, 22018187, 21292466, 20922014, 21014649, 21167456, 19365035, 19840573, 18878888, 18589197, 17901433, 18306400, 18479151, 18362453, 17130760, 15894862, 16752839, 16232197, 15756163, 14969967, 15075150, 15691658, 15371545, 14468459, 13618897, 14221596, 13987884, 14004265, 13545840, 13870281, 13137433, 12649223, 12174154, 12096896, 12544626, 11910371, 11623880, 12031592, 12623526, 12221868, 11438342, 10620430, 10318538, 9878055, 9872242, 9693506, 8760673]
6179H760673L89060p93487O08881j98538N59992J87101j074063k1330j151682
6170G266607R56487N66105m06909r19355K23170m9689M42547m12780l27499j008378
6160F330306K02210P38121J01685k05260j67943o20393N97687M42042j51763n74316
6150F692376j3808J245j306016r5592Q66270J67687p38936k28120m33600L5613
6140D947119L56519N959r31650j33230L22364j185533k67956M39914J184932Q31448
6130E569886j080785l65736M50368k53069n05210r83871K29390K94571L09838
6121C665382M88069R07969q23685n20808o3194k70242k72928K06399K13522m74756
6111C055728N51602j8573J79005n9021q38048j60735K48762M89671M10264P64131
$$ y = [8760673, 9149733, 8356246, 8965127, 8766589, 9326581, 9513682, 8439619, 8418289, 7266607, 8223094, 8789199, 8382290, 7462935, 7686105, 7636416, 8078963, 7666183, 7338684, 6330306, 6532516, 7270637, 7372322, 7167062, 6999119, 6378726, 6976413, 7418455, 7266692, 6692376, 6678568, 6679813, 5373797, 5278205, 6144475, 6312162, 5573226, 5345106, 4911506, 4947119, 5303638, 5309597, 4377947, 4244717, 4567081, 3381548, 3113592, 3553506, 4738438, 5569886, 4489101, 4123365, 4573733, 4320664, 3815454, 2831583, 3060973, 3355544, 3665382, 4153451, 5061420, 4237735, 3716927, 3653733, 3383491, 3110563, 3316962, 3530484, 3055728, 3607330, 3588757, 3767762, 3708741, 2870693, 2709958, 2958720, 3448391, 3858655, 4622786]
6101D622786p38611p15415L360M0646L61692J19819k44878m52990P0983Q00343
6091C867735M40350j060591k09537L53086J481594n41756j409387k12488M650
6082B713656j43900R45987l88565j539257K22085M06723l95635N1125K57689K27981
6072B357889P91868o11215n34433P23841J66202n29027N1810J799J9659J7453
6062B455846l51337j99060m81274R61099O87055q22632o38381P94987j78191O01080
6052B829192p16504K99462N51831j765362M32255K12617M55741p54886l3945q7320
6042A423081L69124j12596n69668l12621P25937J01017O43629O70283p68439j56568
6032B013179J02112P4603l36823O91483L14129r36520n01997Q06398N28796L34363
$$ y = [4622786, 3884175, 3168760, 3172120, 3212766, 3574458, 3694277, 3449399, 2996409, 3067392, 3867735, 4308085, 3247494, 3037957, 3391043, 4872637, 4330881, 2921494, 2709006, 2713656, 2569756, 3515743, 3127178, 1587921, 1810006, 2216729, 1821094, 1872219, 2129908, 2357889, 3149757, 2538542, 2004109, 2727950, 2894152, 2365125, 2416935, 2418734, 2438393, 2455846, 2104509, 1905449, 1424175, 2385274, 3072329, 2249697, 1611316, 2406303, 2228112, 2829192, 2112688, 2412150, 2963981, 1198619, 1630874, 1843491, 2299232, 1544346, 1510401, 1423081, 1792205, 1679609, 1109941, 797320, 1523257, 1624274, 2267903, 2938186, 2169747, 2013179, 2115291, 2189894, 1853071, 2544554, 2858683, 1922163, 1420166, 2226564, 2755360, 3089723]
6022C089723j42590l58618J40099J06784j8081K59430j120437m20000J295464
6013B831774M812j356325M46514R06327r1780L55817k49654O34908M2280j38807
6003C385866m58972m24682K28987L81004j48286l57559j49932M62173K73792N15780
5993C708171o49350r52902O04237q47082O95933j371950j09278J207696M47685
5984B733160n51m5871n22902K18665n40763P69070Q66073J74946M84690j724748
5974B411769m32528k12120k92923M67280O59006M59677o14723Q85006q124n5121
5964C267199o47511L26353Q62593N15397P318J9928j363787n75984J034165L22813
5954C768484J77467l02407K88858M2522o70828o19673N09438l34772j33819r27584
$$ y = [3089723, 2947133, 2588515, 2728614, 2835398, 2817317, 3076747, 1956310, 1536310, 2831774, 2836586, 1480261, 1926775, 2833102, 2741322, 3097139, 2847485, 3482393, 3524673, 3385866, 2926894, 2502212, 2731199, 3112203, 2963917, 2606358, 2456426, 2918599, 3192391, 3708171, 3058821, 2105919, 2710156, 1863074, 2559007, 1187057, 1077779, 2285475, 2733160, 2732609, 2686738, 2163836, 2382501, 1841738, 2610808, 3476881, 3651827, 4136517, 2411769, 1979241, 1767121, 1474198, 1941478, 2600484, 3060161, 2445438, 3330444, 3322320, 3267199, 2619688, 2946041, 3808634, 4324031, 4331349, 4351277, 2987490, 2411506, 3445671, 3768484, 3945951, 3643544, 3932402, 3974924, 3304096, 2684423, 3193861, 2859089, 2725270, 1797686]
5944A797686j58502l17875K45039N20322J88945M81148r03736M55567N92900k52875
5934B648619M16537M2517P32137l1448Q70405k12057m62215j018488n25259Q20674
5924C281422L15342l77716m54528O0939l08255P6638M2116p72702q85730M52103
5914A429629P25615P03962p68263j37313J241432q82796o9971n385R22996k8671
5904C131235m46022o66091l74477L57797M67383M4981n7226k21162K14417M72452
5894B923287j040315J11876l51619k43173M64752k59856Q81104q21218K8482M43195
5884B136515M34446K83828M22771M2080O62122K22003l61751k90177q17878r91864
5874A742095m91122R37967l63305M26889N52650n46564Q7062M8684L43032K33507
$$ y = [1797686, 1639184, 1321309, 1566348, 2086670, 2275615, 2756763, 1853027, 2308594, 2901494, 2648619, 3065156, 3107673, 3839810, 3808362, 4678767, 4466710, 4004495, 2986007, 2460748, 3281422, 3596764, 3219048, 2764520, 2825459, 2517204, 2593842, 2635958, 1863256, 977526, 1429629, 2155244, 2859206, 2090943, 1953630, 3195062, 2312266, 2242295, 2236910, 3159906, 3131235, 2685213, 2019122, 1644645, 2002442, 2469825, 2514806, 2457580, 2236418, 2450835, 2923287, 1882972, 1994848, 1643229, 1400056, 1864808, 1604952, 2486056, 1664838, 1693320, 2136515, 2570961, 2854789, 3277560, 3319640, 3981762, 4203765, 3842014, 3551837, 2733959, 1742095, 1250973, 2188940, 1825635, 2252524, 2805174, 2258610, 2345672, 2394356, 2737388, 2970895]
5864B970895N38228m79838j135871k80984j152420J602915N35969R59982k37046
5855C321830j142783O8513L34995L28916M94974J32468k1690r19521J115371m98417
5845C214656L33117k00210r1601L29944j34793N5187p77135L80216j254860Q34501
5835B689022R78740m40387R56465R98158q29054j600521P83915P19918J38005
5826D394261M6941m30727K23371l36319J54656J091472l43984n62443j12734j55896
5816C968598K44165R00117n37507k58943R3657j29203r24731J98427J322487m30994
5806D446073p624o02748k8338O13520J002534q68397J13644p09586M96679k44888
5796D210869q89490O81101J047891o51427J24123Q01001R2665p04675p12800j26115
$$ y = [2970895, 3509123, 3029285, 1893414, 1612430, 460010, 2062925, 2598894, 3558876, 3321830, 2179047, 2247560, 2582555, 2911471, 3406445, 3538913, 3517223, 2597702, 3713073, 3214656, 3547773, 3347563, 3255962, 3585906, 3451113, 3506300, 2729165, 3109381, 1854521, 2689022, 3667762, 3227375, 4183840, 5181998, 4352944, 2752423, 3536338, 4256256, 4394261, 4441202, 4010475, 4233846, 3897527, 4052183, 5143655, 4799671, 4237228, 4124494, 3968598, 4212763, 5112880, 4575373, 4316430, 4410087, 4280884, 3356153, 3554580, 4877067, 4446073, 4438449, 3835701, 3807363, 4420883, 5423417, 4555020, 4668664, 3959078, 4455757, 4210869, 3321379, 4002480, 5050371, 4398944, 4523067, 5324068, 5416733, 4712058, 3999258, 3873143]
5786C873143J72191N42653o62192m04637O61524J5956j260285J48366J257412
5777D344131K36705L03841O40673l54200j76669m38779l72525L92749O76020P54862
5767F006808o5149Q001L97705p0646j518752m20085P17762p52782P99236J310990
5757F413088p29880M15063K4990O78357M09539j379687k22474R91579L63282j087257
5747E876600J39092K61937K28623R1186N17697J10634K7024k41730p40922O29785
5737F899926R64687J006249P5896q26058k31469M40426J184478K16844N60298
5728A0291277N23448M25903k12402N89555j81394l3832k74292R4335r71362J043831
5718A1295067J345595J83835j85181J99582J171440O02075M71975R61775P27718
$$ y = [3873143, 4045334, 4587987, 3925795, 3521158, 4182682, 4198638, 2938353, 3086719, 4344131, 4580836, 4884677, 5525350, 5171150, 4994481, 4555702, 4183177, 4575926, 5251946, 6006808, 5941659, 5949660, 6347365, 6276719, 4757967, 4337882, 5055644, 4302862, 5102098, 6413088, 5683208, 6098271, 6123261, 6801618, 7211157, 5831470, 5608996, 6600575, 6963857, 5876600, 6015692, 6277629, 6506252, 6597438, 7115135, 7225769, 7252793, 7011063, 6270141, 6899926, 7864613, 8870862, 8946758, 8120700, 7889231, 8329657, 9514135, 9730979, 10291277, 10814725, 11240628, 11028226, 11617781, 11436387, 11402555, 11128263, 11222598, 10251236, 11295067, 12640662, 12824497, 12639316, 12838898, 14010338, 14612413, 15084388, 16046163, 16773881]
5709A6773881o12611J621249J63510m3732R81552P23797P49065R95347K033308
5700B3385366J120393k396K79307R67895N75954L89278O38096K473430J755796
5691C1583119J031511J695821Q03331J692223J683018K130182J317103K668818
5683D4605126K724660K320762M840099L646767L002030L766354N044469N231024
5675G5181291L589367M691078M280251N149802L960971M555830L994132K963404
5667A08366126K224656K945503M207196Q44734M92137J183582J767245J237084
5659A23268263J754076K057511J780966J878726K906019L383470L670625L631600
5651A44331256M050917N392599N452089N880529N959217N707531N058912L306416
$$ y = [16773881, 16161270, 17782519, 17946029, 17902297, 18883849, 19607646, 20356711, 21352058, 23385366, 24505759, 24503363, 24782670, 25750565, 26326519, 26715797, 27353893, 29827323, 31583119, 32614630, 34310451, 35113782, 36806005, 38489023, 40619205, 41936308, 44605126, 47329786, 49650548, 54490647, 58137414, 61139444, 64905798, 69950267, 75181291, 78770658, 83461736, 87741987, 92891789, 96852760, 101408590, 105402722, 108366126, 110590782, 113536285, 117743481, 118588215, 119080352, 120263934, 122031179, 123268263, 125022339, 127079850, 128860816, 130739542, 133645561, 137029031, 140699656, 144331256, 148382173, 153774772, 159226861, 165107390, 171066607, 176774138, 181833050, 185139466]
5643A85139466L156612L313894J757977n59002r47438j945533l531729l726510
5635A82657737m024520m048573m861839n303072m378454m967241n213265l196517
5627A46664256l030314k332431l248717k429412j831827m26024O21956q4023j628669
5618A32274795r10948l75783k74485p71737j525714j621405k488332k729082k722192
5609A18855117l162367l078908n074475m229106l107599m261524m570516l424559
5601H7946063l714614k704308k877670m112814l020438k390374k38391j910184
5593F6977270k460987k143779j425078j302958o15791k138792j79739j013052
5585E5697094m41656N64992j61952J167193J176794J030378N81906K083899J445641
$$ y = [185139466, 188296078, 191609972, 193367949, 192808947, 191861509, 189915976, 186384247, 182657737, 178633217, 174584644, 169722805, 164419733, 160041279, 155074038, 149860773, 146664256, 143633942, 141301511, 138052794, 135623382, 133791555, 133365531, 133987487, 133903464, 132274795, 131363847, 130988064, 130713579, 129941842, 128416128, 126794723, 124306391, 121577309, 118855117, 115692750, 112613842, 107539367, 103310261, 100202662, 95941138, 91370622, 87946063, 84231449, 81527141, 78649471, 74536657, 71516219, 69125845, 68887454, 66977270, 64516283, 62372504, 60947426, 59644468, 59028677, 56889885, 56710146, 55697094, 55255438, 55820430, 55658478, 56825671, 58002465, 59032843, 59614749, 61698648, 63144289]
5576F3144289K045339K638216K258045L443976K838372M214544L191282L104628
5568H6878691M039500L642052M000789M367198L691415L842778K281923K494472
5560A15238818K132474J334221J816977K091069O75985P99730J225737L61447
5552A25676458J176669J432509K479923K069723K867164K168230M357960L892786
5544A46121422N874532O648990O140138O043430O943103N683947M340794N616278
5536A93412634N017556K989023K091969J431173j24012r08823j771861l548013
5528A98589646l207449m602560n133681m423753n228014m348489m095505l592557
5520A63957638k367937k842873k781306j091464j975861r79852j295382j758215
$$ y = [63144289, 65189628, 67827844, 70085889, 73529865, 76368237, 80582781, 83774063, 86878691, 90918191, 94560243, 98561032, 102928230, 106619645, 110462423, 112744346, 115238818, 117371292, 118705513, 120522490, 122613559, 123289544, 124089274, 125315011, 125676458, 126853127, 128285636, 130765559, 132835282, 135702446, 137870676, 142228636, 146121422, 151995954, 158644944, 164785082, 170828512, 177771615, 183455562, 187796356, 193412634, 198430190, 201419213, 203511182, 204942355, 204818343, 203909520, 202137659, 198589646, 195382197, 190779637, 185645956, 181222203, 175994189, 171645700, 167550195, 163957638, 161589701, 158746828, 155965522, 154874058, 152898197, 151918345, 150622963, 148864748]
5512A48864748j503042j885140m47190k048867l709149l360132m464661l919224
5504A27527343m740816m707773n436974m802980o664417o081442l055619m627778
5496H7409544n476693n105838m553482l855902l120055l101369k777486j956834
5488E7461885l161564l351172l335503j700706k803147k140144p25865j194643
5480C9049141j721526k076621l19073j598938j871231j704368j871472M91264
5472B8377176n09801j243468J82289n75193j273863j726748o9725K05447n33734
5463B2832380K82812j203843j458111j3198p65608l26444p63043J142200l97370
5454A9329775k019476M9531K8037r20306o64283o35449o00153L34972p59501p66
$$ y = [148864748, 147361706, 145476566, 145029376, 142980509, 139271360, 135911228, 131446567, 127527343, 122786527, 118078754, 112641780, 107838800, 101174383, 95092941, 92037322, 87409544, 81932851, 76827013, 72273531, 68417629, 65297574, 62196205, 59418719, 57461885, 54300321, 50949149, 47613646, 45912940, 43109793, 40969649, 40243784, 39049141, 37327615, 35250994, 34931921, 33332983, 31461752, 29757384, 27885912, 28377176, 27867375, 26623907, 26806196, 26231003, 24957140, 23230392, 23160667, 23366114, 22832380, 23115192, 21911349, 20453238, 20440040, 19674432, 19347988, 18584945, 19727145, 19329775, 17310299, 17359830, 17387867, 16467561, 15803278, 15167829, 14567676, 14902648, 14143147, 14142381]
5444A4142381m37152l93827Q4993q9068n07250p72408P3635L13136m23261l31138
5434A1660041L44865k62840m06755n37022l43032M54254j62887o96718k30879
5425I819027N0034j29839K93042o18700k34024j42637r21656J345943L38294n63120
5415I236364J55614l80296n47599l15497k37998N35708j14763o19035O49300J32250
5405H494048j154278O3042k94225j341604M22905J153799Q77589l39179k57623
5396G624474j019277n31337L43559k63492l33390j24425n35889J44790R14456
5387F219469M44868l35985r16240n73280O46918Q65873p48678k93278j64333j84081
5377D961253q7555j986J2541k25802L75514P13189n81375n34093K20384n6898
$$ y = [14142381, 13705229, 13311402, 13396395, 13307327, 12800077, 12027669, 12101304, 12414440, 11991179, 11660041, 12004906, 11742066, 11335311, 10798289, 10455257, 10909511, 10746624, 10049906, 9819027, 9869061, 9739222, 10032264, 9413564, 9179540, 9036903, 8115247, 9461190, 9799484, 9236364, 9391978, 9011682, 8464083, 8148586, 7910588, 8446296, 8331533, 7712498, 8361798, 8494048, 7339770, 7402812, 7108587, 5766983, 6189888, 7343687, 8221276, 7882097, 7624474, 6605197, 6073860, 6417419, 6153927, 5820537, 5696112, 5160223, 5305013, 6219469, 6664337, 6328352, 5412112, 4838832, 5485750, 6351623, 5602945, 5309667, 5145334, 4961253, 4873698, 4871712, 4884253, 4658451, 5033965, 5747154, 5165779, 4631686, 4852070, 4795172]
5367D795172p47337K49100J06088J05562j335561J43205R54605J041838j191991
5358D120681K40205r7329m57206l29955R82610j59272j454605P2557O25785J15908
5348C659379L25786K73196m29880L90506r36065K62808J59704m53053J74351Q1908
5338C508640M36200j57575r42515M6289N04465l56342k07951N67745n27189M10910
5328C282677O04555j16035k27240Q55976L83219j366202j168429M02827N62162
5319C213510l85751J56541L29958n60177L43861L41324N99204r64774p40043O26146
5309B959799Q02384p70016m05162J23989R21115n09789r41279J00884O13114p4545
5299B820494l7543p23552Q99262M06719L2424j420962L36732R10812j076121J142891
$$ y = [4795172, 4047835, 4296935, 4403023, 4508585, 3173024, 3316229, 4270834, 5312672, 4120681, 4360886, 4263557, 3806351, 3476396, 4459006, 4299734, 2845129, 2917686, 3543471, 3659379, 3985165, 4258361, 3828481, 4218987, 3282922, 3545730, 3705434, 3252381, 3426732, 3508640, 3944840, 3787265, 2844750, 2891039, 3395504, 3039162, 2831211, 3398956, 2871767, 3282677, 3887232, 3771197, 3543957, 4399933, 4783152, 3416950, 2248521, 2651348, 3213510, 2827759, 2984300, 3314258, 2754081, 3097942, 3439266, 4038470, 3073696, 2333653, 2959799, 3762183, 2992167, 2587005, 2710994, 3632109, 3122320, 2181041, 2281925, 2895039, 2820494, 2782951, 2059399, 2958661, 3365380, 3397804, 1976842, 2313574, 3224386, 2148265, 3291156]
5289C291156J65326q44751K82824l75410P682N55931m81394n12623o93396K29593
5279A624938L36516N60321j67348O0633R21129j18840n87665K9862l6858l46578
5269B276110r98132L98776P77606l25484K92483N77176J24610Q2692r00081l5403
5259B270353k00836L58138k92204J23815K38021l64335M26970J43547k17566l77085
5249B108818K84294k58505J16043J228841O86198j219502K90422k64504k3672
5240B948433K81168j061349J30648Q58845j069867N87794J000853r28936K11581
5231B959170r70335o4220L9220k84312L66420J008580P97078p42829r24630N40104
5221B724246K95366p67533P19856L96918q36198J070288n82601m45311M55659
$$ y = [3291156, 3456482, 2611731, 2894555, 2519145, 2526827, 3082758, 2601364, 2088741, 1395345, 1624938, 1961454, 2521775, 2354427, 2415060, 3336189, 3217349, 2629684, 2659546, 2622688, 2276110, 1277978, 1676754, 2454360, 2128876, 2421359, 2998535, 3123145, 3205837, 2305756, 2270353, 2069517, 2427655, 2135451, 2259266, 2497287, 2132952, 2559922, 2703469, 2485903, 2108818, 2393112, 2134607, 2250650, 3479491, 4165689, 2946187, 3236609, 2972105, 2948433, 3229601, 2168252, 2298900, 3157745, 2087878, 2675672, 3676525, 2747589, 2959170, 1988835, 1924615, 1963835, 1679523, 2045943, 3054523, 3851601, 3108772, 2184142, 2724246, 3019612, 2252079, 2971935, 3368853, 2532655, 3602943, 3020342, 2575031, 3030690]
5212C030690M57143L18897r49589P79543p58842O59345P68058j05582N338K1040
5202D226041J627116Q0274m58283m61416j84770m88149K46120n28142O10256o15290
5192D053757o77817J195247N03841j016161n49324l97047k02313L45624N31998
5183C787805O55778j083073j012823L95070j66027k81876K28529j0514J052686
5174C565555K5162q27643L26198L96208o72683j17734N14902o47028r4544L02243
5164B770636K6001J11544l16201N3633J64971k66180j7213L19732R70934M58208
5154D276065k45173J9572q3576L1196p93709p25319P76750o99994L07576L22510
5144C185898r6824J68504o36083Q58294J42389M42445p76338J35779K87987l59923
$$ y = [3030690, 3487833, 3806730, 2857141, 3636684, 2877842, 3537187, 4305245, 4199663, 4205001, 4226041, 5853157, 5933431, 5475148, 5013732, 4828962, 4340813, 4586933, 4058791, 4669047, 4053757, 3375940, 4571187, 5075028, 4058867, 3509543, 3112496, 2910183, 3255807, 3787805, 4443583, 3360510, 2347687, 2742757, 2576730, 2294854, 2523383, 2512869, 3565555, 3590717, 2763074, 3089272, 3485480, 2812797, 2695063, 3209965, 2562937, 2468393, 2770636, 2796637, 2908181, 2591980, 2645613, 2810584, 2544404, 2527191, 2846923, 3817857, 4276065, 4030892, 4050464, 3966888, 3998084, 3204375, 2479056, 3255806, 2555812, 2863388, 3185898, 3089074, 3257578, 2621495, 3479789, 3622178, 4064623, 3288285, 3424064, 3712051, 3352128]
5134C352128m18722l96914M29294o61565N29796N72258m22933K48461L68560k02557
5124C397806J255657n25949N58471J4121j066507o02307Q37597J19549j28505
5115C859933k05721J33801n76272p49486J322365n7102K1713R11392p52769j692325
5105B215529L17574Q46695M7713p65267J071355j437302J101964J890659j83041
5096E105879q62087N83831K63492p85969M66960J164810l27574p21236l72891
5087D515215q74806n7123k06113k73632O50942j82801j75842J43569O57079k2521
5077D173967n62008M32279L64801j190791P75497j26720J93586M81745J85903
5068D728259p32126j24734M82093j62227J193651m8314O53472M76573o62735j022152
$$ y = [3352128, 2933406, 2536492, 2965786, 2304221, 2834017, 3406275, 2983342, 3231803, 3600363, 3397806, 4653463, 4127514, 4685985, 4700106, 3633599, 3031292, 3868889, 3988438, 3859933, 3654212, 3788013, 3211741, 2462255, 3784620, 3727518, 3749231, 4660623, 3907854, 2215529, 2533103, 3379798, 3427511, 2662244, 3733599, 2296297, 3398261, 5288920, 5105879, 4243792, 4827623, 5091115, 4305146, 4772106, 5936916, 5609342, 4888106, 4515215, 3640409, 3583286, 3377173, 3103541, 3754483, 3571682, 3395840, 3539409, 4196488, 4173967, 3611959, 4044238, 4409039, 3218248, 3993745, 3867025, 4060611, 4542356, 4728259, 3996133, 3871399, 4353492, 4191265, 5384916, 5336602, 5990074, 6466647, 5803912, 4781760]
5058D781760Q20051m78045o38970L68291Q9546j92206l81889j9488n76952J118179
5048D890277p9532k33590o33877M86590J441549q89521N48580q89685R10785K63306
5038E814882j81665n50406J67255J388521k13016j033298L04583R5150j19576
5029E672430r32734Q73994O19257j136437L38859k92668o47658r77586J029871
5020D547328N79531L64242k7515l15911O05161P7001J033560J71528j22166J83857
5010G096616j4227K24427r60880N38256J409011L88424o60777J40628o43696p6946
5000G440836R7361K72321N80480L06299q69077q62671J35127J456638P79855j340928
4990G996241j052639J79288K23208J61270Q72760o58248j77376j111034Q22034
$$ y = [4781760, 5601811, 5123766, 4484796, 4853087, 4942633, 4750427, 4368538, 4349050, 3772098, 4890277, 4810745, 4577155, 3943278, 4429868, 5871417, 4981896, 5530476, 4640791, 5551576, 5814882, 5633217, 5082811, 5250066, 6638587, 6425571, 5392273, 5696856, 5792006, 5672430, 4739696, 5613690, 6232947, 5096510, 5435369, 5142701, 4495043, 3517457, 4547328, 5126859, 5491101, 5463586, 5147675, 5752836, 5829837, 6863397, 7034925, 6912759, 7096616, 7082389, 7306816, 6345936, 6884192, 8293203, 8681627, 8020850, 8161478, 7517782, 7440836, 7538197, 7810518, 8390998, 8697297, 7828220, 6965549, 7100676, 8557314, 9337169, 7996241, 6943602, 7122890, 7346098, 7507368, 8380128, 7721880, 7544504, 6433470, 7255504]
4981G255504R85286l0460N90809L70546j0079K81156M04175J411584K5511L6831
4971A1320863q3023n33054j237782J47960J710623n38661j022115J90014R00269
4962A0855094Q99551K05796J15771J027807j20049Q58259N90936j14114J58809
4953A4477860P48453O12215K91270K84722L00406J379040Q91852M63554n36739
4944A8912633O46595P77864J754044J450920J570702O00533K978K160491J355035
4935B9231795K236902K09886J446800J554446J286516K001003J690867Q27797
4927D0486012Q52777J299060N94508J480727J897039J552446J385371J857987
4919E1405927J244635K774548R35091J559318J529776J422052K237052J209535
$$ y = [7255504, 8240790, 8210330, 8801139, 9171685, 9161606, 9442762, 9846937, 11258521, 11284032, 11320863, 11237840, 10704786, 9467004, 9614964, 11325587, 10786926, 9764811, 9954825, 10855094, 11754645, 11960441, 12076212, 13104019, 12983970, 13842229, 14433165, 14319051, 14477860, 15226313, 15838528, 16129798, 16414520, 16714926, 18093966, 18985818, 19449372, 18912633, 19559228, 20337092, 22091136, 23542056, 25112758, 25713291, 25716269, 27876760, 29231795, 31468697, 31678583, 33125383, 34679829, 35966345, 37967348, 39658215, 40486012, 41338789, 42637849, 43232357, 44713084, 46610123, 48162569, 49547940, 51405927, 52650562, 55425110, 56360201, 57919519, 59449295, 60871347, 63108399, 64317934]
4911F4317934K935808K236209J661708K561189K469175K710809J853285R85530
4903H1731647K176764J426417J853190K009229K040791K118988J863058K276730
4895I7496814K163729K601089L012195L021649L199280K928844L277892K038163
4887A19739655L31392J913186J790409O20507K306329J229000N13146J914085
4879A30357709K134587K538500O29000K26656J168023J579429K110589J465629
4871A42210122J710885M89668Q51748J990825K202842K934869J792181L499638
4863A57682778L641539K997464K617490L368609L276208L570540L400999K882599
4855A83438226J457682J204753L314576J292185J046852J489830J136214l35900
$$ y = [64317934, 67253742, 69489951, 71151659, 73712848, 76182023, 78892832, 80746117, 81731647, 83908411, 85334828, 87188018, 89197247, 91238038, 93357026, 95220084, 97496814, 99660543, 102261632, 105273827, 108295476, 111494756, 114423600, 117701492, 119739655, 120071047, 121984233, 123774642, 124395149, 126701478, 127930478, 128443624, 130357709, 132492296, 135030796, 135659796, 135886452, 137054475, 138633904, 140744493, 142210122, 143921007, 144410675, 145262423, 147253248, 149456090, 152390959, 154183140, 157682778, 161324317, 164321781, 166939271, 170307880, 173584088, 177154628, 180555627, 183438226, 184895908, 186100661, 189415237, 190707422, 191754274, 193244104, 194380318, 194044418]
4847A94044418J903661P69653L49100M3760J409675J545796Q25955J779719K084570
4838B04756307R22637K347259K97194J557371J343975j262872j89193r77060M7095
4829B08842713j668044j248910l66471j147984J45918Q49736p07145N4841l83905
4820B04370749k47702m04990j105904j515484r17926j772351o72885p42621j746521
4811A95244365k002611k666133l227256k538868k921527m042671l781978l329573
4803A70733748k051716l135663k590861k250086j693806j714436j319696k106994
4795A53870490q97331k10742j536587q86713j955288j494107j513675j343423
4787A44032624L0621j017001j588399j035272k191578k107451q17404j383601
$$ y = [194044418, 195948079, 196717732, 197066832, 197110592, 198520267, 200066063, 200892018, 202671737, 204756307, 205678944, 208026203, 208323397, 209880768, 211224743, 209961871, 209772678, 208795618, 208842713, 207174669, 205925759, 205559288, 204411304, 204557222, 205406958, 204699813, 204754654, 204370749, 204123047, 203718057, 202612153, 201096669, 200178743, 198406392, 197733507, 196990886, 195244365, 193241754, 190575621, 187348365, 184809497, 181887970, 177845299, 174063321, 170733748, 168682032, 165546369, 162955508, 160705422, 159011616, 157297180, 155977484, 153870490, 152973159, 152762417, 151225830, 150339117, 148383829, 146889722, 145376047, 144032624, 144063245, 143046244, 141457845, 140422573, 138230995, 136123544, 135306140, 133922539]
4779A33922539k215559k674172l002814l416894k622054j162284k592551j496339
4771A14739872j643494k204352k899699k122434k095662k215289j383793k457840
4763I7717309j490812j405164j416910j015859j530424j794054j674315j581973
4755H5807798k019940j759079j578265n98065n65462j289658j459359j656360
4747G4881610j000601j436256l91347q53716j194322j14336o98651k74159P00168
4738F9618390K32165j191791R29349O10943k46320j52587n11627K49971J246260
4729G0784753J150653N83349L04337J436147J322520K079644K342223J677577
4721H1681203K123705K006550K430305K391669K339617K388059J857715K346492
$$ y = [133922539, 131706980, 129032808, 126029994, 122613100, 119991046, 118828762, 116236211, 114739872, 113096378, 110892026, 107992327, 105869893, 103774231, 101558942, 100175149, 97717309, 96226497, 94821333, 93404423, 92388564, 90858140, 89064086, 87389771, 85807798, 83787858, 82028779, 80450514, 79852449, 79286987, 77997329, 76537970, 74881610, 73881009, 72444753, 72053406, 71199690, 70005368, 69891032, 69192381, 68918222, 69618390, 69850555, 68658764, 69588113, 70199056, 69952736, 69800149, 69288522, 69538493, 70784753, 71935406, 72518755, 72823092, 74259239, 75581759, 77661403, 80003626, 81681203, 83804908, 85811458, 88241763, 90633432, 92973049, 95361108, 97218823, 99565315]
4713I9565315K497955K879068K980490J975779j42234J074859K6838k52931O85848
4704A11290987p16855j244135j174375j968924l410284k086153r79222l057860
4696I6653179m078801l173862l753644k605666l782669k283672j964592l131349
4688G1878924k246159k398154l614797k480007k500889k451037j744196p03410
4680E3740275k717270k377870k121215j971397j903950m07985p89570j823676
4672C9627342j388161j365148q38051l74817j221794j189989j846030j655395
4664B9747957q5942k016001m190l31601J10626j145411j340047J27323L05510
4655B5368224r33733j143066m18847m26470j15028j696743J32631J32620j343697
$$ y = [99565315, 102063270, 104942338, 107922828, 109898607, 109756373, 110831232, 110858070, 110605139, 111290987, 110574132, 109329997, 108155622, 106186698, 102776414, 100690261, 99711039, 96653179, 92574378, 89400516, 85646872, 83041206, 79258537, 76974865, 75010273, 71878924, 69632765, 67234611, 63619814, 61139807, 58638918, 56187881, 54443685, 53740275, 51023005, 48645135, 46523920, 44552523, 42648573, 42240588, 41451018, 39627342, 38239181, 36874033, 36035982, 35661165, 34439371, 33249382, 31403352, 29747957, 29662015, 27646014, 27641824, 27310223, 27420849, 26275438, 24935391, 25062714, 25368224, 24434491, 23291425, 22872578, 22446108, 22331080, 20634337, 20766968, 20899588, 19555891]
4646A9555891r72254R0661m223P6971m7979l17782l07816j190964j3686l73441
4636A6495378r48292j27792l21556R6775n68469p20025K98472l99570l13349P19556
4626A4211128j01365m06041N03181P6375n41901j267593L54716J024446j711405
4617A2141541j9658L62396p74877J52447m7854K3989o06804k84392M58448l6647
4607A1368589j061438o63275j73305O2631L17182k33660n65516J050332J69299
4598A0270839n60271R2491N33092j093956j73686L79317Q60230p747o10781L8915
4588I728443k74854n98911p8959p236m13637P1866m9110k52549L4422K92839q06927
4577G645387M28186N42846q96788l87731N0974J39336O52481n31859O91514j002449
$$ y = [19555891, 18583637, 18674298, 18670075, 18747046, 18699067, 18381285, 18073469, 16882505, 16868819, 16495378, 15547086, 15419294, 15097738, 15194513, 14626044, 13906019, 14204491, 13804921, 13491572, 14211128, 14109763, 13703722, 14206903, 14283278, 13741377, 12473784, 12828500, 13852946, 12141541, 12121883, 12484279, 11709402, 11861849, 11813995, 11837984, 11231180, 10946788, 11405236, 11368589, 10307151, 9643876, 9470571, 9533202, 9850384, 9616724, 9051208, 10101540, 10270839, 9710568, 9803059, 10336151, 9242195, 9068509, 9447826, 10308056, 10300309, 9689528, 9728443, 9453589, 8854678, 8775719, 8768483, 8354846, 8426712, 8377602, 8125053, 8159475, 8452314, 7645387, 8073573, 8616419, 7719631, 7331900, 7382874, 7522210, 8174691, 7642832, 8334346, 7331897]
4567G331897j412205K87304K23816o84224J85002j33066J488943N21593o59143
4558G149917R07225J080116j291342j378367L31617j97549n12807j19087R56842
4549F926565Q4639L70875j02349K37507K15456j201324P06457r85336Q03130q67799
4539F187821o9374J39117M43807R3988j532394R85803N4962K21976n95175q3426
4529E847105j42482M96042j07656J135921q01517o11708q39224L58244O69902
4520F004627l20961m82645j72090m66103L89544q35724P27193R23611q2940j85620
4510E498892j88252O28846n03859k28765j58371L76742J041428l43368m24631
4501E698662M3421N79743l11344M23472R076j345920n32904k04644N87479J677162
$$ y = [7331897, 5919692, 6206996, 6430812, 5746588, 5931590, 5798524, 7287467, 7809060, 7149917, 8057142, 9137258, 7845916, 6467549, 6799166, 6601617, 6088810, 5969723, 6926565, 7011204, 7382079, 7279730, 7517237, 7732693, 6531369, 7237826, 6252490, 7055620, 6187821, 6118447, 6257564, 6701371, 6795359, 5262965, 6248768, 6303730, 6525706, 5930531, 5847105, 5704623, 6200665, 6093009, 7228930, 6427413, 5815705, 4976481, 5334725, 6004627, 5683666, 5201021, 5028931, 4562828, 4952372, 4116648, 4843841, 5767452, 5684512, 5498892, 5310640, 5939486, 5435627, 5206862, 5048491, 5425233, 6466661, 6123293, 5698662, 5742083, 6321826, 6010482, 6433954, 6443030, 5097110, 4564206, 4359562, 4947041, 6624203]
4491F624203P16647o03626p27652p06050k92853k29375J131080P96988J82194
4482F891556l95455l15024m57367j45087j57150n71422L68598L53300L38455L77040
4472F287444m68135K42775K68187l67236j74488J075278n85841o62678n8787R51406
4462F507925m47215m30169J63571P82530n81783n91807Q34576k75067K4993O62344
4452F649898l35079m407m09061L2084p46009J19116K62882J67026J039105K26151
4442G001706k39580l75188R22379j184109N11454J66978J72644m69404J56038
4433F662918O35942r20165o11135N07524N85500J86085P45050Q9296J065603O00030
4423I546648q51852o77675O66235P56083K23182L03747j49558N33425K07375k19970
$$ y = [6624203, 7340850, 6737224, 6009572, 5303522, 5010669, 4781294, 5912374, 6709362, 6891556, 6496101, 6181077, 5723710, 5578623, 5421473, 4850051, 5218649, 5571949, 5910404, 6287444, 5819309, 6062084, 6330271, 5963035, 5788547, 6863825, 6277984, 5615306, 5556519, 6507925, 6060710, 5630541, 5794112, 6576642, 5994859, 5403052, 6237628, 5962561, 5987554, 6649898, 6314819, 6310412, 5901351, 5933435, 5187426, 5306542, 5569424, 5736450, 6775555, 7001706, 6762126, 6386938, 7309317, 6125208, 6636662, 6803640, 6976284, 6506880, 6662918, 7298860, 6378695, 5767560, 6275084, 6860584, 7046669, 7791719, 7881015, 8946618, 9546648, 8694796, 8017121, 8683356, 9439439, 9662621, 9966368, 9816810, 10350235, 10557610, 10337640]
4413A0337640K87985K26928l10768L20684N63937J131698J67365j77016Q57317
4404A3405770K34560M43883L67966J076875k49482O38225K67595J23058K06275
4395A6514725J77032P61342J241862R51086j34297J24638J380182R17618j65806
4386B1768382k55593J803127P17508O97503O37319k49766J790306J111689P30794
4377B8751269N19226J295726K89080j52758J723516J237256O691q89256J714675
4368C4495425Q88700P00529J500546j75067R83160J522186R90328n58237J762919
4359D2110489L481676K310670L35598J345074L438125J673094N17206K942824
4351E8154756K633502K154811K213581J361729J041325J903638J837673K292291
$$ y = [10337640, 10625625, 10852553, 10541785, 10862469, 11426406, 12558104, 12725469, 12548453, 13405770, 13640330, 14084213, 14452179, 15529054, 15279572, 15917797, 16185392, 16308450, 16514725, 16691757, 17453099, 18694961, 19646047, 19511750, 19636388, 21016570, 21934188, 21768382, 21512789, 23315916, 24033424, 24730927, 25368246, 25118480, 26908786, 28020475, 28751269, 29270495, 30566221, 30855301, 30702543, 32426059, 33663315, 33670006, 32780750, 34495425, 35384125, 36084654, 37585200, 37410133, 38393293, 39915479, 40905807, 40347570, 42110489, 45592165, 47902835, 48238433, 49583507, 53021632, 54694726, 55211932, 58154756, 60788258, 62943069, 65156650, 66518379, 67559704, 69463342, 71301015, 73593306]
4343G3593306K128145J736837K634772Q95506P58005L104465J867347L419659
4335I0138042K535253L530782M409139M036293M965295M207601L239934M493868
4327A21556207M217081M533596N623654M780003M083944N490877O902246O460398
4319A63648006P000600P507474Q971963J0348561J2032959J2376485J2755784
4312B34641832J4120578J4207012J4098424J4029489J0488934R217322Q841763
4305C19645354P289242M073002M33545k250158l726993n209746p922358q066063
4297C04265825p319898r099710q637400r075210r285977r400921r726589r226067
4289B32494053r132760p752886r881794r583113q094934q920683q316301q169603
$$ y = [73593306, 75721451, 77458288, 80093060, 80988566, 81746571, 84851036, 86718383, 90138042, 92673295, 96204077, 100613216, 104649509, 109614804, 113822405, 117062339, 121556207, 125773288, 130306884, 135930538, 140710541, 144794485, 150285362, 157187608, 163648006, 170648606, 178156080, 187128043, 197476604, 209509563, 221886048, 234641832, 248762410, 262969422, 277067846, 291097335, 301586269, 310803591, 319645354, 326934596, 331007598, 331441143, 329190985, 325463992, 320254246, 312331888, 304265825, 296945927, 287846217, 279208817, 270133607, 260847630, 251446709, 241720120, 232494053, 223361293, 215608407, 205726613, 196143500, 188048566, 179127883, 170811582, 162641979]
4281A62641979p461809q058369p932139o562397o627701n300895n553030n569084
4273A09576555n738660m852794m069332m049425m360491l851931k652673k507617
4265G7493632l164776l401373l468951k849043k077610k156282k220536k181243
4257E5973818k356306k429128j554839j194765j181223k201377q39887j829663
4249D2386630j089826j509850r08547p53147j143521j058408j483019r64431o41650
4240C2834231j837044j356387p27661j023669p47427q57604m42005n53853q20150
4231B4468431N69757p05671j469009j415696j118009k74749J47303n2487K89608
4222B0439478j762665j278566K76543o36524o27836l43119l2344R4889J86050
$$ y = [162641979, 155180170, 147121801, 139189662, 132627265, 125999564, 120698669, 115145639, 109576555, 103837895, 98985101, 94915769, 90866344, 86505853, 82653922, 80001249, 77493632, 74328856, 70927483, 67458532, 64609489, 62531879, 60375597, 58155061, 55973818, 53617512, 51188384, 49633545, 48438780, 47257557, 45056180, 44216293, 42386630, 41296804, 39786954, 38878407, 38125260, 36981739, 35923331, 34440312, 33475881, 32834231, 30997187, 29640800, 28913139, 27889470, 27142043, 26284439, 25842434, 25288581, 24468431, 25038188, 24332517, 22863508, 21447812, 20329803, 20055054, 20202357, 20149870, 20439478, 18676813, 17398247, 17674790, 17038266, 16410430, 16067311, 16034967, 16129856, 16315906]
4213A6315906j33899n66567j104255k59466J80174o34372m96113O10645j050811
4204A2861242j416179O48350Q91769j248711j149656j48965O14678k21451p90252
4195A0040825r19754j7100J79257P29304o10820J71672k75952j2390l66210k39308
4185H679524Q00517j70882m48230q21167P02495K59557k50627k3865p99677m33538
4175G494107L41379M07684m68846K18207o08312n9369L72406N5998m35200j318468
4165E999586J28369Q40770l17493r76990L72619K71431l2833L88571m90957j48507
4155F034566j21017J33383J28119j23250P8217J51440l66801o07203J304449Q59159
4145G471062p46923r81124k81272o83305q03877J153829O8359o36459l72847N39332
$$ y = [16315906, 16182007, 15615440, 14511185, 14251719, 14431893, 13797521, 13301408, 13912053, 12861242, 11445063, 12093413, 12985182, 11736471, 10586815, 10437850, 11052528, 10831077, 10040825, 9121071, 9103971, 9283228, 10012532, 9401712, 9573384, 9297432, 9285042, 8918832, 8679524, 9480041, 9309159, 8860929, 8039762, 8742257, 9001814, 8751187, 8727322, 7927645, 7494107, 7835486, 8243170, 7774324, 7992531, 7384219, 7324850, 7697256, 7753254, 7318054, 5999586, 6127955, 6968725, 6651232, 5674242, 6046861, 6318292, 6285459, 6674030, 6183073, 6034566, 5913549, 6046932, 6175051, 6051801, 6130018, 6281458, 5914657, 5307454, 6611903, 7471062, 6724139, 5743015, 5461743, 4778438, 3974561, 5128390, 5196749, 4560290, 4187443, 4726775]
4135D726775M66532o48643l70248O54938L81669l04217n10686j82855M18275J51999
4125D783539n1913l31273P52504M6245O51763n15707j56749L42791q12841O15142
4115E323501L82551J35150j15669l09558j130354k59377M07228N64603J91681
4106E189756o08354N88774O19754Q45854l01618o36001J40739l34804j029510
4097D474590r157L00533P95386L70890j205824l40567K78533l66396L53498N18994
4087E170480p4549J19696J07168k10081J193843j95019n53016p93700L95340N01171
4077E661333l17246l97703k79877J271413J267268n95682j154433J87065J082299
4068F724437p80020j70694K46765n28375O18434Q56218p13319j70001J582810
$$ y = [4726775, 5193307, 4544664, 4174416, 4829354, 5211023, 4906806, 4396120, 4213265, 4631540, 4783539, 4731626, 4400353, 5152857, 5199102, 5850865, 5335158, 5178409, 5521200, 4708359, 5323501, 5706052, 5841202, 5725533, 5415975, 4285621, 4026244, 4433472, 4998075, 5189756, 4581402, 5170176, 5789930, 6635784, 6334166, 5698165, 5838904, 5504100, 4474590, 4465433, 4765966, 5561352, 5932242, 4726418, 4385851, 4664384, 4297988, 4651486, 5170480, 5095931, 5215627, 5322795, 5112714, 6306557, 6111538, 5558522, 4764822, 5160162, 5661333, 5344087, 4946384, 4666507, 5937920, 7205188, 6609506, 5455073, 5642138, 6724437, 5944417, 5773723, 6020488, 5492113, 6110547, 6966765, 6253446, 6083445, 7666255]
4059G666255R6431j948127L17614J007783N31600j80357j067947Q90582k75953
4050G037881J025245P15403m08371R06520P56733m56020j45296O19222K72065
4041A0323382K74559j41599j67066L75357j39253J377061Q1314p08907K20563
4032A1495411Q62086L26890J39077o84987P35571J502993m74313J108378J314803
4023A6325909K46962P19951L25933k8599k12095J282923J530360L83542P58768
4014B1333654Q89675L51328L46104J506994R88370J818732P90882J300891R86938
4005C0313568J053767K154841K298623L522481K396253K567174K464799K618019
3997D9389525K127752M653226L937195L966938M674851N550682N432432N597025
$$ y = [7666255, 7762686, 5814559, 6132173, 7139956, 7671556, 7491199, 6423252, 7313834, 7037881, 8063126, 8778529, 8370158, 9276678, 10033411, 9577391, 9432095, 10051317, 10323382, 10597941, 10456342, 10289276, 10664633, 10525380, 11902441, 11983755, 11274848, 11495411, 12357497, 12684387, 12823464, 12138477, 12874048, 14377041, 13902728, 15011106, 16325909, 16572871, 17292822, 17618755, 17590156, 17378061, 18660984, 20191344, 20574886, 21333654, 22223329, 22574657, 22920761, 24427755, 25416125, 27234857, 28025739, 29326630, 30313568, 31367335, 33522176, 35820799, 39343280, 41739533, 44306707, 46771506, 49389525, 51517277, 56170503, 60107698, 64074636, 68749487, 74300169, 79732601, 85329626]
3989H5329626M945096N553130N035756L522129M039250L779240L609069J658333
3981A17471629J791591R97725K016370R77549M79299J325611J429997J724973
3973A28214744J977688K220460K483093P86949L158642M358282L417336M079547
3965A50696741M833306O694976Q613356J1070550J1074818J0540262J1304317
3958B14828326R546240N944787K882819j231701p142921r144678q336905r849145
3950A97496822j0198567r574421q515062p634844q083330o603283o192669m341864
3942A36352782m744927m772527k773718k745184l000517k031171j958927l31415
3934A13994396Q36507l77135l82611P23777R90469L47359P99757r12729r92333
$$ y = [85329626, 90274722, 95827852, 100863608, 104385737, 108424987, 112204227, 115813296, 117471629, 119263220, 120260945, 122277315, 123254864, 123734163, 125059774, 126489771, 128214744, 130192432, 132412892, 134895985, 135682934, 138841576, 143199858, 146617194, 150696741, 155530047, 162225023, 170838379, 181908929, 192983747, 203524009, 214828326, 224374566, 230319353, 233202172, 231970471, 224827550, 215682872, 207345967, 197496822, 187298255, 177723834, 169208772, 161573928, 153490598, 146887315, 140694646, 136352782, 131607855, 126835328, 124061610, 121316426, 118315909, 116284738, 114325811, 113994396, 114830903, 114453768, 114071157, 114794934, 115785403, 116132762, 116932519, 116019790, 115027457]
3925A15027457j577122k382909l931029n175262m939863m294124m232300n079961
3917H3414887n374300l622612l348771l527681l434654l360958k762022k890195
3909E5093694l740732k795234j524625j573510l433702k108875k337364j844204
3901C5735448j830841j526578j341616j24288j200913k990504j440434o22168
3893B4658106N95089j169684o94192r22691q50162n52904j613405j190932J98875
3884A8458100j212239k05815j308231n79646J77864j133574l67961L1159K14882
3875A4074539k12145o08395q22338p09101q56797p56922m29743K17155M91926
3866A0388179q87857j444812j67089J41794o06660K22039R91652J69343n68694
$$ y = [115027457, 113450335, 111067426, 107136397, 101961135, 97021272, 92727148, 88494848, 83414887, 78040587, 74417975, 71069204, 67541523, 64106869, 60745911, 57983889, 55093694, 51352962, 48557728, 47033103, 45459593, 42025891, 39917016, 37579652, 35735448, 33904607, 32378029, 31036413, 30912125, 29711212, 26720708, 25280274, 24658106, 25253195, 24083511, 23389319, 22466628, 21616466, 21063562, 19450157, 18259225, 18458100, 17245861, 17040046, 15731815, 15152169, 15330033, 14196459, 13828498, 13859657, 14074539, 13862394, 13253999, 12431661, 11722560, 10865763, 10108841, 9679098, 9896253, 10388179, 9500322, 8055510, 7888421, 8030215, 7423555, 7645594, 8637246, 8806589, 8237895]
3857H237895P2285J31019L90345m77967k26602M7783M23925j24936o81291p10749
3847G081707l01028k2762j760794M60020P99270J45279J19307l58854j4023k65877
3837E882245K5778P1390r11587L52055j10182l91030J19697q8313P3528j26204
3827D897377K12252q65672l90855P90001j3370J9980n60139m47923K65359o8711
3817C838299M20365q94621J43434N21816K09173K65011r00705p11974Q6334K65014
3807C242146J39835l82105J83084J67123J06818M56239j029793n80545J246110
3798C548912q27907l43540N39461r98128p08151N68613m917K68445k20117K11590
3788B034261m87083o04727J225777l14502k8649j54925m57834n1901P44511r36506
$$ y = [8237895, 8310180, 8441199, 8831544, 8353577, 8126975, 8174758, 8598683, 8473747, 7792456, 7081707, 6780679, 6757917, 4997123, 5457143, 6256413, 6401692, 6520999, 6162145, 6148122, 5882245, 5908023, 5979413, 5067826, 5419881, 5309699, 4918669, 5038366, 4950053, 5023581, 4897377, 5109629, 4243957, 3853102, 4643103, 4629733, 4649713, 4089574, 3641651, 3907010, 3838299, 4258664, 3364043, 3507477, 4029293, 4238466, 4503477, 3602772, 2890798, 2977132, 3242146, 3381981, 2999876, 3182960, 3350083, 3456901, 3913140, 2883347, 2302802, 3548912, 2721005, 2377465, 2916926, 1918798, 1210647, 1779260, 1774343, 2042788, 1822671, 2034261, 1547178, 942451, 2168228, 1853726, 1825077, 1670152, 1212318, 1160417, 1904928, 968422]
3778I68422n7691r5094q51757R63312l50532j334253M11594J64504P56295M76225
3768A051025J98879J04211n94291K83271L59071M49484O5021q03346l71476k14133
3758E27716n2431j1484K46836O26415m59718J97729M5528n33855q53744J137427
3748H70419J103753j216771o97719N50065k93092n65779O5871K31520R55207O3028
3738A066502j40850q5702q6011p24296K235215j59352k14487k02436j241376o24063
3728a76856K94749k48744J7160K46411k43377O36845N66666J22754o74637L48847
3718H89818j94158o82783n82010M57981j41845l40191n06938J604679L31409R8034
3708I33996N01337n69672m78853q61802L97516m59513J240186R86311m74116o85931
$$ y = [968422, 910731, 815637, -36120, 927192, 576660, -757593, -345999, -181495, 574800, 1051025, 1249904, 1354115, 759824, 1043095, 1402166, 1851650, 1916671, 1113325, 741849, 527716, 475285, 463801, 710637, 1337052, 877334, 1075063, 1120591, 586736, -267008, 870419, 1974172, 757401, 59682, 609747, 316655, -249124, -183253, 48267, 1003474, 1066502, 925652, 839950, 753939, 29643, 2264858, 2105506, 1891019, 1688583, 447207, -176856, 117893, -130851, -113691, 132720, -110657, 526188, 1092854, 1215608, 540971, 889818, 695660, 12877, -569133, -111152, -252997, -593188, -1100126, 504553, 835962, 933996, 1435333, 865661, 386808, -474994, -77478, -536991, 703195, 1689506, 1215390, 529459]
3698E29459M39182L2400o8179J19437M51886K90109j027094L20644o80706m87759
3688h0621N18777m6079O82464N34712j315124M21072L25773o59880J37072N47007
3678A065173Q35026j02137o56303j23769k81375n7431R76707P45709o11532j156739
3668F33329k8323O65567L72991k66073p28862J71795P17214j200650L7155K93494
3658F67637j530817P34452O51018K5534j219977J71155O63596j191573N77916
3649d51059J354139k50309j12948l67158R1687O02861o00825k57775P88952L7923
3639H35488k04818M78152N07289p57435n70304P1855p19793Q53713L23908j051048
3629b32993K39259K87967M24856n76046L05250L28222n28549l2950j78079K02709
$$ y = [529459, 968641, 1001041, 932862, 1052299, 1504185, 1794294, 767200, 1087844, 407138, -80621, 438156, 392077, 1074541, 1609253, 294129, 715201, 1040974, 381094, 518166, 1065173, 1900199, 1798062, 1141759, 1017990, 736615, 679184, 1655891, 2401600, 1790068, 633329, 605006, 1270573, 1643564, 1377491, 648629, 820424, 1537638, 336988, 374143, 667637, -863180, -128728, 522290, 547824, -672153, -500998, 162598, -1028975, -451059, 903080, 652771, 539823, 172665, 264352, 867213, 266388, 8613, 797565, 835488, 630670, 1108822, 1616111, 858676, 288372, 360227, -359566, 494147, 818055, -232993, 6266, 294233, 719089, 143043, 448293, 776515, 247966, 215016, 36937, 239646]
3619B39646l84637p97643J58494R26023j72261p1215O08975j98130m98542L23124
3609A33834N14035n44465P96113m90200j133654j45861L0268M25065K30875k32631
3599d16621J098121K57160n6011p01942l02353m02957k70418P75170K89493K71798
3589E41440j30011k67400k20046n79694O9877K14667N25530M86656m12134L84223
3579F13108n95827k44054O18271l98586m93456O76969J0495p68857N9219M84662
3569c8056O05003q0161o21162J61751n14124Q3003n01564Q33573Q75981L92860
3559A197104p76332m09835M27000K56478K8335j7558k82267p16416k07876K07286
3549b94081M14078K67716o36427o6483K60851K47046n69319R1346l05438k25468
$$ y = [239646, -144991, -942634, -784140, 141883, -30378, -101593, 507382, 309252, -189290, 133834, 647869, 103404, 899517, 409317, -724337, -870198, -839930, -414865, -183990, -416621, 681500, 938660, 882649, 180707, -121646, -524603, -795021, -19851, 269642, 541440, 411429, 144029, -76017, -655711, -585834, -371167, 154363, 641019, 228885, 613108, 17281, -226773, 391498, -7088, -500544, 176425, 186920, -581937, -522718, -38056, 566947, 486786, -134376, 27375, -486749, -403746, -905310, -71737, 804244, 1197104, 420772, 10937, 437937, 694415, 722750, 705192, 422925, -293491, -501367, -294081, 119997, 387713, -248714, -315197, -54346, 192700, -376619, -285273, -590711, -816179]
3539h16179k25334j20579J57809P05434l54217p66591M56300J95262j362570K79270
3529a851395R53421M05591O93772r63357j06362J42086K17179m2597L04050L23585
3519G5973j119081L43654P01858r94859k85467l54018J27806J23681n20852J38630
3509a762675N00051j13954Q3355J364750K03706n5252J57229l39876k51183k75159
3499d89008j78723N66652N32018n86353O40090Q24290j944038j92350K61352n32615
3489a098685P35683M04585n99809N96191j00134q60855J4352N14415l418k37409
3479f35084K72468P19909l64156m02481K36372p86118m0684K73833P58923O08844
3469F41826q74486j227321R3129J551290o09547k94157R98482o21779J85798p70513
$$ y = [-816179, -1041513, -1162092, -1004283, -298849, -653066, -1419657, -963357, -768095, -2130665, -1851395, -897974, -492383, 201389, -761968, -868330, -726244, -509065, -551662, -247612, 75973, -1043108, -699454, 2404, -992455, -1277922, -1631940, -1504134, -1380453, -1901305, -1762675, -1262624, -1376578, -1293223, 71527, 275233, 219981, 377210, 37334, -213849, -489008, -667731, -101079, 430939, -155414, 484676, 1308966, -635072, -827422, -566070, -1098685, -363002, 41583, -558226, 37965, -62169, -923024, -908672, -394257, -397675, -635084, -362616, 357293, -6863, -409344, -172972, -959090, -999774, -725941, 32982, 641826, -232660, -1459981, -1366852, 184438, -425109, -719266, 279216, -342563, -156765, -927278]
3459i27278p07161P29128J80160q12963J160027M72480q33655m53656P73646p78689
3449a197961J32154J337818J30884p76794K69019j46928J10198K8447q4664p8963
3439b76790P9703m28865p9097n51239Q26926l87429j62187J6259O10249O4379
3429b88091n40477r66943k28132K026526m05992N74J689942j02608N0680k17441
3419A018038r44151j028013m9320J454932o7509j056826l59956k94801Q53875
3410d73731K43321j304833q46406Q09004O95109O11112J3377N35173l3665o78635
3400d30174n54744M79349R5871q52937R36535r6522M04027Q30867J87641j082316
3390h2403M00868j21994N7269l90257k11211j72894j44615k361l0780m54941l58907
$$ y = [-927278, -1634439, -905311, -725151, -1538114, -378087, 94393, -739262, -1192918, -419272, -1197961, -1065807, 272011, 402895, -373899, -104880, -251808, -141610, -113163, -197827, -276790, -197087, -625952, -705049, -1256288, -429362, -816791, -978978, -962719, -352470, -288091, -828568, -1795511, -2023643, 2883, -403109, -402535, 1287407, 1184799, 1235479, 1018038, 73887, -954126, -1003446, 451486, 383977, -672849, -1032805, -1327606, -473731, -230410, -1535243, -2381649, -1572645, -877536, -266424, -253047, 282126, 248461, -430174, -984918, -505569, -409698, -1262635, -326100, -422622, -18595, 812272, 999913, -82403, 318465, 196471, 253740, -136517, -347728, -520622, -665237, -667598, -698378, -1153319, -1512226]
3379a512226J72322O75169L19584M80230q91260L57661k37838M15736J72221j88384
3369b36785k77184j62476n04669P63914j01408L88844M31309o73080k75937K48799
3359c98673k23778n9731R71700o61849m2121k65641J431521k81710l97622k65752
3349a93656L46834K43186j092801J69583j77251j71749l90813N79903J44007K71045
3339b71712M57689K87486l49911k62238m32367L41100k31389L26992J03222p54826
3329g85954O89163l06070o81994N90527P69632N81648l65024l37242k28204q31801
3319i05319m68752M67122O37026k90779j4300L44446l23345j23987O25174j7361
3309g0075N55785L84609j406056j249580J027173K05818o4161K46182J31777M22040
$$ y = [-1512226, -1339904, -664735, -345151, 135079, -756181, -398520, -636358, -220622, -48401, -236785, -513969, -676445, -1181114, -417200, -518608, -129764, 301545, -371535, -647472, -398673, -622451, -682182, 289518, -372331, -414452, -680093, 751428, 469718, 72096, -193656, 153178, 396364, -696437, -526854, -704105, -875854, -1266667, -686764, -542757, -271712, 185977, 473463, 123552, -138686, -571053, -229953, -461342, -134350, -31128, -785954, -96791, -402861, -1084855, -494328, 275304, 856952, 491928, 154686, -73518, -905319, -1374071, -906949, -269923, -560702, -575002, -230556, -553901, -677888, -52714, -70075, 485710, 870319, -535737, -1785317, -758144, -552326, -616487, -370305, -238528, 183512]
3299A83512l03765o11388P15034J076468p96522r89992P33223O90994o52098p00708
3289f55242J77935L90426k50539O86249n92036q79241j71805L08836J147183j62253
3279d87K6359l84963p06204o81374J303535k31150n39740K93743K90187L54827
3269b75267L68321m04109Q0997m3520o87607J264529Q2752j60488K59582k73900
3259B11290n54839J072863K56548l13373K474r1796p88708r09852P19192O02311
3249B06110o69706n76307J409367Q46421j04709M17231p83025r50743J058165
3240H52804j04073M51839m6419j292615K09473l95347L6354J022301K70592K5958
3230A030867J97271J170532j437745K69608o61287K14851N83664L86089p96574
$$ y = [183512, -120253, -731641, -16607, 1059861, 263339, -726653, 6570, 697564, 45466, -655242, -477307, -86881, -337420, 348829, -243207, -1122448, -1294253, -985417, 161766, -487, 25872, -359091, -1065295, -1746669, -443134, -674284, -1214024, -920281, -630094, -275267, 93054, -311055, -230058, -273578, -961185, 303344, 386096, 225608, 485190, 211290, -343549, 729314, 985862, 672489, 674963, 583167, -205541, -1115393, -396201, 206110, -463596, -1039903, 369464, 1215885, 1111176, 1528407, 745382, -205361, 852804, 748731, 1200570, 1154151, -138464, 71009, -324338, -287984, 734317, 1004909, 1030867, 1228138, 2398670, 960925, 1230533, 569246, 784097, 1367761, 1753850, 957276]
3221I57276J46274L49443l43411j06811O06065o673j81288n45551p8970L31180
3211A127534p71527K58557J082381O59981p68637j219835j08784J062876J253889
3202B576435l34863n21667P4351j42141L90423l4507J055635m23015P51164K88551
3192C680366k57976o08510P05348J27681J83529K40809L17333Q57014q2487J104
3182E164211K53722r2889J081403R55431O86460J094444K249094J422986J227981
3173A4042843Q6020Q39676J922112R47648J998693K246052L147232J802965L977148
3164C1010389N555912N848411Q622721P960626Q760358J0023710Q156554M767681
3156I0706362M440981K092901m859995p961802n994805p294935o409064p597652
$$ y = [957276, 1103550, 1452993, 1109582, 1002771, 1608836, 1602163, 1420875, 875324, 796354, 1127534, 356007, 614564, 1696945, 2356926, 1588289, 368454, 259670, 1322546, 2576435, 2241572, 1719905, 1794256, 1652115, 2042538, 2008031, 3063666, 2640651, 3391815, 3680366, 3422390, 2813880, 3519228, 3646909, 3830438, 4071247, 4388580, 5245594, 5163107, 5164211, 5417933, 5325044, 6406447, 7361878, 8048338, 9142782, 11391876, 12814862, 14042843, 14128863, 14968539, 16890651, 17838299, 19836992, 22083044, 25230276, 27033241, 31010389, 36566301, 42414712, 51037433, 58998059, 67758417, 77782127, 85938681, 90706362, 95147343, 97240244, 92380249, 84418447, 78423642, 71128707, 64719643, 57121991]
3148E7121991n813470l736153l720255l818609k877908k809187k344368k791983
3140B9210058k827981k062934j492488j989083j099946j677106j384607q60785
3132A5815128j745340p15840j120665n24163j266047o89012l50911r29748l44306
3123H129096M15430j14005M32734p64771p78255j040220M17689o61461o58666
3114E377571K95850p36900m67175J17346O21377m33726j21623J79884q39384q49291
3104C143929L37357o92727j60078O00781r8450J95592j166498J37683R6510m79967
3094A914132P4357N11654k98882j80642m13099J001419m89379K67596k25963j24664
3084B036529O6810n28572q3925J86294M14961O26803j44157m74903n57783J201994
$$ y = [57121991, 51308521, 47572368, 43852113, 40033504, 37155596, 34346409, 32002041, 29210058, 26382077, 24319143, 22826655, 20837572, 19737626, 18060520, 16675913, 15815128, 14069788, 13353948, 12233283, 11709120, 10443073, 9754061, 9403150, 8473402, 8129096, 8544526, 8430521, 8863255, 8098484, 7320229, 6280009, 6697698, 6036237, 5377571, 5673421, 4936521, 4469346, 4586692, 5208069, 4774343, 4652720, 4832604, 3993220, 3143929, 3481286, 2788559, 2628481, 3229262, 3130812, 3326404, 2159906, 2297589, 2394099, 1914132, 1988489, 2500143, 2201261, 2020619, 1607520, 2608939, 2119560, 2387156, 2161193, 2036529, 2103339, 1574767, 1490842, 1677136, 2092097, 2718900, 2574743, 2099840, 1542057, 2744051]
3074B744051J18021r22498P10274l34279j082722l72365J118161j240736p06717
3065C1190O54124N58770j70219L55939r41854q55292R148J755151L25810m01187
3055A321580j98406J15399L12412o32577j94634M2155j83482k43377m27283J177161
3045A088948K74233j546825R26276K86130o9491J13314o89496m05235L84413q76599
3035e14332m86709Q17491O50220N45158o58307j72935J415432K26364o90483L39253
3025A471152J19142o1590K17151j136190k34597N90772q54760m32927J287106
3016I65259J37886j68247m09620O49820n03766p25392r2617O56945j39454p06778
3006c35964J16980k99635o6778L45379M60628n22594M06994k46794k45637M66403
$$ y = [2744051, 2862072, 1939574, 2649848, 2315569, 1232847, 860482, 1978643, 737907, 31190, 685314, 1244084, 1073865, 1429804, 487950, -367342, -358194, 1396957, 1722767, 1321580, 1123174, 1238573, 1550985, 918408, 723774, 765929, 582447, 339070, -88213, 1088948, 1363181, -183644, 742632, 1028762, 959271, 1072585, 383089, -22146, 362267, -514332, -1001041, -183550, 466670, 1011828, 353521, 180586, 1596018, 1822382, 1131899, 1471152, 1590294, 1528704, 1745855, 609665, 375068, 965840, 111080, -321847, 965259, 1103145, 934898, 525278, 1175098, 671332, -54060, -146677, 510268, 370814, -335964, -218984, -518619, -585397, -240018, 220610, -301984, 105010, -141784, -387421, 78982]
2996G8982J22737m31595q16158L21560J311945Q76171q74728o94697O48759k83041
2986B59935l9344r35579j11450L20980K72384L78975O2722l28169Q78553o53214
2976A05793K04104M15343o70148p12481p27112o97687O59569J294364L17500J49329
2966C38574M1370M55147k45148p48661j307771L85469J316869N0724k21604K19945
2956B84914n64225P867L76693Q07064J91176k00483p96536p85313O31034k52852
2946c00661J1137P59911j099099L27380N66004L11936l46106j113584M50794n82743
2936a015031R556m16244J25032J461345m37073P2065N04193M35589k77641q31490
2926c69699M33488N31701q86414j007611J169457J130721J31657q47238j26949
$$ y = [78982, 201719, -229876, -1046034, -724474, 587471, 1463642, 588914, -105783, 542976, 259935, 220591, -714988, -826438, -505458, -233074, 145901, 208623, -119546, 759007, 105793, 309897, 725240, 55092, -657389, -1384501, -2082188, -1422619, -128255, 189245, 338574, 379944, 835091, 589943, -158718, -1466489, -1081020, 235849, 286573, 64969, 284914, -279311, -271444, 105249, 912313, 1103489, 903006, 106470, -678843, -47809, -300661, -289524, 470387, -628712, -301332, 264672, 576608, 230502, -883082, -432288, -1015031, -1005475, -1421719, -1296687, 164658, -272415, -200350, 303843, 739432, 461791, -369699, 63789, 595490, -290924, -1298535, -129078, 1001643, 1133300, 286062, 159113]
2917A59113o69660N03408L22881j026409n58414J48073M98424j01110l31997R48475
2907a07216j19940m63791J156884J2443K11756q54896p64872R73965J148914n5712
2897A137535P320j233579n07972P12199l57410J13373R34181m68197J64546J46761
2887F48757p28393K62155J16678m69186j8727O61752N25733N58512n35864m76568
2877E44849J87697J09880m9520j24031M95728K8251p74445O76481J74480n59015
2867G10355j25079j30580J01940P63360l87018r74558J54861K24427K00046J12314
2857F50068m14746p48972J481120k20623n73862P5565j06094n81743J74989k50711
2847e15009L38507M05020p90666n6920n39577L54126N78638m18001l77780J655296
$$ y = [159113, -510547, -7139, 315742, -710667, -1269081, -1121008, -622584, -723694, -1055691, -107216, -227156, -690947, 465937, 478380, 690136, -164760, -929632, 44333, 1193247, 1137535, 1144855, -88724, -596696, 115503, -241907, -128534, 805647, 337450, 501996, 648757, -79636, 182519, 299197, -169989, -188716, 473036, 998769, 1557281, 1021417, 544849, 732546, 842426, 792906, 668875, 1164603, 1192854, 418409, 1094890, 1269370, 710355, 585276, 454696, 556636, 1319996, 932978, -41580, 113281, 337708, 537754, 650068, 235322, -513650, 967470, 746847, 172985, 248550, 142456, -439287, -264298, -515009, -176502, 228518, -562148, -619068, -1158645, -804519, -225881, -643882, -1021662, 633634]
2837F33634L27476j187229n19255P94648J055351o6149K51387M98990j067993
2828G20860j03896P38281p24336k9334P49139l62909p52463M048K41755O55209
2818A136354M83554p40088q75005m87888K90172L60611k81139M32461n42033o40910
2808h63911N75508k0234Q55986j6774o7780j29646j24235j350794J88840L2437
2798i20603p1127N34293Q3419M68865N8920j20489O3683J51958o17653o34235
2788a002969K91038P90403n41857o19333M57275q62996J03083l34135J836177
2779A16686k2241q61704P86044J76766L33591j189917N93241O7466J133411k62402
2769H70941j020613j5093N757r80977J040653L90598L59125m39850K56922L03097
$$ y = [633634, 961110, -226119, -745374, 49274, 1104625, 1038476, 1289863, 1788853, 720860, 616964, 1355245, 630909, 601575, 1350714, 987805, 235342, 239390, 481145, 1136354, 1619908, 879820, 4815, -483073, -192901, 167710, -113429, 319032, -223001, -863911, -288403, -308637, 547349, 530575, 462795, 333149, 208914, -1141880, -953040, -920603, -991730, -457437, -374018, 94847, 153767, 33278, 96961, 248919, -368734, -1002969, -711931, 78472, -463385, -1082718, -625443, -1488439, -1385356, -1719491, 116686, 94445, -767259, 18785, 195551, 529142, -660775, -67534, -68, 1133343, 870941, -149672, -164765, -159008, -1139985, -99332, 291266, 650391, 210541, 467463, 770560]
2759G70560j301056q61974R75005Q72216l0538j007888p16875K93164Q73199p0485
2749b04672r69726j36013N11802J32838n14782J329087j77814J39852n75938R4465
2739c70901J030575j125500j20577J036481p84719j381647J53928J48046k28158
2730a642472k93107M94948M09782n56834J47300J261115Q30803J95848J49605
2721I96988q83195l8837L24139K76563p83813q19448N24761O66859N24207K05935
2711I94159o99686j783736J540330p5435l69981L09596l99127l63897j11526O19632
2701c39671O66093l33448K17426M70350j9699k69857k85659M32535j117770M62567
2691a17133L04618L08456o53589j121692P99690j49200j33825Q54367l14241O87586
$$ y = [770560, -530496, -1392470, -417465, 454751, 424213, -583675, -1300550, -1007386, -134187, -204672, -1174398, -1310411, -798609, -665771, -1180553, 148534, -29280, 110572, -465366, -370901, 659674, -465826, -586403, 450078, -334641, -1716288, -1562360, -1414314, -1642472, -1935579, -1440631, -1030849, -1587683, -1440383, -179268, 651535, 847383, 996988, 113793, 74956, 399095, 675658, -108155, -927603, -402842, 264017, 788224, 994159, 294473, -1489263, 51067, -24368, -394349, -84753, -483880, -847777, -959303, -339671, 326422, -7026, 210400, 680750, 661051, 391194, 105535, 538070, -579700, -117133, 187485, 495941, -157648, -1279340, -479650, -628850, -762675, 91692, -222549, 465037]
2681D65037N6799p45784N85236j84855j110927k5558o63729Q01003Q08009J62593
2671A47824m26367p48883R71535J184928l08921l87461p85014R61910q86956m02399
2661f79804L10196J39299o53255l51564M93275o10165J269740M4982o76003J19826
2651e93473M18077j016560M81913Q14231N16582m75304o74230Q77357k40739k71779
2641a63925r34008k40360N33145J38543L78200o20302l53017J94466O9829o08351
2631a605780P46647p8973R48973J228057o99458q79129o90407R6674k7956j31798
2621a093150R59481J57604L30460k53047l25056m48058N78131M31999k19247k52015
2611a32898j146279M49281k9016l82694p17507J090687J161651r37733j076252
$$ y = [465037, 521836, -223948, 361288, 176433, -934494, -960052, -1623781, -822778, -14769, 147824, -278543, -1027426, -55891, 1129037, 820116, 432655, -352359, 609551, -277405, -679804, -369608, -230309, -883564, -1235128, -741853, -1352018, -82278, -37296, -713299, -593473, -175396, -1191956, -710043, 104188, 620770, 145466, -528764, 348593, 107854, -163925, -1097933, -1338293, -805148, -666605, -288405, -908707, -1261724, -1067258, -997429, -1605780, -859133, -938106, 10867, 1238924, 539466, -339663, -1030070, -933396, -961352, -1093150, -133669, 23935, 354395, 101348, -223708, -671766, -93635, 338364, 119117, -132898, -1279177, -829896, -858912, -1241606, -1959113, -868426, 293225, -644508, -1720760]
2602a720760J322887J025304k58633m56896o48637N18777J070496n31270j050359
2593g29091j119195l82242J136315J168845n31759n37656M44906r5081j86683
2584h31641P04768m14980J047022N92416r18886q80657r93642L01110L42775R35021
2574a16694q79947j20666J007734O48151N64405P45283j644818p80632J322626
2565G45442m59192q31511P96914j33789q36192K49246j14091m9060M08569j69012
2555c92676M95466j066564m25562N16655m22520L08051k50949K28511M89781j091829
2545a611636N61490N78335o39447j62542P40845N53295K37703J08112Q7908j30613
2535C23450k83516J81035K49821k16159R7022l56668o7905k50538l87952M31360
$$ y = [-1720760, -397873, 627431, 368798, -88098, -736735, -217958, 852538, 321268, -729091, -1848286, -2230528, -1094213, 74632, -457127, -994783, -549877, -644958, -831641, -126873, -541853, 505169, 1097585, 178699, -701958, -1695600, -1394490, -1051715, -116694, -996641, -1117307, -109573, 538578, 1102983, 1848266, 203448, -577184, 745442, 286250, -545261, 251653, 117864, -718328, -469082, -583173, -632233, -223664, -392676, 102790, -963774, -1389336, -872681, -1295201, -987150, -1238099, -1009588, -519807, -1611636, -1050146, -471811, -1111258, -1273800, -532955, 20340, 258043, 366155, 454063, 323450, 39934, 220969, 470790, 254631, 351653, -5015, -72920, -323458, -711410, -280050]
2525b80050n79218L43069K92482O04066j41368L43810p96629q14528P31139N4502
2515b42725L56775M96293j75598o82197j99453n71287M33265o49513o53496L58161
2505a529775O06845P33272k0106k95286m92464J224163R94430k074211K85978
2496e67154K124518n87261j684914l11168N18436J39644K85262m93359K25932
2487c50064J35055k89893p1246R05127K97467M05138k53087j39226j09315p51374
2477b21418R40519M6335j105631j50263N85524L7756o10M99682K13906Q15773
2467A661573k55170M65943m37808q61750K81187J01673k21430K24972m28873j6732
2457E13585l26467J86622m80492K91424j40571j49663L82850k12835l72865L98578
$$ y = [-280050, -859268, -516199, -223717, 380349, 238981, 582791, -213838, -1028366, -297227, -242725, 114050, 610343, 434745, -247452, -446905, -1018192, -584927, -1234440, -1887936, -1529775, -922930, -189658, -209764, -505050, -997514, 226649, 1221079, -853132, -567154, 1557364, 970103, -714811, -1025979, -507543, -367899, -82637, -575996, -350064, -215009, -504902, -576148, 328979, 626446, 1031584, 778497, 639271, 529956, -221418, 719101, 765436, -340195, -490458, 95066, 132822, 132212, 631894, 845800, 1661573, 1406403, 1872346, 1434538, 572788, 853975, 955648, 734218, 959190, 530317, 513585, 187118, 373740, -106752, 184672, 44101, -105562, 277288, 64453, -308412, 90166]
2447I0166P3969k039036K3650N35064L70206P43642m04589N1726j25068R0644
2437e89626O59098l91295P97559j054145l00717P02171j0342m82091K0566j100687
2427a749509L90120N99852L75461L83654j197184m97031N07406J077242q4037
2418a94026l97158M85478J18749n36005k67803Q73182L8986q90030P3186J085788
2408C90347M7039j020704K55579n42608J342215N05513q30968j91855n5136m59921
2398e60499j28845J392393k49139m37473j033744K62441P62701r31166J010171
2389H6840O12831p94909N64511j08405l32239o2475m91940P35647O1687j290433
2379a018885R77561L93570M66451K51951q88158q93741K46209Q53379k5391j112406
$$ y = [90166, 164135, -1874901, -1851251, -1316187, -945981, -202339, -606928, -555202, -680270, -589626, 69472, -321823, 475736, -578409, -879126, -176955, -187297, -669388, -648822, -1749509, -1359389, -759537, -384076, -422, -1197606, -1694637, -1187231, -109989, -194026, -591184, -105706, 13043, -522962, -790765, 82417, 121403, -768627, -695441, 390347, 437386, -583318, -327739, -870347, 471868, 977381, 146413, -45442, -100578, -560499, -689344, 703049, 453910, 16437, -1017307, -754866, 7835, -923331, 86840, 699671, -95238, 469273, 360868, 28629, -33846, -525786, 209861, 271548, -1018885, -41324, 352246, 818697, 1070648, 182490, -711251, -465042, 388337, 362946, -749460]
2369g49460k80060l27005j33141N69337K44609L41108K00541o39204L96246j20526
2359d97555J96055K95493m02420j83270o56464K70512M83451M32825L06876m1403
2349B04100p931P98736R4633o08610j61748n73109r31551R43411K86377n42615
2339d98307L57269l66471M79373k2466L38192J073531j540796j56676n9689J19522
2329b76518J505231m20189m65539l83152n46944O27853n8962P028j45524Q08952
2319F52236J16177j024863r25583J20053K88614L31567r1484L46008P99302o2445
2309E49582m04330R18036j56325o07644o89358R31873K72844r39407j172K31274
2299A05373J33007L62162L42303j40986l37208j380385M58346J144473p90536
$$ y = [-749460, -1029520, -1356525, -1489666, -920329, -675720, -334612, -134071, -773275, -377029, -497555, -301500, -6007, -408427, -591697, -1248161, -977649, -494198, -61373, 245503, 204100, 196169, 994905, 1089538, 480928, 319180, -253929, -1185480, -242069, 44308, -498307, -141038, -507509, -28136, -50602, 287590, 1361121, -179675, -336351, -396040, -276518, 1228713, 808524, 342985, -40167, -587111, 40742, -18220, -11192, -156716, 652236, 768413, -256450, -1182033, -1061980, -773366, -441799, -533283, -187275, 612027, 549582, 145252, 1063288, 906963, 299319, -390039, 541834, 814678, -124729, -125901, 105373, 238380, 600542, 942845, 801859, 464651, -915734, -457388, 687085, -103451]
2290a03451j118770M58600N52339J34143L11109L27246n02806Q34655j38406r83019
2280b28360n92457J86586J343866j481050l91902K24114j70941N57213j85347
2271g38278N22521L16736m77735J78807J025379q23659l89102N62778j4810K22031
2261C84668k25314k4822q49203N8308R22247j029247L09240O17905J095597j218886
2251D0493k68764k25201M9730J95072k00125J16925N10788n69100M73517L57827
2241D81162j64599n76392j43532O82964K51511m25608k4135M4381N96241L5835
2231G57828o24625N43928j187490l84296O4596P07055k33182k12977P44150j11576
2221F3411j130991J043673j28312p32485J081114L66317l35767r8483l83972P62745
$$ y = [-103451, -1222221, -763621, -211282, -77139, 233970, 561216, 58410, 893065, 754659, -228360, -820817, -634231, 709635, -771415, -1163317, -939203, -1110144, -552931, -738278, -215757, 100979, -376756, -197949, 827430, 3771, -385331, 177447, 162637, 384668, 159354, 134532, -714671, -656363, 265884, -763363, -454123, 163782, 1259379, 40493, -228271, -453472, -403742, -208670, -408795, -291870, 218918, -350182, 123335, 481162, 316563, -259829, -403361, 279603, 531114, 105506, 81371, 125752, 721993, 757828, 133203, 677131, -510359, -894655, -830059, -123004, -356186, -569163, 174987, 63411, -1067580, -23907, -152219, -884704, 196410, 562727, 226960, 128477, -255495, 507250]
2211E07250m75610K31412O4624R62015J09588k57464n46059L6324o80848j096267
2201a145035j10875K6183M59894J540302K63727j301389o64879K95729L19536
2192c16807O488N18868J8569M29405K28111k15740N9310n50171j248396l41414
2182a411777P17630J13383j098592M12712P9793K70993J106690J413899l24771
2173A279960l74445P86900p01499p08898K24148p92155K40770M37637j46933o34371
2163c88886N66001J58252q52840m52458L16213J231648o81047o31606j90996K35501
2153f90218Q7391K97992K33072r89172O74039L21172K90911M85028q82733J82679
2143A0161R59469k45606l42907m04871p40775J12843M29628Q34163j12642n64206
$$ y = [507250, 31640, 263052, 327676, 1289691, 1399279, 1141815, 595756, 632080, -48768, -1145035, -1255910, -1229727, -769833, 770469, 1034196, -267193, -932072, -636343, -316807, -310319, 208549, 227118, 656523, 884634, 668894, 728204, 178033, -1070363, -1411777, -694147, -580764, -1679356, -1266644, -1186851, -915858, 190832, 1604731, 1279960, 905515, 1692415, 990916, 282018, 506166, -285989, -45219, 392418, 245485, -388886, 177115, 335367, -517473, -969931, -653718, 577930, -103117, -734723, -925719, -690218, -602827, -304835, -71763, -1060935, -386896, -65724, 225187, 710215, -172518, 10161, 969630, 724024, 381117, -23754, -764529, -651686, -222058, 612105, 499463, -64743]
2133f4743k28907K05875j23806n47013R85375L33016J9475n26161r28294M92915
2123c82268L73368l20700N12345O84185q59878k65776L65637k2858J56395Q1612
2113C22062o04163r04936j72867O09673J269114K85861q19043p93299L42008m21277
2103h86867K13413O40419L04881p25371k54324r3316J056541O86726k49747l77385
2093C14970m14251M72254m99318K36352N01233q58251J61788J50604k04418p9884
2083b18921O03141J87724m55082J53286q22845l93349m0291n6048q3266L93732
2073g31919J39600M1372n10365m38781M07419J225324M69160m04897l58258J403647
2063A242302l09717p11154J75387j7564K21394m81350m1427j24729K47453J50000
$$ y = [-64743, -293650, -87775, -211581, -758594, 226781, 559797, 579272, 53111, -875183, -382268, -8900, -329600, 182745, 866930, 7052, -258724, 106913, 84055, 240450, 322062, -282101, -1187037, -1359904, -750231, 518883, 804744, -14299, -807598, -465590, -886867, -673454, -33035, 271846, -453525, -707849, -801165, 255376, 942102, 692355, 314970, -99281, 372973, -126345, 110007, 611240, -247011, -85223, 65381, -139037, -218921, 384220, 571944, 116862, 270148, -552697, -946046, -986337, -1042385, -1125651, -731919, -592319, -550947, -1061312, -1500093, -1092674, 132650, 601810, 196913, -161345, 1242302, 932585, 221431, 396818, 379254, 600648, 119298, 77871, -46858, 200595, 350595]
2053C50595k49224k94356o36601K04812N34579K67821J38126M80529l97852k49397
2043A49032K99815k95585r05573m62729N97896K03368J431682j25956m91387O2608
2033D63171n10583O29849j47432n79616j034438R10964Q24244M57496o56813j189746
2023h32904l5293P27293J694727L24235j287423o07430K82225q44919M63348J601374
2013A485233M47436q15337l85602m9528o24268J67234o4975O28009r98077K73490
2003F3615J32746k1421N08208j36904o00418l84461Q11040M1826p36283J44166
1993a77886k5564q83818N03661M60801l13966O66678N28265o93458L92757Q0790
1983E38260k45185l09648k06634l30409M94338l05222L58126J32735j2036j03697
$$ y = [350595, 101371, -192985, -829586, -624774, -90195, 177626, 315752, 796281, 398429, 149032, 448847, 153262, -752311, -1215040, -617144, -413776, 1017906, 891950, 400563, 463171, -47412, 582437, 435005, -144611, -1179049, -268085, 556159, 1013655, 356842, -832904, -868197, -140904, 1553823, 1878058, 590635, -16795, 265430, -579489, -116141, 1485233, 1932669, 1117332, 731730, 682202, 57934, 225168, 160193, 788202, -209875, 63615, 196361, 174940, 683148, 546244, -54174, -438635, 372405, 414231, -322052, -177886, -203450, -1087268, -583607, -122806, -436772, 229906, 758171, 64713, 457470, 538260, 293075, -16573, -223207, -553616, -59278, -364500, -6374, 126361, 114325, 10628]
1973A0628J30896N86611j481444j221277N79435P83489R43947n68623N76891L64077
1963G04630o17842M37381M7681M1263j71525N55595m43769j358949J265819k30771
1953B29513N64626j95637j257478J40754P00050o436r22997P17775l43900M55297
1943H1567j52279L09362k45813m19721J541543o68099r43600P40483j36650K27782
1933C34575k06373j461068O79695R48811k90321L46213L18916M60896K69268j410085
1923i473N80958Q9466j126320j796o88258l16574K13299O41379M4725J96253M25676
1912D9335j12847P7147O29276K04999k63072J29368n94664n81908K80389J09902
1902g2075l76415J57692m36743K9742o22306J030238M25579m33435o67649P90481
$$ y = [10628, 141524, 728135, -753309, -1974586, -1395151, -611662, 332285, -236338, 340553, 704630, 86788, 524169, 571850, 613113, 441588, 997183, 553414, -805535, 460284, 229513, 794139, 598502, -658976, -518222, 181828, 175392, -747605, -29830, -373730, 81567, -70712, 238650, -7163, -426884, 1114659, 446560, -497040, 243443, 106793, 334575, 128202, -1332866, -653171, 295640, 5319, 351532, 670448, 1131344, 1400612, -9473, 571485, 660951, -465369, -467165, -1155423, -1471997, -1258698, -617319, -572594, -376341, 49335, -63512, 13635, 642911, 847910, 584838, 714206, 119542, -462366, -181977, -72075, -448490, -290798, -727541, -697799, -1320105, -289867, 135712, -297723, -965372, -174891]
1892a74891P19899o60100N43499k53855N08808p11706j46065m55245K03424N68469
1882A42237n8990k35407j8246l59410J09810J076460o86373J23040Q12271q37612
1872F7780l33249Q53378l77614j477703k942N00613L85808J55254N52687l82784
1862e8772M22138l94539p55320N36646J34792j62504k73886Q0692O69059N52823
1852G51129J0669j213136n92526N79378J139733J71780l49288o25686m59336L74804
1842b12479J4553O92624j339914n45966P73901M51328N06709j149266o40754J553950
1832A04686M4095p88637o14278J028989J19014Q896J00095q65848Q98924J14533
1822A50469O15654l08381R92444j120357O55624k94226l80298L91363o58150K12034
$$ y = [-174891, 545008, -115092, 428407, 174552, 683360, -28346, -174411, -629656, -426232, 142237, 83247, -152160, -170406, -529816, -420006, 656454, -29919, 93121, 905392, 67780, -265469, 587909, 210295, -1267408, -1270350, -769737, -383929, -228675, 324012, -58772, 363366, -31173, -786493, -249847, -115055, -277559, -551445, -470753, 198306, 751129, 761798, -451338, -1043864, -464486, 675247, 847027, 497739, -127947, -587283, -212479, -197926, 494698, -845216, -1391182, -617281, -165953, 340756, -808510, -1449264, 104686, 148781, -639856, -1254134, -225145, -106131, -97235, 2860, -862988, 35936, 150469, 766123, 457742, 1450186, 329829, 985453, 691227, 310929, 702292, 44142, 256176]
1812B56176k42729m60454k72363J213571M51101m3170J4519p55710O972J116702
1802A284615j605345K58184k48892m01710M76807l73393k93047O23025M70202
1793A90446n2149o51393j16959L55102J70182J23918n6308K58108N60150j5821
1783G65276m48612r21425M08767L14762K64863o69234m7892L55495m87786K05820
1773b59966J79767q04708J169633K07490k74922q95887K73882O26238k32478M25730
1763D14779K72442k38484p19809N74961o40346k82041O65628n08430j0736J097404
1753F25368k46688J74930m403R42717j150407j532025P02973k00659K54907j53830
1743e87117p09843O08161J339245J36253j245999N47574J06342l22400m09477
$$ y = [256176, 13447, -447007, -719370, 494201, 945302, 902132, 916651, 160941, 167913, 1284615, -320730, -62546, -311438, -713148, -236341, -609734, -902781, -279756, 190446, 138297, -513096, -630055, -274953, -104771, 19147, -37161, 220947, 781097, 765276, 316664, -604761, -195994, 118768, 383631, -285603, -333495, 22000, -465786, -259966, -80199, -884907, 284726, 492216, 217294, -678593, -404711, 221527, -10951, 414779, 687221, 448737, -271072, 303889, -336457, -618498, 47130, -461300, -472036, 625368, 378680, 553610, 549207, 1491924, 341517, -1190508, -487535, -688194, -433287, -587117, -1296960, -688799, 650446, 786699, -459300, 88274, 194616, -127784, -537261]
1734e37261P37464K10622R52786j202845o46285J086371q31230O45355N20508
1725I35485L29527o39705l54806n82582N49555N36286O36350M8098l40266l92980
1715G24962q96005l56226j81660L09060P18260m8395p4944K02792L91796k63452
1705E26188p50523J39130n21154L34272j35599J340824o18042m40769L05119P41114
1695I20560P5351q36426j578508l16475L97247o2879K80213j13200N31427J140138
1685D37448N56316j67157j55309o6187j231923q99235J127615j73609j13349O81344
1675d046L85275m62756j42670L03122p54571K2427j13160Q8907O80026l77625
1665c75071L622M20300L53112P29472j37333l01097P2353k8890p19403j22731
$$ y = [-537261, 200203, 410825, 1363611, 160766, -485519, 600852, -230378, 414977, 935485, 1265012, 625307, 270501, -312081, 237474, 773760, 1410110, 1458208, 1117942, 724962, -171043, -527269, -708929, -399869, 318391, 269996, 195052, 397844, 789640, 526188, -224335, -85205, -606359, -272087, -407686, 933138, 315096, -125673, 179446, 920560, 995911, 159485, -1419023, -1735498, -1338251, -1401130, -1120917, -1234117, -702690, 437448, 993764, 826607, 671298, 605111, -626812, -1526047, -398432, -572041, -685390, -4046, 381229, -81527, -224197, 78925, -675646, -653219, -766379, -677472, 2554, -375071, -371449, 48851, 401963, 1131435, 994102, 693005, 765358, 736468, 17065, -105666]
1655a05666q44763p69784J433869l71681K19978j20667M07420J8222J294750m90772
1645F70906o70857L60545J49252J55129k13694P2976m41387j508512L43193N81145
1635e01304K7216j070147R13041Q69571R10820m42534o1845p18108q38072n2058
1625i63420P14475N38486k97948k71178r4608M33236M70762O27329j6377K44878
1615A385635q53001J01471m66063l6073J046231q70564J61659n76378l08785J410233
1605I94365q96987J64835P8881j90085j195459M93237M34353m57325Q64664L93844
1595F84323r32011n6294p43358j08455M89262J018558o3486O51494K21893p21691
1585D40235l36711N11650m00314k6418K94043P694j12678l95431n75975O66018
$$ y = [-105666, -950429, -1720213, -286344, -658025, -438047, -558714, -151294, -133072, 1161678, 670906, 49, 360594, 509846, 664975, 451281, 524257, 82870, -1425642, -1082449, -501304, -474088, -1544235, -631194, 238377, 1149197, 706663, 644818, -73290, -911362, -963420, -248945, 289541, -8407, -279585, -374193, 59043, 529805, 1157134, 1140757, 1385635, 532634, 634105, 168042, 131969, 1178200, 307636, 469295, -107083, -415868, 994365, 97378, 262213, 341094, 151009, -1044450, -551213, -116860, -574185, 290479, 684323, -247688, -303982, -1047340, -1155795, -666533, 352025, 288539, 940033, 1161926, 440235, 103524, 615174, 214860, 188442, 482485, 490179, 377501, -17930, -593905, 72113]
1575G2113j390380j33004J113098J592042r8715j893606j21446J411768L4135
1566E86005n49822J56541k0613l96961r0636Q22242j43033L01615k81431K63633
1556F47540k28568n08303M6424k5447m09835l8641O92224K85676k40408m0933
1546A79729N90854K06187l2575K45439j568821R0268P18182l11155j84851o65765
1536g32508N8175N27441j57081P22663m61888j49734L99520r27278k30232J476503
1526E25581m50966O8444J588905j082302o90129N36826q58003k45900N55064O61383
1516F08903J17973k08716j33806l98007L4055n22260m1161k29149l61156Q46673
1506b86651J058997L46280k72561q53489O18299J154330p11256j022880l6348
$$ y = [72113, -1318267, -1451271, -338173, 1253869, 1155154, -738452, -859898, 551870, 586005, 36183, 192724, 172111, -224850, -315486, 506756, 363723, 665338, 383907, 647540, 418972, -89331, -42907, -68354, -478189, -516830, 175394, 461070, 220662, 179729, 770583, 976770, 944195, 1189634, -379187, -288919, 429263, 118108, -66743, -732508, -674333, -146892, -303973, 418690, -43198, -192932, 206588, -720690, -950922, 525581, 74615, 143059, 1731964, 649662, -40467, 496359, -361644, -607544, -52480, 608903, 726876, 518160, 384354, -13653, 20402, -501858, -543019, -772168, -1133324, -286651, 772346, 1118626, 846065, -7424, 610875, 1765205, 1053949, 31069, -5279]
1497e279L46219N12945j95438m02340K93660J38766L16177j299552n01181M58859
1487c37164m6949m53842P05127q3569N6965J198359n12609q52187P36964L97760
1477H08855k83909r2253N68001j787695K84446K55438j1088L24874J1036p076
$$ y = [-5279, 340940, 853885, 658447, 256107, 549767, 688533, 1004710, -294842, -796023, -337164, -384113, -837955, -132828, -216397, -159432, 1038927, 526318, -325869, 411095, 808855, 524946, 432693, 1000694, -787001, -502555, -247117, -258205, 66669, 77705, 70629]
$$ [...]
##END NTUPLES=NMR SPECTRUM
##END=
