##TITLE=1H_EC-3356
 200.13MHz, CDCl3,
 8 sc
 
 11.8.2025
##JCAMPDX= 6.0         $$ Bruker NMR JCAMP-DX V2.0
##DATA TYPE= NMR SPECTRUM
##DATA CLASS= NTUPLES
##ORIGIN= UXNMR, Bruker Analytische Messtechnik GmbH
##OWNER= pz
$$ XWIN-NMR		Version 3.5
$$ Mon Aug 11 14:12:08 2025 Russian Standard Time (UT+4h)  she@DPX200
##.OBSERVE FREQUENCY= 200.1313
##.OBSERVE NUCLEUS= ^1H
##.ACQUISITION MODE= SIMULTANEOUS
##.ACQUISITION SCHEME= undefined
##.AVERAGES= 8
##.DIGITISER RES= 18
##SPECTROMETER/DATA SYSTEM= spect
##.PULSE SEQUENCE= zg30
##.SOLVENT NAME= CDCl3
##.SHIFT REFERENCE= (INTERNAL, CDCl3, 0, 15.4428)
##AUDIT TRAIL= $$ (NUMBER, WHEN, WHO, WHERE, WHAT)
$$ ##TITLE= Audit trail, XWIN-NMR		Version 3.5
$$ ##JCAMPDX= 5.01
$$ ##ORIGIN= Bruker BioSpin GmbH
$$ ##OWNER= she
$$ F:/spectra/data/she/nmr/H-C/1/pdata/1/auditp.txt
$$ ##AUDIT TRAIL=  $$ (NUMBER, WHEN, WHO, WHERE, WHAT)
(   1,<2025-08-11 14:11:02.17 +0400>,<she>,<DPX200>,
      <created by zg, POWCHK disabled, PULCHK disabled
       configuration hash MD5:
       00 E9 B6 7A A2 85 ED C7 34 08 36 98 17 FE 4E 26
       data hash MD5: 16K
       86 C1 BD 0E 98 8C C1 19 60 13 D1 F1 73 8C B2 C8>)
(   2,<2025-08-11 14:11:04.37 +0400>,<she>,<DPX200>,
      <Start of raw data processing
       efp BC_mod = 2 LB = 0.25 FT_mod = 6 PKNL = 1 PHC0 = -1556.703 PHC1 = 8.39229 SI = 16K 
       data hash MD5: 16K
       FD E7 D1 9A C7 82 B9 3F FC A8 12 72 26 3F 3F CC>)
(   3,<2025-08-11 14:11:19.59 +0400>,<she>,<DPX200>,
      <pk PHC0 = -8.721024 PHC1 = 10.6 
       data hash MD5: 16K
       FA 35 8B 6D 67 73 F8 9B 0F 62 E5 52 7C 4B 36 AD>)
(   4,<2025-08-11 14:11:23.82 +0400>,<she>,<DPX200>,
      <abs ABSG = 5 
       data hash MD5: 16K
       47 B4 C1 DF 85 5A DA 9E 14 6D 3C 63 B8 D4 97 1C>)
$$ ##END=
$$ 
$$ hash MD5
$$ 4E 49 7D 0F F9 80 B1 8B 9B DE B8 33 26 0C 73 6A
##$RELAX= 
##$RELAX= 
##$RELAX= 
##$RELAX= 
##$RELAX= 
##$RELAX= 
$$ Bruker specific parameters
$$ --------------------------
##$DU= <F:/spectra>
##$EXPNO= 1
##$NAME= <H-C>
##$PROCNO= 1
##$TYPE= <nmr>
##$USER= <she>
##$AMP= (0..31)
100 100 100 100 100 100 100 100 100 100 100 100 100 100 100 100 100 100 
100 100 100 100 100 100 100 100 100 100 100 100 100 100 
##$AQSEQ= 0
##$AQ_mod= 1
##$AUNM= <au_zg>
##$AUTOPOS= <>
##$BF1= 200.13
##$BF2= 200.13
##$BF3= 200.13
##$BF4= 200.13
##$BF5= 200.13
##$BF6= 200.13
##$BF7= 200.13
##$BF8= 200.13
##$BYTORDA= 1
##$CFDGTYP= 0
##$CFRGTYP= 5
##$CHEMSTR= <none>
##$CNST= (0..31)
1 1 145 1 1 1 1 1 1 1 1 1 1 1 1 1 1 1 1 1 1 1 1 1 1 1 1 1 1 1 1 1 
##$CPDPRG= <>
##$CPDPRG1= <>
##$CPDPRG2= <>
##$CPDPRG3= <>
##$CPDPRG4= <mlev>
##$CPDPRG5= <mlev>
##$CPDPRG6= <mlev>
##$CPDPRG7= <mlev>
##$CPDPRG8= <mlev>
##$CPDPRGB= <>
##$CPDPRGT= <>
##$D= (0..31)
0 0.7 0 0 0 0 0 0 0 0 0 0.03 0 0 0 0 0 0 0 0 0 0 0 0 0 0 0 0 0 0 0 0 
##$DATE= 1754907061
##$DBL= (0..7)
120 120 120 120 120 120 120 120 
##$DBP= (0..7)
150 150 150 150 150 150 150 150 
##$DBP07= 0
##$DBPNAM0= <>
##$DBPNAM1= <>
##$DBPNAM2= <>
##$DBPNAM3= <>
##$DBPNAM4= <>
$$ [...]
##$SUBNAM3= <"">
##$SUBNAM4= <"">
##$SUBNAM5= <"">
##$SUBNAM6= <"">
##$SUBNAM7= <"">
##$SUBNAM8= <"">
##$SUBNAM9= <"">
##$SW= 18.0517328524113
##$SWIBOX= (0..15)
0 0 2 0 0 0 0 0 0 0 0 0 0 0 0 0 
##$SW_h= 3612.71676300578
##$TD= 16384
##$TD0= 1
##$TE= 0
##$TE2= 300
##$TE3= 300
##$TEG= 300
##$TL= (0..7)
0 120 120 120 120 120 120 120 
##$TP= (0..7)
150 150 150 150 150 150 150 150 
##$TP07= 0
##$TPNAME0= <>
##$TPNAME1= <>
##$TPNAME2= <>
##$TPNAME3= <>
##$TPNAME4= <>
##$TPNAME5= <>
##$TPNAME6= <>
##$TPNAME7= <>
##$TPOAL= (0..7)
0.5 0.5 0.5 0.5 0.5 0.5 0.5 0.5 
##$TPOFFS= (0..7)
0 0 0 0 0 0 0 0 
##$TUNHIN= 0
##$TUNHOUT= 0
##$TUNXOUT= 0
##$USERA1= <user>
##$USERA2= <user>
##$USERA3= <user>
##$USERA4= <user>
##$USERA5= <user>
##$V9= 5
##$VALIST= <valist>
##$VCLIST= <CCCCCCCCCCCCCCC>
##$VD= 0
##$VDLIST= <DDDDDDDDDDDDDDD>
##$VPLIST= <PPPPPPPPPPPPPPP>
##$VTLIST= <TTTTTTTTTTTTTTT>
##$WBST= 1024
##$WBSW= 4
##$XGAIN= (0..3)
0 0 0 0 
##$XL= 0
##$YL= 0
##$YMAX_a= 343091
##$YMIN_a= -396197
##$ZGOPTNS= <>
##$ZL1= 120
##$ZL2= 120
##$ZL3= 120
##$ZL4= 120
##$ABSF1= 15.50229
##$ABSF2= -2.54956
##$ABSG= 5
##$ABSL= 3
##$ALPHA= 0
##$AQORDER= 0
##$ASSFAC= 0
##$ASSFACI= 0
##$ASSFACX= 0
##$ASSWID= 0
##$AUNMP= <proc_1d>
##$AZFE= 0.1
##$AZFW= 0.1
##$BCFW= 0
##$BC_mod= 2
##$BYTORDP= 0
##$COROFFS= 0
##$CY= -3
##$DATMOD= 1
##$DC= 0
##$DFILT= <>
##$DTYPP= 0
##$F1P= 0
##$F2P= 0
##$FCOR= 1
##$FTSIZE= 16384
##$FT_mod= 6
##$GAMMA= 0
##$GB= 0
##$INTBC= 1
##$INTSCL= 3.241238e-09
##$ISEN= 128
##$LB= 0.25
##$LEV0= 0
##$LPBIN= 0
##$MAXI= 10000
##$MC2= 0
##$MEAN= 0
##$ME_mod= 0
##$MI= 1.114404
##$NCOEF= 0
##$NC_proc= -6
##$NLEV= 6
##$NOISF1= 3.799351
##$NOISF2= 2.8
##$NSP= 0
##$NTH_PI= 0
##$NZP= 0
##$OFFSET= 15.44279
##$PC= 1
##$PHC0= -1565.424
##$PHC1= 18.99229
##$PH_mod= 1
##$PKNL= yes
##$PPARMOD= 0
##$PSCAL= 0
##$PSIGN= 0
##$REVERSE= no
##$SF= 200.13001579119
##$SI= 16384
##$SIGF1= 3
##$SIGF2= 2
##$SINO= 0.751879
##$SIOLD= 32768
##$SREGLST= <19F.Aceton>
##$SSB= 0
##$STSI= 16384
##$STSR= 0
##$SW_p= 3612.71676300578
##$SYMM= 0
##$S_DEV= 0
##$TDeff= 16384
##$TDoff= 0
##$TI= <>
##$TILT= no
##$TM1= 0
##$TM2= 0
##$TOPLEV= 0
##$USERP1= <user>
##$USERP2= <user>
##$USERP3= <user>
##$USERP4= <user>
##$USERP5= <user>
##$WDW= 1
##$XDIM= 16384
##$YMAX_p= 439207652
##$YMIN_p= -444292
$$ End of Bruker specific parameters
$$ ---------------------------------
##NTUPLES= NMR SPECTRUM
##VAR_NAME=  FREQUENCY,     SPECTRUM/REAL,   SPECTRUM/IMAG
##SYMBOL=    X,             R,               I
##VAR_TYPE=  INDEPENDENT,   DEPENDENT,       DEPENDENT
##VAR_FORM=  AFFN,          ASDF,            ASDF
##VAR_DIM=   16384,         16384,           16384
##UNITS=     HZ,            ARBITRARY UNITS, ARBITRARY UNITS
##FACTOR=    0.220516191357247, 1,           1
##FIRST=     3090.56581285074, 0,            0
##LAST=      -522.150950155041, 0,           0
##MIN=       -522.150950155041, -444292,     0
##MAX=       3090.56581285074, 439207652,    0
$$ Real data points
##PAGE= N=1
##DATA TABLE= (X++(R..R)), XYDATA
$$ [...]
$$ plain form
7250 -62627 -66901 -179844 -79919 -43151 -125407 11106 -24129 -16388 52048 155415 167883 40648
7238 40648 -165687 -178091 -89034 -124013 -11831 -131367 -237038 -171015 -157968 -157458 -274693
7227 -274693 -80262 -106987 -97732 88851 88392 -149404 -228092 -224103 -118040 -82636 -93651 -109945
7215 -109945 -41815 -65416 -60736 -233639 -282128 -120336 -3096 -7792 -72240 -158190 -155936 -62149
7203 -62149 -179815 -117847 -125360 -184273 -55572 -64521 -93786 -66976 -33735 120875 65681 21833
7191 21833 -19757 19212 124061 158395 -94994 -164682 -47816 -234056 -57435 -92865 -88040
7180 -88040 -133112 -138421 -72929 56777 -55893 -73064 -64643 -94158 7013 72947 51020 135499
7168 135499 154520 -11583 -133916 -44553 45861 -58618 7552 45192 49811 53103 115035
$$ packed form
7250f2627m274j12943R9925L6768q2256J36513l5235P741O8436J03367J2468j27235
7238D0648k06335j2404Q9057l4979J12182j19536j05671O6023J3047N10j17235
7227b74693J94431k6725R255J86583m59k37796p8688L989J06063L5404j1015j6294
7215a09945O8130k3601M680j72903m8489J61792J17240m696o4448q5950K254R3787
7203f2149j17666O1968p513n8913J28701q949k9265K6810L3241J54610n5194m3848
7191B1833m1590L8969J04849L4334k53389o9688J16866j86240J76621l5430M825
7180h8040m5072n309O5492J29706j12670j7171Q421k9515J01171O5934k1927Q4479
7168A35499J9021j66103j22333Q9363R0414j04479O6170L7640M619L292O1932
$$ plain form
7157 115035 10268 6956 -22683 49931 -7609 148929 -9942 -98848 -49579 -60930 -56751
7146 -56751 9673 -17551 -196154 -158413 4932 27657 -52582 -165758 -172081 -192770 -161722
7135 -161722 -43126 -91424 -82773 -128853 -120451 -80608 -215933 -294291 -176649 -107295 -165202
7124 -165202 -217896 -273158 -225119 -178395 -206817 -140737 -61562 13786 -132233 66677 149533
7113 149533 163462 98196 48057 18340 -18759 -126392 -252268 -171923 -131506 -64572 -87821
7102 -87821 -100256 -38495 -24940 -13136 17626 42251 12608 -62735 -101155 59193 55992 -13502
7090 -13502 -2537 -81230 39059 84003 152573 98367 40887 -58415 -134433 -226230 -188367 -134441
7078 -134441 -111392 11676 -51554 -63892 194966 34065 -16710 -10450 84566 -14910 -92106
$$ packed form
7157A15035j04767l312k9639P2614n7540J56538j58871q8906M9269j1351M179
7146e6751O6424k7224j78603L7741J63345K2725q0239j13176o323k0689L1048
7135a61722J18596m8298Q651m6080Q402L9843j35325p8358J17642O9354n7907
7124a65202n2694n5262M8039M6724k8422O6080P9175P5348j46019J98910Q2856
7113A49533J3929o5266n0139k9717l7099j07633j25876Q0345M0417O6934k3249
7102h7821j2435O1761J3555J1804L0762K4625k9643p5343l8420J60348l201o9494
7090a3502J0965p8693J20289M4944O8570n4206n7480r9302p6018r1797L7863N3926
7078a34441K3049J23068o3230j2338K58858j60901n0775O260R5016r9476p7196
$$ plain form
7067 -92106 -191844 -112132 -144583 -28940 102234 -403 -1770 104316 80629 -46733 40364
7056 40364 29818 83929 157207 66977 79696 108134 142471 281910 79390 71875 53629 205787
7044 205787 110922 101716 120039 20253 37945 113827 219231 282584 530552 423608 295549
7033 295549 363321 397613 230980 124688 142906 232753 211021 195229 214312 166748 103313
7022 103313 92454 135392 205017 295739 254031 392359 327776 448119 413002 281724 255616
7011 255616 368834 435343 337182 157183 214714 244711 316445 157146 175351 188145 121297
7000 121297 84981 99467 117702 173671 171303 221689 194408 126192 108384 172596 294564 272661
6988 272661 344830 356535 215729 287204 300422 93629 -6645 274797 389001 161943
$$ packed form
7067i2106r9738P9712l2451J15643J31174j02637j367J06086k3687j27362Q7097
7056D0364j0546N4111P3278r0230J2719K8438L4337J39439k02520p515j8246J52158
7044B05787r4865r206J8323r9786J7692P5882J05404O3353K47968j06944j28059
7033B95549O7772L4292j66633j06292J8218Q9847k1732j5792J9083m7564o3435
7022A03313j0859M2938O9625R0722m1708J38328o4583J20343l5117j31278k6108
7011B55616J13218O6509r8161j79999N7531K9997P1734j59299J8205J2794o6848
7000A21297l6316J4486J8235N5969k368N0386k7281o8216j7808O4212J21968k1903
6988B72661P2169J1705j40806P1475J3218k06793j00274K81442J14204k27058
$$ plain form
6978 161943 121712 113599 223700 152526 117101 134942 233650 197794 102670 282570 305133
6967 305133 199848 376310 530455 534168 525605 336669 219700 221008 327179 410077 374971
6956 374971 333522 352383 299627 322667 282693 159298 241942 356707 289210 122958 328224
6945 328224 613064 495270 374591 365164 214131 345183 304367 381066 236229 365088
6935 365088 359326 334736 288406 229850 282003 314509 313693 385848 493598 699542 789321 736204
6923 736204 831541 839099 906250 1228514 1177789 1297217 1595413 1421360 1399343 1387452 1227425
6912 1227425 1136638 1120579 1142387 1109998 908999 778590 744263 745800 682209 699607 810635
6901 810635 782469 603394 502259 520273 492536 485269 527611 416418 449734 434827 367992
$$ packed form
6978A61943m0231q113J10101p1174l5425J7841R8708l5856r5124J79900K2563
6967C05133j05285J76462J54145L713q563j88936j16969J308J06171Q2898l5106
6956C74971m1449J8861n2756K3040l9974j23395Q2644J14765o7497j66252K05266
6945C28224K84840j17794j20679r427j51033J31052m0816P6699j44837J28859
6935C65088n762k4590m6330n8556N2153L2506q16P2155J07750K05944Q9779n3117
6923G36204R5337P558O7151L22264n0725J19428K98196j74053k2017j1891j60027
6912A227425r0787j6059K1808l2389k00999j30409l4327J537o3591J7398J11028
6901H10635k8166j79075j01135J8014k7737p267M2342j11193L3316j4907o6835
$$ plain form
6890 367992 410840 537399 515877 460729 394118 393801 494609 527414 637729 510734 345940
6879 345940 351885 343841 386618 380192 347944 319221 403144 391461 290714 412758 374113 392041
6867 392041 353983 390810 436485 410068 389758 441353 375427 517173 601595 439127 363333
6856 363333 253503 294509 302859 420653 531601 582541 275758 229596 335359 350886 285368
6845 285368 304864 504620 477836 467094 336407 268549 382507 329366 185103 182707 182467
6834 182467 165051 192500 270502 417832 471426 340019 350998 387659 401639 332008 265202
6823 265202 296290 186238 396483 437178 361882 421117 381146 298117 402736 342786 570809
6812 570809 656244 529483 692801 864466 676481 467613 353820 383504 551932 634219
$$ packed form
6890C67992M2848J26559k1522n5148o6611l17J00808L2805J10315j26995j64794
6879C45940N945q044M2777o426l2248k8723Q3923j1683j00747J22044l8645J7928
6867C92041l8058L6827M5675k6417k0310N1595o5926J41746Q4422j62468p5794
6856C63333j09830M1006Q350J17794J10948N0940l06783m6162J05763J5527o5518
6845B85368J9496J99756k6784j0742j30687o7858J13958n3141j44263k396k40
6834A82467j7416K7449P8002J47330N3594j31407J0979L6661J3980o9631o6806
6823B65202L1088j10052K10245M0695p5296N9235l9971q3029J04619n9950K28023
6812E70809Q5435j26761J63318J71665j87985k08868j13793K9684J68428Q2287
$$ plain form
6802 634219 637131 591036 473633 491202 509450 532412 574505 663953 590046 674946 850925
6791 850925 749355 653229 650535 516391 527523 519867 564692 824302 801380 698897 732929
6780 732929 590427 485549 495401 380235 392505 484183 507031 493197 489297 292727 225593
6769 225593 256425 394055 563564 477081 350039 269245 211923 230489 259079 118385 212550
6758 212550 348518 525023 566881 595199 627757 360801 319334 393590 487395 470311 478912
6747 478912 456065 482511 530159 589844 550452 603689 345141 498617 443929 405655 266869
6736 266869 320021 335745 298912 382542 397168 397525 385128 382332 455259 349672 454164 611293
6724 611293 627961 529585 391855 423331 543969 670618 695340 695655 516188 468209 549389
$$ packed form
6802F34219K912m6095j17403J7569J8248K2962M2093Q9448p3907Q4900J75979
6791H50925j01570r6126k694j34144J1132p656M4825K59610k2922j02483L4032
6780G32929j42502j04878R852j15166J2270R1678K2848j3834l900j96570o7134
6769B25593L0832J37630J69509q6483j27042q0794n7322J8566K8590j40694R4165
6758B12550J35968J76505M1858K8318L2558k66956m1467P4256R3805j7084Q601
6747D78912k2847K6446M7648N9685l9392N3237k58548J53476n4688l8274j38786
6736B66869N3152J5724l6833Q3630J4626L57j2397k796P2927j05587J04492J57129
6724F11293J6668r8376j37730L1476J20638J26649K4722L15j79467m7979Q1180
$$ plain form
6713 549389 639502 694837 746510 862246 915394 781100 701293 663485 673343 747827 676534
6702 676534 684417 816375 726292 665472 542354 773707 914489 894930 1065265 1022366 927506
6691 927506 927822 872937 933001 1071261 1183176 1092081 985236 1126008 1257641 1073143 1086279
6680 1086279 1373443 1387200 1394248 1417164 1468242 1574695 1549023 1509888 1554838 1677686 1817385
6669 1817385 1950064 1874028 1792502 1761396 1799677 1795394 1960810 2014529 1928971 2123795 2238835
6658 2238835 2163262 2195636 2303340 2325044 2393402 2514716 2309863 2463919 2536599 2525375 2572751
6647 2572751 2693232 2687641 2570418 2472464 2504351 2513735 2577658 2852318 3021275 3075620 2992746
6636 2992746 2969639 2906608 3004413 3079263 3079908 3069940 3052646 3328728 3494361 3535789 3456352 3511115
$$ packed form
6713E49389R0113N5335N1673J15736N3148j34294p9807l7808R858P4484p1293
6702F76534P883J31958r0083o0820j23118K31353J40782j9559J70335m2899r4860
6691I27506L16n4885O0064J38260J11915r1095j06845J40772J31633j84498J3136
6680A086279K87164J3757P048K2916N1078J06453k5672l9135M4950J22848J39699
6669A817385J32679p6036q1526l1106L8281m283J65416N3719q5558J94824J15040
6658B238835p5573L2374J07704K1704O8358J21314k04853J54056P2680j1224M7376
6647B572751J20481n591j17223r7954L1887R384O3923K74660J68957N4345q2874
6636B992746k3107o3031R7805P4850O45r968j7294K76082J65633M1428p9437N4763
$$ plain form
6624 3511115 3468006 3526244 3526288 3365687 3374403 3425161 3452504 3431834 3510191 3522447 3492785 3471954
6612 3471954 3594189 3610062 3780848 3766091 3916582 3913818 3648890 3851994 3860676 3791455 3826533
6601 3826533 3923366 3957551 4098884 4065935 3981644 4015531 3935767 3887571 3885980 3906321 3801292
6590 3801292 3816143 3990726 4249276 4359122 4367427 4484891 4464789 4462174 4710922 4840974 5003706
6579 5003706 5086141 5196542 5520702 5820857 6187059 6493876 6644042 6796282 6920085 6943832
6569 6943832 6771099 6486044 6344384 6159221 5921785 5844404 5907767 6124837 6182891 6308309
6559 6308309 6456448 6581914 6733249 6690270 6467498 6388240 5893890 5626030 5268726 4951559
6549 4951559 4878307 4628907 4354002 4241949 4034714 3755799 3841266 3764421 3679721 3742056
$$ packed form
6624C511115m3109N8238M4j60601Q716N0758K7343k0670P8357J2256k9662k0831
6612C471954J22235J5873J70786j4757J50491k764k64928K03104Q682o9221L5078
6601C826533R6833L4185J41333l2949q4291L3887p9764m8196j591K0341j05029
6590C801292J4851J74583K58550J09846Q305J17464k0102k615K48748J30052J62732
6579E003706Q2435J10401L24160L00155L66202L06817J50166J52240J23803K3747
6569F943832j72733k85055j41660j85163k37436p7381O3363K17070N8054J25418
6559F308309J48139J25466J51335m2979k22772p9258m94350k67860l57304l17167
6549D951559p3252k49400k74905j12053k07235k78915Q5467p6845q4700O2335
$$ plain form
6539 3742056 3735986 3619938 3623779 3561205 3484063 3635106 3570210 3669869 3661066 3905733 3818509
6528 3818509 3746365 3804895 3839164 3886253 3932676 4197592 4298298 4451021 4527027 4557283 4576650
6517 4576650 4741006 4842341 4926485 5203063 5503458 5786593 6037593 6115706 6400179 6733434
6507 6733434 7232836 7665658 8284635 8822780 9461103 10050710 10666897 10911682 11077883 11209405
6497 11209405 11005454 10929591 10717208 10380353 10170322 10244875 10464722 10519624 10835203 11361885
6487 11361885 11670496 12012204 12161648 12317011 12168381 11835524 11240181 10764767 10329587
6478 10329587 9896538 9681605 9502811 9272584 9034880 8810171 8552643 8443860 8229961
6469 8229961 8174787 8151966 8153949 7967240 7974686 7849266 7805784 7891994 7981100 7940437 7874038
$$ packed form
6539C742056o070j16048L841o2574p7142J51043o4896R9659q803K44667q7224
6528C818509p2144N8530L4269M7089M6423K64916J00706J52723P6006L0256J9367
6517D576650J64356J01335Q4144K76578L00395K83135K51000P8113K84473L33255
6507F733434M99402M32822O18977N38145O38323N89607O16187K44785J66201J31522
6497A1209405k03951p5863k12383l36855k10031P4553K19847N4902L15579N26682
6487A1361885L08611L41708J49444J55363j48630l32857n95343m75414m35180
6478A0329587m33049k14933j78794k30227k37704k24709k57528j08783k13899
6469H229961n5174k2821J983j86709P446j25420m3482Q6210Q9106m0663o6399
$$ plain form
6458 7874038 7755117 7651115 7651018 7697064 7774543 7637345 7528075 7506306 7364092 7409389 7604118
6447 7604118 7561157 7505662 7414962 7544865 7556667 7442472 7355886 7486093 7625252 7819178
6437 7819178 7907038 7820004 7937882 7987407 8132053 8244942 8265320 8203881 8249856 8540613 8658331
6426 8658331 8671676 8660214 8744743 8951441 9143998 9331257 9516624 9551071 9718220 10011785
6416 10011785 10199096 10442748 10587069 10895840 11149015 11279896 11486495 11730157 11762843 11708476
6406 11708476 11843362 12107140 12051022 12165326 12325953 12301104 12100310 11995504 12051618 12124558
6396 12124558 12239957 12243917 12168451 12201772 12226248 12041900 12116658 12342305 12378322 12422762 12741728
6385 12741728 12776368 13127569 13350405 13579012 13745376 14000854 14223421 14420947 14607020 14917339
$$ packed form
6458G874038j18921j04002r7M6046P7479j37198j09270k1769j42214M5297J94729
6447G604118m2961n5495r0700J29903J1802j14195q6586J30207J39159J93926
6437G819178Q7860q7034J17878M9525J44646J12889K0378o1439M5975K90757J17718
6426H658331J3345j1462Q4529K06698J92557J87259J85367L4447J67149K93565
6416A0011785J87311K43652J44321L08771K53175J30881K06599K43662L2686n4367
6406A1708476J34886K63778n6118J14304J60627k4849k00794j04806N6114P2940
6396A2124558J15399L960p5466L3321K4476j84348P4758K25647L6017M4440L18966
6385A2741728L4640L51201K22836K28607J66364K55478K22567J97526J86073L10319
$$ plain form
6375 14917339 15395504 15610945 15835244 16105143 16358917 16481187 16721221 16815042 16764978 16835943
6365 16835943 16840169 16704866 16857076 17034751 17068652 17072849 17361612 17590769 17806474 18288825
6355 18288825 18715708 19131746 19771013 20412058 20760547 20947006 21128639 21126407 20908657 20724501
6345 20724501 20553897 20649098 20664736 20582026 20650105 20726560 20763135 20945011 21092792 21535494
6335 21535494 21975208 22584076 23279501 23952927 24638232 25203999 25672124 25886000 25807587 25782149
6325 25782149 25509933 25259125 25320631 25217052 25266875 25670823 26083230 26628151 27224765 28034208
6315 28034208 28937844 29891799 30953044 32311275 34021518 35974824 38283434 40759163
6307 40759163 43707725 47004770 50404758 53441940 56499413 58921967 60571484 61543098
$$ packed form
6375A4917339M78165K15441K24299K69899K53774J22270K40034R3821n0064P0965
6365A6835943M226j35303J52210J77675L3901M197K88763K29157K15705M82351
6355A8288825M26883M16038O39267O41045L48489J86459J81633k232k17750j84156
6345B0724501j70604R5201J5638q2710O8079P6455L6575J81876J47781M42702
6335B1535494M39714O08868O95425O73426O85305N65767M68125K13876p8413k5438
6325B5782149k72216k50808O1506j03579M9823M03948M12407N44921N96614Q09443
6315B8034208R03636R53955J061245J358231J710243J953306K308610K475729
6307D0759163K948562L297045L399988L037182L057473K422554J649517R71614
$$ plain form
6299 61543098 62060574 62454218 63184009 64398861 65799541 67259820 68474669 68925565 68823411
6290 68823411 68118250 66855757 65424747 64393803 63705183 63441765 64064837 65026507 66704278
6281 66704278 69062104 71902731 75336614 79148990 83033800 86819909 90123007 92699560
6273 92699560 94021968 94325001 93535866 91540024 88690571 85184841 80948375 76088734
6265 76088734 71453865 67053508 63252588 59977474 57012605 54338352 51828017 49636791
6257 49636791 47393389 45057077 42912534 40879831 38789962 36806797 35211970 33597227
6249 33597227 32125997 31005578 29916558 28718120 27769198 26963426 26183895 25531569 24887244
6240 24887244 24309216 23425662 22812169 22360276 21906979 21439348 20896035 20626966 20294151
$$ packed form
6299F1543098N17476L93644P29791J214852J400680J460279J214849M50896j02154
6290F8823411p05161j262493j431010j030944o88620k63418O23072R61670J677771
6281F6704278K357826K840627L433883L812376L884810L786109L303098K576553
6273I2699560J322408L03033p89135j995842k849453l505730m236466m859641
6265G6088734m634869m400357l800920l275114k964869k674253k510335k191226
6257D9636791k243402k336312k144543k032703k089869j983165j594827j614743
6249C3597227j471230j120419j089020j198438r48922q05772p79531o52326o44325
6240B4887244n78028q83554o13493m51893m53297m67631n43313k69069l32815
$$ plain form
6231 20294151 19941574 19687121 19495406 19262575 19134132 19065268 18994891 18908926 18827270 18480519
6221 18480519 18422579 18155198 17760289 17482811 17269027 17058501 16751646 16507362 16395633 16375914
6211 16375914 16324169 16130695 16136470 16206764 16215647 16359766 16551009 16638368 16825651 16809103 16571192
6200 16571192 16349318 15877179 15599154 15356551 14879166 14653656 14378522 14080037 14010678 13801611
6190 13801611 13915024 13843290 13722920 13729650 13902134 13900068 13965527 14227734 14438632 14736397
6180 14736397 14989551 15273029 15735467 16169709 16353522 16578251 16546772 16562552 16503939 16125625
6170 16125625 15732837 15669712 15533173 15469340 15577436 15685801 15910037 16337563 16890260 17244440
6160 17244440 18047504 18488545 18942611 19319915 19557663 19798007 19848312 19966232 20065234 20080279
$$ packed form
6231B0294151l52577k54453j91715k32831j28443o8864p0377q5965q1656l46751
6221A8480519n7940k67381l94909k77478k13784k10526l06855k44284j11729j9719
6211A6375914n1745j93474N775P0294Q883J44119J91243Q7359J87283j6548k37911
6200A6571192k21874m72139k78025k42603m77385k25510k75134k98485o9359k09067
6190A3801611J13413p1734j20370O730J72484k066O5459K62207K10898K97765
6180A4736397K53154K83478M62438M34242J83813K24729l1479J5780n8613l78314
6170A6125625l92788o3125j36539o3833J08096J08365K24236M27526N52697L54180
6160A7244440Q03064M41041M54066L77304K37748K40344N0305J17920R9002J5045
$$ plain form
6150 20080279 20025988 19922008 19749698 19627115 19347131 19110333 19118697 19011276 18924553 19275266
6140 19275266 19744645 20148130 20850196 21552298 22253303 22975497 23712537 24248738 24353700
6131 24353700 24575268 24690560 24492218 24277814 23839495 23250741 22446451 21948433 21422831
6122 21422831 21110882 20841171 20647939 20614279 20696153 20688542 21081011 21443108 21929346 22417131
6112 22417131 22751680 23068697 23336879 23588751 23768237 23800772 23475956 23246629 22856852 22251574
6102 22251574 21601327 21037028 20418998 19872165 19332147 19002978 18818665 18783346 18629746 18615466
6092 18615466 18735140 18914647 19020971 19075828 18873698 18610578 18173697 17538646 16995531 16463925
6082 16463925 15981935 15560428 15158008 14607496 14061827 13495113 12726101 12256388 11777716
$$ packed form
6150B0080279n4291j03980j72310j22583k79984k36798Q364j07421q6723L50713
6140A9275266M69379M03485P02066P02102P01005P22194P37040N36201J04962
6131B4353700K21568J15292j98342k14404m38319n88754q04290m98018n25602
6122B1422831l11949k69711j93232l3660Q1874p611L92469L62097M86238M87785
6112B2417131L34549L17017K68182K51872J79486L2535l24816k29327l89777o05278
6102B2251574o50247n64299o18030n46833n40018l29169j84313l5319j53600j4280
6092A8615466J19674J79507J06324N4857k02130k63120m36881o35051n43115n31606
6082A6463925m81990m21507m02420n50512n45669n66714p69012m69713m78672
$$ plain form
6073 11777716 11405306 11117538 10850441 10579927 10525935 10522363 10386724 10367928 10224152 9950226
6063 9950226 9838752 9722390 9543028 9151199 8571292 8070631 7723664 7282376 6964574 6704486
6053 6704486 6364299 6202409 6105075 5911015 5736423 5548839 5477119 5286469 5043781 4977580
6043 4977580 4909224 4708656 4534373 4529878 4379800 4409704 4418435 4241814 4217223 4304012 4354501
6032 4354501 4203015 4136044 4152327 4117276 3999975 3948610 3871626 3919314 3798276 3850512 3893687
6021 3893687 3888320 3762894 3766171 3774390 3755015 3687676 3624449 3627434 3597553 3654795 3663575 3717902
6009 3717902 3664093 3583549 3579553 3401531 3534487 3825821 3771807 3771041 3856887 3789030 3609538
5998 3609538 3526811 3567276 3763521 3691857 3529129 3441244 3625889 3645626 3675908 3797352 3777761
$$ packed form
6073A1777716l72410k87768k67097k70514n3992l572j35639j8796j43776k73926
6063I950226j11474j16362j79362l91829n79907n00661l46967m41288l17802k60088
6053F704486l40187j61890r7334j94060j74592j87584p1720j90650k42688o6201
6043D977580o8356k00568j74283m495j50078K9904Q731j76621k4591Q6789N0489
6032D354501j51486o6971J6283l5051j17301n1365p6984M7688j21038N2236M3175
6021C893687n367j25426L277Q219j9375o7339o3227K985k9881N7242Q780N4327
6009C717902n3809q0544l996j78022J32956K91334n4014p66Q5846o7857j79492
5998C609538q2727M0465J96245p1664j62728q7885J84645J9737L0282J21444j9591
$$ plain form
5987 3777761 3782228 3878753 3884489 4002700 4123473 4161912 4121408 4160426 3968619 4037075 4068555
5976 4068555 3943173 3964631 3942638 3949525 3800305 3713629 3810223 3869446 3890709 3763511 3742827
5965 3742827 3817367 3968665 3967798 3795650 3862638 4051249 3937271 3929990 4023428 4020418 3834401
5954 3834401 3866006 3988296 3876501 3739690 3769263 3805426 3813722 3758873 3712975 3797929 3832557
5943 3832557 3851318 3836173 3792944 3724426 3677058 3727260 3696407 3765964 3600628 3722140 3594144
5932 3594144 3520634 3607475 3478664 3439287 3563557 3540403 3625391 3739710 3826997 3728787 3565403
5921 3565403 3614594 3654225 3716163 3520190 3622584 3732069 3763588 3658329 3810402 3672738
5911 3672738 3408067 3449279 3414419 3426417 3378875 3372686 3485684 3510395 3690871 3619062 3509240
$$ packed form
5987C777761M467R6525N736J18211J20773L8439m0504L9018j91807O8456L1480
5976D068555j25382K1458k1993O887j49220q6676R6594N9223K1263j27198k0684
5965C742827P4540J51298q67j72148O6988J88611j13978p281R3438l010j86017
5954C834401L1605J22290j11795j36811K9573L6163Q296n4849m5898Q4954L4628
5943C832557J8761j5145m3229o8518m7368N0202l0853O9557j65336J21512j27996
5932C594144p3510Q6841j28811l9377J24270k3154Q4988J14319Q7287r8210j63384
5921C565403M9191L9631O1938j95973J02394J09485L1519j05259J52073j37664
5911C672738k64671M1212l4860J1998m7542o189J12998K4711J80476p1809j09822
$$ plain form
5900 3509240 3450103 3480297 3403617 3337309 3468531 3474559 3457914 3354939 3333607 3480789 3386433
5889 3386433 3317195 3342340 3333283 3262784 3180885 3237074 3358336 3129365 3118054 3152465 3094800
5878 3094800 3020852 3096371 3100841 3164709 3010936 2995114 3145621 3212037 3318333 3374853 3400350
5867 3400350 3362075 3405992 3329008 3148448 3179171 3214233 3212723 3091159 3140249 3099703 3185123
5856 3185123 3356202 3256295 3247460 3142131 3155746 3074183 3085047 3125315 3167309 3382663 3441851
5845 3441851 3397627 3452051 3480306 3404880 3421875 3670703 3771408 3833116 3964272 4150632 4402842
5834 4402842 4512950 4666460 4793386 4901823 5181118 5380425 5442534 5407767 5337823 5269594
5824 5269594 5317343 5311697 5310035 5525258 5452635 5449997 5512806 5600358 5731662 5776054 5810306 5896662
$$ packed form
5900C509240n9137L0194p6680o6308J31222O028j6645j02975k1332J47182r4356
5889C386433o9238K5145r057p0499q1899N6189J21262k28971j1311L4411n7665
5878C094800p3948P5519M470O3868j53773j5822J50507O6416J06296N6520K5497
5867C400350l8275M3917p6984j80560L0723L5062j510j21564M9090m0546Q5420
5856C185123J71079r9907q835j05329J3615q1563J0864M0268M1994K15354N9188
5845C441851m4224N4424K8255p5426J6995K48828J00705O1708J31156J86360K52210
5834D402842J10108J53510J26926J08437K79295J99307O2109l4767o9944o8229
5824E269594M7749n646j662K15223p2623k638O2809Q7552J31304M4392L4252Q6356
$$ plain form
5812 5896662 6093020 6203702 6447485 6802856 7081448 7310610 7611610 7805012 7916095 8015596
5802 8015596 7962659 8131677 8239361 8072353 8255913 8192001 8001290 7924446 7706688 7603089
5792 7603089 7660792 7518599 7443202 7372676 7352961 7218672 7313478 7522946 7465504 7576684 7683632
5781 7683632 7805899 7722935 7498414 7408159 7360695 7216300 7025742 6714369 6360426 6267714
5771 6267714 6036804 5907501 5722189 5705365 5482835 5348099 5228802 5084791 4936992 4790355
5761 4790355 4780614 4672831 4519139 4647719 4693708 4629139 4611425 4595933 4631068 4671061 4799903
5750 4799903 4964118 5159524 5303844 5510147 5582861 5750622 5801738 5921706 5888012 5767220
5740 5767220 5509993 5438067 5478518 5385423 5297228 5275793 5381332 5412580 5487243 5430230 5486702
$$ packed form
5812E896662J96358J10682K43783L55371K78592K29162L01000J93402J11083R9501
5802H015596n2937J69018J07684j67008J83560o3912j90711p6844k17758j03599
5792G603089N7703j42193p5397p0526j9715j34289R4806K09468n7442J11180J06948
5781G683632J22267q2964k24521r0255m7464j44395j90558l11373l53943r2712
5771F267714k30910j29303j85312j6824k22530j34736j19297j44011j47799j46637
5761D790355r741j07783j53692J28580M5989o4569j7714j5492L5135L9993J28842
5750D799903J64215J95406J44320K06303P2714J67761N1116J19968l3694j20792
5740E767220k57227p1926M0451r3095q8195k1435J05539L1248P4663n7013N6472
$$ plain form
5729 5486702 5560407 5628822 5745850 5804296 5999017 6258398 6510341 6919282 7105663 7401096
5719 7401096 7794326 8469348 8950678 9456900 10286133 11088962 11823550 12289988 12575331 12560217
5709 12560217 12360233 11872671 11175585 10568680 10180934 9687985 9358102 9051357 9021226 9012344
5699 9012344 8838191 8629778 8480125 8600156 8628082 8402476 8580611 8670630 9014299 9004161
5689 9004161 8952512 9228352 9595670 9933045 10344109 11105237 11800972 12463517 13086774 13750989
5679 13750989 13898858 13916458 13451679 12843818 12049073 11190797 10794985 10314504 9895395 9452343
5669 9452343 9087723 8859184 8552027 8245614 8084188 7804106 7666982 7519148 7490896 7453944
5659 7453944 7351465 7356619 7136323 7054976 7149790 7089815 7040562 7133243 7361635 7579024 7808396
$$ packed form
5729E486702P3705O8415J17028N8446J94721K59381K51943M08941J86381K95433
5719G401096L93230O75022M81330N06222Q29233Q02829P34588M66438K85343j5114
5709A2560217j99984m87562o97086o06905l87746m92949l29883l06745l0131q882
5699I012344j74153k08413j49653J20031K7926k25606J78135R0019L43669j0138
5689I004161n1649K75840L67318L37375M11064P61128O95735O62545O23257O64215
5679A3750989J47869J7600m64779o07861p94745q58276l95812m80481m19109m43052
5669I452343l64620k28539l07157l06413j61426k80082j37124j47834k8252l6952
5659G453944j02479N154k20296q1347R4814n9975m9253R2681K28392K17389K29372
$$ plain form
5648 7808396 7917137 7826824 7749242 7543241 7208510 6910731 6507348 6023071 5850378 5765387
5638 5765387 5575977 5377328 5281853 5245368 4941675 4768747 4818804 4904732 4641190 4638304 4538715
5627 4538715 4423879 4433503 4219015 4177435 4194034 4322183 4276208 4243807 4159659 4140635 4158445
5616 4158445 4391608 4346199 4251141 4083847 4031311 4006030 3895482 3904224 3941538 3942201 3825784
5605 3825784 3907823 4111137 4131790 3891861 3950539 3966951 4001324 4115796 4074313 4173307 4162027
5594 4162027 4071759 4202120 4344028 4471983 4286446 4229202 4312846 4483202 4666518 4605666
5584 4605666 4663972 4617304 4705218 4507020 4552401 4613312 4616758 4541896 4570903 4575027 4534953 4761182
5572 4761182 4863082 4645303 4657849 4816141 4673985 4606778 4649722 4615350 4617465 4638863 4549677
$$ packed form
5648G808396J08741r0313p7582k06001l34731k97779m03383m84277j72693q4991
5638E765387j89410j98649r5475l6485l03693j72928N0057Q5928k63542k886r9589
5627D538715j14836R624k14488m1580J6599J28149m5975l2401q4148j9024J7810
5616D158445K33163m5409r5058j67294n2536k5281j10548Q742L7314O63j16417
5605C825784Q2039K03314K0653k39929N8678J6412L4373J14472m1483R8994j1280
5594D162027r0268J30361J41908J27955j85537n7244Q3644J70356J83316o0852
5584D605666N8306m6668Q7914j98198M5381O0911L446p4862K9007M124m0074K26229
5572D761182J01900k17779J2546J58292j42156o7207M2944l4372K115K1398q9186
$$ plain form
5561 4549677 4522381 4371674 4468788 4626857 4523998 4556963 4681940 4730885 4674141 4752364 4873782
5550 4873782 4915806 4875475 4933484 4926363 4938926 4990484 4921414 4966809 5139638 5173076 5127877
5539 5127877 5052642 5015810 5070208 5167146 5267149 5182044 5130769 5021661 5236843 5315391 5271913
5528 5271913 5380633 5469993 5535601 5615511 5706139 5771176 5945651 6059034 6069601 6151626 6490950
5517 6490950 6773471 6992073 7244681 7319852 7556488 7753020 7711884 7606545 7660986 7740367
5507 7740367 7738866 7709304 7828636 7904889 8161617 8250282 8527334 8602469 8697763 9038562 9311726
5496 9311726 9732169 10256816 10755319 11302186 11939131 12566916 13570446 14333212 15248286
5487 15248286 16503972 17857707 19569445 21905631 24541460 27723581 31811199 36479590
$$ packed form
5561D549677k7296j50707R7114J58069j02859L2965J24977M8945n6744P8223J21418
5550D873782M2024m0331N8009p121J2563N1558o9070M5395J72829L3438m5199
5539E127877p5235l6832N4398R6938J00003q5105n1275j09108K15182P8548m3478
5528E271913J08720Q9360O5608P9910R0628O5037J74475J13383J0567Q2025L39324
5517F490950K82521K18602K52608P5171K36636J96532m1136j05339N4441P9381
5507G740367j501k9562J19332P6253K56728Q8665K77052P5135R5294L40799K73164
5496I311726M20443N24647M98503N46867O36945O27785J003530P62766R15074
5487A5248286J255686J353735J711738K336186K635829L182121M087618M668391
$$ plain form
5479 36479590 41226380 45664615 48945930 50141955 50045560 47261578 42371926 37654305
5471 37654305 33578638 30363797 27645163 25411544 23520747 22000653 20562150 19121351
5463 19121351 17870593 16632330 15722052 15082027 14598240 14048159 13409336 12955677 12585273
5454 12585273 12178035 11801895 11330148 10945410 10884396 10536175 10484113 10298038 9973261 9550605
5444 9550605 9369604 9387555 9036264 8834352 8789745 8687813 8528285 8665337 8521814 8266346
5434 8266346 8030188 7724161 7582510 7509877 7402754 7148609 6975148 6911881 6806685 6655600
5424 6655600 6742056 6749379 6679387 6542176 6541242 6490290 6319915 6290841 6171746 6181093 6064438
5413 6064438 5976698 6093680 6177877 6332746 6393172 6420057 6571856 6614669 6630333 6708264 6922150
$$ packed form
5479C6479590M746790M438235L281315J196025r6395k783982m889652m717621
5471C7654305m075667l214841k718634k233619j890797j520094j438503j440799
5463A9121351j250758j238263r10278o40025m83787n50081o38823m53659l70404
5454A2585273m07238l76140m71747l84738o1014l48221n2062j86075l24777m22656
5444I550605j81001J7951l51291k01912m4607j01932j59528J37052j43523k55468
5434H266346k36158l06027j41651p2633j07123k54145j73461o3267j05196j51085
5424F655600Q6456P323o9992j37211r34n0952j70375k9074j19095R347j16655
5413F064438q7740J16982Q4197J54869O0426K6885J51799M2813J5664P7931K13886
$$ plain form
5402 6922150 7093131 7230326 7385960 7491057 7657721 7736339 7843242 7931949 7902609 7845579
5392 7845579 8194883 8435761 8672676 8877995 9091646 9525856 9902755 9862200 10116979 10396776
5382 10396776 10542321 10681572 10708049 10916764 10972986 11039748 11190926 11493079 11657163 11794398
5372 11794398 11959237 12287617 12561281 12638847 12812246 12783164 12741853 12887408 12819304 12867287
5362 12867287 12794655 12486138 12291632 12334877 12226780 12151449 11959472 11736661 11854725 11897540
5352 11897540 12020144 12086574 12131792 11986258 11717578 11460411 11316667 11060544 10807510 10506307
5342 10506307 10027252 9784428 9362638 9125658 9062478 8959404 9067423 8899766 8914308 8793790
5332 8793790 8701330 8727532 8602077 8415269 8150985 7995412 7751997 7570029 7544039 7643379
$$ packed form
5402F922150J70981J37195J55634J05097J66664P8618J06903Q8707k9340n7030
5392G845579L49304K40878K36915K05319K13651M34210L76899m0555K54779K79797
5382A0396776J45545J39251K6477K08715N6222O6762J51178L02153J64084J37235
5372A1794398J64839L28380K73664P7566J73399k9082m1311J45555o8104M7983
5362A2867287p2632l08517j94506M3245j08097p5331j91977k22811J18064M2815
5352A1897540J22604O6430M5218j45534k68680k57167j43744k56123k53034l01203
5342A0506307m79055k42824m21790k36980o3180j03074J08019j67657J4542j20518
5332H793790r2460K6202j25455j86808k64284j55573k43415j81968k5990R9340
$$ plain form
5322 7643379 7392850 7157395 6846563 6783070 6841567 6919455 6968368 6933671 6833519 6785380 6681045
5311 6681045 6781661 6946747 6998224 6886005 6900332 6898298 6932232 6766618 6776355 6712717 6676138
5300 6676138 6564980 6445093 6579256 6533506 6559300 6487781 6403603 6457889 6612313 6574857 6565414
5289 6565414 6361230 6250211 6262444 6393019 6403376 6495050 6386692 6308918 6379472 6448279 6415217
5278 6415217 6412899 6418382 6379977 6446265 6671064 6709363 6655907 6720273 6572334 6464471 6472912
5267 6472912 6465643 6471959 6382689 6413810 6500610 6519415 6544713 6538993 6495041 6691097 6785850 6661728
5255 6661728 6584289 6571599 6730487 6828383 6935532 6855679 6795673 6798409 6813085 6924019 6864142
5244 6864142 6862432 7067557 7016657 6962462 7043732 7007097 6985992 7022368 7159464 7354898 7531799
$$ packed form
5322G643379k50529k35455l10832o3493N8497P7888M8913l4697j00152m8139j04335
5311F681045J00616J65086N1477j12219J4327k034L3934j65614R737o3638l6579
5300F676138j11158j19887J34163m5750K5794p1519q4178N4286J54424l7456r443
5289F565414k04184j11019J2233J30575J0357R1674j08358p7774P0554O8807l3062
5278F415217k318N483l8405O6288K24799L8299n3456O4366j47939j07863Q441
5267F472912p269O316q9270L1121Q6800J8805K5298n720m3952J96056R4753j24122
5255F661728p7439j2690J58888R7896J07149p9853o0006K736J4676J10934n9877
5244F864142j710K05125n0900n4195Q1270l6635k1105L6376J37096J95434J76901
$$ plain form
5233 7531799 7588292 7561628 7435436 7371097 7413946 7470746 7383107 7242379 7279957 7370618 7353145
5222 7353145 7317799 7327819 7527217 7569780 7375433 7370042 7372498 7333564 7367198 7382875 7393411
5211 7393411 7371962 7404071 7316074 7528666 7669413 7720736 7750824 7749689 7860501 7927537 7932385
5200 7932385 7811361 7814908 7760110 7784177 7759417 7941765 8049445 8050479 7935430 7847338 7927515
5189 7927515 7971218 8064893 8246770 8300021 8283518 8174415 8294461 8342354 8349034 8385931 8463815
5178 8463815 8529543 8465274 8640655 8703591 8623673 8575258 8614018 8657344 8687287 8684198 8757298
5167 8757298 8783992 9051131 9041340 9062913 9187898 9119628 9175530 9309379 9553153 9606986 9789928
5156 9789928 10073524 10293331 10608752 10720481 10989715 11123749 11134273 11263883 11521820 11562099
$$ packed form
5233G531799N6493k6664j26192o4339M2849N6800q7639j40728L7578R0661j7473
5222G353145l5346J0020J99398M2563j94347n391K456l8934L3634J5677J0536
5211G393411k1449L2109q7997K12592J40747N1323L0088j135J10812O7036M848
5200G932385j21024L547n4798K4067k4760J82348J07680J034j15049q8092Q0177
5189G927515M3703R3675J81877N3251j6503j09103J20046M7893O680L6897P7884
5178H463815O5728o4269J75381O2936p9918m8415L8760M3326K9943l089P3100
5167H757298K6694K67139r791K1573J24985o8270N5902J33849K43774N3833J82942
5156I789928K83596K19807L15421J11729K69234J34034J0524J29610K57937M0279
$$ plain form
5146 11562099 11389231 11269499 11220154 11069315 10975923 10858764 10689245 10728444 10622886 10640191
5136 10640191 10766143 10764121 10627939 10702266 10769144 10636013 10513074 10615419 10820248 10856337
5126 10856337 10885024 10922126 10854769 10985857 11038775 11179886 11253104 11361737 11566089 11525177
5116 11525177 11489726 11564143 11704329 11805475 12086708 12133805 12180754 12290979 12278156 12423247
5106 12423247 12589388 12685307 12654555 12971129 13179214 13365810 13527010 13772352 14222094 14661605
5096 14661605 15145722 15645328 16215602 16879595 17602812 18045123 18494830 18836488 19091039
5087 19091039 19167882 19323902 19445029 19616637 19841688 19831750 19856512 19788144 19870699 19553846
5077 19553846 19406304 19536730 19519938 19210940 19022975 19056743 19003762 19079474 19168203 19157504
$$ packed form
5146A1562099j72868j19732m9345j50839r3392j17159j69519L9199j05558J7305
5136A0640191J25952k022j36182P4327O6878j33131j22939J02345K04829L6089
5126A0856337K8687L7102o7357J31088N2918J41111P3218J08633K04352m0912
5116A1525177l5451P4417J40186J01146K81233M7097M6949J10225j2823J45091
5106A2423247J66141R5919l0752L16574K08085J86596J61200K45342M49742M39511
5096A4661605M84117M99606N70274O63993P23217M42311M49707L41658K54551
5087A9091039P6843J56020J21127J71608K25051r938K4762o8368Q2555l16853
5077A9553846j47542J30426j6792l08998j87965L3768n2981P5712Q8729j0699
$$ plain form
5067 19157504 19395592 19416097 19544525 19675133 19904341 19770431 19669424 19537745 19011193 18469931
5057 18469931 18086826 17943964 17586953 17234529 16988001 16603843 16280383 16085183 15656763
5048 15656763 15484982 15392014 15326440 15217550 14994922 14777983 14745351 14628327 14622038 14626763 14747945
5037 14747945 14822907 14916557 14960209 14899335 14957875 15088097 15142214 14977050 14854769 14796662 14669194
5026 14669194 14669545 14746369 14721864 14738318 14852142 14854380 15068024 15128963 15181500 15216045 15414531
5015 15414531 15604141 15773782 15840177 15964510 16140063 16492449 16771814 16955582 17151560 17363579
5005 17363579 17425325 17705788 17983803 18342243 18789080 19183110 19812032 20439378 21180065 21993692
4995 21993692 22844307 23612621 24538319 25532158 26411966 27575022 28864839 30452252 32263843
$$ packed form
5067A9157504K38088K0505J28428J30608K29208j33910j01007j31679n26552n41262
5057A8469931l83105j42862l57011l52424k46528l84158l23460j95200m28420
5048A5656763j71781r2968o5574j08890k22628k16939l2632j17024o289M725J21182
5037A4747945P4962R3650M3652o0874N8540J30222N4117j65164j22281n8107j27468
5026A4669194L51P6824k4505J6454J13824K238K13644O0939N2537L4545J98486
5015A5414531J89610J69641O6395J24333J75553L52386K79365J83768J95978K12019
5005A7363579O1746K80463K78015L58440M46837L94030O28922O27346P40687Q13627
4995B1993692Q50615P68314R25698R93839Q79808J163056J289817J587413J811591
$$ plain form
4986 32263843 34657595 38143626 42188100 47010036 52536944 57913894 62822747 66627922
4978 66627922 68513381 67754645 65111812 61109153 56367319 52528328 49532385 47229404
4970 47229404 45525227 44196300 42611489 41030869 39510187 37780378 35929825 34602822
4962 34602822 33472643 32586706 31966729 31517866 31316555 31223437 31174661 31258022 31504451 31895124
4952 31895124 32310852 33002551 33454367 34041188 34560390 35072426 35546678 35887958 36212274
4943 36212274 36318520 36667662 37125309 37617752 38168502 39064014 40274419 41504656 42786123
4934 42786123 44474633 46369309 48305010 50888570 53926345 57217840 60836490 64770633
4926 64770633 68983063 73098846 76253776 78747769 80005360 78579180 75311424 71621985
$$ packed form
4986C2263843K393752L486031M044474M821936N526908N376950M908853L805175
4978F6627922J885459p58736k642833m002659m741834l838991k995943k302981
4970D7229404j704177j328927j584811j580620j520682j729809j850553j327003
4962C4602822j130179q85937o19977m48863k01311r3118m8776Q3361K46429L90673
4952C1895124M15728O91699M51816N86821N19202N12036M74252L41280L24316
4943C6212274J06246L49142M57647M92443N50750Q95512J210405J230237J281467
4934D2786123J688510J894676J935701K583560L037775L291495L618650L934143
4926F4770633M212430M115783L154930K493993J257591j426180l267756l689439
$$ plain form
4918 71621985 66659094 61231336 56672230 52930774 50084335 47706260 45536837 43381261
4910 43381261 41574063 39838757 38390008 36865356 35273259 33956739 32861213 32167924
4902 32167924 31323734 30574030 30134147 29726279 29411658 29235099 29243081 28982927 28737412 28523544
4892 28523544 28105796 27707871 27235656 26524795 25764071 25139150 24466425 24050453 23747935
4883 23747935 23573676 23377706 23510669 23604692 23748141 24229347 25021267 25665257 26176920 26560550
4873 26560550 26663371 26520365 26046001 25568856 25012492 24109404 23197100 22288608 21435483
4864 21435483 20767802 20248254 19791386 19328102 19242489 18991928 19017302 19186349 19439342 19700689
4854 19700689 19808836 19741335 19596707 19348866 18906067 18125281 17515298 16866789 16399946 15954253
$$ packed form
4918G1621985m962891n427758m559106l741456k846439k378075k169423k155576
4910D3381261j807198j735306j448749j524652j592097j316520j095526o93289
4902C2167924q44190p49704m39883m07868l14621j76559P982k60154k45515k13868
4892B8523544m17748l97925m72215p10861p60724o24921o72725m15972l02518
4883B3747935j74259j95970J32963R4023J43449M81206P91920O43990N11663L83630
4873B6560550J02821j43006m74364m77145n56364r03088r12304r08492q53125
4864B1435483o67681n19548m56868m63284q5613k50561K5374J69047K52993K61347
4854A9700689J08147o7501j44628k47841m42799p80786o09983o48509m66843m45693
$$ plain form
4844 15954253 15495310 15138176 14801720 14529255 14349800 13978838 13716877 13782216 13618620 13274430
4834 13274430 13115949 13191860 13224787 13118356 13022091 13098220 13152224 13423550 13596565 13481524
4824 13481524 13214528 12978965 12726311 12296600 11913231 11495261 11366045 10912420 10428560
4815 10428560 9951288 9770251 9574720 9418284 9417338 9333105 9229233 8860347 8682163 8479258
4805 8479258 8473096 8465180 8370655 8342831 8185872 8150519 8126520 8053903 7993772 8015933 7829751
4794 7829751 7515169 7620520 7514711 7410774 7358121 7405528 7403242 7173935 7257232 7442234
4784 7442234 7405158 7151076 7112691 7138198 7143795 6954901 6873590 6909079 6964160 6831988 6746693
4773 6746693 6694233 6704403 6777026 6675451 6558125 6549976 6585259 6530669 6471624 6348546 6427215
$$ packed form
4844A5954253m58943l57134l36456k72465j79455l70962k61961O5339j63596l44190
4834A3274430j58481P5911L2927j06431r6265P6129N4004K71326J73015j15041
4824A3481524k66996k35563k52654m29711l83369m17970j29216m53625m83860
4815A0428560m77272j81037j95531j56436r46q4233j03872l68886j78184k02905
4805H479258o162p916r4525k7824j56959l5353k3999p2617o0131K2161j86182
4794G829751l14582J05351j05809j03937n2653M7407k286k29307Q3297J85002
4784G442234l7076k54082l8385K5507N597j88894q1311L5489N5081j32172q5295
4773F746693n2460J0170P2623j01575j17326q149L5283n4590n9045j23078P8669
$$ plain form
4762 6427215 6192575 6063746 6017440 6086737 6042935 6032521 6170884 6126041 6087204 6012784 5791363
4751 5791363 5949408 5756994 5755738 5801276 5769198 5678624 5710259 5580583 5680606 5769065 5792444
4740 5792444 5806194 5583099 5672251 5611947 5605620 5445618 5542497 5603407 5577747 5733748 5601337
4729 5601337 5557538 5548658 5479037 5408181 5271476 5380093 5281285 5220763 5275055 5330817 5329751
4718 5329751 5354739 5463965 5473589 5525262 5478892 5423395 5218785 5163528 5067049 5210826 5317702
4707 5317702 5471115 5434093 5366754 5434031 5461441 5555148 5517650 5505576 5487909 5520241 5559390
4696 5559390 5641040 5735741 5756996 5805722 5850843 5893753 6063247 6121597 6248388 6415478 6718418
4685 6718418 6891091 7026794 7200536 7655100 7945992 8491491 9240821 9846299 10472728 11177441
$$ packed form
4762F427215k34640j28829m6306O9297m3802j0414J38363m4843l8837p4420k21421
4751E791363J58045j92414j256M5538l2078r0574L1635j29676J00023Q8459K3379
4740E792444J3750k23095Q9152o0304o327j60002R6879O0910k5660J56001j32411
4729E601337m3799q880o9621p0856j36705J08617r8808o0522N4292N5762j066
4718E329751K4988J09226R624N1673m6370n5497k04610n5257r6479J43777J06876
4707E317702J53413l7022o7339O7277K7410R3707l7498j2074j7667L2332L9149
4696E559390Q1650R4701K1255M8726M5121M2910J69494N8350J26791J67090L02940
4685F718418J72673J35703J73742M54564K90892N45499P49330O05478O26429P04713
$$ plain form
4675 11177441 11504232 11685117 11895028 11882014 11753194 11716141 11601200 11736796 12156436 12522305
4665 12522305 13017511 13389208 13696212 13744900 13677429 13574283 13146677 13044161 13136824 13172705
4655 13172705 13350071 13480637 13679797 13650556 13471500 13220878 12890483 12672160 12517427 12610877
4645 12610877 12772462 13165744 13389530 13615673 13855303 14009243 13967146 13808009 13677314 13670936
4635 13670936 13856188 14079548 14400515 14721321 14994054 15502071 15983127 16660764 17275098
4626 17275098 17993377 18702481 19331188 19697975 19644082 19379749 18621231 17803003 16890815 16068718
4616 16068718 15112653 14255481 13398119 13036014 12525520 11979656 11622918 11250420 11043212
4607 11043212 10796479 10596738 10377526 10039678 9850492 9575888 9424175 9444982 9444581 9515674
$$ packed form
4675A1177441L26791J80885K09911j3014j28820l7053j14941J35596M19640L65869
4665A2522305M95206L71697L07004M8688o7471j03146m27606j02516R2663L5881
4655A3172705J77366J30566J99160k9241j79056k50622l30395k18323j54733R3450
4645A2610877J61585L93282K23786K26143K39630J53940m2097j59137j30695o378
4635A3670936J85252K23360L20967L20806K72733N08017M81056O77637O14334
4626A7275098P18279P09104O28707L66787n3893k64333p58518q18228r12188q22097
4616A6068718r56065q57172q57362l62105n10494n45864l56738l72498k07208
4607A1043212k46733j99741k19212l37848j89186k74604j51713K0807m01P1093
$$ plain form
4597 9515674 9551942 9634371 9890678 10142299 10209829 10489812 10800513 11262627 11784479 12216880
4587 12216880 12874832 13707672 14483462 15455749 16706779 18086765 19435625 20794289 22299669
4578 22299669 23503470 24329389 25243795 26190224 26890573 27776097 28737772 29819416 30687664
4569 30687664 31198023 31518010 31468308 30638169 29307511 27524301 25790204 23960907 22288619
4560 22288619 20856511 19407755 18148217 17158495 16356772 15742114 14991165 14289136 13751036
4551 13751036 13198099 12874903 12569427 12287127 12062347 11956281 11710743 11716007 11662118 11660384
4541 11660384 11825004 11942653 12085646 12144239 12460498 13080943 13623327 14000774 14565379 15489601
4531 15489601 16484957 17742244 19023596 20662084 22253002 23899743 25554344 26805541
$$ packed form
4597I515674L6268Q2429K56307K51621O7530K79983L10701M62114N21852M32401
4587A2216880O57952Q32840P75790R72287J251030J379986J348860J358664J505380
4578B2299669J203801Q25919R14406R46429P00349Q85524R61675J081644Q68248
4569C0687664N10359L19987m9702q30139j330658j783210j734097j829297j672288
4560B2288619j432108j448756j259538r89722q01723o14658p50949p02029n38100
4551A3751036n52937l23196l05476k82300k24780j06066k45538N264n3889j734
4541A1660384J64620J17649J42993N8593L16259O20445N42384L77447N64605R24222
4531A5489601R95356J257287J281352J638488J590918J646741J654601J251197
$$ plain form
4523 26805541 27412581 27438595 26826724 25639401 24182573 22532653 20879011 19301421 18011111
4514 18011111 16901380 15852874 14914140 13930950 13205140 12703631 12109375 11442365 11063976
4505 11063976 10679226 10148799 9770925 9464944 9152647 8903273 8712158 8525501 8450796 8233751
4495 8233751 7982232 7876350 7838419 7783189 7749705 7577535 7490877 7437790 7289523 7244807 7130686
4484 7130686 7125946 7131912 6969953 6876322 6886296 6885238 6711410 6753964 6644387 6478434 6652364
4473 6652364 6874578 6968939 7011633 7030027 7257707 7388043 7543999 7667046 7843977 7798790
4463 7798790 7857786 8116055 8431759 8668265 8824020 9024402 9000809 9122109 9380860 9536991
4453 9536991 9720459 9949885 10411870 10869292 11026068 11494825 12062038 12690351 13470754 14466464
$$ packed form
4523B6805541O07040K6014o11871j187323j456828j649920j653642j577590j290310
4514A8011111j109731j048506r38734r83190p25810n01509n94256o67010l78389
4505A1063976l84750n30427l77874l05981l12297k49374j91115j86657p4705k17045
4495H233751k51519j05882l7931n5230l3484j72170q6658n3087j48267m4716j14121
4484G130686m740N966j61959r3631R974j058j73828M2554j09577j65953J73930
4473F652364K22214R4361M2694J8394K27680J30336J55956J23047J76931m5187
4463G798790N8996K58269L15704K36506J55755K00382k3593J21300K58751J56131
4453I536991J83468K29426M61985M57422J56776M68757N67213O28313P80403R95710
$$ plain form
4443 14466464 15337411 16412345 17699324 19255023 21225048 23382079 25672094 28004891
4435 28004891 30083091 31721601 32703394 33048018 32700907 31797989 30860904 30044216 29480714
4426 29480714 29181483 29161654 29498272 30203864 31162439 32372479 33799920 34971330 35856757
4417 35856757 36138550 35668516 34711112 32915187 31062716 29298695 27512571 25884777 24496477
4408 24496477 23225856 22082341 21314431 20482734 19689269 19074750 18469253 18121822 17715950
4399 17715950 17253860 17150099 17178937 17128869 17184419 17331049 17462895 17445749 17743324 18085190
4389 18085190 18303380 18883614 19553705 20296025 21296254 22642206 24045290 25557893 26998968
4380 26998968 28371205 29383027 30171458 30481761 30444276 30232876 29895401 29799552 29917756
$$ packed form
4443A4466464Q70947J074934J286979J555699J970025K157031K290015K332797
4435B8004891K078200J638510R81793L44624l47111r02918r37085q16688n63502
4426B9480714k99231j9829L36618P05592R58575J210040J427441J171410Q85427
4417C5856757K81793m70034r57404j795925j852471j764021j786124j627794j388300
4408B4496477j270621j143515p67910q31697p93465o14519o05497l47431m05872
4399A7715950m62090j03761K8838n0068N5550J46630J31846j7146K97575L41866
4389A8085190K18190N80234O70091P42320J000229J345952J403084J512603J441075
4380B6998968J372237J011822P88431L10303l7485k11400l37475r5849J18204
$$ plain form
4371 29917756 30291226 31026000 31841369 32917845 34376724 35742642 37470208 39254895 40703979
4362 40703979 42039433 43255987 44280739 45066434 45640432 46625783 47981763 49680242 51862773
4353 51862773 54418283 57582225 61105465 65403239 70229665 75686559 82067773 89143895
4345 89143895 97033125 106097408 116113786 127671706 141051582 157233968 177339604
4338 177339604 202000772 232591625 268694533 309064457 350562949 389345342 419861173
4331 419861173 437390599 439207652 423725756 393590148 356774730 320705671 288584429
4324 288584429 260627860 236918903 216654891 198637910 182487041 167591233 153706990
4317 153706990 141214053 129926998 119787511 110861138 102927837 95685793 89067158 83240909
$$ packed form
4371B9917756L73470P34774Q15369J076476J458879J365918J727566J784687J449084
4362D0703979J335454J216554J024752P85695N73998R85351J355980J698479K182531
4353E1862773K555510L163942L523240M297774M826426N456894O381214P076122
4345H9143895P889230R064283J0016378J1557920J3379876J6182386K0105636
4338A77339604K4661168L0590853L6102908M0369924M1498492L8782393L0515831
4331D19861173J7529426J817053j5481896l0135608l6815418l6069059l2121242
4324B88584429k7956569k3708957k0264012j8016981j6150869j4895808j3884243
4317A53706990j2492937j1287055j0139487q926373p933301p242044o618635n826249
$$ plain form
4309 83240909 77859856 72901918 68365880 64474210 60913431 57637522 54681877 52042032
4301 52042032 49651127 47436367 45459427 43588252 41878272 40127220 38575193 37011855
4293 37011855 35593312 34362941 33175107 32118825 30566291 29386550 28475356 27237536
4285 27237536 26198614 25198778 24395342 23557620 22893172 22263405 21489019 21020052 20409148
4276 20409148 19883441 19154376 18673495 18080961 17723132 17331799 16817513 16341255 15885273
4267 15885273 15451801 15046138 14801042 14600869 14268957 13975456 13732062 13521973 13235352
4258 13235352 12912962 12557695 12483616 12403052 12180011 11980809 11669419 11506841 11326536 11016637
4248 11016637 10859969 10953649 10646332 10500694 10322500 10203967 9913583 9717780 9383091 9102213
$$ packed form
4309H3240909n381053m957938m536038l891670l560779l275909k955645k639845
4301E2042032k390905k214760j976940j871175j709980j751052j552027j563338
4293C7011855j418543j230371j187834j056282j552534j179741r11194j237820
4285B7237536j038922r99836q03436q37722o64448o29767p74386m68967o10904
4276B0409148n25707p29065m80881n92534l57829l91333n14286m76258m55982
4267A5885273m33472m05663k45096k00173l31912k93501k43394k10089k86621
4258A3235352l22390l55267p4079q0564k23041j99202l11390j62578j80305l09899
4248A1016637j56668R3680l07317j45638j78194j18533k90384j95803l34689k80878
$$ plain form
4238 9102213 9101804 9025299 8932008 8955648 8772489 8712631 8376732 8255549 8158668 8112606 8095096
4227 8095096 7720448 7596769 7531855 7401739 7372060 7355485 7445238 7341777 6942765 6818305
4217 6818305 6819822 6898336 6821189 6566814 6408016 6326149 6312905 6187317 6014743 6060809 5981150
4206 5981150 5896701 5883142 5799104 5739510 5682159 5595695 5552928 5504327 5502092 5384220 5194950
4195 5194950 5119394 5193449 5073229 5019037 4929379 4708187 4697962 4724372 4782530 4698871 4640540
4184 4640540 4545746 4420335 4632802 4639687 4361607 4062054 4033656 4123790 3971412 3932460 4039147
4173 4039147 3909918 3830581 3872680 3606804 3492263 3495492 3502816 3376768 3353739 3402429 3420362
4162 3420362 3370795 3335706 3314209 3173078 3184003 3291307 3116700 3212895 3328196 3381818 3420988
$$ packed form
4238I102213m09p6505r3291K3640j83159n9858l35899j21183r6881m6062j7510
4227H095096l74648j23679o4914j30116k9679j6575Q9753j03461l99012j24460
4217F818305J517P8514p7147k54375j58798q1867j3244j25588j72574M6066p9659
4206E981150q4449j3559q4038n9594n7351q6464m2767m8601k235j17872j89270
4195E194950p5556P4055j20220n4192q9658k21192j0225K6410N8158q3659n8331
4184D640540r4794j25411K12467O885k78080k99553k8398R0134j52378l8952J06687
4173D039147j29229p9337M2099k65876j14541L229P324j26048k3029M8690J7933
4162C420362m9567l5089k1497j41131J0925J07304j74607R6195J15301N3622L9170
$$ plain form
4151 3420988 3344250 3276756 3340141 3498539 3331732 3084345 2804956 2793152 2907365 3065936
4141 3065936 3079491 3054412 2939142 2839502 2688526 2754338 2806502 2947318 2838515 2844851 2876478
4130 2876478 3024385 2985120 2776356 2687730 2729934 2887247 2749602 2605791 2681252 2659259
4120 2659259 2584049 2651213 2630475 2551408 2423783 2503755 2631261 2561856 2591171 2644151 2632067
4109 2632067 2522692 2511453 2483649 2462303 2327361 2384458 2263035 2402048 2418998 2403205 2435601
4098 2435601 2333203 2366059 2299051 2460887 2474819 2547777 2522281 2385991 2352559 2274864 2274876
4087 2274876 2296764 2317791 2385975 2198477 2324792 2401170 2426476 2256418 2170480 2221888 2092443
4076 2092443 2012400 2067744 2050708 1949691 1863595 2049913 2133375 2176850 2221400 2084407 1973369
$$ packed form
4151C420988p6738o7494O3385J58398j66807k47387k79389j1804J14213J58571
4141C065936J3555k5079j15270r9640j50976O5812N2164J40816j08803O336L1627
4130B876478J47907l9265k08764q8626M2204J57313j37645j43811P5461k1993
4120B659259p5210O7164k0738p9067j27625P9972J27506o9405K9315N2980j2084
4109B632067j09375j1239k7804k1346j34942N7097j21423J39013J6950j5793L2396
4098B435601j02398L2856o7008J61836J3932P2958k5496j36290l3432p7695J2
4087B274876K1888K1027O8184j87498J26315P6378K5306j70058q5938N1408j29445
4076B092443q0043N5344j7036j01017q6096J86318Q3462M3475M4550j36993j11038
$$ plain form
4065 1973369 1944651 2015459 2116360 2004760 2097939 1970866 1941954 2081922 2114209 2092056 1952726
4054 1952726 1956491 1988299 2009843 2038263 2080013 1959784 1908956 1884634 1881347 1896780 2045121
4043 2045121 2218869 2051547 2057144 2138209 2224634 2456945 2495942 2453680 2451982 2557516 2735733
4032 2735733 2726793 2914773 3207747 3423063 3467866 3743841 3864706 3794619 3618911 3490746
4022 3490746 3170746 3343564 3139277 2783302 2658292 2628665 2703009 2523484 2322474 2284258
4012 2284258 2204373 2164083 2197618 2024236 1962142 2000030 1906918 1896382 1794937 1788513 1804202
4001 1804202 1792284 1881609 2030055 2121589 1935040 2090809 1978599 1875389 1842536 1764742
3991 1764742 1904209 1901276 1784811 1633731 1510041 1616204 1804361 1809885 1479004 1488202 1357987
$$ packed form
4065A973369k8718P0808J00901j11600R3179j27073k8912J39968L2287k2153j39330
4054A952726L765L1808K1544K8420M1750j20229n0828k4322l287J5433J48341
4043B045121J73748j67322N597Q1065Q6425K32311L8997m2262j698J05534J78217
4032B735733q940J87980K92974K15316M4803K75975J20865p0087j75708j28165
4022C490746l20000J72818k04287l55975j25010k9627P4344j79525k01010l8216
4012B284258p9885m0290L3535j73382o2094L7888r3112j0536j01445o424J5689
4001A804202j1918Q9325J48446R1534j86549J55769j12210j03210l2853p7794
3991A764742J39467k933j16465j51080j23690J06163J88157N524l30881R198j30215
$$ plain form
3980 1357987 1279294 1469693 1498358 1538096 1603686 1502440 1466942 1494535 1603278 1458524 1555838
3969 1555838 1454868 1461834 1367223 1348472 1414145 1499992 1461392 1485242 1359215 1375571 1346566
3958 1346566 1285851 1404099 1429451 1363989 1456020 1471891 1502738 1329479 1240443 1293188 1412228
3947 1412228 1385517 1458744 1501608 1499334 1510849 1456012 1551580 1431728 1417502 1495191 1307497
3936 1307497 1288990 1255777 1293711 1461111 1524211 1478204 1549233 1560596 1476151 1406200 1346800
3925 1346800 1347648 1327669 1417068 1439009 1356608 1346132 1500220 1418874 1316015 1155690 1247397
3914 1247397 1310029 1446324 1532891 1464166 1324410 1361182 1319603 1413115 1327096 1328532 1295831
3903 1295831 1436878 1516364 1369878 1429788 1450556 1461449 1654989 1416733 1242783 1379914
$$ packed form
3980A357987p8693J90399K8665L9738O5590j01246l5498K7593J08743j44754R7314
3969A555838j00970O966r4611j8751O5673Q5847l8600K3850j26027J6356k9005
3958A346566o0715J18248K5352o5462R2031J5871L0847j73259q9036N2745J19040
3947A412228k6711P3227M2864k274J1515n4837R5568j19852j4226P7689j87694
3936A307497j8507l3213L7934J67400O3100m6007P1029J1363q4445o9951n9400
3925A346800Q48j9979Q9399K1941q2401j0476J54088q1346j02859j60325R1707
3914A247397O2632J36295Q6567o8725j39756L6772m1579R3512q6019J436l2701
3903A295831J41047P9486j46486N9910K0768J0893J93540k38256j73950J37131
$$ plain form
3893 1379914 1386069 1250506 1299096 1430375 1518232 1512547 1431032 1378256 1290833 1318369 1371866
3882 1371866 1480905 1460890 1461459 1455322 1336452 1301373 1226084 1420147 1540702 1685425 1747517
3871 1747517 1581428 1486694 1563375 1551079 1610368 1636463 1522806 1532522 1545394 1518594 1529661
3860 1529661 1444827 1458583 1493583 1544315 1445514 1435643 1385371 1390770 1333463 1351728 1370805 1537725
3848 1537725 1597132 1516255 1511537 1536156 1534778 1546762 1553823 1509781 1437886 1488113 1564361 1533948
3836 1533948 1546938 1532953 1582388 1544003 1446473 1500285 1524888 1515799 1467626 1585402 1529699
3825 1529699 1540497 1455162 1408022 1412115 1482292 1592737 1421103 1422367 1304347 1466733 1511416
3814 1511416 1368560 1247659 1525000 1414371 1468364 1460095 1485991 1543535 1551949 1525897 1542566
$$ packed form
3893A379914O155j35563M8590J31279Q7857n685q1515n2776q7423K7536N3497
3882A371866J09039k0015N69o137j18870l5079p5289J94063J20555J44723O2092
3871A747517j66089r4734P6681j2296N9289K6095j13657R716J2872k6800J1067
3860A529661q4834J3756L5000N0732r8801r871n0272N399n7307J8265J9077J66920
3848A537725N9407q0877m718K4619j378J1984P061m4042p1895N0227P6248l0413
3836A533948J2990j3985M9435l8385r7530N3812K4603r089m8173J17776n5703
3825A529699J0798q5335m7140M093P0177J10445j71634J264j18020J62386M4683
3814A511416j42856j20901K77341j10629N3993q269K5896N7544Q414k6052J6669
$$ plain form
3803 1542566 1655528 1668857 1494440 1653159 1651371 1429941 1231831 1284835 1439997 1348274
3793 1348274 1469275 1515911 1437201 1391828 1505069 1468705 1499822 1470829 1540870 1424694 1361387
3782 1361387 1518356 1398579 1445521 1465163 1607877 1589615 1460965 1421384 1422199 1309218 1455876
3771 1455876 1404307 1364472 1417257 1458284 1574850 1599800 1455607 1474828 1541643 1525848 1422030
3760 1422030 1323075 1298448 1413391 1422550 1504521 1407587 1452410 1492385 1568845 1544218 1413072
3749 1413072 1448972 1537518 1580112 1571373 1475340 1427346 1410243 1427922 1511408 1499248 1279145
3738 1279145 1243077 1302330 1356330 1408591 1260511 1448546 1549390 1516793 1465253 1469941 1457926
3727 1457926 1448123 1345783 1406575 1340158 1299428 1414708 1391482 1219146 1158887 1278578 1571632
$$ packed form
3803A542566J12962J3329j74417J58719j788k21430j98110N3004J55162r1723
3793A348274J21001M6636p8710m5373J13241l6364L1117k8993P0041j16176o3307
3782A361387J56969j19777M6942J9642J42714j8262j28650l9581Q15j12981J46658
3771A455876n1569l9835N2785M1027J16566K4950j44193J9221O6815j5795j03818
3760A422030r8955k4627J14943R159Q1971r6934M4823L9975P6460k4627j31146
3749A413072L5900Q8546M2594q739r6033m7994j7103J7679Q3486j2160k20103
3738A279145l6068N9253N4000N2261j48080J88035J00844l2597n1540M688j2015
3727A457926r803j02340O0792o6417m0730J15280k3226j72336o0259J19691K93054
$$ plain form
3716 1571632 1485825 1321187 1327224 1512073 1572090 1542487 1370080 1363413 1436663 1548915 1621866
3705 1621866 1666836 1575639 1487228 1623337 1547988 1370023 1385841 1456320 1501964 1604138 1711615
3694 1711615 1609367 1677709 1654299 1564254 1674006 1716367 1663103 1855667 1822329 1692548 1666869
3683 1666869 1697437 1721648 1728144 1714214 1768674 1803521 1779320 1781502 1684068 1725453 1810311 1655121
3671 1655121 1586705 1601495 1546014 1437622 1455151 1547616 1547026 1568442 1630285 1455509 1519589
3660 1519589 1632398 1724442 1667365 1653076 1793267 1788181 1700819 1625492 1592460 1694607 1655089
3649 1655089 1705223 1842849 1927364 1868522 1971238 1925212 1944734 2029991 1976468 2024520 1950826
3638 1950826 1988290 1995855 2042081 1968468 2226205 2074104 2025057 2235216 2305037 2250784 2117100
$$ packed form
3716A571632q5807j64638O037J84849O0017k9603j72407o667P3250J12252P2951
3705A621866M4970r1197q8411J36109p5349j77965J5818P0479M5644J02174J07477
3694A711615j02248O8342k3410r0045J09752M2361n3264J92564l3338j29781k5679
3683A666869L0568K4211O496j3930N4460L4847k4201K182r7434M1385Q4858j55190
3671A655121o8416J4790n5481j08392J7529R2465n90K1416O1843j74776O4080
3660A519589J12809R2044n7077j4289J40191n086q7362p5327l3032J02147l9518
3649A655089N0134J37626Q4515n8842J02716m6026J9522Q5257n3523M8052p3694
3638A950826L7464P565M6226p3613K57737j52101m9047K10159O9821n4253j33684
$$ plain form
3627 2117100 2274510 2287001 2411629 2448858 2494173 2614824 2651368 2719906 2785934 2737443 2722175
3616 2722175 2804104 2700738 2589101 2590829 2697017 2623124 2631281 2669289 2569385 2568108 2593646
3605 2593646 2619869 2775257 2666195 2560938 2596020 2671147 2692009 2680429 2684369 2834901 2890130
3594 2890130 3229599 3411957 3582490 3716405 3740088 3814687 3830039 3825309 3898843 3711347 3567484
3583 3567484 3494645 3503931 3493740 3394137 3411535 3441831 3411904 3376414 3344063 3480243 3551591
3572 3551591 3657212 3610693 3596673 3526461 3718921 3743820 3859206 3860981 4178393 4303851 4396203
3561 4396203 4489223 4430203 4497351 4582175 4650564 4806559 4959781 4830798 5047420 4954285 4934370
3550 4934370 4773324 4670492 4763197 4834549 5153879 5275580 5318709 5335341 5460212 5399995
$$ packed form
3627B117100J57410J2491J24628L7229M5315J20651L6544O8538O6028m8491j5268
3616B722175Q1929j03366j11637J728J06188p3893Q157L8008r9904j277K5538
3605B593646K6223J55388j09062j05257L5082P5127K0862j1580L940J50532N5229
3594B890130L39469J82358J70533J33915K3683P4599J5352m730P3534j87496j43863
3583C567484p2839R286j0191r9603J7398L0296k9927l5490l2351J36180P1348
3572C551591J05621m6519j4020p0212J92460K4899J15386J775L17412J25458R2352
3561D396203R3020n9020O7148Q4824O8389J55995J53222j28983K16622r3135j9915
3550D934370j61046j02832R2705P1352L19330J21701M3129J6632J24871o0217
$$ plain form
3540 5399995 5608150 5844836 6031350 6148860 6099746 6210385 6421147 6846558 6734273 6784232
3530 6784232 6879463 7076427 7258097 7561263 7871903 8028726 8081575 8474980 8654069 9013595
3520 9013595 9135348 9483090 10095191 10582846 10947882 11460094 12057074 12711072 13271032 13871799
3510 13871799 14700695 15325931 15932615 16582843 17249179 17831067 18221710 18665769 18676685 18482696
3500 18482696 18211023 17898748 17466750 17325859 17214996 17138643 17168979 17118234 17456054 17843282
3490 17843282 18000951 17798420 17468257 16808241 15923648 15287188 14538216 13902580 13478648
3481 13478648 13162314 12902180 12605805 12493947 12488700 12631505 12846013 13122841 13451439 13748967
3471 13748967 13952541 14015260 13991259 13783931 13497455 13387497 13375382 13680758 14471306 15253410
$$ packed form
3540E399995K08155K36686J86514J17510m9114J10639K10762M25411j12285M9959
3530F784232R5231J96964J81670L03166L10640J56823N2849L93405J79089L59526
3520I013595J21753L47742O12101M87655L65036N12212N96980O53998N59960O00767
3510A3871799Q28896O25236O06684O50228O66336N81888L90643M44059J0916j93989
3500A8482696k71673l12275m31998j40891j10863p6353L0336n0745L37820L87228
3490A7843282J57669k02531l30163o60016q84593o36460p48972o35636m23932
3481A3478648l16334k60134k96375j11858n247J42805K14508K76828L28598K97528
3471A3748967K03574O2719k4001k07328k86476j09958j2115L05376P90548P82104
$$ plain form
3461 15253410 16260640 17460763 18557518 19211530 19249111 18991623 17948859 16626555 15365708
3452 15365708 14223806 13445586 12664492 11955759 11485276 11164744 10977127 10759537 10541940
3443 10541940 10335253 10183619 10066274 10013780 10020671 9919324 9692661 9580941 9327740 9173245
3433 9173245 9237035 9288768 9526247 10113842 10482258 10911161 11348904 11454488 11306591 11011125
3423 11011125 10332484 9656054 9064009 8532567 8124458 7668677 7416400 6895097 6441207
3414 6441207 6302038 6097507 5744933 5416815 5322575 5277396 5025059 4770565 4662754 4511706
3404 4511706 4401403 4319342 4209066 4214385 4019027 3894803 4119305 3863679 3644008 3736003
3394 3736003 3773743 3554419 3404919 3439883 3300741 3265108 3384404 3348683 3174446 3065615
$$ packed form
3461A5253410J007230J200123J096755O54012L7581k57488j042764j322304j260847
3452A5365708j141902p78220p81094p08733m70483l20532j87617k17590k17597
3443A0541940k06687j51634j17345n2494O891j01347k26663j11720k53201j54495
3433I173245O3790N1733K37479N87595L68416M28903M37743J05584j47897k95466
3423A1011125o78641o76430n92045n31442m08109m55781k52277n21303m53890
3414F441207j39169k04531l52574l28118r4240m5179k52337k54494j07811j51048
3404D511706j10303q2061j10276N319j95358j24224K24502k55626k19671R1995
3394C736003L7740k19324j49500L4964j39142l5633J19296l5721j74237j08831
$$ plain form
3384 3065615 2954683 2978258 2983856 2897086 2925632 2950593 2911328 2831278 2930478 3145629 2857873
3373 2857873 2773387 2787415 2745498 2841867 2759233 2738125 2806194 2704698 2685854 2688823 2478282
3362 2478282 2595994 2498634 2513000 2519323 2464719 2417437 2509195 2497171 2524477 2255955 2312696
3351 2312696 2207195 2209095 2138965 2110489 2202911 2287586 2392572 2272089 2148917 2134456 2160346
3340 2160346 2090262 2274030 2110481 1939869 1831467 1860655 1902654 1916922 1883216 2117625
3330 2117625 2125157 2070010 2099561 2137389 2116810 2020431 1975015 1978724 2067591 2128293 2132748 2057481
3318 2057481 1966349 1999110 1900225 1791251 1867046 1813250 1618121 1664410 1666682 1611295 1640091
3307 1640091 1739186 1872647 1858447 1770179 1807648 1777938 1754000 1724927 1852785 1856308 1753405
$$ packed form
3384C065615j10932K3575N598q6770K8546K4961l9265q0050R9200K15151k87756
3373B857873q4486J4028m1917R6369q2634k1108O8069j01496j8844K969k10541
3362B478282J17712r7360J4366O323n4604m7282R1758j2024K7306k68522N6741
3351B312696j05501J900p0130k8476R2422Q4675J04986j20483j23172j4461K5890
3340B160346p0084J83768j63549j70612j08402K9188M1999J4268l3706K34409
3330B117625P532n5147K9551L7828k0579r6379m5416L709Q8867O0702M455p5267
3318B057481r1132L2761r8885j08974P5795n3796j95129M6289K272n5387K8796
3307A640091R9095J33461j4200q8268L7469k9710k3938k9073J27858L523j02903
$$ plain form
3296 1753405 1749633 1939050 1915819 1924158 2078132 2160205 2022905 1954875 1947690 2066789 2095634
3285 2095634 2029035 1969992 2065433 2060408 1978451 2047817 2081465 2177094 2025058 1892325 1843133
3274 1843133 2142633 2075991 1737775 1853283 2017538 1921627 1873347 1873287 1907003 1998789 1874246
3263 1874246 1917061 1866456 1814751 1828171 1866802 1821484 1783825 1613060 1619843 1714579 1565646
3252 1565646 1555002 1664312 1764845 1715720 1743932 1682772 1666591 1666473 1658647 1609659 1609755 1683309
3240 1683309 1679244 1819314 1772698 1815778 1846975 1838154 1761872 1699207 1636214 1693061 1781215 1731494
3228 1731494 1855904 1931832 1930970 1813736 1666942 1814976 1952508 2040782 2017480 1843253 1962829
3217 1962829 1947444 2019904 1992458 2062218 2181449 2088175 2133070 2092666 2183199 2225113 2156745
$$ packed form
3296A753405l772J89417k3231Q339J53974Q2073j37300o8030p185J19099K8845
3285B095634o6599n9043R5441n025q1957O9366L3648R5629j52036j32733m9192
3274A843133K99500o6642l38216J15508J64255r5911m8280o0L3716R1786j24543
3263A874246M2815n0605n1705J3420L8631m5318l7659j70765O783R4736j48933
3252A565646j0644J09310J00533m9125K8212o1160j6181j18p826m8988R6P3554
3240A683309m065J40070m6616M3080L1197q821p6282o2665o2993N6847Q8154m9721
3228A731494J24410P5928q62j17234j46794J48034J37532Q8274k3302j74227J19576
3217A962829j5385P2460k7446O9760J19231r3274M4895m0404R0533M1914o8368
$$ plain form
3206 2156745 2267693 2401933 2355827 2305065 2384059 2572529 2620428 2673520 2829969 2916230 2838608
3195 2838608 2944725 3036581 2960708 2976738 2964089 3121542 3085583 3038848 3142394 3046220 2986038
3184 2986038 3370680 3317923 3278057 3244936 3492031 3547315 3675029 3695730 3732557 3795412 3880244
3173 3880244 4062443 4452063 4390671 4402821 4593371 4683291 4692492 4793213 4941990 5019432 4780643
3162 4780643 4589230 4670584 4697332 4499208 4438540 4529260 4489204 4543389 4564390 4686343 4534844
3151 4534844 4542591 4554676 4712517 4641579 4638275 4639364 4796059 4952023 4954893 4955416 5005268 5083176
3139 5083176 5117130 5206670 5241833 5160979 5086082 5044647 4978335 5017778 4906646 4743286 4639762
3128 4639762 4612048 4716021 4670232 4792470 4728552 4722249 4597364 4433201 4456289 4524067 4415461
$$ packed form
3206B156745J10948J34240m6106n0762P8994J88470M7899N3092J56449Q6261p7622
3195B838608J06117R1856p5873J6030j2649J57453l5959m6735J03546r6174o0182
3184B986038L84642n2757l9866l3121K47095N5284J27714K0701L6827O2855Q4832
3173C880244J82199L89620o1392J2150J90550Q9920R201J00721J48777P7442k38789
3162D780643j91413Q1354K6748j98124o0668R0720m0056N4185K1001J21953j51499
3151D534844P747J2085J57841p0938l304J089J56695J55964K870N23M9852P7908
3139E083176L3954Q9540L5163q0854p4897m1435o6312L9443j11132j63360j03524
3128D639762k7714J03973m5789J22238o3918o303j24885j64163K3088O7778j08606
$$ plain form
3117 4415461 4256520 4184835 4070430 3989747 4161093 4082738 3870599 3825486 3930111 3970515
3107 3970515 3690252 3552087 3531940 3480802 3475013 3363279 3387017 3390282 3346426 3204694 3122619
3096 3122619 3064333 2969230 2846180 2796798 2731721 2527943 2409958 2408189 2444185 2322961 2279925
3085 2279925 2283133 2108785 2035668 2013190 1950901 1902410 1916956 1853170 1773921 1722564 1781067
3074 1781067 1876565 1960270 2112262 1916685 1783001 1796669 1720841 1841705 1834430 1877768 1803339
3063 1803339 1842290 1946979 1891503 1964447 1993783 2067324 2240183 2369411 2478214 2535287 2660646
3052 2660646 2620507 2633231 2611954 2478763 2339524 2239397 2111943 1911769 1911705 1772690 1768537
3041 1768537 1654056 1586652 1484566 1275274 1181676 1136934 1021428 911263 977378 1102959
$$ packed form
3117D415461j58941p1685j14405q0683J71346p8355k12139m5113J04625M0404
3107C970515k80263j38165k0147n1138n789j11734K3738L265m3856j41732q2075
3096C122619n8286r5103j23050m9382o5077k03778j17985j769L5996j21224m3036
3085B279925L208j74348p3117k2478o2289m8491J4546o3786p9249n1357N8503
3074A781067R5498Q3705J51992j95577j33684J3668p5828J20864p275M3338p4429
3063A803339L8951J04689n5476P2944K9336P3541J72859J29228J08803N7073J25359
3052B660646m0139J2724k1277j33191j39239j00127j27454k00174o4j39015m153
3041A768537j14481o7404j02086k09292r3598m4742j15506j10165O6115J25581
$$ plain form
3031 1102959 1052653 1139353 966832 971336 972969 864704 1078184 1048332 916455 933137 919607
3020 919607 855992 788988 801597 823307 762164 706734 655758 564322 610252 740379 704007
3009 704007 567641 531336 635374 682453 620094 640282 732925 807409 775128 818250 799697
2998 799697 732760 783377 742352 739408 820777 674955 622435 612564 530967 473499 412941 437403
2986 437403 571872 354489 445731 491407 599014 652681 590536 432832 416125 541183 574101
2975 574101 500760 476951 481970 481711 610294 489169 389857 341114 313080 336132 416388 487193
2963 487193 501665 522510 390734 433871 485357 324674 279974 409025 525151 485077 480917
2952 480917 523369 572745 422652 403369 194078 147151 195029 381888 232171 321724 296297
$$ packed form
3031A102959n0306Q6700j72521M504J633j08265K13480k9852j31877J6682j3530
3020I19607o3615o7004J2609K1710o1143n5430n0976r1436M5930J30127l6372
3009G04007j36366l6305J04038M7079o2359K0188R2643P4484l2281M3122j8553
2998G99697o6937N0617m1025k944Q1369j45822n2520r871q1597n7468o0558K4462
2986D37403J34469k17383R1242M5676J07607N3667o2145j57704j6707J25058L2918
2975E74101p3341k3809N019k59J28583j21125r9312m8743k8034K3052Q0256P0805
2963D87193J4472K0845j31776M3137N1486j60683m4700J29051J16126m0074m160
2952D80917M2452M9376j50093j9283k09291m6927M7878J86859j49717Q9553k5427
$$ plain form
2941 296297 124254 171180 183425 246539 334452 229292 175006 199536 252500 142518 178775
2930 178775 278123 245747 221750 140524 214681 92765 159583 306069 384383 417936 352001
2919 352001 400874 197523 136098 299452 294460 308869 214992 261124 69861 -25500 200296
2908 200296 197827 279221 303036 282255 236029 273458 303699 198630 134364 243872 120326
2897 120326 109067 213743 262307 293695 119527 81029 125027 212304 124102 35067 166612
2886 166612 198312 107137 97385 310806 345774 225717 189914 115739 173946 224093 72964
2875 72964 16336 132016 192755 90205 34822 152444 157230 54904 8170 103450 57861
2864 57861 177357 248180 289549 145333 179931 281868 228390 98840 -4002 144914 303878
$$ packed form
2941B96297j72043M6926J2245O3114Q7913j05160n4286K4530N2964j09982L6257
2930A78775R9348l2376k3997q1226P4157j21916O6818J46486P8314L3553o5935
2919C52001M8873k03351o1425J63354m992J4409r3877M6132j91263r5361K25796
2908B00296k469Q1394K3815k0781m6226L7429L0241j05069o4266J09508j23546
2897A20326j1259J04676M8564L1388j74168l8498M3998Q7277q8202q9035J31545
2886A66612L1700r1175r752K13421L4968j20057l5803p4175N8207N0147j51129
2875G2964n6628J15680O0739j02550n5383J17622M786j02326m6734R5280m5589
2864E7861J19496P0823M1369j44216L4598J01937n3478j29550j02842J48916J58964
$$ plain form
2853 303878 226663 134397 134066 177070 241181 202898 193857 22726 -66502 -102165 -155347 -41831
2841 -41831 27186 102619 62805 47961 88425 102171 107326 -44051 91953 204564 214408 248372
2829 248372 208924 9002 -235627 -22073 92006 157100 179578 80715 10107 200359 180536
2818 180536 55650 122479 134421 207782 195664 142788 193813 201544 224679 216104 193593 136970
2806 136970 134867 84709 74029 205034 155188 186233 191655 138230 3972 -43451 -103350 -111869
2794 -111869 -39389 25528 58020 31659 31089 -3758 219102 294111 166514 83512 38177 -71333
2782 -71333 -176270 -97065 9251 -22745 35545 97552 -64867 -115847 -47971 68633 183381
2771 183381 149544 91252 -63740 -102246 -37355 41368 60497 -107484 -76831 118813 -82471
$$ packed form
2853C03878p7215r2266l31M3004O4111l8283r041j71131q9228l5663n3182J13516
2841d1831O9017P5433l9814j4844M0464J3746N155j51377J36004J12611R844L3964
2829B48372l9448j99922k44629K13554J14079O5094K2478r8863p0608J90252j9823
2818A80536j24886O6829J1942P3361j2118n2876N1025P731K3135q575k2511n6623
2806A36970k103n0158j0680J31005m9846L1045N422n3425j34258m7423n9899q519
2794a11869P2480O4917L2492k6361n70l4847K22860P5009j27597q3002m5335j09510
2782g1333j04937P9205J06316l1996N8290O2007j62419n0980O7876J16604J14748
2771A83381l3837n8292j54992l8506O4891P8723J9129j67981L0653J95644k01284
$$ plain form
2760 -82471 -156980 71313 -96081 45664 171623 91670 -27117 -41120 -23702 -9163 22757
2749 22757 -7069 -49440 -61379 18848 21976 -179264 -172631 -244477 -238342 -22512 95059 19146
2737 19146 116623 3519 9493 -102136 -151273 -30647 53972 -63376 -56909 -40893 48642
2726 48642 36242 168909 68507 -128555 -71537 -13169 79346 -85306 -5512 27550 67235
2715 67235 -55251 8506 109735 -5129 -90826 -75079 -91976 -62848 -131952 -106511 -49379
2704 -49379 82540 96357 20253 -9415 -110905 -154354 16150 232628 359377 268386 366539
2693 366539 277067 25903 -221274 -238636 -146717 -88791 -38384 60954 16108 142922 -72113
2682 -72113 -197376 -2818 -34203 49987 177443 125239 67555 -54654 -28374 -113477 -63921
$$ packed form
2760h2471p4509K28293j67394J41745J25959p9953j18787j4003J7418J4539L1920
2749B2757k9826m2371j1939Q0227L128k01240O633p1846O135K15830J17571p5913
2737A9146R7477j13104N974j11629m9137J20626Q4619j17348O467J6016Q9535
2726D8642j2400J32667j00402j97062N7018N8368R2515j64652P9794L3062L9685
2715F7235j22486O3757J01229j14864q5697J5747j6897K9128o9104K5441N7132
2704d9379J31919J3817p6104k9668j01490m3449J70504K16478J26749r0991R8153
2693C66539q9472k51164k47177j7362R1919N7926N0407R9338m4846J26814k15035
2682g2113j25263J94558l1385Q4190J27456n2204n7684j22209K6280q5103M9556
$$ plain form
2671 -63921 -47190 -74098 -5426 117927 63644 -127968 -73376 55300 159516 73242 4987
2660 4987 -100316 1346 35074 23325 138383 151018 -25539 -35216 -49173 106220 228368
2649 228368 70641 50612 -41376 -13270 116796 189178 164507 244672 296132 52786 72536
2638 72536 191349 347134 255578 290492 178913 94436 50416 11876 -16769 33962 -133365
2627 -133365 -29455 10602 -9228 -58648 -26072 -2854 -87441 -17975 29437 178526 182469
2616 182469 193511 47462 -16109 44183 122525 32348 10810 -16435 17062 -6903 -51057
2605 -51057 -42479 109718 12607 -60506 -90328 95236 74333 -24373 7485 -64579 -118782 -123236
2593 -123236 -89037 30141 14954 -87918 -85982 -218332 -79153 -4389 -48826 -116983 -141802
$$ packed form
2671f3921J6731k6908O8672J23353n4283j91612N4592J28676J04216q6274o8255
2660D987j05303J01662L3728j1749J15058J2635j76557r677j3957J55393J22148
2649B28368j57727k0029r1988K8106J30066P2382k4671Q0165N1460k43346J9750
2638G2536J18813J55785r1556L4914j11579q4477m4020l8540k8645N0731j67327
2627a33365J03910M0057j9830m9420L2576K3218q4587O9466M7412J49089L943
2616A82469J1042j46049o3571O0292P8342r0177k1538k7245L3497k3965m4154
2605e1057Q578J52197r7111p3113k9822J85564k0903r8706L1858p2064n4203m454
2593a23236L4199J19178j5187j02872J936j32350J39179P4764m4437o8157k4819
$$ plain form
2582 -141802 71393 8338 -65549 -160821 -132163 -66035 -8713 -56090 -48292 -22027 -43839 9996
2570 9996 -32186 -10036 -52378 19861 54801 7445 -8520 40129 65225 249581 29412 97786
2558 97786 10169 111465 48973 44938 22925 -37735 26449 55204 178252 212072 134088 88914
2546 88914 -35629 5532 96579 120190 108958 132188 45259 38217 111494 39739 -2565 -97753
2534 -97753 -7466 -3856 108476 12941 -64268 -73198 -41015 -13994 -17121 16341 -7127 99462
2522 99462 123442 16285 32202 75067 62396 126563 101759 -118266 -30439 -60102 43064
2511 43064 73495 220451 25607 79024 95684 156024 233316 70609 -64410 -69093 -90638
2500 -90638 21884 -42456 -78637 117444 210491 200161 111719 111313 -63056 -47512 34262 -18277
$$ packed form
2582a41802K13195o3055p3887r5272K8658O6128N7322m7377P798K6265k1812N3835
2570I996m2182K2150m2342P2239L4940m7356j5965M8649K5096J84356k20169O8374
2558I7786q7617J01296o2492m035k2013o0660O4184K8755J23048L3820p7984m5174
2546H8914j24543M1161R1047K3611j1232K3230q6929p042P3277p1755m2304r5188
2534i7753R0287L610J12332r5535p7209q930L2183K7021l127L3462k3468J06589
2522I9462K3980j07157J5917M2865j2671O4167k4804k20025Q7827k9663J03166
2511D3064L0431J46956j94844N3417J6660O0340P7292j62707j35019m683k1545
2500i0638J12522o4340l6181J96081R3047j0330q8442m06j74369J5544Q1774n2539
$$ plain form
2488 -18277 -55896 -105328 -111544 -115836 37099 57815 -47893 56241 -32424 47925 -61208
2477 -61208 -11333 98013 167730 141544 221970 135326 99549 119930 120346 176751 85991 67368
2465 67368 -76359 -196783 -69795 -65261 54406 47659 -48136 87707 10937 -67177 13578
2454 13578 72100 88962 -4494 -63538 -7714 -25751 -4859 127977 160517 207652 230917 238053
2442 238053 381722 263802 93076 37590 194964 106103 120213 265094 211086 119969 192791
2431 192791 297504 332716 395249 315266 337849 377597 378091 481206 464140 535667 596961 706366
2419 706366 639512 466294 404927 385598 352506 330171 539157 689958 794907 861540 828583
2408 828583 1028355 1176478 1084911 1074414 890820 1098058 1288076 1336218 1596057 1815572
$$ packed form
2488a8277l7619m9432o216m292J52935K0716j05708J04134q8665Q0349j09133
2477f1208M9875J09346O9717k6186Q0426q6644l5777K0381M16N6405r0760j8623
2465F7368j43727j20424J26988M534J19667o747r5795J35843p6770p8114Q0755
2454A3578N8522J6862r3456n9044N5824j8037K0892J32836L2540M7135K3265P136
2442B38053J43669j17920j70726n5486J57374q8861J4110J44881n4008r1117P2822
2431A92791J04713L5212O2533p9983K2583L9748M94J03115j7066P1527O1294J09405
2419G06366o6854j73218o1367j9329l3092k2335K08986J50801J04949O6633l2957
2408H28583J99772J48123r1567j0497j83594K07238J90018M8142K59839K19515
$$ plain form
2398 1815572 2016652 2029734 2213948 2495519 2502373 2722446 2908315 3208397 3441042 3763039
2388 3763039 4150591 4688576 5239794 5946536 6565719 7180699 7739277 8516772 9417274 10000519
2378 10000519 11076351 12515323 14457656 16731974 19829564 23680501 28044951 32874787
2370 32874787 38082062 42708043 45257771 44575102 42673675 38751651 33088224 28845059
2362 28845059 25287584 22352698 20015354 18139983 16581641 15122636 13838688 12959832
2354 12959832 12162510 11355398 10748989 9874406 9018483 8232558 7602982 7154079 6880904
2345 6880904 6435652 5893640 5464987 5062424 4812506 4529356 4157989 4172661 3964278 3768516
2335 3768516 3679868 3422451 3338397 3191195 3003623 2892056 2751504 2584243 2566443 2623058
$$ packed form
2398A815572K01080J3082J84214K81571O854K20073J85869L00082K32645L21997
2388C763039L87552N37985N51218P06742O19183O14980N58578P77495R00502N83245
2378A0000519J075832J438972J942333K274318L097590L850937M364450M829836
2370C2874787N207275M625981K549728o82669j901427l922024n663427m243165
2362B8845059l557475k934886k337344j875371j558342j459005j283948q78856
2354A2959832p97322q07112o06409q74583q55923p85925o29576m48903k73175
2345F880904m45252n42012m28653m02563k49918k83150l71367J4672k08383j95762
2335C768516q8648k57417q4054j47202j87572j11567j40552j67261j7800N6615
$$ plain form
2325 2623058 2509088 2493994 2514717 2192376 2092824 2007384 2004655 1745620 1758743 1707486 1672616
2314 1672616 1702826 1530781 1425379 1339354 1318370 1207045 1292102 1503737 1391879 1162591
2304 1162591 1137474 1232260 1190636 1244992 1074241 1057440 1018374 889379 1053450 761096 908638
2293 908638 1134021 1054268 992705 956165 831565 773194 910493 837985 901269 940311 789674
2282 789674 757355 836646 738749 686526 706860 780496 693615 481547 592155 709029 682837
2271 682837 694025 716132 639278 623814 606231 582230 645394 508398 522665 585520 587442 573970
2259 573970 460386 492559 444505 353523 486050 724093 709803 595879 395782 366669 554021
2248 554021 519945 371451 289745 468846 449811 348799 471006 339965 243809 310575 317921
$$ packed form
2325B623058j13970j5094K0723l22341r9552q5440k729k59035J3123n1257l4870
2314A672616L0210j72045j05402q6025k0984j11325Q5057K11635j11858k29288
2304A162591k5117R4786m1624N4356j70751j6801l9066j28995J64071k92354J47542
2293I08638K25383p9753o1563l6540j24600n8371J37299p2508O3284L9042j50637
2282G89674l2319P9291r7897n2223K0334P3636q6881k12068J10608J16874k6192
2271F82837J1188K2107p6854j5464j7583k4001O3164j36996J4267O2855J922j3472
2259E73970j13584L2173m8054r0982J32527K38043j4290j13924k00097k9113J87352
2248E54021l4076j48494q1706J79101j9035j01012J22207j31041r6156O6766P346
$$ plain form
2237 317921 356246 320028 403275 442061 305199 236254 217298 243378 285850 276251 253322 160222
2225 160222 237944 349035 124483 166124 178772 138911 89610 247923 379393 354066 317151
2214 317151 300831 259366 169920 109119 185522 108117 58549 195525 247867 192334 120745
2203 120745 -16837 -46870 17321 65099 235630 226259 165854 208228 251532 202748 39636
2192 39636 -7695 -61473 -25797 -39999 7536 98867 134359 30838 21509 130282 953
2181 953 -42585 102290 -17402 -103078 31824 -586 -172440 75414 177627 131455 146347
2170 146347 171495 299307 154954 -27430 27224 61553 20121 141731 68558 -118467 4196
2159 4196 -111057 -62029 21944 74985 253216 229541 207322 158688 209316 175024 151016 139640
$$ packed form
2237C17921L8325l6218Q3247L8786j36862o8945j8956K6080M2472r599k2929r3100
2225A60222P7722J11091k24552M1641J2648l9861m9301J58313J31470k5327l6915
2214C17151j6320m1465q9446o0801P6403p7405m9568J36976N2342n5533p1589
2203A20745j37582l0033O4191M7778J70531r371o0405M2374M3304m8784j63112
2192C9636m7331n3778L5676j4202M7535R1331L5492j03521r329J08773j29329
2181I53m3538J44875j19692q5676J34902l2410j71854K47854J02213m6172J4892
2170A46347K5148J27812j44353j82384N4654L4329m1432J21610p3173j87025J22663
2159D196j15253M9028Q3973N3041J78231k3675k2219m8634N0628l4292k4008j1376
$$ plain form
2147 139640 208519 131915 49703 33364 200162 180532 142480 73075 175693 272281 167452
2136 167452 -55106 -49368 -22655 79016 -19725 77060 183152 51670 -33428 82522 38753
2125 38753 141373 274404 87814 -93019 19758 175976 73690 -68426 -100629 -136582
2115 -136582 -45522 -7675 -37796 -163777 -120441 -63107 11831 158965 183050 69416 85470
2104 85470 165426 115479 102845 60508 184661 -32758 102490 119948 30805 68996 60523
2093 60523 195293 166549 146136 -39675 -24019 87169 168106 125287 -19782 60915 14870
2082 14870 -76765 -55599 -91335 -328198 -190763 -106957 49710 -8857 90946 124550 26203
2071 26203 -114386 -65072 25279 115725 97652 43150 67920 30583 24005 134483 56778 -121476
$$ packed form
2147A39640O8879p6604q2212j6339J66798j9630l8052o9405J02618R6588j04829
2136A67452k22558N738K6713J01671r8741R6785J06092j31482q5098J15950m3769
2125C8753J02620J33031j86590j80833J12777J56218j02286j42116l2203l5953
2115a36582R1060L7847l0121j25981M3336N7334P4938J47134K4085j13634J6054
2104H5470P9956m9947j2634m2337J24153k17419J35248J7458q9143L8191q473
2093F0523J34770k8744k0413j85811J5656J11188Q0937m2819j45069Q0697m6045
2082A4870r1635K1166l5736k36863J37435Q3806J56667n8567R9803L3604r8347
2071B6203j40589M9314R0351R0446j8073n4502K4770l7337o578J10478p7705j78254
$$ plain form
2059 -121476 -102869 -90038 -15673 94182 -7489 -323447 -223735 -106363 -136657 -26882 -147567
2048 -147567 -214415 -134097 -31042 -63903 65260 95240 -16836 16762 -49338 -142901 -140328
2037 -140328 -113333 -150420 -51005 -148671 -111057 44454 92762 27464 -6264 9700 -61544
2026 -61544 -161322 -113977 -143357 84521 53884 -14234 1951 48338 107368 -30120 -50224
2015 -50224 70774 28467 33840 -28252 -25169 -3015 -67502 37158 -94364 -216696 -70586
2004 -70586 14161 -86279 -77964 -193088 -173163 -92064 -110246 -104962 -11653 39003 192796 134481
1992 134481 -48395 -102520 -59931 -37375 -61332 -56300 -47246 126779 16463 -128951 -184758
1981 -184758 -151823 -18470 2200 77161 63592 247212 141117 10099 -59886 -144391 -196079
$$ packed form
2059a21476J8607J2831P4365J09855j01671l15958R9712J17372l0294J09775j20685
2048a47567o6848Q0318J03055l2861J29163K9980j12076L3598o6100r3563K573
2037a40328K6995l7087R9415r7666L7614J55511M8308o5298l3728J5964p1244
2026f1544r9778M7345k9380K27878l0637o8118J6185M6387N9030j37488k0104
2015e0224J20998m2307N373o2092L083K2154o4487J04660j31522j22332J46110
2004g0586Q4747j00440Q315j15124J9925Q1099j8182N284R3309N0656J53793n8315
1992A34481j82876n4125M2589K2556k3957N032R054J74025j10316j45414n5807
1981a84758L2935J33353K0670P4961j3569J83620j06095j31018o9985q4505n1688
$$ plain form
1970 -196079 -164305 -149151 10932 2029 -68061 -147320 -225308 -198661 -148721 -39132 -89585
1959 -89585 -178040 -203423 -166129 -211142 -188782 -81212 -49385 38126 160518 -15919 -4281
1948 -4281 -39021 -200382 -294259 -209861 -71837 -102824 15148 -3720 -55449 9332 51582
1937 51582 208687 46314 -19901 164106 42993 -2864 143300 113246 104316 -196477 -145400
1926 -145400 -109970 51406 -44689 4734 -57691 26109 -5194 -253540 -199315 -284793 -130846
1915 -130846 -218344 -167789 -157237 -80359 -23653 -141220 -31980 -73387 -192411 -181290 -60701
1904 -60701 -54827 -134846 -103930 -22099 49403 133956 75447 106174 61542 -128214 469 11045
1892 11045 -95132 -228039 -79123 -118072 -266556 -129789 48679 -69276 -61491 -64860 -77382
$$ packed form
1970a96079L1774J5154J60083q903p0090p9259p7988K6647M9940J09589n0453
1959h9585q8455k5383L7294m5013K2360J07570L1827Q7511J22392j76437J1638
1948d281l4740j61361r3877Q4398J38024l0987J17972j8868n1729O4781M2250
1937E1582J57105j62373o6215J84007j21113m5857J46164l0054q930l00793N1077
1926a45400L5430J61376r6095M9423o2425Q3800l1303k48346N4225q5478J53947
1915a30846q7498N0555J0552P6878N6706j17567J09240m1407j19024J1121J20589
1904f0701N874q0019L0916Q1831P1502Q4553n8509L0727m4632j89756J28683J0576
1892A1045j06177j32907J48916l8949j48484J36767J78468j17955P785l369j2522
$$ plain form
1881 -77382 -65963 -91631 73366 -21866 -70405 -15253 -51737 -83452 -46049 18244 36246 -39028
1869 -39028 -23329 -162100 -283974 -174801 -181433 -281569 -236575 -21558 -47755 -104431 -128838
1858 -128838 -272371 -144817 -103992 -43717 20876 -68435 -1712 -53916 25906 -69510 -132836
1847 -132836 -139513 -70666 19248 -21821 -263172 -117178 -3277 -105098 -128517 -169961 -122711
1836 -122711 -138059 -4437 -34898 -46086 -71255 -97289 -193090 -176506 -125132 -154648 -126088
1825 -126088 -129151 -92348 -3674 -124947 -105707 -150997 -155628 -41719 15443 -27445 -145380
1814 -145380 -104647 40097 -70644 -74904 4250 -155144 -199441 -210365 -91651 -161376 -67424
1803 -67424 13165 -57447 -115305 98911 -60443 -258791 -253040 -97558 23769 -133580 -71063
$$ packed form
1881g7382J1419k5668J64997r5232m8539N5152l6484l1715L7403O4293J8002p5274
1869c9028J5699j38771j21874J09173o632j00136M4994K15017k6197n6676k4407
1858a28838j43533J27554M0825O0275O4593q9311O6723n2204P9822r5416o3326
1847a32836o677O8847Q9914m1069k41351J45994J13901j01821k3419m1444M7250
1836a22711j5348J33622l0461j1188k5169k6034r5801J6584N1374k9516K8560
1825a26088l063L6803Q8674j21273J9240m5290m631J13909N7162m2888j17935
1814a45380M0733J44744j10741m260P9154j59394m4297j0924J18714o9725R3952
1803f7424Q0589p0612n7858K14216j59354j98348N751J55482J21327j57349O2517
$$ plain form
1792 -71063 -60655 -142160 -159501 -69613 -32762 -136626 4227 -94344 -235191 -229590 -258998
1781 -258998 -282435 -134863 -102630 -194253 -153686 -121117 -131676 65829 153767 108587 130161
1770 130161 7996 -6069 -155964 76348 124306 153536 118587 54989 99652 124864 -2263
1759 -2263 -10237 95611 -24286 -33173 3758 -62823 -27836 41013 -11410 2137 52422 -34736
1747 -34736 3040 9629 119614 92273 11835 -11942 -121376 -202414 -209284 -262250 -224584 -31882
1735 -31882 -78866 -49658 -41972 65955 -76621 -95956 -118587 -132114 -193835 -227568 -174453 -172942
1723 -172942 -166962 -42892 -50653 -50521 -2358 -23768 152567 86414 159513 -137383 -354491 -239910
1711 -239910 -176662 -95622 -109606 -64242 -145569 -150289 -99424 -228902 -228415 -98901 277 -50182
$$ packed form
1792g1063J0408q1505j7341Q9888L6851j03864J40853r8571j40847N601k9408
1781b58998k3437J47572L2233r1623M0567L2569j0559J97505Q7938m5180K1574
1770A30161j22165j4065j49895K32312M7958K9230l4949o3598M4663K5212j27127
1759b263p974J05848j19897q887L6931o6581L4987O8849n2423J3547N0285q7158
1747c4736L7776O589J09985k7341q0438k3777j09434q1038o870n2966L7666J92702
1735c1882m6984K9208P686J07927j42576j9335k2631j3527o1721l3733N3115J511
1723a72942N980J24070p761J32M8163k1410J76335o6153P3099k96896k17108J14581
1711b39910O3248Q1040j3984M5364q1327m720N0865j29478M87J29514R9178n0459
$$ plain form
1699 -50182 -80834 -30751 -69622 -2770 63248 16267 29638 -96551 -71170 -67137 54734 92128
1687 92128 -13092 -82392 -37400 -112808 -148814 -69927 -49032 21312 2564 3169 102325 138313
1675 138313 16687 71 40886 -88773 -205485 -206782 -95008 -70179 -157452 -135468 -49227
1664 -49227 -81359 -264334 -231193 -223297 -232365 -116235 40167 -93498 -6992 -17290 -65677
1653 -65677 138385 121134 -188375 -249096 -84748 -138404 -81418 -58904 -44071 21155 103123
1642 103123 39355 -47815 -174562 -106139 -76841 -128491 -221272 -406825 -197958 -139281 -113873
1631 -113873 -197411 -155822 -162311 783 -3784 -15772 40195 -38827 -201912 -198106 -73476 -53860
1619 -53860 -151121 -90724 -10776 2185 -6473 -213907 -135597 -24116 66776 76503 77513 -11750
$$ packed form
1699e0182l0652N0083l8871O6852O6018m6981J3371j26189K5381M033J21871L7394
1687I2128j05220o9300M4992p5408l6006P8887K0895P0344j8748O05R9156L5988
1675A38313j21626j6616M0815j29659j16712j297J11774K4829q7273K1984Q6241
1664d9227l2132j82975L3141P896r068J16130J56402j33665Q6506j0298m8387
1653f5677K04062j7251l09509o0721J64348n3656N6986K2514J4833O5226Q1968
1642A03123o3768q7170j26747O8423K9298n1650r2781j85553K08867N8677K5408
1631a13873q3538M1589o489J63094m567j1988N5967p9022j63085L806J24630J9616
1619e3860r7261O0397P9948J2961q658k07434P8310J11481R0892R727J010q9263
$$ plain form
1607 -11750 -69884 -112732 -122053 -38699 61543 -42444 -129900 -130730 -185349 -237497 -229684 -140973
1595 -140973 -158724 -240821 -172701 -121039 -134758 -32128 17916 -702 -52969 -33991 64209
1584 64209 26038 139130 -2726 -46102 -46237 -22212 -66511 -106816 -84726 -100391 -200804 -266375
1572 -266375 -217266 -219897 -311467 -155163 -65834 -7708 26192 22848 67143 -5011 -58013 -60177
1560 -60177 33792 -7555 91151 154406 -6387 -173373 -195103 -264315 -140587 -149172 -161454
1549 -161454 -72807 33008 -16930 -74242 -63614 -71481 -115424 -53794 458 -145637 -188555
1538 -188555 -102648 -123069 116816 -27012 -157331 -59823 80112 287060 162922 -66368
1528 -66368 -160205 -65975 -76926 -48643 -189271 -85493 -99820 -116636 -197197 -252186 -186326
$$ packed form
1607a1750n8134m2848r321Q3354J00242j03987q7456q30n4619n2148P813Q8711
1595a40973j7751q2097O8120N1662j3719J02630N0044j8618n2267J8978R8200
1584F4209l8171J13092j41856m3376j35K4025m4299m0305K2090j5665j00413o5571
1572b66375M9109k631r1570J56304Q9329N8126L3900l344M4295p2154n3002k164
1560f0177R3969m1347R8706O3255j60793j66986k1730o9212J23728q585j2282
1549a61454Q8647J05815m9938n7312J0628p867m3943O1630N4252j46095m2918
1538a88555Q5907k0421K39885j43828j30319R7508J39935K06948j24138k29290
1528f6368r3837R4230j0951K8283j40628J03778j4327j6816q0561n4989O5860
$$ plain form
1517 -186326 -116449 -129985 -165379 -208425 -276123 -132896 -120788 -72632 -42492 -125386 -351580
1506 -351580 -356429 -347196 -200612 -163260 -239865 806 -23022 -74123 -48047 -101413 -67251 5251
1494 5251 185 58270 66449 20637 -83435 -63790 -113834 -258872 -171390 -179846 -62666 -58915
1482 -58915 -12996 113650 -47183 -177257 -135409 -202027 -212401 -225757 -106125 -134848 -123612
1471 -123612 -93361 7316 -80048 -260339 -188696 -170608 15463 -89005 20156 59641 86969
1460 86969 211836 29547 -86581 49553 29456 132322 -9681 -210687 -134898 -146594
1450 -146594 30081 180837 164679 155761 -59941 -179994 -89895 -101324 -130934 -135919 -108010
1439 -108010 -29304 108618 -14099 -138562 -159942 -139844 -246141 -120004 92823 3888
$$ packed form
1517a86326O9877j3536l5394m3046o7698J43227J2108M8156L0140q2894k26194
1506c51580m849R233J46584L7352p6605K40671k3828n1101K6076n3366L4162P2502
1494E251n066N8085Q179m5812j04072J9645n0044j45038Q7482q456J17180L751
1482e8915M5919J26646j60833j30074M1848o6618j0374j3356J19632k8723J1236
1471a23612L0251J00677q7364j80291P1643J8088J86071j04468J09161L9485K7328
1460H6969J24867j82289j16128J36134k0097J02866j42003k01006P5789j1696
1450a46594J76675J50756j6158q918k15702j20053R0099j1429k9610m985K7909
1439a08010P8706J37922j22717j24463k1380K0098j06297J26137K12827q8935
$$ plain form
1429 3888 16476 122918 52163 52304 -32024 -94770 -93784 -267731 -193716 -72159 -122549 -106772
1417 -106772 -141612 -283958 -203929 -88805 145985 -1251 -106397 62875 -53966 -134290
1407 -134290 -111581 -61799 753 -75656 -112945 -130471 -164776 -57259 751 -80663 -44463
1396 -44463 -71646 82139 -21708 -140124 -55421 -120134 -111120 6961 94539 172378 226269
1385 226269 38643 -239206 -358381 -234567 -220501 -130640 -37458 -129873 -166805 -124666 -106677
1374 -106677 -205134 -286693 -107945 -92565 -148040 -98901 -79089 -235256 -225382 3684 -62522
1363 -62522 -140981 -85670 -131562 -117651 -162537 -173668 -58778 -2408 -16089 86675 223312
1352 223312 260010 201373 101932 66677 67533 -87777 -45179 22202 968 -125311 -256082
$$ packed form
1429C888J2588J06442p0755J41q4328o2746R86j73947P4015J21557n0390J5777
1417a06772l4840j42346Q0029J15124K34790j47236j05146J69272j16841q0324
1407a34290K2709M9782O2552p6409l7289j7526l4305J07517N8010q1414L6200
1396d4463k7183J53785j03847j18416Q4703o4713R014J18081Q7578P7839N3891
1385B26269j87626k77849j19175J23814J4066Q9861R3182r2415l6932M2139J7989
1374a06677r8457q1559J78748J5380n5475M9139J9812j56167R874K29066o6206
1363f2522p8459N5311m5892J3911m4886j1131J14890N6370j3681J02764J36637
1352B23312L6698n8637r9441l5255Q56j55310M2598O7381k1234j26279j30771
$$ plain form
1341 -256082 -146693 14519 38680 29206 92022 6312 105448 98561 107563 42899 62666 57192
1329 57192 -135745 13470 54822 -16497 73953 53219 -27941 -62979 3868 70389 -1292
1318 -1292 21035 57816 199385 45896 18629 -20906 -79756 -180688 -330761 -265202 -2689
1307 -2689 53524 -44714 99410 14991 -58764 -46879 1046 -124261 -275431 -144699 -66588
1296 -66588 -52333 36933 38293 -24538 -7109 -9224 27062 92284 71279 84104 -49464 -201764
1284 -201764 -43305 27993 49514 170984 182325 289479 214130 4056 -88365 -79285 -174
1273 -174 -103633 -74698 36356 -86653 -98910 -14954 -29356 -59584 -5188 -124028 -169698
1262 -169698 -81917 26393 -22584 50272 108108 59508 57123 20604 14257 -109402 67655
$$ packed form
1341b56082J09389J61212K4161r474O2816q5710R9136o887R002o4664J9767n474
1329E7192j92937J49215M1352p1319R0450k0734q1160l5038O6847O6521p1681
1318a292K2327L6781J41569j53489k7267l9535n8850j00932j50073O5559K62513
1307b689N6213r8238J44124q4419p3755J1885M7925j25307j51170J30732P8111
1296f6588J4255Q9266J360o2831J7429k115L6286O5222k1005J2825j33568j52300
1284b01764J58459P1298K1521J21470J1341J07154p5349k10074r2421R080P9111
1273a74j03459K8935J11054j23009j2257Q3956j4402l0228N4396j18840m5670
1262a69698Q7781J08310m8977P2856N7836m8600k385l6519o347j23659J77057
$$ plain form
1251 67655 65902 -41229 -38556 -251548 -162188 78480 174562 131958 48365 -50528 -58836 21895
1239 21895 50517 -104703 -168184 -48390 56545 115821 97605 51188 87400 165900 176928
1228 176928 -81388 -258330 -213156 -120993 -126980 -63775 -14804 154826 37102 4455 146379
$$ packed form
1251F7655j753j07131K673k12992Q9360K40668R6082m2604q3593r8893q308Q0731
1239B1895K8622j55220o3481J19794J04935N9276j8216m6417L6212P8500J1028
1228A76928k58316j76942M5174R2163n987O3205M8971J69630j17724l2647J41924
$$ [...]
##END NTUPLES=NMR SPECTRUM
##END=
