##TITLE=1H_EC-3356(3-2)
 200.13MHz, CDCl3,
 8 sc
 
 19.8.2025
##JCAMPDX= 6.0         $$ Bruker NMR JCAMP-DX V2.0
##DATA TYPE= NMR SPECTRUM
##DATA CLASS= NTUPLES
##ORIGIN= UXNMR, Bruker Analytische Messtechnik GmbH
##OWNER= pz
$$ XWIN-NMR		Version 3.5
$$ Tue Aug 19 13:35:43 2025 Russian Standard Time (UT+4h)  she@DPX200
##.OBSERVE FREQUENCY= 200.1308
##.OBSERVE NUCLEUS= ^1H
##.ACQUISITION MODE= SIMULTANEOUS
##.ACQUISITION SCHEME= undefined
##.AVERAGES= 8
##.DIGITISER RES= 18
##SPECTROMETER/DATA SYSTEM= spect
##.PULSE SEQUENCE= zg30
##.SOLVENT NAME= CDCl3
##.SHIFT REFERENCE= (INTERNAL, CDCl3, 0, 15.38)
##AUDIT TRAIL= $$ (NUMBER, WHEN, WHO, WHERE, WHAT)
$$ ##TITLE= Audit trail, XWIN-NMR		Version 3.5
$$ ##JCAMPDX= 5.01
$$ ##ORIGIN= Bruker BioSpin GmbH
$$ ##OWNER= she
$$ F:/spectra/data/she/nmr/H-C/1/pdata/1/auditp.txt
$$ ##AUDIT TRAIL=  $$ (NUMBER, WHEN, WHO, WHERE, WHAT)
(   1,<2025-08-19 13:34:33.98 +0400>,<she>,<DPX200>,
      <created by zg, POWCHK disabled, PULCHK disabled
       configuration hash MD5:
       00 E9 B6 7A A2 85 ED C7 34 08 36 98 17 FE 4E 26
       data hash MD5: 16K
       81 58 6F D6 70 2D C8 56 28 B5 FE 71 13 2C 19 65>)
(   2,<2025-08-19 13:34:36.54 +0400>,<she>,<DPX200>,
      <Start of raw data processing
       efp BC_mod = 2 LB = 0.25 FT_mod = 6 PKNL = 1 PHC0 = -1556.569 PHC1 = 6.592279 SI = 16K 
       data hash MD5: 16K
       34 92 85 6E 83 8F F9 79 3F 46 97 85 AB D0 E3 35>)
(   3,<2025-08-19 13:34:54.89 +0400>,<she>,<DPX200>,
      <pk PHC0 = -2.772041 PHC1 = 3.4 
       data hash MD5: 16K
       99 2B 5B 6B CA 9E A5 3D 45 48 65 58 BD 2A 3C 4B>)
(   4,<2025-08-19 13:34:58.67 +0400>,<she>,<DPX200>,
      <abs ABSG = 5 
       data hash MD5: 16K
       ED 15 6D F7 59 01 14 4F EE 21 F2 14 D1 DF EB E7>)
$$ ##END=
$$ 
$$ hash MD5
$$ D4 63 61 39 BA 42 2B 90 7F 96 AC E0 69 F0 BC 27
##$RELAX= 
##$RELAX= 
##$RELAX= 
##$RELAX= 
##$RELAX= 
##$RELAX= 
$$ Bruker specific parameters
$$ --------------------------
##$DU= <F:/spectra>
##$EXPNO= 1
##$NAME= <H-C>
##$PROCNO= 1
##$TYPE= <nmr>
##$USER= <she>
##$AMP= (0..31)
100 100 100 100 100 100 100 100 100 100 100 100 100 100 100 100 100 100 
100 100 100 100 100 100 100 100 100 100 100 100 100 100 
##$AQSEQ= 0
##$AQ_mod= 1
##$AUNM= <au_zg>
##$AUTOPOS= <>
##$BF1= 200.13
##$BF2= 200.13
##$BF3= 200.13
##$BF4= 200.13
##$BF5= 200.13
##$BF6= 200.13
##$BF7= 200.13
##$BF8= 200.13
##$BYTORDA= 1
##$CFDGTYP= 0
##$CFRGTYP= 5
##$CHEMSTR= <none>
##$CNST= (0..31)
1 1 145 1 1 1 1 1 1 1 1 1 1 1 1 1 1 1 1 1 1 1 1 1 1 1 1 1 1 1 1 1 
##$CPDPRG= <>
##$CPDPRG1= <>
##$CPDPRG2= <>
##$CPDPRG3= <>
##$CPDPRG4= <mlev>
##$CPDPRG5= <mlev>
##$CPDPRG6= <mlev>
##$CPDPRG7= <mlev>
##$CPDPRG8= <mlev>
##$CPDPRGB= <>
##$CPDPRGT= <>
##$D= (0..31)
0 0.7 0 0 0 0 0 0 0 0 0 0.03 0 0 0 0 0 0 0 0 0 0 0 0 0 0 0 0 0 0 0 0 
##$DATE= 1755596073
##$DBL= (0..7)
120 120 120 120 120 120 120 120 
##$DBP= (0..7)
150 150 150 150 150 150 150 150 
##$DBP07= 0
##$DBPNAM0= <>
##$DBPNAM1= <>
##$DBPNAM2= <>
##$DBPNAM3= <>
##$DBPNAM4= <>
$$ [...]
##$SUBNAM3= <"">
##$SUBNAM4= <"">
##$SUBNAM5= <"">
##$SUBNAM6= <"">
##$SUBNAM7= <"">
##$SUBNAM8= <"">
##$SUBNAM9= <"">
##$SW= 18.0517779522481
##$SWIBOX= (0..15)
0 0 2 0 0 0 0 0 0 0 0 0 0 0 0 0 
##$SW_h= 3612.71676300578
##$TD= 16384
##$TD0= 1
##$TE= 0
##$TE2= 300
##$TE3= 300
##$TEG= 300
##$TL= (0..7)
0 120 120 120 120 120 120 120 
##$TP= (0..7)
150 150 150 150 150 150 150 150 
##$TP07= 0
##$TPNAME0= <>
##$TPNAME1= <>
##$TPNAME2= <>
##$TPNAME3= <>
##$TPNAME4= <>
##$TPNAME5= <>
##$TPNAME6= <>
##$TPNAME7= <>
##$TPOAL= (0..7)
0.5 0.5 0.5 0.5 0.5 0.5 0.5 0.5 
##$TPOFFS= (0..7)
0 0 0 0 0 0 0 0 
##$TUNHIN= 0
##$TUNHOUT= 0
##$TUNXOUT= 0
##$USERA1= <user>
##$USERA2= <user>
##$USERA3= <user>
##$USERA4= <user>
##$USERA5= <user>
##$V9= 5
##$VALIST= <valist>
##$VCLIST= <CCCCCCCCCCCCCCC>
##$VD= 0
##$VDLIST= <DDDDDDDDDDDDDDD>
##$VPLIST= <PPPPPPPPPPPPPPP>
##$VTLIST= <TTTTTTTTTTTTTTT>
##$WBST= 1024
##$WBSW= 4
##$XGAIN= (0..3)
0 0 0 0 
##$XL= 0
##$YL= 0
##$YMAX_a= 551909
##$YMIN_a= -708778
##$ZGOPTNS= <>
##$ZL1= 120
##$ZL2= 120
##$ZL3= 120
##$ZL4= 120
##$ABSF1= 15.4252
##$ABSF2= -2.626693
##$ABSG= 5
##$ABSL= 3
##$ALPHA= 0
##$AQORDER= 0
##$ASSFAC= 0
##$ASSFACI= 0
##$ASSFACX= 0
##$ASSWID= 0
##$AUNMP= <proc_1d>
##$AZFE= 0.1
##$AZFW= 0.1
##$BCFW= 0
##$BC_mod= 2
##$BYTORDP= 0
##$COROFFS= 0
##$CY= -3
##$DATMOD= 1
##$DC= 0
##$DFILT= <>
##$DTYPP= 0
##$F1P= 0
##$F2P= 0
##$FCOR= 1
##$FTSIZE= 16384
##$FT_mod= 6
##$GAMMA= 0
##$GB= 0
##$INTBC= 1
##$INTSCL= 3.241238e-09
##$ISEN= 128
##$LB= 0.25
##$LEV0= 0
##$LPBIN= 0
##$MAXI= 10000
##$MC2= 0
##$MEAN= 0
##$ME_mod= 0
##$MI= 1.114404
##$NCOEF= 0
##$NC_proc= -6
##$NLEV= 6
##$NOISF1= 3.799351
##$NOISF2= 2.8
##$NSP= 0
##$NTH_PI= 0
##$NZP= 0
##$OFFSET= 15.38003
##$PC= 1
##$PHC0= -1559.341
##$PHC1= 9.992279
##$PH_mod= 1
##$PKNL= yes
##$PPARMOD= 0
##$PSCAL= 0
##$PSIGN= 0
##$REVERSE= no
##$SF= 200.129528360767
##$SI= 16384
##$SIGF1= 3
##$SIGF2= 2
##$SINO= 0.751879
##$SIOLD= 32768
##$SREGLST= <19F.Aceton>
##$SSB= 0
##$STSI= 16384
##$STSR= 0
##$SW_p= 3612.71676300577
##$SYMM= 0
##$S_DEV= 0
##$TDeff= 16384
##$TDoff= 0
##$TI= <>
##$TILT= no
##$TM1= 0
##$TM2= 0
##$TOPLEV= 0
##$USERP1= <user>
##$USERP2= <user>
##$USERP3= <user>
##$USERP4= <user>
##$USERP5= <user>
##$WDW= 1
##$XDIM= 16384
##$YMAX_p= 419768038
##$YMIN_p= -408228
$$ End of Bruker specific parameters
$$ ---------------------------------
##NTUPLES= NMR SPECTRUM
##VAR_NAME=  FREQUENCY,     SPECTRUM/REAL,   SPECTRUM/IMAG
##SYMBOL=    X,             R,               I
##VAR_TYPE=  INDEPENDENT,   DEPENDENT,       DEPENDENT
##VAR_FORM=  AFFN,          ASDF,            ASDF
##VAR_DIM=   16384,         16384,           16384
##UNITS=     HZ,            ARBITRARY UNITS, ARBITRARY UNITS
##FACTOR=    0.220516191357247, 1,           1
##FIRST=     3077.99808570173, 0,            0
##LAST=      -534.718677304041, 0,           0
##MIN=       -534.718677304041, -408228,     0
##MAX=       3077.99808570173, 419768038,    0
$$ Real data points
##PAGE= N=1
##DATA TABLE= (X++(R..R)), XYDATA
$$ [...]
12253A73501j31484O0784j3392m8344M765J295m2761q9934P1823Q645o821N9300
$$ 173501 42017 102801 89409 41065 45830 47125 4364 -85570 -13747 -5102 -11923 47377
12241D7377k4416j16534Q4856J3982o5543k3131o2551m7015N3860J05904K5613
$$ 47377 22961 -93573 -8717 5265 -60278 -83409 -145960 -192975 -139115 -33211 -7598
12230g598j6474N3602l9192n6301J10895J00720J3841J686j88846q4393n6473
$$ -7598 -24072 29530 -9662 -65963 44932 145652 159493 161179 -27667 -112060 -168533
12219a68533L7220J4218p9019K31775J05535r1002j0264N5675M3497p8962j63837
$$ -168533 -131313 -117095 -196114 35661 141196 50194 39930 95605 139102 60140 -103697
12208a03697m227n9390N9433Q7751K3500P1861j65649J17026k6201j10950M3178
$$ -103697 -107924 -167314 -107881 -20130 3370 75231 -90418 26608 407 -110543 -67365
12197f7365Q610k4635R2476J2987n3812m3777N4771R6487j25890p0793K930R3187
$$ -67365 -58755 -83390 9086 22073 -31739 -75516 -20745 75742 -50148 -120941 -118011 -24824
12185b4824P3098P0356j85670o5739Q3965N5673K5079j67350K6887R4136K4902
$$ -24824 48274 118630 -67040 -132779 -48814 6859 31938 -135412 -108525 -14389 10513
12174A0513l9237Q8432j0998p1500J4701j02566J2785Q7604o4361M784J0541o3338
$$ 10513 -28724 59708 48710 -22790 -8089 -110655 -97870 -10266 -74627 -69843 -59302 -122640
12162a22640M5914M5548K0260K1564L379R671j22901O7643k2470J11456k8343
$$ -122640 -76726 -31178 -10918 10646 14025 23696 -99205 -31562 -54032 57424 29081
12151B9081k2551p8895L5200J44756m6509J7840j53830Q5305O6407j1869m7668
$$ 29081 6530 -72365 -37165 107591 61082 78922 -74908 10397 76804 64935 17267
12140A7267r158r0749J18872k9748N9145o2996M3387O3786k8303l6344j25895
$$ 17267 8109 -82640 36232 6484 65629 2633 46020 109806 81503 45159 -80736
12129h0736j25220Q2915J96707j702P7885J1631r8885J0441j05523p9337J67720
$$ -80736 -205956 -123041 73666 71964 149849 161480 62595 73036 -32487 -111824 55896
12118E5896n2245j09937M7347K4367j26879j609J6795Q3966J03613l2985R8529
$$ 55896 3651 -106286 -58939 -34572 -161451 -163060 -146265 -62299 41314 8329 106858
12107A06858q4627q8753k3175o4487k4548J04568l9857M465J15942J988Q2363
$$ 106858 22231 -66522 -89697 -154184 -178732 -74164 -114021 -109556 6386 8374 90737
12096I0737r2301k1361m2143o043R08j25243R0897J14490j09744n5395J8024J26362
$$ 90737 -1564 -22925 -65068 -71111 -70203 -195446 -104549 9941 -99803 -155198 -137174 -10812
12084a0812j03765J00107P4920J28602j22816q6544N0410j3027j973p0545J14671
$$ -10812 -114577 -14470 60450 189052 66236 -20308 30102 17075 15102 -55443 59228
12073E9228J0363p2895K204o908p1869P4254J2642L0080m4126K3505j11755J49910
$$ 59228 69591 -3304 -1100 -8008 -79877 -5623 7019 37099 -7027 16478 -95277 54633
12061E4633J41363j63704P1698O042j67043J1404J08213J2627j41933Q2090m3923
$$ 54633 195996 32292 103990 110032 -57011 -45607 62606 75233 -66700 15390 -28533
12050b8533o5285O2724N9312r9662J979J08191n672J41521o4090j52959j8476
$$ -28533 -93818 -31094 28218 -71444 -69465 38726 33054 174575 110485 -42474 -60950
12039f0950J26624q9776k8600M1829L757J39297M282j83266j48169Q2811J31649
$$ -60950 65674 -24102 -52702 -10873 -7116 132181 136463 -46803 -194972 -112161 19488
12028A9488M6379l3842q7841l5170J35790j2674n6767m0243R5875k2108j4481
$$ 19488 65867 32025 -55816 -90986 44804 32130 -24637 -64880 30995 8887 -5594
12017e594l9982O6012O2115N0998Q155j62526J4568R176j6325m5966n595k7337
$$ -5594 -45576 20436 82551 133549 141704 -20822 -6254 2922 -13403 -59369 -64964 -92301
12005i2301J01254p4907O1199M9882m4862k1672J12289j7710q1887j14546P4739
$$ -92301 8953 -65954 -4755 45127 265 -21407 90882 73172 -8715 -123261 -48522
11994d8522N2575Q6674O2422n8185n2723Q687p1116l2018j0301j18084R8228o1138
$$ -48522 4053 90727 153149 94964 42241 50928 -20188 -52206 -62507 -180591 -82363 -143501
11982a43501M4227m589J18800J4794J8925J3438r4364k328m0936l991J21691o8080
$$ -143501 -99274 -103863 14937 29731 48656 62094 -32270 -34598 -75534 -79525 42166 -25914
11970b5914n2347J6386j20092N1214J71908N0143J1877r3325j44186Q7174K4522
$$ -25914 -78261 -61875 -181967 -130753 41155 91298 103175 9850 -134336 -47162 -22640
11959b2640K04193M9753j11772j31690M3776n7908K5093n7262l7772N9876P3419
$$ -22640 181553 231306 119534 -12156 31620 -26288 -1195 -58457 -96229 -36353 37066
11948C7066L2132m0342O5078k2901l4581N16K6717o7765R7901l0926p7044K2165
$$ 37066 69198 28856 93934 71033 36452 36968 63685 -4080 93821 62895 -14149 8016
11936H016p995q0320n3759N8726M0410J1825K5059l7944K0152n297R056J06996
$$ 8016 21 -80299 -134058 -75332 -34922 -23097 1962 -35982 -15830 -21127 -12071 94925
11924I4925j40047L5348P8920q3343P8471q2826p2992n5098N5360k8216P8446
$$ 94925 -45122 -9774 69146 -14197 64274 -18552 -91544 -146642 -91282 -119498 -41052
11913d1052L3543L3174N3980p5225j49254j0650M6493O6596L5251J17234j03781
$$ -41052 -7509 25665 79645 4420 -144834 -155484 -108991 -42395 -7144 110090 6309
11902F309j33589J79096Q6278j94928r4655L3979O3487J2701P15k042o2379N5810
$$ 6309 -127280 51816 138094 -56834 -151489 -117510 -54023 -41322 -40607 -42649 -105028 -49218
11890d9218j9601o0477Q3589l4353j02340K26717P7247m0545l395j05007l9692
$$ -49218 -68819 -129296 -45707 -80060 -182400 44317 121564 81019 77624 -27383 -67075
11879f7075J09351m9428l2296k8878j09405R6299j4920L7462Q8661j04616N6246
$$ -67075 42276 -7152 -39448 -68326 -177731 -81432 -96352 -58890 29771 -74845 -18599
11868a8599k7563L5557p001L2102k7061O9575L8034o5383K5377L950l9932j55891
$$ -18599 -46162 -10605 -17606 14496 -12565 57010 95044 29661 55038 58988 19056 -136835
11856a36835k1056M0790J91542R879p3665R0615L6318j18536K6272K0594n8671
$$ -136835 -157891 -117101 74441 84320 10655 101270 137588 19052 45324 65918 7247
11845G247N219N5230j12158K6286O3265L2331J05565j34695j8211o217l7182N7959
$$ 7247 12466 67696 -44462 -18176 45089 77420 182985 48290 30079 23862 -13320 44639
11833D4639O820p2822N1127O9791j024j12211j24444N7775N7510q6600K2557q0783
$$ 44639 51459 -21363 29764 99555 98531 -13680 -138124 -80349 -22839 -109439 -86882 -167665
11821a67665J38689N8101J9290j4854J22558k7360j24464R7538J00439j04097
$$ -167665 -28976 29125 48415 33561 156119 128759 4295 101833 202272 98175
11811I8175p2903p5199q6076r4848M8196J57771o6566M693P9671L8863o004j6433
$$ 98175 25272 -49927 -136003 -230851 -182655 -24884 -91450 -86757 -7086 31777 25773 9340
11799I340J1690m9022K0835N7164p8107J9170N341R264L7560L9461n027k0534
$$ 9340 21030 -27992 -7157 50007 -28100 -8930 -3589 5675 43235 82696 77669 57135
11787E7135J28774q6172j65316Q4538l7747j22470m5176J9331O6301J03875l406
$$ 57135 185909 99737 -65579 18959 -18788 -141258 -186434 -167103 -100802 3073 -333
11776c33l3086j7651o0048M3579J01655j9709k8730q6582j3329Q5967M454M400
$$ -333 -33419 -51070 -111118 -67539 34116 14407 -14323 -100905 -114234 -28267 -23813 -19413
11764a9413J13711j56132K3110J29036j77846p3070J57889j4206k0664N4476P4762
$$ -19413 94298 -61834 -38724 90312 -87534 -160604 -2715 -16921 -37585 16891 91653
11753I1653m1537o0528k7622K0447P9009r5321j10846O335m133K2883p0743L4375
$$ 91653 50116 -10412 -38034 -17587 61422 -33899 -144745 -138410 -142543 -119660 -190403 -156028
11741a56028L2067n6983P2049R6189Q8569j23084K7694q8141l9992J57507j6042
$$ -156028 -123961 -180944 -108895 -12706 75863 -47221 -19527 -107668 -147660 9847 -6195
11730f195q885o0765P1245K6728O3193j8906m1951M6052K1643j61984L060l9412
$$ -6195 -15080 -75845 -4600 22128 85321 66415 24464 70516 92159 -69825 -66765 -106177
11718a06177O2671M5251r158m1289J12580r9030J23854l006j82914P6660n1969
$$ -106177 -43506 1745 -7413 -48702 63878 -35152 88702 85696 -97218 -20558 -72527
11707g2527L5032l1263J13402M5776n8142o983j0622j20119J20680o170L5257
$$ -72527 -37495 -68758 44644 90420 32278 25295 14673 -105446 15234 9064 44321
11696D4321R610Q0883r0809q1514K9972M914k0014r9528n6620K7565j9627R9351
$$ 44321 53931 134814 44005 -37509 -7537 -2623 -22637 -122165 -178785 -151220 -170847 -71496
11684g1496J14933O9303O8881p1888j26363l6313M8041j1871L1928M0590L2590
$$ -71496 43437 112740 181621 109733 -16630 -52943 -4902 -16773 15155 55745 88335
11673H8335M6989J8592J9512p3272j2296L574j49747J18475J02390j13827m0860
$$ 88335 135324 153916 173428 100156 87860 91434 -58313 60162 162552 48725 7865
11662G865J0016J27184r0571q5818n6381o6522J37481m0261k4838N8873m662M6342
$$ 7865 17881 145065 54494 -31324 -87705 -154227 -16746 -57007 -81845 -22972 -27634 18708
11650A8708l3320J57237p1215J9317O2526p5944Q816j2663L3300l9127l8965J2274
$$ 18708 -14612 142625 71410 90727 153253 77309 86125 73462 106762 67635 28670 40944
11638D0944k7766n2101q0161Q0563J16250p1501r695L3005M6671p3616M2714j4990
$$ 40944 13178 -38923 -119084 -38521 77729 6228 -3467 29538 76209 2593 45307 30317
11626C0317p1962P7884p4022L439k5995Q8894r287o9277K7411p338N3819L5253
$$ 30317 -41645 36239 -37783 -34344 -60339 28555 19268 -50009 -22598 -29936 23883 59136
11614E9136L0250p0991j32735K9523J06673R1188o0976j09810R7161J10926l0877
$$ 59136 89386 18395 -114340 -84817 21856 113044 52068 -57742 39419 150345 119468
11603A19468n0842J70660p2436r0646L88o908M9286J5126J24510O7p2794n8545
$$ 119468 68626 239286 166850 76204 76592 69684 118970 134096 258606 258673 185879 127334
11591A27334l7658K4780m6140M3188l8459P822O8014p5376O7521j6172q6761l0762
$$ 127334 89676 114456 68316 111504 73045 80867 148881 73505 141026 124854 38093 7331
11579G331r2971k5909L8532J14574J0571j35131L2485m5707L3789J73282J0344
$$ 7331 -85640 -111549 -73017 41557 52128 -83003 -50518 -96225 -62436 110846 121190
11568A21190K7572r4036m5680R2226P379n9102q6433M132J19539M0023J3600j08766
$$ 121190 148762 54726 9046 101272 108651 49549 -36884 -32752 86787 126810 140410 31644
11556C1644p2416K3527j7460R914J14181j14548K1752K0470J82830N390j97218
$$ 31644 -40772 -17245 -34705 -24791 89390 -25158 -3406 17064 199894 205284 8066
11545H066L5811O8489r411m6817j7498J1626o4574N4631Q5527j5775l6443l3749
$$ 8066 43877 112366 102955 56138 38640 50266 -14308 40323 125850 110075 73632 39883
11533C9883o8008J52721K2485K7011k9988O2193J4004j33461j09358m1060l2500
$$ 39883 -28125 124596 147081 174092 144104 206297 220301 86840 -22518 -63578 -96078
11522i6078M8074J09454J7922Q7724m2577K0489j76700Q7243k8014k8444j3978
$$ -96078 -48004 61450 79372 167096 124519 145008 -31692 55551 27537 -907 -14885
11511a4885M1389l9403j8483n2090J6830P4499j6423J4161l8927n7784M1011m1735
$$ -14885 26504 -12899 -31382 -83472 -66642 7857 -8566 5595 -33332 -91116 -50105 -91840
11499i1840M728J57705L7707n4291j48993J7376J24603j6296L308L1703O8610
$$ -91840 -87112 70593 108300 54009 -94984 -77608 46995 30699 34007 65710 134320
11488A34320p6286N284m5136P5624K3144j46933n1079O0144J23266j2113q6970
$$ 134320 58034 63318 18182 93806 116950 -29983 -81062 -20918 102348 90235 3265
11477C265J0523R5648k1678R554o1685j4532O7386O5572N2109N2054j13452j88373
$$ 3265 13788 109436 87758 97312 35627 21095 88481 154053 206162 258216 144764 -43609
11465d3609Q4366M7105n2585L9117O6112N4541K5906o4571j01900p5088J28778
$$ -43609 40757 87862 35277 74394 140506 195047 220953 156382 54482 -20606 108172
11454A08172k7933k6379J11728p3704o3751Q7113j01146m5658J00600J5015J67086
$$ 108172 80239 53860 165588 91884 28133 115246 14100 -31558 69042 84057 251143
11443B51143j3919o6397j20608k8080L0443p4108m0025L604R0715J37894J7723
$$ 251143 237224 170827 50219 22139 52582 -21526 -61551 -57947 32768 170662 188385
11432A88385n8131r4084j5440n1752K0693l5428J32608j2447j2069l185j11327
$$ 188385 130254 36170 20730 -31022 -10329 -45757 86851 74404 62335 59150 -52177
11421e2177m5063M0780R8333O6676q0166L5838M9988o8401J29590K301j27348
$$ -52177 -97240 -56460 41873 108549 28383 64221 114209 45808 175398 177699 50351
11410E0351j08310Q0139p0047L7216L1943O7955k8875J0986k0381Q7542l0748
$$ 50351 -57959 22180 -47867 -10651 21292 89247 60372 71358 50977 138519 107771
11399A07771n2319Q3881O9978K4070r4795j13512K5618J4710K9817j32841n8174
$$ 107771 55452 139333 209311 233381 138586 25074 50692 65402 95219 -37622 -95796
11388i5796J5184j10831P5308Q4590L4961J4224J63639j3672m323j8196Q6417
$$ -95796 -80612 -191443 -116135 -31545 3416 17640 181279 167607 163284 145088 231505
11377B31505o1359j31013j12524O318J20337P194q4765R3722K6407j9575P652
$$ 231505 170146 39133 -73391 -67073 53264 60458 -24307 69415 95822 76247 83899
11366H3899j7935N3574J7197q7001N2952l1425J8913p6573L587J8327Q8951p9696
$$ 83899 65964 119538 136735 49734 102686 71261 90174 13601 17188 35515 124466 44770
11354D4770q9063J81809l1844J414o4225M2865n7122J27314m8509l8227M1473
$$ 44770 -44293 137516 105672 107086 42861 85726 28604 155918 107409 69182 110655
11343A10655j733M0561m0183j33206Q199K7680j419l2026O0765j56281J80149
$$ 110655 108922 149483 109300 -23906 -15707 11973 10554 -21472 39293 -116988 63161
11332F3161O0372j88434k5325J09234O0027J1173L5019n1427j7464M6910M8710
$$ 63161 123533 -64901 -90226 19008 79035 90208 125227 73800 56336 103246 151956
11321A51956k4035J23495L4389k6643j19649j88970R63K46409l3626n4953q1596
$$ 151956 127921 251416 285805 259162 139513 -49457 -48494 197915 164289 109336 27740
11310B7740m8668p9178M7227P1875O8719P1313M255j18522J17877k912j00895
$$ 27740 -20928 -100106 -52879 18996 87715 159028 163283 44761 162638 159726 58831
11299E8831k5137J14632L6428q4662j40472Q0618P4736J5488Q6028k4350j69756
$$ 58831 33694 148326 184754 100092 -40380 40238 114974 130462 216490 192140 22384
11288B2384n0305R0129J43127o2655p2410O28j9345J34530N380Q2455j02656L3540
$$ 22384 -27921 62208 205335 142680 70270 70898 51553 186083 191463 273918 171262 204802
11276B04802o8080j1602Q0075p3519j00271P791l4273l4791J25037Q0723l0843
$$ 204802 136722 125120 205195 131676 31405 39196 4923 -29868 95169 175892 145049
11265A45049J03106n7890j89537n5671R8684R448M1705l004K1689P1175n743m0513
$$ 145049 248155 190265 728 -54943 43741 53189 94894 91890 113579 184754 179011 138498
11253A38498j517J25350l4653r3000r6033q5719l074N4846J52111J6246k9327
$$ 138498 136981 262331 227678 134678 38645 -47074 -50148 4698 156809 173055 143728
11242A43728q9111Q3999Q3138q4595O399N1273O448Q31o6056L9260o6872M3743
$$ 143728 54617 138616 221754 137159 143558 194831 201279 202110 136054 175314 108442 152185
11230A52185O7832m7215k7412j79161j7741J21935Q7432m5528L8928L4110j30919
$$ 152185 220017 172802 145390 -33771 -51512 70423 157855 112327 151255 185365 54446
11219E4446j02406J68294M8415l9961l2473R2940L741l3151o465J5112o6096K4732
$$ 54446 -47960 120334 168749 128788 96315 189255 192996 159845 153380 168492 102396 127128
11207A27128R9489j1386m7349p2900J03232j71303J77889M1857k67055k8232Q2324
$$ 127128 226617 215231 167882 94982 198214 26911 204800 246657 -20398 -48630 33694
11196C3694J11809L055k8048p7637L9258O1450q2915r3427j7975O6921m7663r787
$$ 33694 145503 148558 120510 42873 82131 143581 60666 -32761 -50736 16185 -31478 -41265
11184d1265J80384k8582k876q1650R8178J04048L3700m8136j18248q2198j23345
$$ -41265 139119 110537 107661 26011 124189 228237 261937 213801 95553 13355 -109990
11173a09990Q8473J49708O0064m1249j23637O6910j3930k7637K4148L4964r802
$$ -109990 -21517 128191 188255 147006 23369 90279 76349 48712 72860 107824 98022
11162I8022L6195j9324M790j00215N2956J43893l6642j19947J3719J13661r9609
$$ 98022 134217 114893 119683 19468 72424 216317 179675 59728 73447 187108 87499
11151H7499O2919k287N7521j47268N0427M6659q4486M096M8376P524n606o0031
$$ 87499 150418 148131 205652 58384 108811 155470 70984 75080 123456 130980 125374 65343
11139F5343q9570R0327Q6415l2095o9094L3049P3934k8879p9535O5594o2881j7341
$$ 65343 -24227 66100 152515 120420 51326 84375 158309 129430 49895 115489 52608 35267
11127C5267j8523m4811J43607J09083o1940m9887L0575r2077O1171J3583L3746
$$ 35267 16744 -28067 115540 224623 162683 112796 143371 51294 112465 126048 159794
11116A59794N6627m2919j7551k2521n7873j945R6381L6655q0308K8844n3008j66996
$$ 159794 216421 173502 155951 133430 75557 73612 169993 206648 126340 155184 102176 -64820
11104f4820J30622J64393n8822j52410j5826O4457M340K9431k470l9165J53138
$$ -64820 65802 230195 171373 18963 3137 67594 71934 101365 98895 59730 212868
11093B12868n0740o4076n6198k7954L4749k437J81205k1886n6494J4668n7611
$$ 212868 162128 98052 41854 13900 48649 46212 227417 205531 149037 163705 106094
11082A06094j8004J45712k6073O8878j16483q0454J82548l8791j33333j2349l1375
$$ 106094 88090 233802 207729 276607 160124 79670 262218 223427 90094 77745 46370
11071D6370J18170J44502p7139r9800Q9488L6469n8946K1895L2178L5419n175
$$ 46370 164540 309042 231903 132103 221591 258060 199114 221009 253187 288606 283431
11060B83431J40399J4971l8387m2458J19608J203j36654n2098J3736J00565j0081
$$ 283431 423830 438801 400414 357956 477564 478767 342113 290015 303751 404316 394235
11049C94235p9060n7701l4622L390R5809j49533r5387p462M2925O2417K4681k9465
$$ 394235 315175 257474 222852 226242 322051 172518 77131 69669 112594 175011 199692 170227
11037A70227j57001J06115n0615J271R4747J4542o8257L0614O6496Q901o1311
$$ 170227 13226 119341 68726 69997 164744 179286 111029 141643 208139 217040 155729
11026A55729O6231P8506L6372j67895K2240o4494L7580Q3536q9448O3627l3105
$$ 155729 221960 300466 336838 168943 191183 126689 164269 247805 158357 221984 188879
11015A88879j74268n3708J15867J46543l4153l2968r3274O632m0329M2836Q1703
$$ 188879 14611 -39097 76770 223313 189160 156192 62918 69550 29221 72057 153760
11004A53760j09677m9128J53049J20489n1774j09712r36p2076j20080K2663P0634
$$ 153760 44083 -5045 148004 268493 216719 107007 106071 33995 -86085 -63422 7212
10993G212J23979j1936K9521m6896l9231m0N7711l9901M3706R9069J7592j66469
$$ 7212 131191 119255 148776 101880 62649 62609 120320 80419 124125 223194 240786 74317
10981G4317O5531j05938O1394N8194O2854k1705j70605J27417J18348j39485k9415
$$ 74317 139848 33910 95304 153498 216352 194647 24042 151459 269807 130322 100907
10970A00907m3322l5135J32519K1452l2189L0478j19427q564Q7806n9462n5021
$$ 100907 57585 22450 154969 176421 144232 174710 55283 46719 134525 75063 20042
10959B0042R9144J6176P4038L7231j27811l4886j4421M1031j4375l3503l0287
$$ 20042 119186 135362 209400 246631 118820 83934 69513 110544 96169 62666 32379
10948C2379J45070j9032j8617j3654j04855l0114J20185K8268p0691Q444K6363
$$ 32379 177449 158417 139800 126146 21291 -8823 111362 139630 68939 77383 103746
10937A03746m334O4228J83105j29183P1868j21902n0528N6652j8300k0958j5485
$$ 103746 99412 163640 346745 217562 289430 167528 117000 173652 155352 134394 118909
10926A18909M2422l0886L5795J4830K1676q6771k0523l2321L5783M9514q5835
$$ 118909 161331 130445 166240 181070 202746 115975 95452 63131 98914 148428 62593
10915F2593L004j4746Q8230J51422j7386j33286m5281L8093J0317n7891q8283
$$ 62593 65597 50851 139081 290503 273117 139831 94550 132643 142960 85069 -3214
10904c214L125J62441R0138p4070K6255r6749O0384m1420r8689J8867J44309N7262
$$ -3214 -89 162352 252490 178420 204675 107926 168310 126890 28201 47068 191377 248639
10892B48639Q5931r0356J2760n7158o468Q4689k0561j4581q2107J7607n4760p7379
$$ 248639 334570 244214 256974 199816 193348 278037 257476 242895 160788 178395 123635 46256
10880D6256K5982J10677p0604J52321P1194l8973j81299m6468j20653R1380Q1197
$$ 46256 72238 182915 112311 264632 335826 296853 115554 69086 -51567 39813 121010
10869A21010J1616l3426p1572J17233J12896R9053j12526P859K9063J8069p9084
$$ 121010 132626 99200 27628 144861 257757 356810 244284 252143 281206 299275 220191
10858B20191J1628m8394n8566n4292J09158Q9774l3550j13182P5506n5733K7614
$$ 220191 231819 183425 124859 70567 179725 269499 235949 122767 198273 142540 170154
10847A70154M1684r9344K9522m4083J8626j7224K0340J48318j87704R505J94843
$$ 170154 211838 112494 142016 97933 116559 99335 119675 267993 80289 89794 284637
10836B84637o2185m84j68181j1397J05019k4342k0821m33N9248J4249K5153R3158
$$ 284637 222452 221968 53787 42390 147409 123067 102246 101813 161061 175310 200463 293621
10824B93621o5380q814l4003j77204K0595J22868M2518j27115m3918O6318J18861
$$ 293621 228241 219427 185424 8220 28815 151683 194201 67086 23168 89486 208347
10813B08347Q3722J2646j42490l370P4799J1555m3780n2072P1780J8522m7998
$$ 208347 292069 304715 162225 158855 233654 245209 201429 149357 221137 239659 191661
10802A91661P0596O5156j29011K6057j55035K8024R6496k8143L7157r0297J00017
$$ 191661 262257 327413 198402 224459 69424 97448 193944 165801 202958 112661 212678
10791B12678j7949J4125K5627J442R735j08577J34170j23772m1115R856r885J37235
$$ 212678 194729 208854 234481 235923 245658 137081 271251 147479 106364 116220 106335 243570
10779B43570k8033K354J79074l9178j02950q906k7832L5812l3563l7517J02384
$$ 243570 215537 217891 396965 357787 254837 245931 218099 253911 220348 182831 285215
10768B85215K5867k09057J8868l9132K2329k6013Q5895R9543j21358J52610p15
$$ 285215 311082 102025 120893 81761 104090 78077 163972 263515 142157 294767 294052
10757B94052j15613J7062K3428l8023N9822J15109J7010K7540P1901j95987o7757
$$ 294052 178439 195501 218929 180906 240728 355837 372847 400387 472288 276301 208544
10746B08544J036M7313M3999j8286m7105K580M0831Q2603L1899k18642j5967R930
$$ 208544 209580 256893 300892 282606 235501 238081 278912 361515 393414 174772 158805 168735
10734A68735L1467N4765L6786J5418k7430L732o8841l0117Q5991N9031r700n6394
$$ 168735 200202 254967 291753 307171 279741 283473 214632 184515 270506 329537 319837 263443
10722B63443m4373K3298n8532M3150J6084J1610j33875l8576J12998k6858R4079
$$ 263443 219070 242368 183836 226986 243070 254680 120805 82229 195227 168369 262448
10711B62448p5373O6492N1996o4140j3633p4107J9148j8047J06038L158n4145
$$ 262448 187075 253567 305563 241423 227790 153683 172831 154784 260822 263980 209835
10700B09835P2656p1735m3727J12509K3105M1255k2158P9282J3023j01012k5228
$$ 209835 282491 210756 167029 279538 302643 343898 321740 401022 414045 313033 287805
10689B87805J3601L3813j06932L3665K7973r5447J51505o9444p6353j8337p9203
$$ 287805 301406 335219 228287 261952 289925 194478 345983 276539 200186 181849 102646
10678A02646P281J56323j5813p1m4133q4043r838J283l8577o1286N5854R5405
$$ 102646 109927 266250 250437 250366 206233 122190 112352 113635 75058 13772 69626 165031
10666A65031O0932L8163J43885o0103j73410J6555J33134m7675l8711j36202q8873
$$ 165031 225963 264126 408011 347908 174498 191053 324187 276512 237801 101599 12726
10655A2726P6694Q4382k393o0331L0103J64524r1949l1118K0434l6988N2980M6179
$$ 12726 89420 173802 171409 111078 141181 305705 213756 182638 203072 166084 219064 265243
10643B65243j43320q3977Q0029J07099P6797k1382K3435Q542l2657j7090j07951
$$ 265243 121923 37946 117975 225074 301871 280489 303924 312466 279809 262719 154768
10632A54768K2935J4748l3937k4473P4613m0353L3949M9388r6710M7741R1032
$$ 154768 177703 192451 158514 134041 208654 168301 202250 251638 154928 202669 293701
10621B93701L9206p9473P6664J02030k8558K8916k4250n3183j5302k7508k7572
$$ 293701 332907 253434 330098 432128 403570 432486 408236 355053 339751 312243 284671
10610B84671R6134R750m1375p0227m0307O6147M11q8901O3365J0090o9817M825
$$ 284671 380805 390555 349180 278953 238646 304793 305204 216303 279668 289758 219941 224766
10598B24766M4136K2407N950m4127l2502r2041J22013Q1973M0349K1568j7490
$$ 224766 268902 291309 297259 253132 220630 128589 250602 332575 372924 394492 377002
10587C77002o1263L9052j9662m4292J0207l0499n4559R2358k0581m4201N7974
$$ 377002 315739 354791 335129 290837 301044 270545 215986 308344 287763 243562 301536
10576C01536K3153N7107r9933n8896r6858m2526L5880J54144O1779k6994L0238
$$ 301536 324689 381796 281863 222967 126109 83583 119463 273607 335386 308392 338630
10565C38630n4471j35222J00948l9477Q2145M0030J8896L2329m3432o5421o7386
$$ 338630 284159 148937 249885 210408 292553 332583 351479 383808 340376 274955 207569
10554B07569k5697K274n4372M0705J32443M6547M233j09014l950l3068n1475m6204
$$ 207569 181872 184146 129774 170479 302922 349469 353702 244688 240738 207670 156195 109991
10542A09991J10072O7462K4326K2082j15485L5892J56413n2246j96403J64335
$$ 109991 220063 287525 311851 333933 218448 254340 410753 358507 162104 326439
10532C26439n2854R403L7933r8835K7176k594m9956P3860k7291K1299M830J03976
$$ 326439 273585 282988 320921 222086 249262 246668 196712 270572 243281 264580 269410 373386
10520C73386J2088J46713k2342j62067m0306J19718j251J6449j73968m2394k8348
$$ 373386 385474 532187 509845 347778 307472 427190 425939 442388 268420 226026 197678
10509A97678l3714Q8066O1962J02678j6968r64j22648m5268R181J4201O4986L1437
$$ 197678 163964 252030 313992 416670 399702 398738 276090 230822 240003 254204 319190 350627
10497C50627r035O4468k141k7861j9647P7264j3964p1007R3634L2865j76931l4007
$$ 350627 341592 406060 403919 376058 356411 433675 419711 348704 442338 475203 298272 264265
10485B64265n8645Q618J3O4542l9768l7524m3904j0903J38839P1795n0770j7619
$$ 264265 205620 214238 214251 278793 239025 201501 157597 146694 285533 357328 306558 288939
10473B88939m4443Q9941l8206M1487J4498j58263N5545J08228J29026m5259q4223
$$ 288939 244496 334437 296231 337718 352216 193953 249498 357726 486752 441493 357270
10462C57270J2102k5098j5103J12282j17225O0743m803o6459L8420k14R4136j51965
$$ 357270 369372 344274 329171 441453 324228 384971 380168 313709 352129 351915 446051 294086
10450B94086J638N7456m639J9169m6318L7048m1080J20434k1864m132J63410n1046
$$ 294086 295724 353180 348541 367710 321392 358440 317360 437794 415930 411798 575208 524162
10438E24162j20122j51938N0141M1613J34679q9408j07438k2649k1814L3683L0512
$$ 524162 404040 252102 302243 343856 478535 389127 281689 259040 237226 270909 301421
10427C01421M7304P6389j08574r2387l1303R1973O7970M5698j6630l7161p9041
$$ 301421 348725 425114 316540 224153 192850 284823 352793 398491 381861 344700 265659
10416B65659M8577k7266L7140L2708l1663Q870J5030M401Q6678M4187j25904L7779
$$ 265659 314236 286970 324110 356818 325155 334025 349055 353456 440134 484321 358417 396196
10404C96196p6207j59482J07451J76817l0278J6444n0683J34473p3773p7502o2085
$$ 396196 319989 160507 267958 444775 414497 430941 380258 514731 440958 363456 301371
10393C01371j5282J17367P3462m222m614m5425M1058M8557n0402j34494j5428
$$ 301371 286089 403456 476918 472696 468082 422657 463715 512272 461870 327376 311948
10382C11948R2514L8649Q0270k9204j7776q0798M3573k0729R6523m5865j01952
$$ 311948 404462 443111 523381 494177 476401 395603 439176 418447 514970 469105 367153
10371C67153r8618R9134K5327K5138P0436j26539l6236M6319j2158L3629P5878
$$ 367153 268535 367669 392996 418134 488570 362031 325795 372114 359956 393585 469463
10360D69463j06180K099Q3941q5454j38357J54573N6383n5148J08798P0478p9449
$$ 469463 363283 365382 449323 363869 225512 380085 436468 381320 490118 560596 481147
10349D81147o328N9599L4244j8400k779K310q1571M6759j56300L2287J69104p5522
$$ 481147 474819 534418 568662 550262 547483 549793 468222 514981 358681 390968 560072 484550
10337D84550j22263K085o5760k0661N2216O2050J02138N1974l2708r5175K254
$$ 484550 362287 364372 298612 277951 330167 392217 494355 546329 513621 418446 420700
10326D20700j1028o468L1432J1298j69967J28940K4935J11649j4287L9112j40783
$$ 420700 409672 403204 434636 445934 275967 404907 429842 541491 527204 566316 425533
10315D25533l0441P7972Q6159K2720k9083j06257P3071M5017k1893M8519J1267
$$ 425533 395092 473064 559223 581943 552860 446603 519674 564691 542798 591317 602584
10304F02584k23927R6981J08907j07384N3705L3959m9663q5686M7068k5148J1892
$$ 602584 378657 475638 584545 477161 530866 564825 515162 429476 476544 451396 463288
10293D63288L5089M1260q1600m4103k7411J32567R6163q4555N1328J36235j03547
$$ 463288 498377 539637 458037 413934 386523 519090 615253 530698 582026 718261 614714
10282F14714j58498k7729L8327P7589O5639r5194o1514P7506P3527J8557l3009
$$ 614714 456216 428487 466814 544403 610042 514848 453334 530840 604367 622924 589915
10271E89915j3296p4196o0713K35080k618j54624J12773O4603p111j27539p315
$$ 589915 576619 502423 441710 676790 674172 519548 632321 696924 689813 562274 554959
10260E54959M1890j3494j02827K0067K9940j13979j9990J19333l988j4633J09581
$$ 554959 596849 583355 480528 500595 530535 416556 396566 515899 511911 497278 606859
10249F06859k6841M610j34687K1228J23318q7258p9691R8157M0399p2774K3937
$$ 606859 580018 584628 449941 471169 594487 507229 427538 525695 566094 493320 517257
10238E17257M703p1706P910J03093r9397j9454J11296p9834Q2533q6346N4556
$$ 517257 521960 450254 458164 561257 461860 442406 553702 473868 556401 470055 524611
10227E24611j965N2850O7800q1485k9734O4644K9004J25877k5322n8541r6130
$$ 524611 522646 575496 643296 561811 532077 596721 625725 751602 726280 667739 571609
10216E71609j8595n6426j86965J05503J33513m2413k467k2237Q1606Q3046k5022
$$ 571609 553014 496588 309623 415126 548639 506226 503759 481522 563128 646174 621152
10205F21152R258L5018j6260o1628N3221O0222j17298M9245m3219m7097l6137
$$ 621152 630410 665428 649168 587540 640761 700983 583685 632930 589711 542614 506477
10194E06477O7925J45222k8723m3707J16889j8939j0732o4042q7653j5561m5625
$$ 506477 574402 719624 690901 647194 764083 745144 734412 670370 582717 567156 521531
10183E21531L3864p3471K5353J44989J26409r8332k1027N0878j065m8951J1738
$$ 521531 555395 481924 507277 652266 778675 680343 659316 710194 709129 660178 671916
10172F71916M3020n821N4716o041j97373Q9154J8708p4566K9026j7291n4132M4004
$$ 671916 714936 709115 763831 757790 560417 649571 668279 593713 622739 605448 551316 595320
10160E95320R6996n0661o5997N7571Q1772N1594M7830P6259r6475p5619Q1710
$$ 595320 692316 641655 575658 633229 715001 766595 814425 890684 794209 718590 800300
10149H00300N1250l7457p6751j50895R5869P5271q607r6799Q2967O9332K2905
$$ 800300 851550 814093 737342 586447 682316 757587 748980 652181 735148 804480 827385
10138H27385l7l5437j5526M3305J13004p5827j04516J31573J55344j18174o1021
$$ 827385 827348 791911 776385 819690 932694 856867 752351 883924 1039268 921094 860073
10127H60073J9823M582j05463l6591J27566M5688O1100o8187r7234R0614k4031
$$ 860073 879896 884478 779015 742424 869990 915678 976778 908591 811357 901971 877940
10116H77940M8100M7652j2176L9921m2424k1959O6669k3577O7095P9221j42563
$$ 877940 926040 973692 961516 1001437 959013 937054 1003723 980146 1047241 1126462 983899
10105I83899N9032q5465P8119O4679J34910m9432P8042P6241n4555L2438L2286
$$ 983899 1042931 957466 1035585 1100264 1235174 1185742 1263784 1340025 1285470 1317908 1350194
10094A350194J28147O8492J46847o8549N849N2239J8098R0575l8157M2830J02478
$$ 1350194 1478341 1546833 1693680 1625131 1630980 1683219 1701317 1791892 1753735 1796565 1899043
10083A899043K7215K5116L7814O8049r9429J05747l5092r4432j15614k1623p4035
$$ 1899043 1926258 1951374 1989188 2057237 1957808 2063555 2028463 1934031 1818417 1796794 1722759
10072A722759L5531K8891j25668O8411P2491j04489k069M8973J21070K7716m222
$$ 1722759 1758290 1787181 1661513 1729924 1802415 1697926 1695857 1744830 1865900 1893616 1889394
10061A889394m5577j781J07910O4814j6373l1218j8990J6789R1672m3678q1893
$$ 1889394 1843817 1842036 1949946 2014760 1998387 1967169 1948179 1964968 2056640 2012962 1931069
10050A931069J51236K35750O4105L2263j14990p3105n6494J4565R2796J3364q8262
$$ 1931069 2082305 2318055 2382160 2414423 2299433 2226328 2169834 2184399 2277195 2290559 2202297
10039B202297j90837j24626L7545m0198k03059M366q0445j82693r9817J64573
$$ 2202297 2011460 1886834 1924379 1884181 1681122 1685488 1605043 1422350 1322533 1487106
10029A487106M7334N0803l3405q1650K1760j9561K5714l1806M6688o7465n6790
$$ 1487106 1534440 1585243 1551838 1470188 1491948 1472387 1498101 1466295 1512983 1445518 1388728
10018A388728k8313J29065n242L1301m798J6641j74420J3765J22026m536J7124
$$ 1388728 1360415 1489480 1484238 1515539 1510741 1527382 1352962 1366727 1488753 1484217 1501341
10007A501341P5488J62503J89274l9265L6787J19484o7655j40662M7630J79241
$$ 1501341 1576829 1739332 1928606 1889341 1926128 2045612 1977957 1837295 1884925 2064166
9997B064166Q3957j5236j03367Q7802J11444j12108p8657m6893j97015k6252K373
$$ 2064166 2148123 2132887 2029520 2117322 2228766 2116658 2038001 1991108 1794093 1767841 1770214
9986A770214J20665j33876q9880j4607m9L5463O2922o1353j1286J9562j01669
$$ 1770214 1890879 1757003 1667123 1652516 1652467 1687930 1750852 1689499 1678213 1697775 1596106
9975A596106O1254N6818Q32L2106K2158q8945P5593k6585l5686l2069m1569m8427
$$ 1596106 1657360 1714178 1715010 1747116 1769274 1680329 1755922 1729337 1693651 1661582 1620013 1571586
9963A571586j2632o9198R0610j0594O2303P5094n3517k5110j9036J27273J1650
$$ 1571586 1558954 1489756 1580366 1569772 1632075 1707169 1653652 1628542 1609506 1736779 1748429
9952A748429k0615K1672R3628j36938l9428J40906J83106j48849O5688J402J26235
$$ 1748429 1727814 1749486 1843114 1706176 1666748 1807654 1990760 1841911 1907599 1909001 2035236
9941B035236q4634j1145q3519M0681Q3547j24737K6469N1503N5363Q3118k3236
$$ 2035236 1950602 1939457 1855938 1896619 1980166 1855429 1881898 1933401 1988764 2071882 2048646
9930B048646j06847R7899l1212p3767j754n124j09231J9821K8150J34985K7229
$$ 2048646 1941799 2039698 2008486 1934719 1932965 1927841 1818610 1838431 1866581 2001566 2028795
9919B028795M483j8580q588L0198o7650J3572Q8206J9594l8781O6823M7794M700
$$ 2028795 2033278 2014698 2006110 2036308 1968658 1982230 2070436 2090030 2051249 2118072 2165866 2170566
9907B170566q6376p2631J59899N4201O1208p341j04645j4468L9554P5591O9886
$$ 2170566 2084190 2011559 2171458 2225659 2286867 2279526 2174881 2160413 2199967 2275558 2345444
9896B345444L0380Q9346l737J5386k9015l4388L5972m3234P4861J01341j00839
$$ 2345444 2375824 2465170 2461433 2476819 2447804 2413416 2449388 2406154 2481015 2582356 2481517
9885B481517o7O4730N0192J64604J34661k01235j07343M6008K34922K543j3294
$$ 2481517 2481450 2546180 2596372 2760976 2895637 2694402 2587059 2633067 2867989 2870532 2857238
9874B857238q503m7068M4951L8476J38095l1623K9211N1319J5396L3871Q4111
$$ 2857238 2848735 2801667 2846618 2885094 3023189 2991566 3020777 3072096 3087492 3121363 3205474
9863C205474M6826M9617l1317k7478L4871O0537L2572L8549J1603N6387J67980
$$ 3205474 3252300 3301917 3270600 3243122 3277993 3338530 3371102 3409651 3421254 3477641 3645621
9852C645621K1816m5824k1107J8641J68164M7339Q7929J3631L962R6276J2943
$$ 3645621 3667437 3621613 3600506 3619147 3787311 3834650 3922579 3936210 3940172 4036448 4049391
9841D049391O3679P6081J64739p9185R272J06457m1704j79308J48502J59233J24479
$$ 4049391 4113070 4189151 4353890 4274705 4283977 4390434 4348730 4169422 4317924 4477157 4601636
9830D601636m1256j0223J01456J16145O0277M9182O5036k2047J39881k7334M197
$$ 4601636 4560380 4550157 4651613 4767758 4828035 4877217 4942253 4920206 5060087 5032753 5036950
9819E036950Q624J66460K29212J31643P4555N5779k2481N778J77905J07422O1615
$$ 5036950 5045574 5212034 5441246 5572889 5647444 5703223 5680742 5686520 5864425 5971847 6033462
9808F033462O5422K46445J64906N6038N9623J53154J52676J57007L8100l7719
$$ 6033462 6098884 6345329 6510235 6566273 6625896 6779050 6931726 7088733 7126833 7089114
9798G089114L23425K12803J41637J8375M7012K51915K09068J38920P6593Q7196
$$ 7089114 7412539 7625342 7766979 7785354 7832366 8084281 8293349 8432269 8508862 8596058
9788H596058K53093J67771K83647K46001K84918K81357K85189L09324K11972L08944
$$ 8596058 8849151 9016922 9300569 9546570 9831488 10112845 10398034 10707358 10919330 11228274
9778A1228274L27949L65751L45196M85080M11464L05535N10234L81953L40501
$$ 11228274 11556223 11921974 12267170 12752250 13163714 13469249 13979483 14361436 14701937
9769A4701937O34724O01602N19013P83105P04267P12748Q36434Q21571J074945
$$ 14701937 15336661 15938263 16457276 17240381 17944648 18657396 19493830 20315401 21390346
9760B1390346J169941J039363J268270J385070J512876J714581J780606J868221
$$ 21390346 22560287 23599650 24867920 26252990 27765866 29480447 31261053 33129274
9752C3129274K117113K511920K880743L038973L297382L626142M042769M523306
$$ 33129274 35246387 37758307 40639050 43678023 46975405 50601547 54644316 59167622
9744E9167622N123716N997508O754501P531861Q467842Q885173R065432R279899
$$ 59167622 64291338 70288846 77043347 84575208 93043050 101928223 110993655 120273554
9736A20273554R385278Q656456P755324P394284O977743O574921O356697O045436
$$ 120273554 129658832 138315288 146070612 153464896 160442639 167017560 173374257 179419693
9728A79419693O258232O692782O439081O055701N126272L781590K428893M58305
$$ 179419693 185677925 192370707 198809788 204865489 209991761 213773351 216202244 216660549
9720B16660549j275708k527521m614060n992030o544105p256657p847614p481382
$$ 216660549 215384841 212857320 208243260 202251230 195707125 188450468 180602854 173121472
9712A73121472o648254n554493m113386k560778q04864R10237K336594L776699
$$ 173121472 166473218 160918725 156805339 154244561 153439697 154349934 156686528 160463227
9704A60463227M926843N404707O102640O229641N815825M656683M052669L570542
$$ 160463227 165390070 170794777 176897417 183127058 188942883 193599566 197652235 201222777
9696B01222777L111814L059964K606480K724691L659056M012604L901338M408850
$$ 201222777 204334591 207394555 210001035 212725726 216384782 220397386 224298724 228707574
9688B28707574M191045K390298r836j496662l932286q105560j1304681j2146025
$$ 228707574 232898619 235288917 235279081 233782419 229850133 221744573 210439892 198293867
9680A98293867j2911238j3958469j3926184j3242025j2200534j0796427r647201
$$ 198293867 185382629 171424160 157497976 144255951 132055417 121258990 111611789
9673A11611789q331994p343639o514625n773246n300630m828928m437137m166384
$$ 111611789 103279795 95936156 89421531 83648285 78347655 73518727 69081590 64915206
9665F4915206l964419l610645l341417l024005k756690k609280k476481k300999
$$ 64915206 60950787 57340142 53998725 50974720 48218030 45608750 43132269 40831270
9657D0831270k067439j969392j836652j506767j421508j297228j250207j116400
$$ 40831270 38763831 36794439 34957787 33451020 32029512 30732284 29482077 28365677
9649B8365677j052176j050681j004042j050761p93669q30807p46949n99254o85907
$$ 28365677 27313501 26262820 25258778 24208017 23414348 22583541 21836592 21237338 20551431
9640B0551431o44857p23969n97191o22670o20930m77786l71609m57025m05193
$$ 20551431 19906574 19182605 18585414 17962744 17341814 16864028 16492419 16035394 15630201
9631A5630201m12089m65190l55008m06018k28185l98350k81980l17180l99537
$$ 15630201 15218112 14752922 14397914 13991896 13763711 13365361 13083381 12766201 12366664
9622A2366664k09812l34593j95003j05778k23426j05990k18034k25444l47694
$$ 12366664 12156852 11822259 11627256 11521478 11298052 11192062 10974028 10748584 10400890
9613A0400890j42469k6385j56685j71530q7298j30013j14724k57562j98138m0033
$$ 10400890 10258421 10232036 10075351 9903821 9816523 9686510 9571786 9314224 9116086 9076053
9603I076053L7600k12891k54599j54385p7023j23301k49914J3165o9280o761j64095
$$ 9076053 9113653 8900762 8646163 8491778 8414755 8291454 8041540 8054705 7985425 7978664 7814569
9592G814569j77943j23512N42j39075j84035p5678q5657K9855o3345r5607j32914
$$ 7814569 7636626 7513114 7513656 7374581 7190546 7114868 7029211 7059066 6995721 6900114 6767200
9581F767200k1830q6386K0223j4960l8955K3192o0295m2417j28675q699j01425
$$ 6767200 6745370 6658984 6679207 6664247 6625292 6648484 6588189 6545772 6417097 6408398 6306973
9570F306973r7075j34171l2132n4696n8640j34195Q9051O5863p269J4349j16030
$$ 6306973 6209898 6075727 6043595 5988899 5930259 5796064 5885115 5950978 5943709 5958058 5842028
9559E842028j01476m17k71n0927J2886j2398N40k0422q1858j16843J21877J43599
$$ 5842028 5740552 5740135 5739864 5688937 5701823 5689425 5689965 5669543 5587685 5470842 5592719 5736318
9547E736318n7386j77489o2034J48427j16349j38414l0781r381r7862o2149k1954
$$ 5736318 5678932 5501443 5439409 5587836 5471487 5333073 5302292 5292911 5195049 5132900 5110946
9536E110946o6518j54798p3492q0119j54216o5343o333p8085j507k3488k10008
$$ 5110946 5044428 4889630 4816138 4736019 4581803 4516460 4510127 4432042 4430535 4407047 4197039
9525D197039M4795l4565k5236J14998K8584j69331Q141J06291k216M1965l1746
$$ 4197039 4241834 4207269 4182033 4297031 4325615 4156284 4164425 4270716 4268500 4310465 4278719
9514D278719j957k3106O7943l3004J02572P9050n2130n4974J50818L7814j30183
$$ 4278719 4276762 4253656 4321599 4288595 4391167 4470217 4418087 4363113 4513931 4551745 4421562
9503D421562N3258R4266j55329j50722L7469k22514N6996o9129n3093J73452q1692
$$ 4421562 4474820 4569086 4413757 4263035 4300504 4077990 4134986 4065857 4012764 4186216 4104524
9492D104524j49952J1328O079q8899L5567K8664l854l2180j43244K2850P4798
$$ 4104524 3954572 3965900 3971979 3883080 3918647 3947311 3943457 3911277 3768033 3790883 3865681
9481C865681L734q7488J3115O1344J4391J6658O8005Q4442p7083K560M9924J03964
$$ 3865681 3869415 3781927 3795042 3856386 3870777 3887435 3955440 4039882 3962799 3965359 4015283 4119247
9469D119247m0980o0996p253j16716o3271k688j14082k978J43731O2925q2177
$$ 4119247 4078267 4017271 4010018 3893302 3830031 3827343 3713261 3710283 3854014 3916939 3834762
9458C834762Q5986p3374L1951j5272j52656j55715N6565P1141j19727J07441L651
$$ 3834762 3920748 3847374 3879325 3864053 3711397 3555682 3612247 3683388 3563661 3671102 3674753
9447C674753j16243M7950j12691J8095Q337j21533N6581l38K2201n159r645L1184
$$ 3674753 3558510 3606460 3493769 3511864 3520201 3398668 3455249 3454911 3477112 3471953 3462308 3493492
9435C493492k8674j43117L8524m6952Q1298j43043j01986J28800R8567n6552q1515
$$ 3493492 3464818 3321701 3360225 3313273 3394571 3251528 3149542 3278342 3376909 3320357 3238842
9424C238842j55870j01106O607Q1063j0464p5645q028j9493J49309M490N6232
$$ 3238842 3082972 2981866 2988473 3069536 3059072 2983427 2975399 2955906 3105215 3109705 3165937
9413C165937K2711n4469K1549j40776J18604K7470O7854o0741m0770L0645M2639
$$ 3165937 3188648 3134179 3155728 3014952 3133556 3161026 3228880 3168139 3127369 3158014 3200653
9402C200653n4975k2018M4379L1152k286M3473k3480Q2019J42174J45505r6858
$$ 3200653 3145678 3123660 3168039 3199191 3196905 3240378 3216898 3298917 3441091 3586596 3489738
9391C489738n2608J98348J81576o512q5506l0519q1695o6201N1440K0791n371
$$ 3489738 3437130 3635478 3817054 3810542 3725036 3694517 3612822 3546621 3598061 3618852 3613481
9380C613481O3781O3513O0868K4310O6509N0029p0636J77223J64771O737J51002
$$ 3613481 3677262 3740775 3801643 3825953 3892462 3942491 3871855 4049078 4213849 4220586 4371588
9369D371588L920J2368N7969J40321J10071J43172J20970R2119L379j41765j1779
$$ 4371588 4375508 4387876 4445845 4586166 4696237 4839409 4960379 5052498 5055877 4914112 4902333
9358D902333N2378j09321J15077n9543J10981L362j34215Q223J18101k4591J2806
$$ 4902333 4954711 4845390 4960467 4900924 5011905 5015267 4881052 4889275 5007376 4982785 4995591
9347D995591J03890N0536l8772J55487R2051j00777P4873J95185J2758R2669J68706
$$ 4995591 5099481 5150017 5111245 5266732 5358783 5258006 5332879 5528064 5540822 5633491 5802197
9336E802197J89468P1345j2920J1040L9277R9345R7541n1649M3688J58833J52512
$$ 5802197 5991665 6063010 6050090 6061130 6100407 6199752 6297293 6245644 6289332 6448165 6600677
9325F600677P5811r6888J37514P644M869q0625k19032L7012q2151n0655p3461
$$ 6600677 6676488 6579600 6717114 6724758 6729627 6649002 6429970 6466982 6384831 6334176 6260715
9314F260715j36973j26435M111P762O3125P8785N7897r5892p2539O7042m748J22050
$$ 6260715 6123742 5997307 6001418 6009180 6072305 6151090 6208987 6113095 6040556 6107598 6102850 6224900
9302F224900K8955n4831J34887m7843L9173J38974K4395M3897j1192j77Q5135
$$ 6224900 6253855 6199024 6333911 6286068 6325241 6464215 6488610 6532507 6521315 6521138 6606273
9291F606273j3265r6665J33677Q9700j6646n6506M0085J14609P3855l413P4573
$$ 6606273 6593008 6496343 6630020 6719720 6703074 6646568 6686653 6801262 6875117 6871704 6946277
9280F946277j67892K4331R3243j43718J00061J4968l6894J80252J17371L2152
$$ 6946277 6778385 6802716 6895959 6752241 6852302 6867270 6830376 7010628 7127999 7160151
9270G160151P8683m8429k3700J88034M2546n977J0659M4099J38031Q0157J6587
$$ 7160151 7238834 7190405 7166705 7354739 7397285 7391308 7401967 7446066 7584097 7664254 7680841
9259G680841Q2660J01176J27253M7069k5832J4062J20936J63741J67985J22098
$$ 7680841 7763501 7864677 7991930 8038999 8013167 8027229 8148165 8311906 8479891 8601989
9249H601989j1668K1722K47179J24661J3501K16479M1967J37381J49566p1808
$$ 8601989 8590321 8612043 8859222 8983883 8997384 9213863 9255830 9393211 9542777 9470969
9239I470969K41669J02648K06284J99652J34216K00427J67603J86911L08937L23384
$$ 9470969 9712638 9815286 10021570 10221222 10355438 10555865 10723468 10910379 11219316 11542700
9229A1542700J09157J11052L15468K62146K73476L63070L86995K38344N25573
$$ 11542700 11651857 11762909 12078377 12340523 12613999 12977069 13364064 13602408 14127981
9220A4127981L86857M26309O01888M31493O92235M08118M50094L67636M32534
$$ 14127981 14514838 14941147 15543035 15974528 16666763 17074881 17524975 17892611 18325145
9211A8325145M30099M79723N34185O70570P16933O33566Q97471R05564J058659
$$ 18325145 18755244 19234967 19769152 20439722 21156655 21790221 22687692 23593256 24651915
9202B4651915J155119J438320J522062J524529J916790K083134K299126K701571
$$ 24651915 25807034 27245354 28767416 30291945 32208735 34291869 36590995 39292566
9194C9292566K795729L147441K854209K691814K672007J965511J512790J065054
$$ 39292566 42088295 45235736 48089945 50781759 53453766 55419277 56932067 57997121
9186E7997121N47510O9531m09921q54216r32004j061255j101241o33517k39950
$$ 57997121 58544631 58614162 58204241 57350025 56418021 55356766 54255525 53622008 53382058
9177E3382058O9470N87349R34143J046780J536215J931844K235383K466372L048480
$$ 53382058 53451528 54038877 54973020 56019800 57556015 59487859 61723242 64189614 67238094
9168F7238094L597211M164318M792039N432318O105538O430527O457784O915534
$$ 67238094 70835305 74999623 79791662 85223980 91329518 97760045 104217829 111133363
9160A11133363P598128P804366Q011991Q474461Q838022Q482310Q277559P358547
$$ 111133363 118731491 126535857 134547848 143022309 151860331 160342641 168620200 175978747
9152A75978747N766315M384428L320816J789897K17584j002020k747065l938274
$$ 175978747 181745062 186129490 189450306 191240203 191457787 190455767 187708702 183770428
9144A83770428l869122l915799l569893k125003n1310J838270L494314N166339
$$ 183770428 179901306 175985507 172415614 170290611 170239301 172077571 175571885 180738224
9136A80738224P325716Q872868J0835772J3048961J5021898J7401963J9627460
$$ 180738224 188063940 196936808 207772580 220821541 235843439 253245402 272872862
9129B72872862K0990805K1641428K2014430K0919774J7628810J4811621J2786931
$$ 272872862 293863667 315505095 337519525 358439299 376068109 390879730 403666661
9122D03666661R702007N463799R35571l338493o165800q903258j4754453j9287655
$$ 403666661 413368668 418832467 419768038 416429545 410263745 401360487 386606034 367318379
9114C67318379j8964293j6715645j5177833j2915172r735049p477418n774147
$$ 367318379 348354086 331638441 316460608 303545436 293810387 286332969 280558822
9107B80558822m070608l499136l650397l094917k643615l700007m438476m017451
$$ 280558822 276488214 272989078 269338681 266243764 263600149 259900142 255461666 251444215
9099B51444215n305169o875785o572633o053616n713283n375963m530333l645400
$$ 251444215 246139046 239263261 232690628 226637012 220923729 215547766 211017433 207372033
9091B07372033l613504m103207n050220o174046o613796p099750p030753o669209
$$ 207372033 203758529 199655322 194605102 188431056 181817260 174717510 167686757 161017548
9083A61017548o131637n761659n210135n020272m914464m742439m010711l021669
$$ 161017548 154885911 149124252 143914117 138893845 133979381 129236942 125226231 122204562
9075A22204562k321300j372184p21477l31322k58777J42406L3866o62499q29781
$$ 122204562 119883262 118511078 117789601 117458279 117199502 117341908 117375774 116713275 115883494
9066A15883494o79586q36064r36633n05639k4419J18998K95487N88133O30191
$$ 115883494 115203908 114367844 113431211 112925572 112901153 113020151 113315638 113903771 114533962
9057A14533962k16514m15449n48129j491669k164720k776007l188452l636738
$$ 114533962 114317448 113901999 113353870 111862201 109697481 106921474 103733022 100096284
9049A00096284m216704m815900n314951n312153m994147m200794l884747l336452
$$ 100096284 95879580 91063680 85748729 80436576 75442429 71241635 67356888 64020436
9041F4020436k942081k624183k215390j985648j668190j322509j201711j085439
$$ 64020436 61078355 58454172 56238782 54253134 52584944 51262435 50060724 48975285
9033D8975285p64777o01992m93739l49676l12314j08242k49472j04151r7213p3594
$$ 48975285 48210508 47608516 47114777 46765101 46452787 46344545 46095073 45990922 45893709 45820115
9023D5820115O227P6722J61148K34852N52661N53150O86311J040203J126862J258345
$$ 45820115 45826342 45903064 46064212 46299064 46851725 47404875 48091186 49131389 50258251 51516596
9013E1516596J479672J716579J936354K181446K626694L000572L243413L682784
$$ 51516596 52996268 54712847 56649201 58830647 61457341 64457913 67701326 71384110
9005G1384110M210735M656610N437863O345912O763381P349885P955232P911922
$$ 71384110 75594845 80251455 85689318 92035230 98798611 106148496 114103728 122015650
8997A22015650P504496P170075O621175M790249K904985K131681J253529k52203
$$ 122015650 129520146 136690221 143311396 148101645 151006630 153138311 154391840 154139637
8989A54139637j007205j008342r46134j255855p33284k12731R1370M76036J097693
$$ 154139637 153132432 152124090 151177956 149922101 149188817 148976086 149067456 149543492 150641185
8980A50641185J341432K045784L366461M790919O220719P547657Q678369R619832
$$ 150641185 151982617 154028401 157394862 162185781 168406500 175954157 184632526 194252358
8972A94252358J0617026J1140210J1030729J1149410J1017295R925811Q652990
$$ 194252358 204869384 216009594 227040323 238189733 249207028 259132839 267785829
8965B67785829Q945969R100793P809052O525920O040763N200099K878841l60929
$$ 267785829 276731798 285832591 293641643 300167563 306208326 311408425 314287266 313926337
8957C13926337l418370o342838q832691j0407617j1544711j2472914j2253401
$$ 313926337 310507967 304165129 295332438 284924821 273380110 260907196 248653795
8950B48653795j0758570q955855p324745n891408m551507l381723k228076n96385
$$ 248653795 237895225 228939370 221614625 215723217 211171710 207789987 205561911 204965526
8942B04965526N28559J723762K689028K596262K421630K522716K487547K084977
$$ 204965526 205494085 207217847 209906875 212503137 214924767 217447483 219935030 222020007
8934B22020007K082603J482759P61091L81472N58976M98881J12896P16380K050823
$$ 222020007 224102610 225585369 226346460 226727932 227286908 227785789 227898685 228615065 230665888
8925B30665888L230437L768379N028871O513258N659818M280502O336411J740341
$$ 230665888 233896325 237664704 242693575 249206833 254866651 259147153 265483564 267223905
8917B67223905o930868q754875r890088j7141492k1562347j7275963j3893095
$$ 267223905 260293037 251538162 241648074 224506582 202944235 185668272 171775177
8910A71775177j1983016r958057q135450p093893o468337o529171o152627o174956
$$ 171775177 159792161 149834104 141698654 134604761 128136424 121607253 115454626 109279670
8902A09279670o008956n661212n724085n640171n392864n077017m819100m285533
$$ 109279670 103270714 97609502 91885417 86245246 80852382 75775365 70956265 66670732
8894F6670732l782346l329326k937611l004109k565878k287322k180749k009813
$$ 66670732 62888386 59559060 56621449 53617340 51051462 48764140 46583391 44573578
8886D4573578j893208j814418j682022j479303j417807j305204j338004j393265
$$ 44573578 42680370 40865952 39183930 37704627 36286820 34981616 33643612 32250347
8878C2250347j185879r32631r99110j069276j048503r14298p37892p97631p30037
$$ 32250347 31064468 30131837 29132727 28063451 27014948 26100650 25362758 24565127 23835090
8869B3835090p42466n61390o37416o94568n03095m72480m47912m49871m64194
$$ 23835090 23092624 22531234 21893818 21199250 20696155 20223675 19775763 19325892 18861698
8860A8861698l96288m60954m99298m13371l74318k39307m27599l37174l21592
$$ 18861698 18465410 18004456 17505158 17091787 16717469 16478162 16050563 15713389 15391797
8851A5391797m47401l21507j64447l12771l49597j80575k84132m23823k33084
$$ 15391797 14944396 14622889 14458442 14145671 13796074 13615499 13331367 12907544 12674460
8842A2674460k35298j70439j54793k93935l03260k66080j06956j75608p2745j88726
$$ 12674460 12439162 12268723 12113930 11819995 11516735 11250655 11143699 10968091 10895346 10706620
8832A0706620l80083j69889l228j23180q7193r5079k18200p1460j24187o8165
$$ 10706620 10326537 10156648 10153420 10030240 9943047 9847968 9629768 9558308 9434121 9365956
8822I365956j70984j58802k4722p7691o3777m0358j16426n2177k12564j01335
$$ 9365956 9194972 9036170 9011448 8933757 8869980 8829622 8713196 8661019 8448455 8347120
8812H347120j32515k34430j50646o7647j13658j74037l9698k7471j70472j35434
$$ 8347120 8214605 7980175 7829529 7761882 7648224 7474187 7434489 7407018 7236546 7101112
8802G101112j09602k5085j00966j41752m0755q8992p2148O5245n9337k4934L9197
$$ 7101112 6991510 6966425 6865459 6723707 6682952 6593960 6521812 6587057 6527720 6502786 6541983
8791F541983p9552n1050j57727N3792J73922j6656L5672j13372j39054P4843J65228
$$ 6541983 6462431 6411381 6253654 6307446 6481368 6464712 6500384 6387012 6247958 6322801 6488029
8780F488029m9708j44918r5729r1259q8135r918l9842R394j00626r0087m3831
$$ 6488029 6438321 6293403 6197674 6106415 6018280 6008362 5968520 5977914 5877288 5787201 5743370
8769E743370j19082j18029P180P1547O8274N341n0426j15031q5398R51n5567o7679
$$ 5743370 5624288 5506259 5513439 5584986 5653260 5658601 5608175 5493144 5407746 5408697 5353130 5285451
8757E285451k5782N4307L9302o9448k3107J59663m621o938J9223L0334J898j04019
$$ 5285451 5259669 5313976 5353278 5283830 5260723 5420386 5415765 5408827 5428050 5458384 5460282 5356263
8745E356263j16706k20711o8650J7733K7615m6890j12641j17808q6041M0187k9029
$$ 5356263 5239557 5018846 4950196 4967929 4995544 4948654 4836013 4718205 4632164 4672351 4643322
8734D643322o1519J15466j4384j26067j36066l8357Q9978q1486j27976j11277
$$ 4643322 4581803 4697269 4682885 4556818 4420752 4382395 4472373 4390887 4262911 4151634
8724D151634O4738Q5239l8047o8937n359p312K592j41460o6746Q2105j30964l0139
$$ 4151634 4216372 4301611 4263564 4194627 4189268 4181956 4184548 4043088 3976342 4058447 3927483 3897344
8712C897344J53744j02568q8656K6442l6776j39211p2155j4702J2293o3208r8674
$$ 3897344 4051088 3948520 3859864 3886306 3849530 3710319 3638164 3623462 3635755 3572547 3473873
8701C473873r029J1752j52726j98419j23351o6684L132J6255o0542K7892j05449
$$ 3473873 3464844 3476596 3323870 3125451 3002100 2935416 2938548 2954803 2894261 2922153 2816704
8690B816704m287K3116n5708p7524r4630J3898p9635r9623J20722q853L9029j23205
$$ 2816704 2812417 2835533 2779825 2702301 2607671 2621569 2541934 2442311 2563033 2554180 2593209 2470004
8678B470004k3907M0906l6477L5478j02329j18297j39684M4138n0786m9542N0438
$$ 2470004 2446097 2487003 2450526 2486004 2383675 2265378 2125694 2169832 2119046 2069504 2119942
8667B119942J00745n7221q1023l2008k8913p1248j03454M9108L2632m1023j51827
$$ 2119942 2220687 2163466 2082443 2050435 2021522 1950274 1846820 1895928 1928560 1887537 1735710
8656A735710r400Q1614j43525k0959N9815K9564M6915q9280m7591J2204N8678
$$ 1735710 1726310 1807924 1664399 1643440 1703255 1732819 1779734 1690454 1642863 1655067 1713745
8645A713745k794p5944m4530k0161P303J11457J5138R0225P3655j1564R6637j3280
$$ 1713745 1710951 1635007 1590477 1570316 1577619 1689076 1704214 1794439 1868094 1856530 1953167 1939887
8633A939887j43627P5984m8770q99M6193l263O5134m4586j05513m8567M0913m1398
$$ 1939887 1796260 1872244 1823474 1822575 1868768 1865505 1930639 1886053 1780540 1731973 1772886 1731488
8621A731488O9024j61275R7251o9963k8671P9147j7273P6459J3271K3473L4862
$$ 1731488 1800512 1639237 1736488 1666525 1637854 1717001 1699728 1776187 1789458 1812931 1847793
8610A847793j00457Q7281L4821P0958J40543J6431j8397l720J70044K4141J62860
$$ 1847793 1747336 1834617 1869438 1940396 2080939 2097370 2078973 2075253 2245297 2269438 2432298
8599B432298M4115R118n1933Q7821q9209q6346J09847j16684P18m1164j80759
$$ 2432298 2476413 2485531 2433598 2521419 2432210 2345864 2455711 2339027 2339745 2298581 2117822
8588B117822k84102J04431L31869j21081k47246Q3479J658q3727k4282N8954L216
$$ 2117822 1833720 1938151 2270020 2148939 1901693 1985172 1986830 1903103 1878821 1937775 1940991
8577A940991k19084q2292R0602L2897N4355k6387R951o293Q008R582M6672M8190
$$ 1940991 1721907 1639615 1730217 1763114 1817469 1791082 1801033 1794740 1802748 1812330 1859002 1907192
8565A907192l4049J1458j9732k9261L18Q4484N7233k05002l507k5754o4022L8173
$$ 1907192 1873143 1884601 1864869 1835608 1835926 1920410 1977643 1772641 1769134 1743380 1679358 1717531
8553A717531q0137p5711j39097n2897j2942p0848N0424k4838j1j01530j40613
$$ 1717531 1637394 1561683 1422586 1369689 1356747 1285899 1336323 1311485 1311474 1209944 1069331
8542A069331J28616J6882K8785p4171j14592K27513O3910j50001p9330k2315O6546
$$ 1069331 1197947 1214829 1243614 1169443 1054851 1282364 1346274 1196273 1116943 1094628 1161174
8531A161174m0531m2556o37P7140j986j47437O7428Q37p7848j54907m3869Q591
$$ 1161174 1120643 1078087 1077450 1154590 1152604 1005167 1072595 1073432 995584 840677 796808 805399
8519H05399N926n8692o06P0719m0496m8792M5684j0166m0642O0673j98647J8005
$$ 805399 811325 752633 752027 822746 782250 733458 779142 768976 728334 789007 590360 608365
8507F08365k7029L2881J8310O6128m5673o007l9296j6997J01581Q7863N0918j08651
$$ 608365 581336 614217 632527 698655 652982 646975 607679 590682 692263 780126 831044 722393
8495G22393l0906R835N0705n149j0053j6283j37542N513J23833K6310Q1431M2163
$$ 722393 691487 701322 752027 746878 736825 720542 583000 588513 712346 738656 820087 862250
8483H62250j14661l1341k6359Q4200j1564N0872n398N9328l014P8747M4782r7502
$$ 862250 747589 716248 689889 774089 762525 813397 807999 867327 864313 943060 987842 890340
8471H90340J1351N4441K05606K592J02245m5580N1454J47486J62477j164p1269
$$ 890340 901691 956132 1161738 1164330 1266575 1220995 1272449 1419935 1582412 1581248 1509979
8460A509979Q9408R8456K82233K95145J26208K06461R9089O9432K86515R9175
$$ 1509979 1599387 1697843 1980076 2275221 2401429 2607890 2706979 2776411 3062926 3162101
8450C162101Q835Q370J41840J25149J37905K97925J79039K61772J83393L18744
$$ 3162101 3170936 3179306 3321146 3446295 3584200 3882125 4061164 4322936 4506329 4825073
8440D825073K63094O986R3830M8661M9312J02649J8531O7702k7945j4686j9433
$$ 4825073 5088167 5095153 5188983 5237644 5286956 5389605 5408136 5475838 5447893 5433207 5413774
8429E413774n3003j67152j76902L5346K7827q0388P6623J68709p7088j35235j46603
$$ 5413774 5360771 5193619 5016717 5052063 5079890 4999502 5076125 5244834 5167746 5032511 4885908
8418D885908j44290l34046l29523k33084k09880j55267j55682k03076k33431j32491
$$ 4885908 4741618 4407572 4078049 3844965 3635085 3479818 3324136 3121060 2887629 2755138
8408B755138k5791j65884k5270J9717N5378m8216p0034R0994j50135K5236J72447
$$ 2755138 2729347 2563463 2538193 2557910 2613288 2565072 2495038 2586032 2435897 2461133 2633580
8397B633580R2262q2518J3381K19864k7997j07637O0169p624k7417p200L2260
$$ 2633580 2725842 2643324 2656705 2876569 2848572 2740935 2801104 2793480 2766063 2758863 2791123
8386B791123L206q0728j06375n8874p0816j52168j05851o7220k9295k01571L8365
$$ 2791123 2794329 2713601 2607226 2548352 2477536 2325368 2219517 2152297 2123002 1921431 1959796
8375A959796K0170J9004J13134j41692L4440l1415J1245r8760M304K15226J12909
$$ 1959796 1979966 1998970 2112104 1970412 2004852 1973437 1984682 1885922 1890226 2105452 2218361
8364B218361J31642P9085J8967K74357J31938N3404Q5525m2956N5027J2078J62988
$$ 2218361 2350003 2429088 2448055 2722412 2854350 2907754 2993279 2950323 3005350 3017428 3180416
8353C180416N2410N4544J53155j1247m7601M0703m3525M3692R3384m4732j18748
$$ 3180416 3232826 3287370 3440525 3429278 3381677 3422380 3378855 3422547 3515931 3471199 3352451
8342C352451k10114m9047q36j90767l7349j74580j1466J35877J2886K7466M2915
$$ 3352451 3142337 3093290 3092454 2901687 2864338 2689758 2678292 2814169 2827055 2854521 2897436
8331B897436q7594j43093m3466j95745J65036N0550j56226o382q234j33589r2790
$$ 2897436 2809842 2666749 2623283 2427538 2592574 2643124 2486898 2480516 2472282 2338693 2245903
8320B245903j2220L3016J8625R5557k6483j11851P5900J5168M28M1991J09624
$$ 2245903 2233683 2266699 2285324 2380881 2354398 2242547 2318447 2333615 2334043 2376034 2485658
8309B485658J34269M5000n7224J5857O5131R1075j40880j60229O6553k8608L1887
$$ 2485658 2619927 2664927 2607703 2623560 2688691 2779766 2638886 2478657 2545210 2516602 2548489
8298B548489n3530P167m7877J12264J19595j64229k1520j02938n2886k8461m9682
$$ 2548489 2494959 2502126 2454249 2566513 2686108 2521879 2500359 2397421 2344535 2316074 2266392
8287B266392j32246M1441k6244q1908j11021p006o6240j34410M7414J2288M130
$$ 2266392 2134146 2175587 2149343 2067435 1956414 1949408 1883168 1748758 1796172 1808460 1812590
8276A812590o1845k7548m2799O1704R7854N2302J2628K5118J38174K4271o6905
$$ 1812590 1750745 1723197 1680398 1742102 1839956 1892258 1904886 1930004 2068178 2092449 2025544
8265B025544p5265J77637J70399q3368r839Q0453J17762M8637K0125o8795N9070
$$ 2025544 1950279 2127916 2298315 2214947 2205108 2285561 2403323 2451960 2472085 2403290 2462360
8254B462360K35060J90268j7263O1063K5803K35339J01841N7853r7758M770R7254
$$ 2462360 2697420 2887688 2870425 2931488 2957291 3192630 3294471 3352324 3254566 3259336 3356590
8243C356590l1351r1963J06308N6437j04441J7394J4645k4373o5801n5180P129
$$ 3356590 3325239 3233276 3339584 3396021 3291580 3308974 3323619 3299246 3233445 3178265 3185394
8232C185394j02049o6626o6014k14133J24203m4859j1810j11222N1010j19655
$$ 3185394 3083345 3016719 2950705 2736572 2860775 2815916 2804106 2692884 2743894 2624239
8222B624239o8075j5983j6618o9158Q9335L523k577n6124Q1244L8087m271j9874
$$ 2624239 2556164 2540181 2523563 2454405 2543740 2547263 2544686 2488562 2569806 2607893 2603622 2583748
8210B583748j6113l5454k9485N1366o2709J9862p9289o6801O4489o8082J9509
$$ 2583748 2567635 2532181 2502696 2554062 2491353 2511215 2431926 2365125 2429614 2361532 2381041
8199B381041O4328Q3556n6297j14735J27135j29381J36378r14493J042L61077
$$ 2381041 2445369 2528925 2472628 2357893 2485028 2355647 2492025 1577532 1578574 1939651
8189A939651o9991J38164j51715J84385J11360j62921j13756K70K7812J6840p1979
$$ 1939651 1869660 2007824 1856109 2040494 2151854 1988933 1875177 1875447 1903259 1920099 1848120
8178A848120q6010n6411N487M8930O7536J33335o1953k33241P3044o2170p3530
$$ 1848120 1762110 1705699 1711186 1760116 1827652 1960987 1899034 1665793 1738837 1676667 1603137
8167A603137L0046K3300P7077j598q0662j39422r2993J59452J29734J00042j3646
$$ 1603137 1633183 1656483 1733560 1731962 1651300 1511878 1418885 1578337 1708071 1808113 1794467
8156A794467l7471l0965M5477L3550O3381k1568n6928L2248N7189J5243P6038
$$ 1794467 1756996 1726031 1771508 1805058 1868439 1846871 1789943 1822191 1879380 1894623 1970661
8145A970661l2763m5923p4792K25824j541j58870P9916N5325J2155o3223o6427
$$ 1970661 1937898 1891975 1817183 2043007 2041466 1882596 1962512 2017837 2029992 1966769 1900342
8134A900342J20021J34545k05521K620J34199K8006o8113r0389m0899Q5298J9516
$$ 1900342 2020363 2154908 1949387 1952007 2086206 2114212 2046099 1955710 1914811 2000109 2019625
8123B019625j02360j59663o5787j1697J03816l4895j48682l3589k9333j13546
$$ 2019625 1917265 1757602 1691815 1680118 1783934 1749039 1600357 1566768 1537435 1423889
8113A423889R6852n1438n2353J8816j3890j02992P9384k7203n3811n599m7173
$$ 1423889 1520741 1469303 1416950 1435766 1421876 1318884 1398268 1371065 1317254 1311655 1264482
8102A264482K5169o2661L2003L8850j28163n8279J14503Q1289j44842q9236J67766
$$ 1264482 1289651 1226990 1258993 1297843 1169680 1111401 1225904 1307193 1162351 1073115 1240881
8091A240881l9378n5808l2521j04595L4117J20279j39254r2385n118L8456N8724
$$ 1240881 1201503 1145695 1113174 1008579 1042696 1162975 1023721 931336 926218 964674 1023398
8080A023398k356j28836k0371j77752M990j8419l8583r214k7308n4232Q2119j0321
$$ 1023398 1021042 892206 871835 694083 699073 680654 642071 632857 605549 551317 633436 623115
8068F23115R7682K1620k11400k8627r0789J79692k7593L656M0604M7767K2689
$$ 623115 720797 742417 531017 502390 411601 591293 563700 567356 607960 655727 678416
8057F78416M0973m0236L9777j9376j14508K9812l3164j1173o445k4869o4215L6173
$$ 678416 719389 679153 718930 699554 585046 614858 581694 570521 564076 539207 474992 511165
8045E11165k6640K4742Q0317O9964q6692j36040O2765p5299n6527P4331J49563
$$ 511165 484525 509267 589584 659548 572856 436816 499581 424282 367755 442086 591649
8034E91649j04059p0084K8784R8604j56956l8094q6158O4915m59k106J240m7059
$$ 591649 487590 417506 446290 544894 387938 349844 263686 328601 328142 326036 327276 280217
8022B80217j4408n3110l5047O4263K1704j21999m0905K4751Q9422j469l2811N4451
$$ 280217 265809 212699 177652 241915 263619 141620 100715 125466 214888 213419 180608 235059
8010B35059P4899k6883J0472m3361o2619m8939L01387j6109j15222j19582j44680
$$ 235059 309958 283075 293547 250186 187567 138628 440015 423906 308684 189102 44422
7999D4422O5682M4894j0284J7940q626Q0371j19131K1506l2847r282O8942o4839
$$ 44422 110104 154998 144714 162654 154028 234399 115268 136774 103927 94645 163587 98748
7987I8748P3315m651Q44Q5066j59626L5245J29309p8165j11342k6606L4291O300
$$ 98748 172063 167412 168256 253322 93696 128941 258250 180085 68743 42137 76428 82728
7975H2728l6430n1764M1704j05119K7599J71914k5602n8034k5594M4689L6238
$$ 82728 46298 -5466 36238 -68881 -41282 130632 105030 46996 21402 66091 102329
7964A02329P834r3280q8399p201p9239L5341Q7812j9852o6849j4667l8608P2959
$$ 102329 110163 16883 -71516 -78717 -157956 -122615 -34803 -54655 -121504 -136171 -174779 -101820
7952a01820P7658N1031k6007l8038k7876Q257L6362L0001O755l9953j1488m4390
$$ -101820 -24162 26869 862 -37176 -65052 -56795 -20433 9568 16323 -23630 -35118 -79508
7940g9508J6743J02181J1382q191j02115k1849J21449O6539o567o6551m0208j28891
$$ -79508 -62765 39416 50798 42607 -59508 -81357 40092 106631 100064 33513 -6695 -135586
7928a35586Q5631j13373N1712M1806n3382n4672K0415m4314P5656J35918l4273
$$ -135586 -49955 -163328 -111616 -69810 -123192 -177864 -157449 -201763 -126107 9811 -24462
7917b4462L832q3130M1369k321R915K3000k8432m9125j9714L5884o5736J63482
$$ -24462 -20630 -103760 -62391 -64712 -54797 -31797 -60229 -109354 -129068 -93184 -158920 4562
7905D562O3175o1901Q6433j4153r6317J4424j44978p795m0444J27343J797j44195
$$ 4562 67737 5836 92269 78116 -18201 -3777 -148755 -156550 -196994 -69651 -67854 -212049
7893b12049O2188M8594L3956r2014N8396r0318K5691j5250J6432l5354l8179O5428
$$ -212049 -149861 -101267 -67311 -159325 -100929 -191247 -165556 -180806 -164374 -199728 -237907 -172479
7881a72479J45778L6441J9032j80940J09968k8485l9066J10794m0560k73710N625
$$ -172479 -26701 9740 28772 -152168 -42200 -70685 -109751 1043 -39517 -313227 -307602
7870c07602N4477K5022P0420l500R54L5400r0595l7109J30467n7481P5682k8151
$$ -307602 -253125 -228103 -157683 -161183 -160229 -124829 -215424 -252533 -122066 -179547 -103865 -132016
7858a32016j64721J27042N4008k249L7102J37785j32204j63046K783L9161M0374
$$ -132016 -296737 -169695 -115687 -117936 -80834 56951 -75253 -238299 -235516 -196355 -155981
7847a55981L6048M338m1853N4255n527M3826L4793n9694j59115k3691j6828J2991
$$ -155981 -119933 -115595 -157448 -103193 -108720 -64894 -30101 -89795 -248910 -272601 -289429 -276438
7835b76438R6510N857N1786K1489n5985K4124J0643P4799j59451q5571J74388
$$ -276438 -179928 -174071 -122285 -100796 -156781 -132657 -122014 -47215 -206666 -292237 -117849
7824a17849j09111m6948q8465J15765K43019J3723o212l5662n3361j16077o0480
$$ -117849 -226960 -273908 -362373 -246608 -3589 10134 3922 -31740 -85101 -201178 -261658
7813b61658L8578J01787P6827j20466j25226J11116J14632N7786j41170N6137
$$ -261658 -223080 -121293 -44466 -164932 -290158 -179042 -64410 -6624 -147794 -91657
7803i1657l0588P1307k3320j02639j7925j10654K03517K8644m0601n713J95N460
$$ -91657 -122245 -50938 -74258 -176897 -194822 -305476 -101959 -73315 -113916 -119629 -119434 -113974
7791a13974r2735J94180l8670k00602j2641N6280l3250r4426m2691m046L1001
$$ -113974 -206709 -12529 -51199 -251801 -264442 -208162 -241412 -335838 -378529 -382575 -351574
7780c51574J12610J30415K7558n6071M8218k2368r3840O4111O8538p6036n5235
$$ -351574 -238964 -108549 -80991 -137062 -88844 -111212 -205052 -140941 -72403 -148439 -203674
7769b03674L017J41260k1235P0998n3168n3213k4661j16793m3673J58229j4072
$$ -203674 -200657 -59397 -80632 -9634 -62802 -116015 -140676 -257469 -301142 -142913 -156985
7758a56985J43184m6046P5586L6950m9159o6962j05020Q856N4694m7189l8890
$$ -156985 -13801 -59847 15739 52689 3530 -63432 -168452 -159596 -104902 -152091 -190981
7747a90981J02665M8564K757o0942r2106P7996O0011j22052N1982j25205R4931
$$ -190981 -88316 -39752 -36995 -97937 -190043 -112047 -52036 -174088 -122106 -247311 -152380
7736a52380l4834p0575P4472o4750J23523N5203m7109J19401o8321p7415p3337
$$ -152380 -187214 -257789 -183317 -248067 -124544 -69341 -116450 2951 -65370 -142785 -216122
7725b16122o5770R0237L8372R610J08750j55998P6706L8505p415r1470m3235K8901
$$ -216122 -281892 -191655 -153283 -143673 -34923 -190921 -114215 -75710 -83125 -174595 -217830 -188929
7713a88929m2835l712M5550p1235K8701M6056n112J9958M9823P060M7909n2898
$$ -188929 -231764 -235476 -189926 -261161 -232460 -186404 -191516 -171558 -121735 -114675 -66766 -119664
7701a19664n8710Q5301M3408j31071l5440J8693R6224L6357o6424o2253q3543
$$ -119664 -178374 -93073 -49665 -180736 -216176 -197483 -101259 -64902 -131326 -193579 -277122
7690b77122j1821n1852J05234J14827L5465J2057j08406n0634J82756p0473n7732
$$ -277122 -288943 -340795 -235561 -120734 -85269 -73212 -181618 -232252 -49496 -119969 -177701
7679a77701k7197o6936l664j32730N9131O1405P7922o8537Q7498r011n6975J04346
$$ -177701 -204898 -271834 -275498 -408228 -349097 -287692 -209770 -278307 -190809 -199820 -256795 -152449
7667a52449K2290L7116o9685o1752j2833J69997r536m6586j9474m3639M4365m9305
$$ -152449 -130159 -93043 -162728 -224480 -237313 -67316 -76852 -123438 -142912 -186551 -142186 -191491
7655a91491P9840K0156m6155L4540K7841l7977q5409l7530R4687m4573L5618K5700
$$ -191491 -111651 -91495 -137650 -103110 -75269 -113246 -198655 -236185 -141498 -186071 -150453 -124753
7643a24753M41r922j24496R3631j5036L2553j2389q260K0292N0649Q5720j07845
$$ -124753 -124312 -134234 -258730 -165099 -180135 -147582 -159971 -168231 -147939 -97290 -11570 -119415
7631a19415m7171K4561m8337L3628O3754o0414J4684q824P395j4564r5945J21512
$$ -119415 -166586 -142025 -190362 -156734 -92980 -153394 -138710 -147534 -140139 -154703 -250648 -129136
7619a29136J32733l8555o4378Q3254p2395R53m9327p5985j74065J48697M6766
$$ -129136 3597 -34958 -99336 -16082 -88477 -87524 -136851 -212836 -386901 -238204 -191438
7608a91438k6083l6879m6095J01032j8234O0039j2629p8710l8801l6065N2994
$$ -191438 -217521 -254400 -300495 -199463 -217697 -157658 -170287 -248997 -287798 -323863 -270869
7597b70869J31546L3387M4552o1602n9547L9622m6358Q7754K0024j84559O033
$$ -270869 -139323 -105936 -61384 -122986 -182533 -142911 -189269 -101515 -81491 -266050 -260017
7586b60017l3695R9004p919k3081P1137J2853M056n8048q2767N4520P4292N163
$$ -260017 -293712 -194708 -202627 -225708 -154571 -141718 -137662 -195710 -278477 -223957 -149665 -144502
7574a44502K1255N2908J0893l9328k6615N6455m7228o5222Q4014J49278j14127
$$ -144502 -123247 -70339 -59446 -98774 -125389 -68934 -116162 -181384 -97370 51908 -62219
7563f2219O025P4294j23443k0005L2019J15574j5391M86j08572M2182n272j21907
$$ -62219 -56194 18100 -105343 -125348 -93329 22245 6854 7340 -101232 -59050 -64322 -186229
7551a86229m6807J34728k0201j5986m183k6911M4023k1798o876P3316l1309m785
$$ -186229 -233036 -98308 -118509 -134495 -138678 -165589 -121566 -143364 -150240 -76924 -108233 -113018
7539a13018J5721J9041J38302q5849q1167l297l6953j09249o690O7931L8335P0620
$$ -113018 -97297 -78256 60046 -25803 -106970 -110267 -147220 -256469 -263159 -195228 -156893 -86273
7527h6273R095n6457N0098L9637o4856N0907L1865q7992m2897P9912L2876L8222
$$ -86273 -77178 -133635 -83537 -43900 -108756 -57849 -25984 -113976 -156873 -76961 -44085 -5863
7515e863l1219j48873J35532J54812j63570M6155J715j78894N5409M0946j2624
$$ -5863 -37082 -185955 -50423 104389 -59181 -13026 -11311 -190205 -134796 -93850 -106474
7504a06474r0656O1079P0729Q1307q0573q9537j19131k2678Q4163J24316q3090
$$ -106474 -197130 -136051 -65322 15985 -64588 -154125 -273256 -295934 -211771 -87455 -170545
7493a70545m9442Q5294n5709o863o3358M1783J56178J801r6095k1024J64257J80128
$$ -170545 -219987 -134693 -190402 -197265 -260623 -218840 -62662 -60861 -156956 -177980 -13723 166405
7481A66405q7412q9190N6011n2779r1103j894j8282N3197O7506k1929l2895L6361
$$ 166405 78993 -10197 45814 -6965 -98068 -99962 -118244 -65047 2459 -19470 -52365 -16004
7469a6004j9535O6277l9588J43973r6886L0298P7388o5749j08474q9821Q2550
$$ -16004 -35539 30738 -8850 135123 38237 68535 145923 80174 -28300 -118121 -35571
7458c5571J71968J02577o1911o1671K5661j0385o0K9614j71374j06931J2879P7466
$$ -35571 136397 238974 177063 115392 141053 130668 130608 160222 -11152 -118083 -105204 -27738
7446b7738Q9608R1328q1553J9470m0515O7226p9739m5573O0906P3003J4280n366
$$ -27738 61870 153198 71645 91115 50600 117826 38087 -7486 53420 126423 140703 135337
7434A35337K1334Q0142K8783k7666k3009k0948j3746k4514L2247N201J09511J3264
$$ 135337 156671 236813 265596 237930 214921 193973 180227 155713 187960 193161 302672 315936
7422C15936J7860j00665o2119P4310P165N4610L7542R5488q3776M6228m0099K2052
$$ 315936 333796 233131 171012 245322 252487 307097 344639 440127 356351 402579 362480 384532
7410C84532Q872j7513n1187R3956J33316o501j04524k0703o921l4871l1396k8706
$$ 384532 393404 375891 324704 418660 551976 545475 440951 420248 413327 378456 347060 318354
7398C18354p3568O2420J83937j357j82899K4297L13969j38656m3692l1958K5984
$$ 318354 244786 307206 491143 489786 306887 331184 645153 506497 462805 430847 456831
7387D56831o1012o8714p3933J8199Q0158L3657q8125J7244j6346P3595L8665j9843
$$ 456831 395819 327105 253172 271371 351529 385186 297061 314305 297959 371554 410219 390376
7375C90376o5891j62264Q9600M1152R732J10582p5683j36611J2776j32070j1818
$$ 390376 324485 162221 251821 292973 302705 413287 337604 200993 213769 81699 69881
7364F9881L5138k076J75106q4743j12912J40132J71728O7607j83659j29753j4801
$$ 69881 105019 102943 278049 193306 80394 220526 392254 459861 276202 146449 131648
7353A31648M8071N453j3238l1744n7498k6376k5626N2951L8466M9460o5112k6086
$$ 131648 179719 185172 171934 140190 82692 56316 30690 83641 122107 171567 106455 80369
7341H0369L2550J0860j5127K6483p355r2491K7276J2957J02223J10566k1175l5338
$$ 80369 112919 123779 108652 135135 127780 35289 62565 75522 177745 288311 267136 231798
7329B31798j15611j73365J50980J20272j4796j02640j10486J62373l5829j53427
$$ 231798 116187 -57178 93802 214074 199278 96638 -13848 148525 112696 -40731
7319d0731J6144J09805l1319j71616J0624J68497M8312J18507k3128j47143n3379
$$ -40731 -24587 85218 53899 -117717 -107093 61404 109716 228223 205095 57952 4573
7308D573L8988L6639M0853J22591r9944r387l2275j34620Q826M0653P1900q2648
$$ 4573 43561 80200 121053 243644 143700 134313 102038 -32582 -23756 16897 88797 6149
7296F149l1268J7206N5213j39157j7619O7450k9394J05106J8577L3171p053p15
$$ 6149 -25119 -7913 47300 -91857 -109476 -42026 -71420 33686 52263 85434 78381 77666
7284G7666J8004l3763j80342j0619P6634K9118m2075j3082J01805L6016j03199
$$ 77666 95670 61907 -118435 -129054 -52420 -23302 -65377 -78459 23346 59362 -43837
7273d3837k9451O338j09441J14422R6337q0857k1904J36949j57539O9047m1593
$$ -43837 -73288 -66950 -176391 -61969 34368 -46489 -68393 68556 -88983 -19936 -61529
7262f1529k4027R1099k7072l2J50225q3950m7643J40949J582o662j14243k9959
$$ -61529 -85556 5543 -21529 -21561 128664 44714 -2929 138020 139602 132940 18697 -11262
7250a1262R4602l8389j16314n1997P6088N0955N6233J22227o7822k3758o5886
$$ -11262 83340 44951 -71363 -123360 -47272 3683 59916 182143 114321 90563 24677
7239B4677n6311J26379M5400j05604P3431n8224K2676n5566K734O7123k5281n5146
$$ 24677 -31634 94745 140145 34541 107972 49748 72424 16858 19592 86715 61434 6288
7227F288J11950P681l3648j20200k7925p2377J941n6905M2890j7635o8206Q2910
$$ 6288 118238 125919 92271 -27929 -55854 -128231 -126290 -183195 -140305 -157940 -226146 -143236
7215a43236j5563p166l8456R8100K3307j6533J03950j5297J49539m4519p6273
$$ -143236 -158799 -165965 -204421 -106321 -83014 -99547 4403 -10894 138645 94126 17853
7204A7853p3960q520j0898O1493P5316N6563r7022j02959k6493Q4430J62696q4539
$$ 17853 -56107 -64627 -75525 -14032 61284 117847 20825 -82134 -108627 -24197 138499 53960
7192E3960m9630J7217O1417j03853m9604J47292L4666j35544K6024j3506p6616
$$ 53960 4330 21547 82964 -20889 -70493 76799 111465 -24079 1945 -11561 -88177
7181h8177K0359J673j494n3844p203P4056Q489O9877L3312o7661o8855k2407J25046
$$ -88177 -67818 -66145 -67639 -121483 -128686 -54630 -46141 23736 57048 -10613 -79468 -101875 23171
7168B3171J02080k8909O8651j33920l4159j166J15049j7737j09694q8377m213
$$ 23171 125251 96342 164993 31073 -3086 -4252 110797 93060 -16634 -105011 -109224
7157a09224J02143Q5928r5871p8020N3973n218N0627n1947j8929J04738L2856
$$ -109224 -7081 78847 -17024 -95044 -41071 -46289 4338 -47609 -66538 38200 71056
7146G1056m2328n9011N2944K5382k5991R5373n0660R15O2923j19519j3501j3895
$$ 71056 28728 -30283 22661 48043 22052 117425 66765 67680 130603 11084 -2417 -16312
7134a6312L734J54393o6059j02976J0512k2239J75825l6236q8400L2588r8189
$$ -16312 -12578 141815 75756 -27220 -16708 -38947 136878 100642 12242 44830 -53359
7123e3359L5871P4121m0264M3332n7326L9802j08154O0600M4098J22105o2093
$$ -53359 -17488 56633 16369 59701 2375 42177 -65977 -5377 38721 160826 98733
7112I8733q5787n5945l9968L4753j4531J16868L6664p8824N8214O9501r5296O4058
$$ 98733 12946 -42999 -82967 -48214 -62745 54123 90787 11963 70177 139678 44382 108440
7100A08440r9753k7763l5177J18658j9848l2336J55312m4994o9798J13553l151
$$ 108440 8687 -19076 -54253 64405 44557 12221 167533 122539 52741 166294 163143
7089A63143j06359m1103M0395J17658k1563M0195n0035k8029J7340k3454J46428
$$ 163143 56784 15681 56076 173734 152171 192366 142331 114302 131642 108188 254616
7078B54616P5890n1555o822m3786N8034j27213Q2763K4003n3387j3076j5555o604
$$ 254616 330506 278951 272129 228343 286377 159164 241927 265930 212543 199467 183912 177308
7066A77308K9791r283n9750J2148j8782k4272k4143q7682m1822K3190P1619J10644
$$ 177308 207099 197816 138066 150214 131432 107160 83017 -4665 -46487 -23297 48322 158966
7054A58966r9654K0832p3287j520J51774l5144n4083L1634j7495J37266p5568
$$ 158966 59312 80144 6857 5337 157111 121967 67884 99518 82023 219289 143721
7043A43721J0086j32501l8098Q6752R4822o4432m8376J9620P7769j295q2984p4562
$$ 143721 153807 21306 -16792 69960 164782 100350 51974 71594 149363 148068 65084 -9478
7031i478J28889J34129l2616J7337O8736P1713j25985q2848J35524O3603r2249
$$ -9478 119411 253540 220924 238261 306997 378710 252725 169877 305401 369004 276755
7020B76755n7818n5004R2268J4667J6659Q9440j16465j0073o4523P0129J5615
$$ 276755 218937 163933 256201 270868 287527 376967 260502 250429 185906 256035 271650
7009B71650O5717P536M2754k0028m3077o3975k8777m1642J7165Q1930p0398k9017
$$ 271650 337367 344903 387657 367629 324552 260577 231800 190158 207323 289253 218855 189838
6997A89838L8070l54N2831n2920r4699O1061Q1493N9632n5431p293m3888L2899
$$ 189838 227908 227554 280385 227465 132766 193827 275320 334952 279521 272228 228340 261239
6985B61239P0966Q2315j35553j68956k2861J62363q6520m8142J14448q8354m8333
$$ 261239 332205 414520 278967 110011 87150 249513 162993 114851 229299 140945 92612
6974I2612K338o110J51812Q2397j7750j0418o5085K2749k7605j12007P4248O5102
$$ 92612 94950 88840 240652 323049 305299 294881 229796 252545 224940 112933 187181 252283
6962B52283K3932j1125o1827o1059N7941o8224J40401r6354Q1226J19415j97839
$$ 252283 276215 265090 203263 142204 200145 131921 272322 175968 257194 376609 178770
6951A78770j432J15672q9675L9313K3244r040M4261r3516n553L2088L6702l2133
$$ 178770 177338 293010 203335 242648 265892 256852 301113 207597 202044 234132 270834 238701
6939B38701M5527j1765J89828m4856n4074j7771n9068N4086j325j37o2367O8913
$$ 238701 284228 272463 462291 417435 363361 345590 286522 340608 339283 339146 276779 345692
6927C45692J24927L8472r3175j18974J54511J9376r5783q6827j3745j8854J1124
$$ 345692 470619 509091 415916 296942 451453 470829 375046 288219 274474 255620 266744
6916B66744J56368q4047m8162O4195n3131K4756J14372j5931r2985M7106J21621
$$ 266744 423112 339065 290903 355098 301967 326723 441095 425164 332179 379285 500906
6905E00906o3561l2550J3137P4360j02295J68104K9974K5723J64099j06499k1133
$$ 500906 437345 404795 417932 492292 389997 558101 588075 613798 777897 671398 650265
6894F50265O7686m2596O9527O1317P727o4229O9567j43608O9161q518K7241O0024
$$ 650265 717951 675355 744882 806199 813926 749697 819264 675656 744817 736299 763540 823564
6882H23564J4341P2247q1879J30687j20528M9396j9746Q8418R5726M2108J12463
$$ 823564 837905 910152 828273 958960 838432 887828 868082 956500 1052226 1094334 1206797
6871A206797J41338N2993J20836R3143j6875J97866O1355J6500l3115p5684l2589
$$ 1206797 1348135 1401128 1521964 1615107 1598232 1796098 1857453 1873953 1840838 1765154 1732565
6860A732565j35847l9799O2738O5748R6457k5246j31701R2991L4666J3524k4849
$$ 1732565 1596718 1556919 1619657 1685405 1781862 1756616 1624915 1717906 1752572 1766096 1741247
6849A741247j5240m5676J82421m7816N3287K41843l8200j25014N3753J94503J17618
$$ 1741247 1726007 1680331 1862752 1814936 1868223 2110066 2071866 1946852 2000605 2195108 2312726
6838B312726O4234J56424O6147j07187M956j1928K8494p0877k772j00962o2090
$$ 2312726 2376960 2533384 2599531 2492344 2497300 2485372 2513866 2442989 2440217 2339255 2277165
6827B277165Q2632l436j89327q9678O2802j24609r0319k46379R1566K15334N5448
$$ 2277165 2359797 2356361 2167034 2077356 2140158 2015549 1925230 1678851 1770417 1985751 2041199
6816B041199K4295q8585J04657J02209j4565J58365q263P4678j925k710L0224
$$ 2041199 2065494 1976909 2081566 2183775 2169210 2327575 2319312 2393990 2392065 2389355 2419579
6805B419579j6474P0141m0180p4015j25127p6027j36659o5069r715l51667m9624
$$ 2419579 2403105 2473246 2433066 2359051 2233924 2157897 2021238 1956169 1946454 1594787 1545163
6794A545163M4194o6238j50927L1384M748k8525K3997m4926k9456j03365K9130
$$ 1545163 1589357 1523119 1372192 1403576 1408324 1379799 1403796 1358870 1329414 1226049 1255179
6783A255179Q8540m1154M9532O5147j55985J7447m3305P7616n6875m5896k5692
$$ 1255179 1343719 1302565 1352097 1417244 1261259 1278706 1235401 1313017 1256142 1210246 1184554
6772A184554R0209n1525j20966j62091J1943j4988O5415J04898j74997j10658
$$ 1184554 1274763 1223238 1102272 940181 952124 937136 1002551 1107449 932452 821794
6762H21794J75109M0641j12904J10936O1209j41448J1120L4409L0135j5589L4999
$$ 821794 996903 1037544 924640 1035576 1096785 955337 966457 1000866 1031001 1015412 1050411
6751A050411m1857n6376M7847j9299n943j36023M5569J11586m1008K2388P5137
$$ 1050411 1008554 952178 1000025 980726 974783 838760 884329 995915 954907 977295 1052432
6740A052432J0757K943J35059O8303j5472m3030j53529M0469M2369j8346p4270
$$ 1052432 1063189 1066132 1201191 1269494 1254022 1210992 1057463 1097932 1140301 1121955 1047685
6729A047685P0827o741L7630M6416m8962l8140l943k2287n4191M6681k8079j5595
$$ 1047685 1118512 1111771 1149401 1195817 1146855 1108715 1104772 1082485 1028294 1074975 1046896 1031301
6717A031301Q1056q6946q157k5773p672J18046M5627r6696m0857O5145o8049N0219
$$ 1031301 1112357 1025411 1017254 991481 983809 1101855 1147482 1050786 1009929 1075074 1007025 1057244
6705A057244K6391R5377P2151J3548P2709j11977k3579j8090q8063J22024J13792
$$ 1057244 1083635 1179012 1251163 1264711 1337420 1225443 1201864 1183774 1095711 1217735 1331527
6694A331527L0374p2719j02037j0508N4451J29151L3071j6957q6374j5707N9704
$$ 1331527 1361901 1289182 1187145 1176637 1231088 1360239 1393310 1376353 1289979 1274272 1333976
6683A333976J01666M1319p1591P2263J5827L9512l0913N4153K8653l3012N0211
$$ 1333976 1435642 1476961 1405370 1477633 1493460 1532972 1502059 1556212 1584865 1551853 1602064
6672A602064J00200o2374L7365O6446K03l8669K18734J77482q7980k0945j8480
$$ 1602064 1702264 1639890 1677255 1743701 1743904 1705235 1923969 2101451 2013471 1992526 1974046
6661A974046L2962j07607J0113P1540Q5007j21839l0048o6768N995L1411k6592
$$ 1974046 2007008 1899401 1909514 1981054 2066061 1944222 1914174 1847406 1853401 1884812 1858220
6650A858220L4098L2361J43346j4843J1625q625o103J1884j7792J20456K8074
$$ 1858220 1892318 1924679 2068025 2053182 2064807 2056182 2050079 2061963 2044171 2164627 2192701
6639B192701J24991J90195O2309L5194J10034P4413J14025J26171Q4841m3131
$$ 2192701 2317692 2507887 2570196 2605390 2715424 2789837 2903862 3030033 3114874 3071743
6629C071743K7102J9615q056J1398j51589J8342j03985n1776k3689J11179K3573
$$ 3071743 3098845 3118460 3110404 3121802 2970213 2988555 2884570 2832794 2809105 2920284 2943857
6618B943857N7609k3292J68671n2141L338K02247j3442R2787J32363K55273K12675
$$ 2943857 3001466 2978174 3146845 3094704 3098042 3300289 3286847 3379634 3511997 3767270 3979945
6607C979945J03076J43664J38779j4065Q5799J32656J51999m1829n4957J25248
$$ 3979945 4083021 4226685 4365464 4351399 4437198 4569854 4721853 4680024 4625067 4750315
6597D750315L9622N6781Q6295J14685R2990l4958O9026K2473J3812J81924L6808
$$ 4750315 4789937 4846718 4933013 5047698 5140688 5105730 5174756 5197229 5211041 5392965 5429773
6586E429773K0413K31892K58254M2119m4202P1224P4153L23349K08165M5714K31570
$$ 5429773 5450186 5682078 5940332 5982451 5938249 6009473 6083626 6406975 6615140 6660854 6892424
6575F892424L37594L49040K89007J93016M41551M18558L24288K33860L38405K08792
$$ 6892424 7230018 7579058 7868065 8061081 8502632 8921190 9245478 9479338 9817743 10026535
6565A0026535J87360J92514J35177J34742J26884J80016J32493J11384J74936
$$ 10026535 10213895 10406409 10541586 10676328 10803212 10983228 11115721 11227105 11402041
6556A1402041J84434K40874K71167J88785J48488J12774J53587J25747L45647
$$ 11402041 11586475 11827349 12098516 12287301 12435789 12548563 12702150 12827897 13173544
6547A3173544K49249K59142L27939L41333L12530J13205L91326M48428M21955
$$ 13173544 13422793 13681935 14009874 14351207 14663737 14776942 15168268 15616696 16038651
6538A6038651L26651M83162M53502M81359N08346N44368M11871M89047M94779
$$ 16038651 16365302 16848464 17301966 17783325 18291671 18836039 19247910 19736957 20231736
6529B0231736M91118O58166M42086O10529Q00614J086273J089458J389063J495498
$$ 20231736 20722854 21381020 21823106 22433635 23234249 24320522 25409980 26799043 28294541
6520B8294541J442732J595923J369666Q95507N47581K81820j95215o44150o35019
$$ 28294541 29737273 31333196 32702862 33598369 34145950 34427770 34232555 33588405 32953386
6511C2953386o05783m05586j42876J64870M93108P33033P44181O27195L56726
$$ 32953386 32347603 31942017 31799141 31964011 32457119 33190152 33934333 34561528 34918254
6502C4918254K35975q9604o89571j066520j461930j720959j689466j677616j399247
$$ 34918254 35154229 35064625 34375054 33308534 31846604 30125645 28436179 26758563 25359316
6493B5359316j342798j262068r33216r96983q79188p47483n86401o55842l97890
$$ 25359316 24016518 22754450 21821234 20824251 19945063 19197580 18611179 17955337 17557447
6484A7557447l71782l69892l37669j32931j44191k47583k10196k29780j31347
$$ 17557447 17185665 16815773 16478104 16345173 16200982 15953399 15743203 15513423 15382076
6475A5382076m8851k2254l2229p0845j28355Q6613R9564O9955N9022J86966K04259
$$ 15382076 15333225 15310971 15278742 15207897 15079542 15166155 15265719 15335674 15394696 15581662 15785921
6464A5785921L11088K74248L87624N38340P05710Q03171R08758J149242J244054
$$ 15785921 16097009 16371257 16758881 17297221 18002931 18806102 19714860 20864102 22108156
6455B2108156J246456J600529J846813K099537K437702K823859K945505L096312
$$ 22108156 23354612 24955141 26801954 28901491 31339193 34163052 37108557 40204869
6447D0204869K810133K417046J693538J079803L13676o78193j148448j316069
$$ 40204869 43015002 45432048 47125586 48205389 48519065 47840872 46692424 45376355
6439D5376355r77680l01070J48368M96349J042905J540829J719233J413975J283463
$$ 45376355 44398675 44097605 44245973 44742322 45785227 47326056 49045289 50459264 51742727
6430E1742727P92872k30615r67005j750851k502211k782198k840197k438762k306361
$$ 51742727 52535599 52304984 51337979 49587128 47084917 44302719 41462522 39023760 36717399
6421C6717399j924624j607659j461999j409603j204322j155601j157517q28191
$$ 36717399 34792775 33185116 31723117 30313514 29109192 27953591 26796074 25967883
6413B5967883q65179p71597n72965l10914m48083j63516j44611n5099K86893J68701
$$ 25967883 25102704 24331107 23758142 23447228 22999145 22835629 22691018 22635919 22922812 23091513
6403B3091513N15675O21410P48530R68794J051119J278303J405170J325060J424812
$$ 23091513 23607188 24228598 24977128 25945922 26997041 28275344 29680514 31005574 32430386
6394C2430386J285575R50636N78480O6714l36234r46960j218704j373901j479117
$$ 32430386 33715961 34666597 35245077 35311791 34975557 34028597 32809893 31435992 29956875
6385B9956875j175089r86659r07218p63640p00055n68039k51865l00565j69569
$$ 29956875 28781786 27795127 26887909 26124269 25424214 24856175 24604310 24303745 24134176
6376B4134176L117J52066K55704L48057L37039P85369Q27962R89592R75174J146516
$$ 24134176 24137293 24289359 24545063 24893120 25230159 26015528 26843490 27833082 28808256 29954772
6366B9954772J477783J485646J535360J774392J980335K105161K293330K529116
$$ 29954772 31432555 32918201 34453561 36227953 38208288 40313449 42606779 45135895
6358D5135895K791159K675545K617483K309513J665538J037238M81989j71219
$$ 45135895 47927054 50602599 53220082 55529595 57195133 58232371 58714360 58543141
6350E8543141q95439j140884j009694q78548n75189k24424K3439L35058M61816
$$ 58543141 57647702 56506818 55497124 54618576 54043387 53818963 53842402 54177460 54639276
6341E4639276O64433R94604J373859J694373K088530K709220L059510L527705
$$ 54639276 55303709 56298313 57672172 59366545 61455075 64164295 67223805 70751510
6333G0751510L839752M431953M570333M527077M257441L938288L544316K955629
$$ 70751510 74591262 79023215 83593548 88120625 92378066 96316354 99860670 102816299
6325A02816299K719667K225273J579390J366533J444514R58928N78131K97369
$$ 102816299 105535966 107761239 109340629 110707162 112151676 113110604 113688735 113986104
6317A13986104j92864p54027j545829k215653k578702k457890k204541j530033
$$ 113986104 113793240 113039213 111493384 109277731 106699029 104241139 102036598 100506565
6309A00506565p50825j76319P69749J168560J595064J662727J555271J406050
$$ 100506565 99755740 99579421 100349170 101517730 103112794 104775521 106330792 107736842
6301A07736842J196704P83394O14578O38539J263704J938802K175798K560547
$$ 107736842 108933546 109716940 110331518 110970057 112233761 114172563 116348361 118908908
6293A18908908K317930J604822Q33560l20841j582658k772885l330161l183662
$$ 118908908 121226838 122831660 123665220 123344379 121761721 118988836 115658675 112475013
6285A12475013k788187k452953k320856k154553k440046k703236l571993m105928
$$ 112475013 109686826 107233873 104913017 102758464 100318418 97615182 94043189 89937261
6277H9937261m543139m534613m109869l704382l109971k439596k076565j557400
$$ 89937261 85394122 80859509 76749640 73045258 69935287 67495691 65419126 63861726
6269F3861726j327475j062641o21337l42366j7514M50923O66560J142534J407099
$$ 63861726 62534251 61471610 60850273 60507907 60490393 60941316 61607876 62750410 64157509
6260F4157509J425738J402221J315785J107327Q11783M60289K32674R0195O6211
$$ 64157509 65583247 66985468 68301253 69408580 70220363 70680652 70913326 71003521 71069732
6251G1069732J80680O13950R15831J112247J538948J760590K043650K145013K448437
$$ 71069732 71250412 71864362 72780193 73892440 75431388 77191978 79235628 81380641 83829078
6242H3829078K436024K502501K516581K458334K436038K416224K140732J817699
$$ 83829078 86265102 88767603 91284184 93742518 96178556 98594780 100735512 102553211
6234A02553211J486400Q32818J14159n20187j096030k077168k498567k990650
$$ 102553211 104039611 104872429 104986588 104466401 103370371 101293203 98794636 95803986
6226I5803986l650325l577029l362115k898603k539720k308457k106974j841572
$$ 95803986 92153661 88576632 85214517 82315914 79776194 77467737 75360763 73519191
6218G3519191j506432j371611r94980o88112m89562k10601j70822l05659n54513
$$ 73519191 72012759 70641148 69646168 68958056 68468494 68257893 68087071 67781412 67226899
6209F7226899p73874j257890j667133k050500k209228k439857k210949j944077
$$ 67226899 66453025 65195135 63528002 61477502 59268274 56828417 54617468 52673391
6201E2673391j523774j284957j136480p95043o90083m68841j71486j45094k26414
$$ 52673391 51149617 49864660 48728180 47933137 47243054 46774213 46602727 46457633 46231219
6192D6231219j18927k46366m31155q96996j038803j285286j439510j498909j607627
$$ 46231219 46112292 45865926 45434771 44537775 43498972 42213686 40774176 39275267 37667640
6183C7667640j506637j494340j398577j274673j080632j019967q33683o19249
$$ 37667640 36161003 34666663 33268086 31993413 30912781 29892814 29059131 28439882
6175B8439882m19545l37032j89518o1272r1963K4579p4430j29398k82458n33877
$$ 28439882 28020337 27683305 27493787 27432515 27340552 27365131 27290701 27161303 26878845 26344968
6165B6344968p36148q63014j047154j179324j244344j003982r69408j009745r63487
$$ 26344968 25608820 24745806 23698652 22519328 21274984 20271002 19301594 18291849 17328362
6156A7328362q87551p87238q43199o62439n58921m67585n71129o52000n07590
$$ 17328362 16440811 15653573 14810374 14147935 13589014 13121429 12550300 11898300 11390710
6147A1390710m60840m35669l56157l33529k76637l16427j79539l77671l34316
$$ 11390710 10929870 10494201 10138044 9804515 9527878 9211451 9031912 8654241 8319925
6138H319925j07638k36913k57286j01088j78229p4214j16684j96981l12280r1860
$$ 8319925 8212287 7975374 7718088 7617000 7438771 7364557 7247873 7050892 6738612 6646752
6128F646752j00226k61790l2997j95458j11583j02282r1931j07915n3488L101
$$ 6646752 6546526 6284736 6251739 6056281 5944698 5842416 5750485 5642570 5589082 5592183
6118E592183k58859l4261o3822j0196O0689k20511k6452j75052r2137J9056L1379
$$ 5592183 5333324 5299063 5235241 5225045 5285734 5065223 5038771 4863719 4771582 4790638 4822017
6107D822017l9528j21513J2237j7275O9984P6438p254p8818L8637K75840J62238
$$ 4822017 4782489 4660976 4673213 4655938 4725922 4802360 4795106 4716288 4754925 5030765 5193003
$$ [...]
##END NTUPLES=NMR SPECTRUM
##END=
