##TITLE=1H_EC-3356(2-2)
 200.13MHz, CDCl3,
 8 sc
 
 15.8.2025
##JCAMPDX= 6.0         $$ Bruker NMR JCAMP-DX V2.0
##DATA TYPE= NMR SPECTRUM
##DATA CLASS= NTUPLES
##ORIGIN= UXNMR, Bruker Analytische Messtechnik GmbH
##OWNER= pz
$$ XWIN-NMR		Version 3.5
$$ Fri Aug 15 13:45:39 2025 Russian Standard Time (UT+4h)  she@DPX200
##.OBSERVE FREQUENCY= 200.1313
##.OBSERVE NUCLEUS= ^1H
##.ACQUISITION MODE= SIMULTANEOUS
##.ACQUISITION SCHEME= undefined
##.AVERAGES= 8
##.DIGITISER RES= 18
##SPECTROMETER/DATA SYSTEM= spect
##.PULSE SEQUENCE= zg30
##.SOLVENT NAME= CDCl3
##.SHIFT REFERENCE= (INTERNAL, CDCl3, 0, 15.4009)
##AUDIT TRAIL= $$ (NUMBER, WHEN, WHO, WHERE, WHAT)
$$ ##TITLE= Audit trail, XWIN-NMR		Version 3.5
$$ ##JCAMPDX= 5.01
$$ ##ORIGIN= Bruker BioSpin GmbH
$$ ##OWNER= she
$$ F:/spectra/data/she/nmr/H-C/1/pdata/1/auditp.txt
$$ ##AUDIT TRAIL=  $$ (NUMBER, WHEN, WHO, WHERE, WHAT)
(   1,<2025-08-15 13:44:19.37 +0400>,<she>,<DPX200>,
      <created by zg, POWCHK disabled, PULCHK disabled
       configuration hash MD5:
       00 E9 B6 7A A2 85 ED C7 34 08 36 98 17 FE 4E 26
       data hash MD5: 16K
       AE D0 6A 4E 71 58 B1 D5 DE 6D 3B 94 08 F8 10 CF>)
(   2,<2025-08-15 13:44:21.68 +0400>,<she>,<DPX200>,
      <Start of raw data processing
       efp BC_mod = 2 LB = 0.25 FT_mod = 6 PKNL = 1 PHC0 = -1556.828 PHC1 = 6.59228 SI = 16K 
       data hash MD5: 16K
       0B 93 47 79 D4 44 85 EA CC 94 9D 7F 23 49 B0 6F>)
(   3,<2025-08-15 13:44:40.35 +0400>,<she>,<DPX200>,
      <pk PHC0 = -2.509392 PHC1 = 3.2 
       data hash MD5: 16K
       FA D3 F0 20 FE 14 23 0B 55 77 F2 C8 60 F4 78 4F>)
(   4,<2025-08-15 13:44:43.82 +0400>,<she>,<DPX200>,
      <abs ABSG = 5 
       data hash MD5: 16K
       FF 2A 11 1F 71 8B A7 5E C5 F6 15 84 43 B5 1E FD>)
$$ ##END=
$$ 
$$ hash MD5
$$ 0C E7 10 2A 66 EB A3 3B B5 6F 0A C4 7F F7 B3 74
##$RELAX= 
##$RELAX= 
##$RELAX= 
##$RELAX= 
##$RELAX= 
##$RELAX= 
$$ Bruker specific parameters
$$ --------------------------
##$DU= <F:/spectra>
##$EXPNO= 1
##$NAME= <H-C>
##$PROCNO= 1
##$TYPE= <nmr>
##$USER= <she>
##$AMP= (0..31)
100 100 100 100 100 100 100 100 100 100 100 100 100 100 100 100 100 100 
100 100 100 100 100 100 100 100 100 100 100 100 100 100 
##$AQSEQ= 0
##$AQ_mod= 1
##$AUNM= <au_zg>
##$AUTOPOS= <>
##$BF1= 200.13
##$BF2= 200.13
##$BF3= 200.13
##$BF4= 200.13
##$BF5= 200.13
##$BF6= 200.13
##$BF7= 200.13
##$BF8= 200.13
##$BYTORDA= 1
##$CFDGTYP= 0
##$CFRGTYP= 5
##$CHEMSTR= <none>
##$CNST= (0..31)
1 1 145 1 1 1 1 1 1 1 1 1 1 1 1 1 1 1 1 1 1 1 1 1 1 1 1 1 1 1 1 1 
##$CPDPRG= <>
##$CPDPRG1= <>
##$CPDPRG2= <>
##$CPDPRG3= <>
##$CPDPRG4= <mlev>
##$CPDPRG5= <mlev>
##$CPDPRG6= <mlev>
##$CPDPRG7= <mlev>
##$CPDPRG8= <mlev>
##$CPDPRGB= <>
##$CPDPRGT= <>
##$D= (0..31)
0 0.7 0 0 0 0 0 0 0 0 0 0.03 0 0 0 0 0 0 0 0 0 0 0 0 0 0 0 0 0 0 0 0 
##$DATE= 1755251058
##$DBL= (0..7)
120 120 120 120 120 120 120 120 
##$DBP= (0..7)
150 150 150 150 150 150 150 150 
##$DBP07= 0
##$DBPNAM0= <>
##$DBPNAM1= <>
##$DBPNAM2= <>
##$DBPNAM3= <>
##$DBPNAM4= <>
$$ [...]
##$SUBNAM3= <"">
##$SUBNAM4= <"">
##$SUBNAM5= <"">
##$SUBNAM6= <"">
##$SUBNAM7= <"">
##$SUBNAM8= <"">
##$SUBNAM9= <"">
##$SW= 18.0517328524113
##$SWIBOX= (0..15)
0 0 2 0 0 0 0 0 0 0 0 0 0 0 0 0 
##$SW_h= 3612.71676300578
##$TD= 16384
##$TD0= 1
##$TE= 0
##$TE2= 300
##$TE3= 300
##$TEG= 300
##$TL= (0..7)
0 120 120 120 120 120 120 120 
##$TP= (0..7)
150 150 150 150 150 150 150 150 
##$TP07= 0
##$TPNAME0= <>
##$TPNAME1= <>
##$TPNAME2= <>
##$TPNAME3= <>
##$TPNAME4= <>
##$TPNAME5= <>
##$TPNAME6= <>
##$TPNAME7= <>
##$TPOAL= (0..7)
0.5 0.5 0.5 0.5 0.5 0.5 0.5 0.5 
##$TPOFFS= (0..7)
0 0 0 0 0 0 0 0 
##$TUNHIN= 0
##$TUNHOUT= 0
##$TUNXOUT= 0
##$USERA1= <user>
##$USERA2= <user>
##$USERA3= <user>
##$USERA4= <user>
##$USERA5= <user>
##$V9= 5
##$VALIST= <valist>
##$VCLIST= <CCCCCCCCCCCCCCC>
##$VD= 0
##$VDLIST= <DDDDDDDDDDDDDDD>
##$VPLIST= <PPPPPPPPPPPPPPP>
##$VTLIST= <TTTTTTTTTTTTTTT>
##$WBST= 1024
##$WBSW= 4
##$XGAIN= (0..3)
0 0 0 0 
##$XL= 0
##$YL= 0
##$YMAX_a= 567376
##$YMIN_a= -764463
##$ZGOPTNS= <>
##$ZL1= 120
##$ZL2= 120
##$ZL3= 120
##$ZL4= 120
##$ABSF1= 15.37118
##$ABSF2= -2.680668
##$ABSG= 5
##$ABSL= 3
##$ALPHA= 0
##$AQORDER= 0
##$ASSFAC= 0
##$ASSFACI= 0
##$ASSFACX= 0
##$ASSWID= 0
##$AUNMP= <proc_1d>
##$AZFE= 0.1
##$AZFW= 0.1
##$BCFW= 0
##$BC_mod= 2
##$BYTORDP= 0
##$COROFFS= 0
##$CY= -3
##$DATMOD= 1
##$DC= 0
##$DFILT= <>
##$DTYPP= 0
##$F1P= 0
##$F2P= 0
##$FCOR= 1
##$FTSIZE= 16384
##$FT_mod= 6
##$GAMMA= 0
##$GB= 0
##$INTBC= 1
##$INTSCL= 3.241238e-09
##$ISEN= 128
##$LB= 0.25
##$LEV0= 0
##$LPBIN= 0
##$MAXI= 10000
##$MC2= 0
##$MEAN= 0
##$ME_mod= 0
##$MI= 1.114404
##$NCOEF= 0
##$NC_proc= -6
##$NLEV= 6
##$NOISF1= 3.799351
##$NOISF2= 2.8
##$NSP= 0
##$NTH_PI= 0
##$NZP= 0
##$OFFSET= 15.40092
##$PC= 1
##$PHC0= -1559.337
##$PHC1= 9.79228
##$PH_mod= 1
##$PKNL= yes
##$PPARMOD= 0
##$PSCAL= 0
##$PSIGN= 0
##$REVERSE= no
##$SF= 200.130024171641
##$SI= 16384
##$SIGF1= 3
##$SIGF2= 2
##$SINO= 0.751879
##$SIOLD= 32768
##$SREGLST= <19F.Aceton>
##$SSB= 0
##$STSI= 16384
##$STSR= 0
##$SW_p= 3612.71676300578
##$SYMM= 0
##$S_DEV= 0
##$TDeff= 16384
##$TDoff= 0
##$TI= <>
##$TILT= no
##$TM1= 0
##$TM2= 0
##$TOPLEV= 0
##$USERP1= <user>
##$USERP2= <user>
##$USERP3= <user>
##$USERP4= <user>
##$USERP5= <user>
##$WDW= 1
##$XDIM= 16384
##$YMAX_p= 512188591
##$YMIN_p= -1327544
$$ End of Bruker specific parameters
$$ ---------------------------------
##NTUPLES= NMR SPECTRUM
##VAR_NAME=  FREQUENCY,     SPECTRUM/REAL,   SPECTRUM/IMAG
##SYMBOL=    X,             R,               I
##VAR_TYPE=  INDEPENDENT,   DEPENDENT,       DEPENDENT
##VAR_FORM=  AFFN,          ASDF,            ASDF
##VAR_DIM=   16384,         16384,           16384
##UNITS=     HZ,            ARBITRARY UNITS, ARBITRARY UNITS
##FACTOR=    0.220516191357247, 1,           1
##FIRST=     3082.18647470348, 0,            0
##LAST=      -530.5302883023, 0,             0
##MIN=       -530.5302883023, -1327544,      0
##MAX=       3082.18647470348, 512188591,    0
$$ Real data points
##PAGE= N=1
##DATA TABLE= (X++(R..R)), XYDATA
$$ [...]
11865f9129M221J80056j34888J6249N4034o9392K4334j44571p6106P1569J15531
$$ -69129 -64908 115148 -19740 -3491 50543 -18849 5485 -139086 -215192 -143623 -28092
11854b8092J82470j04575j60084k4630o8624O4135O7158N5993Q9579K0590j37905
$$ -28092 154378 49803 -110281 -134911 -203535 -139400 -72242 -16249 73330 93920 -43985
11843d3985R265R4875p2643k02629n19J67844m8340r7989J4777R6395L1734l1348
$$ -43985 -34720 60155 -12488 -215117 -215636 -47792 -96132 -194121 -179344 -82949 -51215 -82563
11831h2563O4578J6812J2806J08579k7726k94231J76864J85297j062j43403p9428
$$ -82563 -17985 -1173 11633 120212 92486 -201745 -24881 160416 159354 15951 -63477
11820f3477J0760n7064M8079j557k146k15343o7111J28375J24831l6468p1693
$$ -63477 -52717 -109781 -61702 -63259 -65405 -280748 -347859 -219484 -94653 -131121 -202814
11809b02814j1681j2104J67495Q3254o3390P8231Q1096j45552q813l4407n0882
$$ -202814 -214495 -226599 -59104 24150 -39240 38991 120087 -25465 -34278 -68685 -119567
11798a19567N9817J9900J13628L4930j24586K4914n8288p8693N6913k0063J3908
$$ -119567 -59750 -39850 73778 108708 -15878 9036 -49252 -127945 -71032 -91095 -77187
11787g7187P3330m978p3491O480m6327m6211l5377J11613k9354k0672J11973q3725
$$ -77187 -3857 -8835 -82326 -75846 -122173 -168384 -203761 -92148 -121502 -142174 -30201 -113926
11775a13926o1389J16467l2100j03008J0479J70121Q9202r8039j47231R3341L1523
$$ -113926 -175315 -58848 -90948 -193956 -183477 -13356 75846 -22193 -169424 -76083 -44560
11764d4560l0617j14441o0617R7847M2346R0458J48035L7447O0799q9525j40855
$$ -44560 -75177 -189618 -250235 -152388 -110042 -19584 128451 165898 226697 137172 -3683
11753c683O1226J5573j03148J19n2409M1959K9382L350p9920N2787L3399K3249
$$ -3683 57543 73116 -30032 -29913 -82322 -40363 -10981 -7631 -87551 -34764 -1365 21884
11741B1884j61566N1333R607L96p0737R927O0407l2442R3619j05039k7685J02208
$$ 21884 -139682 -88349 -78742 -78346 -149083 -139156 -78749 -111191 -17572 -122611 -150296 -48088
11729d8088r7311Q9613K6426j81840O1462O8479r8090k02K4949j54938J01853
$$ -48088 -145399 -55786 -29360 -211200 -149738 -81259 -179349 -179551 -154602 -309540 -207687
11718b07687M9043R3488l066J21006m9457j06256P471R491j4636O368q3113O3566
$$ -207687 -158644 -65156 -68222 52784 3327 -102929 -95458 -85967 -100603 -94235 -177348 -113782
11706a13782j40757K1126J41867J14647r9731j91164J8202R1803l7568p5427N3035
$$ -113782 -254539 -233413 -91546 23101 -76630 -267794 -249592 -157789 -195357 -270784 -217749
11695b17749J17150M9572K2912j83177n6398O2004j24986L0955J90259l775p5294
$$ -217749 -100599 -51027 -28115 -211292 -267690 -205686 -330672 -299717 -109458 -113233 -188527
11684a88527J14087J30102J05664n9797j2193k24783j03665J02569M7672J12402
$$ -188527 -74440 55662 161326 101529 89336 -135447 -239112 -136543 -88871 23531
11674B3531o1434j54420N1168K720J12588k33553q0923J02777r954N5191O9788
$$ 23531 -37903 -192323 -141155 -138435 -25847 -259400 -340323 -237546 -247500 -192309 -122521
11663a22521J93648j43223j72086M2055M981L836k915P9772J41135j8673n9624
$$ -122521 71127 -72096 -244182 -202127 -197146 -193310 -196225 -116453 24682 6009 -53615
11652e3615q8319J9412P2142p3648J09059o0230K5127K32191j39397k28115j6424
$$ -53615 -141934 -122522 -50380 -124028 -14969 -75199 -50072 182119 42722 -185393 -201817
11641b01817J9043j36937L13903P4441j89347J12495Q7503n1027j52830k2691
$$ -201817 -182774 -319711 -5808 68633 -120714 -8219 79284 28257 -124573 -147264
11631a47264J54747q2170O7757M1058P4496n9486q4162n3584m9981N3173J2227
$$ -147264 7483 -74687 -6930 34128 108624 49138 -35024 -88608 -138589 -85416 -73189
11620g3189N1901n3758j24167l6047K0979R6416J14379n5567k0075N8284l0672
$$ -73189 -21288 -75046 -199213 -235260 -214281 -117865 -3486 -59053 -79128 -20844 -51516
11609e1516k2158n0255j35609R6251K44220k4115j94458J76759J02863j86763
$$ -51516 -73674 -123929 -259538 -163287 80933 56818 -137640 39119 141982 -44781
11599d4781o0921J4324J48355K553j17255J1871O3179L5702j05707l3286j56942
$$ -44781 -105702 -91378 56977 59530 -57725 -45854 17325 53027 -52680 -85966 -242908
11588b42908J73841P0226q7206m3163n4762J26266r64M7634K0643J6708k10839
$$ -242908 -69067 1159 -86047 -129210 -183972 -57706 -58670 -11036 9607 26315 -184524
11577a84524P4535l0023q167j5784R458J06274r23j08106K622J6960O1238J21107
$$ -184524 -109989 -140012 -148179 -163963 -154505 -48231 -49154 -157260 -154638 -137678 -76440 44667
11565D4667p3415J7817j19047M7197l2596k8R3670J01151j6997k2214p798r5693
$$ 44667 -28748 -10931 -129978 -82781 -115377 -115405 -21735 79416 62419 40205 32407 -63286
11553f3286j16913J52504m175j08921k617J93290m6803K11162j27633l3175l4796
$$ -63286 -180199 -27695 -31870 -140791 -143408 49882 3079 214241 86608 53433 18637
11542A8637R6955j6695l3922q0659j84858J46153K7194l5212k4653K4144k1581
$$ 18637 115592 98897 64975 -15684 -200542 -54389 -27195 -62407 -87060 -62916 -84497
11531h4497p004J5971K6461J03786J14604k35522l6225J5282L6879l150p8780
$$ -84497 -91501 -75530 -49069 54717 169321 -66201 -102426 -87144 -50265 -53415 -132195
11520a32195K7376j59100k8317K40231l8823l3043j76060j8881R3545n4283J48681
$$ -132195 -104819 -263919 -292236 -52005 -90828 -123871 -299931 -318812 -225267 -279550 -130869
11509a30869M956n6852J69359O0475l8985j50457l3428j6771l0950N7970Q0905
$$ -130869 -125913 -182765 -13406 47069 8084 -142373 -175801 -192572 -223522 -165552 -84647
11498h4647O371J00952M4615j80393o5227J62425J4283q2061M6767J04257j0607
$$ -84647 -78276 22676 67291 -113102 -178329 -15904 -1621 -83682 -36915 67342 56735
11487E6735j73746Q421P7036r3733m0438J97549o3048r0676n0327J66087M8622
$$ 56735 -117011 -108590 -31554 -125287 -165725 31824 -31224 -121900 -172227 -6140 42482
11476D2482M7937j83641k17855K9897M4042J83032J7101p4337L3834R8352j32430
$$ 42482 90419 -93222 -311077 -281180 -237138 -54106 -37005 -111342 -77508 20844 -111586
11465a11586j49024K04968J34903p8852p8657j2595J99284j12071N0746l4912
$$ -111586 -260610 -55642 79261 409 -78248 -90843 108441 -3630 47116 12204
11455A2204j2468j21709J13217p4130K5880p8474j29567J46004J89224r3096J27030
$$ 12204 -264 -121973 -8756 -82886 -57006 -135480 -265047 -119043 70181 -22915 104115
11444A04115L1042q8934j5721M8248m1234k5299k1512J3076J14026j44567k769
$$ 104115 135157 46223 30502 78750 37516 12217 -9295 3781 117807 -26760 -29529
11433b9529o6510P793P4651o0149n6294K1517q1922N0835p3412r987J34190n2632
$$ -29529 -96039 -88246 -13595 -73744 -130038 -108521 -190443 -139608 -213020 -223007 -88817 -141449
11421a41449n5337j7143R8735J95402J4828Q9486m6429p5832m6978j61391K2529
$$ -141449 -196786 -213929 -115194 80208 95036 184522 138093 62261 15283 -146108 -123579
11410a23579Q8182k02491R1021K1461o395j48083N4999Q9373M1880K5998j02912
$$ -123579 -35397 -237888 -146867 -125406 -131801 -279884 -224885 -135512 -93632 -67634 -170546
11399a70546q9608J27238R3252n2771K308k3803Q4084j10837J42591o61j13504
$$ -170546 -260154 -132916 -39664 -92435 -90127 -113930 -29846 -140683 1908 1247 -112257
11388a12257n948n2522J51119n9390j16926P9538J41156l0273j53836J6121Q3190
$$ -112257 -118205 -170727 -19608 -78998 -195924 -116386 24770 -5503 -159339 -143218 -60028
11377f0028m4078n9672J26310Q9196m6583p6890J72195Q0929l8298q9446j6557
$$ -60028 -104106 -163778 -37468 51728 5145 -71745 100450 181379 143081 53635 37078
11366C7078j41487j07147M3883k2239Q5606j2983q0959J0633j26560l984K48324
$$ 37078 -104409 -211556 -167673 -189912 -104306 -117289 -198248 -187615 -314175 -318159 -69835
11355f9835m671J3443m7363P1901q0074j0065j13445K44053n6035r5442J48038
$$ -69835 -74506 -61063 -108426 -36525 -116599 -126664 -240109 3944 -52091 -147533 505
11344E05j01644K3843R3861K9567j54630p3163P6899J4240J27451j6189K988L787
$$ 505 -101139 -77296 16565 46132 -108498 -181661 -104762 -90522 36929 20740 23728 27515
11332B7515j00869q270r1868K196k726n0453J56235K9220l2067j2509J3645M3524
$$ 27515 -73354 -81624 -173492 -171296 -174022 -224475 -68240 -39020 -71087 -83596 -69951 -26427
11320b6427j10472J05914M3015k3143j72686P9453P0256j53621J22420j1695K1741
$$ -26427 -136899 -30985 12030 -11113 -183799 -104346 -34090 -187711 -65291 -76986 -55245
11309e5245Q1624p4625l7076n8661J88539j03834J19047J23995l6537j33387j21591
$$ -55245 26379 -48246 -85322 -143983 44556 -59278 59769 183764 147227 13840 -107751
11298a07751J01566R513q1592j2583j6721j3027L1721q788k9995M4921J3325O5821
$$ -107751 -6185 3328 -78264 -90847 -107568 -120595 -88874 -97662 -127657 -82736 -69411 -3590
11286c590q7641m5013l3929q1556O6299Q7928j5247l6320R8504O6025L5642M4353
$$ -3590 -91231 -136244 -170173 -251729 -185430 -97502 -112749 -149069 -50565 15460 51102 95455
11274I5455k11854j16852M5706n3153M7685K5824k200M1949J51167n4456l0517
$$ 95455 -116399 -233251 -187545 -240698 -193013 -167189 -169389 -127440 23727 -30729 -61246
11263f1246N0151j15678M4570l0921p9498q5917M9276l0272J25400L7107O6670
$$ -61246 -11095 -126773 -82203 -113124 -192622 -278539 -229263 -259535 -134135 -97028 -30358
11252c0358O9556O913K7376j0172N2988k1518r1106k25133P0360j7019N9332R1743
$$ -30358 39198 46111 73487 63315 116303 94785 3679 -221454 -151094 -168113 -108781 -17038
11240a7038R6572M7841j07952j58645j37247J60894J6966p7771P3870l789O134
$$ -17038 79534 127375 19423 -139222 -276469 -115575 -98609 -176380 -102510 -106299 -100165
11229a00165n4940Q507p2352J38764N9623R6020O1146k32351o9906R3376l5558
$$ -100165 -155105 -146598 -218950 -80186 -20563 75457 136603 -95748 -165654 -72278 -107836
11218a07836K23661j18141R8193R8762j54472p5867M1445J08745q4400O9338j64742
$$ -107836 115825 -2316 95877 194639 40167 -35700 5745 114490 30090 99428 -65314
11207f5314k290M0395n4567M5738L4422j21515Q3707K9536N4880N575L5611K2234
$$ -65314 -67604 -27209 -81776 -36038 -1616 -123131 -39424 -9888 44992 50567 86178 108412
11195A08412K631O4592m7501j4456n1456j58640m1116j429l3950K0490j8414k3339
$$ 108412 111043 175635 128134 113678 62222 -96418 -137534 -138963 -172913 -152423 -170837 -194176
11183a94176R5365N0816R0588J43945j82076J50906o1265q7000j97047n4328l1721
$$ -194176 -98811 -47995 42593 186538 4462 155368 94103 7103 -189944 -244272 -275993
11172b75993R6987J50839k38356J50841J91805O3963j41904q6811J21752o5545
$$ -275993 -179006 -28167 -266523 -115682 76123 140086 -1818 -88629 33123 -32422
11162c2422N3012j53723k2564j4862j17591J14723M5110L4316M6113M030r708
$$ -32422 20590 -133133 -155697 -170559 -288150 -173427 -128317 -94001 -47888 -43858 -53566
11151e3566R7954n8130k0271j424K6606j37499m5777O6016K20179r4789N0257
$$ -53566 44388 -13742 -34013 -35437 -8831 -146330 -192107 -126091 94088 -701 49556
11140D9556m7528o3476N3481j85647L2268J8278N7794r6004j25780K60694j260
$$ 49556 2028 -61448 -7967 -193614 -161346 -143068 -85274 -181278 -307058 -46364 -47624
11129d7624j18410K0721M7297J96658o0823p3871k7485q0491P1386R708j04911
$$ -47624 -166034 -145313 -98016 98642 37819 -36052 -63537 -144028 -72642 -62934 -167845
11118a67845k5025K29297R434N1233l242j00039k20215j80978J40536K35006M3824
$$ -167845 -192870 36427 45861 97094 93852 -6187 -226402 -407380 -266844 -31838 11986
11107A1986j73008O6690R8183J1581k4319P3670l8884N4233J56311n7338r9258
$$ 11986 -161022 -94332 3851 15432 -8887 64783 25899 80132 236443 179105 79847
11096G9847N72M0567k9396J20284j30087M0140J05691K4681J61387l4204k3135
$$ 79847 80419 120986 91590 211874 81787 121927 227618 252299 413686 379482 356347
11085C56347k3963j06771N9902R3348j94670J23854j21155k2446Q8461l2134p2841
$$ 356347 332384 225613 285515 378863 184193 308047 186892 164446 252907 220773 147932
11074A47932k3649m6856M6480j70527j588K19633n3003o2807P7317j11812M4971
$$ 147932 124283 77427 123907 -46620 -48208 171425 118422 55615 132932 21120 66091
11063F6091L4312K303O4266P8138n6356p8361L0525N9792r6935n6617j7752j14581
$$ 66091 100403 102706 166972 245110 188754 110393 140918 200710 103775 47158 29406 -85175
11051h5175R2421J8517j23383K3140J08764k34164J56386M5017R0435j8973l1312
$$ -85175 7246 25763 -97620 -74480 34284 -199880 -43494 1523 91958 72985 41673
11040D1673O6669P8895k3676k53884M431N9451o6742J5408O4524j6512p6320j61286
$$ 41673 108342 187237 163561 -90323 -85892 -26441 -93183 -77775 -13251 -29763 -106083 -267369
11028b67369O3324J68321j59499j13418j4873L9357Q2652m3757P3803J38587J54520
$$ -267369 -204045 -35724 -195223 -308641 -323514 -284157 -201505 -245262 -171459 -32872 121648
11017A21648N3332k75575M0098j8010M295J7383p780m5761k3470J31269L2035
$$ 121648 174980 -100595 -60497 -78507 -74212 -56829 -64609 -110370 -133840 -2571 29464
11006B9464J0354m7196L3663n4366l5392N5586l0982Q9692o7710j27263J57712
$$ 29464 39818 -7378 26285 -28081 -63473 -7887 -38869 50823 -16887 -144150 13562
10995A3562p4969o0594R7918J5549J9484L2484o0266m768J49169j77770J07367
$$ 13562 -61407 -122001 -24083 -8534 10950 43434 -16832 -21600 127569 -50201 57166
10984E7166L0512p1796K0908j4881r0572K5M5546j69984K29813Q2720M5504M4654
$$ 57166 87678 15882 36790 21909 -68663 -68638 -23092 -193076 36737 119457 164961 209615
10972B09615j09358j15347n283r6817J22850N4899j6973K5807j44921j8499o958
$$ 209615 100257 -15090 -20373 -117190 5660 60559 43586 69393 -75528 -94027 -100985
10961a00985J7931n8919J06620L9106K38463o7097j37328R801o6049O2616L1594
$$ -100985 -83054 -141973 -35353 3753 242216 175119 37791 47592 -18457 44159 75753
10950G5753q6933p3827N4122Q529n2588j70175J84973Q2404k40035j6034K27193
$$ 75753 -11180 -85007 -30885 -22356 -74944 -245119 -60146 22258 -217777 -233811 -6618
10939f618J9400P0546R6n2165M508k6614j10512R9269o3225n8591p2051J35771
$$ -6618 12782 83328 83424 31259 35767 9153 -101359 -2090 -65315 -123906 -195957 -60186
10927f0186m9249r9098J1539J22851l8521p0921O1085M4903J02150p9476j65729
$$ -60186 -109435 -208533 -196994 -74143 -112664 -183585 -122500 -77597 24553 -54923 -220652
10916b20652J10846K6288o1582R1999n517j9814k15006K5062J36846K832J36829
$$ -220652 -109806 -83518 -145100 -53101 -58618 -78432 -293438 -268376 -131530 -128698 8131
10905H131n7245k4695j02351k3491N3187j31223O9969k499J65922r1572j52598
$$ 8131 -49114 -73809 -176160 -199651 -146464 -277687 -207718 -210217 -44295 -135867 -288465
10894b88465J61672K161n1165K36587q1658j2774P2659j55266M6764J50347J7721
$$ -288465 -126793 -124632 -175797 60790 -20868 -33642 39017 -116249 -69485 80862 98583
10883I8583o1454q8396m1195J1297J13410k37104k8734J88502R4358J4668o5252
$$ 98583 37129 -51267 -92462 -81165 32245 -204859 -233593 -45091 49267 63935 -1317
10872a317J2818j04048L4010J10371j6047j19934N2673k9560K8282K1070K2007
$$ -1317 11501 -92547 -58537 51834 35787 -84147 -31474 -61034 -32752 -11682 10325
10861A0325r4371j00179J01010P6661J16202m2184q2034k22234O0785l375k8543
$$ 10325 -84046 -184225 -83215 -6554 109648 67464 -14570 -236804 -176019 -179394 -207937
10850b07937P5249N1104j08170p5957k0488J99587K22885l4572j79479j77958
$$ -207937 -132688 -81584 -189754 -265711 -286199 -86612 136273 101701 -77778 -255736
10840b55736l5486J62105J88303q0494j27949J0730j78492K47980J33260q747
$$ -255736 -291222 -129117 59186 -21308 -149257 -138527 -317019 -69039 64221 55474
10830E5474j32505j30714o8591O9592J09982P6281M77R481j21128K855J29145
$$ 55474 -77031 -207745 -276336 -206744 -96762 -20481 -20004 -10523 -131651 -128796 349
10819C49j77800k1039q447J35083J72227L8752o2912j17760k48240Q2631k0942
$$ 349 -177451 -198490 -206937 -71854 100373 139125 76213 -41547 -289787 -207156 -228098
10808b28098O3177K8247l1768n0390K1956p5450K8267K18863O675p6996j74927
$$ -228098 -164921 -136674 -168442 -218832 -196876 -272326 -244059 -25196 -18521 -95517 -270444
10797b70444j0103R6854J03066O6440P5888n5461k98845l0421K64218M405j61265
$$ -270444 -280547 -183693 -80627 -14187 61701 6240 -292605 -323026 -58808 -54403 -215668
10786b15668R6256M9532O6275j14512M1913J9055N621o3170q0058P2412J14639
$$ -215668 -119412 -69880 -3605 -118117 -76204 -57149 -51528 -114698 -194756 -122344 -7705
10775g705k0207J09210j32551j9692j27590j7908j01527L4989L1865R8469R6189
$$ -7705 -27912 81298 -51253 -70945 -198535 -216443 -317970 -282981 -251116 -152647 -56458
10764e6458l1667M2143p699k53012k4179J16917j16126J20673O417l0983N5270
$$ -56458 -88125 -45982 -53681 -306693 -330872 -213955 -330081 -209408 -202991 -233974 -178704
10753a78704J20191j30775j51554r5530J70085K4877J05352K519J92364j15326
$$ -178704 -58513 -189288 -340842 -436372 -266287 -241410 -136058 -133539 58825 -56501
10743e6501j66157O3123l8703J43858k03171n9247K17198q1010j6874K3525o2060
$$ -56501 -222658 -159535 -198238 -54380 -257551 -316798 -99600 -180610 -197484 -173959 -236019
10732b36019O6102J06126j7147o0442p537m3552L3097L9869l071K31590P4085
$$ -236019 -169917 -63791 -80938 -141380 -148917 -192469 -159372 -119503 -122574 109016 183101
10721A83101k29694j63995N1455J26974k2803j36209k0250J15999p2590J00204
$$ 183101 -46593 -210588 -159133 -32159 -54962 -191171 -211421 -95422 -168012 -67808
10711f7808J65639j07619j52942R1365O8424n9698j14636J23680J07521l1689
$$ -67808 97831 -9788 -162730 -71365 -2941 -62639 -177275 -53595 53926 22237
10701B2237J03059j43181j55760j92097J96014J03043m9068J7587r6956K5741
$$ 22237 125296 -17885 -173645 -365742 -169728 -66685 -115753 -98166 -195122 -169381
10691a69381M2759K6540j85258l6451J68275l8362j12421O5957J58128m8882j04435
$$ -169381 -126622 -100082 -285340 -321791 -153516 -191878 -304299 -238342 -80214 -129096 -233531
10680b33531J715J29844l423J2894n6941J01167m1907J8532p9707n1123J73379
$$ -233531 -231816 -101972 -105395 -92501 -149442 -48275 -90182 -71650 -151357 -202480 -29101
10669b9101R6686j28532r8607J95585j3773p4567o7524M7163J6879n9630M7459
$$ -29101 67585 -60947 -159554 36031 22258 -52309 -119833 -72670 -55791 -115421 -67962
10658f7962O9982j10863k4882J78942J03155k15602j96427K6401M9649Q4345K7584
$$ -67962 2020 -108843 -133725 45217 148372 -67230 -263657 -237256 -187607 -103262 -75678
10647g5678L731K958O0292J02793r2510l4323J17496q7513K6609k0764j52900
$$ -75678 -71947 -68989 -8697 94096 1586 -32737 84759 -2754 23855 3091 -149809
10636a49809Q0759J18229j11657M2687j22466k44422J07079J52102Q1767m8457
$$ -149809 -69050 49179 -62478 -19791 -142257 -386679 -279600 -127498 -45731 -94188
10626i4188J9934n3493P8393J48713K6091m7960j26349J33812j35044n6454K0403
$$ -94188 -74254 -127747 -49354 99359 125450 77490 -48859 84953 -50091 -106545 -86142
10615h6142r0211K177l229J35949K9178j9239q5991l020Q4216M3154P7484j35238
$$ -86142 -176353 -174176 -177405 -41456 -12278 -31517 -117508 -120528 -36312 6842 84326 -50912
10603e0912k3957m5255K1913N5555o5527P6183j53250p3455J16966P4891K8723
$$ -50912 -74869 -120124 -98211 -42656 -108183 -32000 -185250 -258705 -141739 -66848 -38125
10592c8125k5344O3544j09213r4779o1233N218J21473m9799N2120j36445o8076
$$ -38125 -63469 75 -109138 -203917 -265150 -259932 -138459 -188258 -136138 -272583 -340659
10581c40659K02590P7844j40746O0493q0108O230q4765K42238j9477j03346L3775
$$ -340659 -138069 -60225 -200971 -140478 -220586 -214356 -299121 -56883 -76360 -179706 -145931
10570a45931J04637J854n6020j7476m9056n2180L3658J39207P8012K5639k15555
$$ -145931 -41294 -39440 -95460 -112936 -161992 -214172 -180514 -41307 36705 62344 -153211
10559a53211J49590Q5521j11584r637m0693l1463N0541M7127L5129m3552j67136
$$ -153211 -3621 81900 -29684 -39321 -80014 -111477 -60936 -13809 21320 -22232 -189368
10548a89368K3204J18950o3381m6083n3830J29238k4592J06734N8019J0222l5670
$$ -189368 -166164 -47214 -110595 -156678 -210508 -81270 -105862 872 58891 69113 33443
10537C3443j46612J01469L0182q4066Q5104L2843m1809j9351p057j3842k7405
$$ 33443 -113169 -11700 18482 -65584 19520 52363 10554 -8797 -15854 -29696 -57101
10526e7101N8136j9629j04401J308P1933N8881l8253o9889J32923K1417j21928
$$ -57101 1035 -18594 -122995 -121687 -49754 9127 -29126 -99015 33908 55325 -66603
10515f6603k6644K0395j7115k2891l0076J62681l6667m3217j36093p5846L189
$$ -66603 -93247 -72852 -89967 -112858 -142934 19747 -16920 -60137 -196230 -272076 -268887
10504b68887J36695r6372L5919K66634N6681l1322j4831n6438p4724J2488L7424
$$ -268887 -132192 -228564 -192645 73989 130670 99348 84517 28079 -46645 -34157 3267
10493C267M381M1526n3813p191M0972j83995K9594k0611J84430m1214j0859j6202
$$ 3267 7648 49174 -4639 -11830 29142 -154853 -125259 -145870 38560 -2654 -13513 -29715
10481b9715J05206l4006m1607J30069j75820j47999k1704R1923L3900j6034J25781
$$ -29715 75491 41485 -122 129947 -45873 -193872 -215576 -123653 -89753 -105787 19994
10470A9994Q7313p8006j1783J47459j40405l0302J04359j64844q0114k1468j04350
$$ 19994 107307 29301 17518 164977 24572 -5730 98629 -66215 -146329 -167797 -272147
10459b72147J12229J89524K6742q1769n0901P4319k1951k684k3570m2634J80098
$$ -272147 -159918 29606 56348 -25421 -76322 -2003 -23954 -26638 -50208 -92842 87256
10448H7256K7206q9978R0786m9493l0377j00279k75360M1931K6797K04616j1087
$$ 87256 114462 24484 115270 65777 35400 -64879 -340239 -298308 -271511 -66895 -77982
10437g7982o2926P2750J40069j2982j13341n8751L0704Q652N7573Q396m3205q4111
$$ -77982 -140908 -68158 71911 58929 -54412 -113163 -82459 -73807 -16234 -7838 -51043 -135154
10425a35154r9022K06988O094J401l4970p5201L8413L6361p024P0074J10946n268
$$ -135154 -234176 -27188 -21094 -19693 -54663 -129864 -91451 -55090 -62114 7960 118906 113638
10413A13638l9361l17236r6589L17598r3994K0976J63064r9933M2587p245l2620
$$ 113638 74277 -242959 -339548 -21950 -115944 -94968 68096 -31837 10750 3505 -29115
10402b9115m2708J30065M1215k2710Q2458k34782q9216Q111j8780J9437L360J80921
$$ -29115 -71823 58242 99457 76747 159205 -75577 -164793 -156682 -175462 -156025 -152665 28256
10390B8256o1820j3257J12254m6418k847R676o4646l9168k940P7202l4812L4882
$$ 28256 -33564 -46821 65433 19015 16168 25844 -38802 -77970 -80910 -3708 -38520 -3638
10378c638p3755M212J04465k3491j04839J13403k9065L4598M1119J2490j15777
$$ -3638 -77393 -73181 31284 7793 -97046 16357 -12708 21890 63009 75499 -40278
10367d0278p0193j7431j94168K35409M0153M0455l2907J7059j24842J18858l0934
$$ -40278 -110471 -127902 -322070 -86661 -46508 -6053 -38960 -21901 -146743 -27885 -58819
10356e8819J17027K8389Q152j88155k6758M3586r3971R2830Q2649O7361L8118
$$ -58819 58208 86597 94749 -93406 -120164 -76578 -170549 -77719 4930 72291 110409
10345A10409j83261J63683N1960k40236j57104J37465m6600K6195r4037M8983
$$ 110409 -72852 90831 142791 -97445 -254549 -117084 -163684 -137489 -231526 -182543
10335a82543P0855J10884j5073o9614J526j26798J03676P6214N5157R57j21025
$$ -182543 -111688 -804 -15877 -85491 -83965 -210763 -107087 -30873 24284 25241 -95784
10324i5784J597J4636j2951J12681p7329k7487M2236j6296P2032l1582n5388K6081
$$ -95784 -94187 -79551 -92502 20179 -57150 -84637 -42401 -58697 13335 -18247 -73635 -47554
10312d7554L1186N2305m237p6107m6194K0789J16494J21617M5398k5321j26546
$$ -47554 -16368 35937 31700 -44407 -90601 -69812 46682 168299 213697 188376 61830
10301F1830P5273r4278l8657R762N0534r3576N829N4430Q2593R791J86129j02894
$$ 61830 137103 42825 4168 13930 64464 -29112 -23283 31147 113740 123531 309660 206766
10289B06766J446o9172j57261J4603j15477O9123q3063M4769J44503P2572M3181
$$ 206766 208212 139040 -18221 -3618 -119095 -49972 -133035 -88266 56237 128809 171990
10278A71990j81310K1397m5862j91744j21432L56051P8318j48364l2919P8240
$$ 171990 -9320 12077 -33785 -225529 -346961 9090 87408 -60956 -93875 -15635
10268a5635J5368k5523L9036J90115j22240o873Q7872r733K4820K3155n8107r3864
$$ -15635 -267 -25790 13246 203361 81121 74248 162120 152387 177207 200362 142255 48391
10256D8391P4189J83864k4655L7096j53201l1169J23061q7759j86876J39193O3843
$$ 48391 122580 306444 281789 318885 165684 134515 257576 169817 -17059 122134 185977
10245A85977J39922O4506j68452k05758L196R5820R0202R1648k21514J72765m5139
$$ 185977 325899 390405 221953 16195 19391 115211 205413 297061 75547 248312 203173
10234B03173J3753N0347N6917j89994j50731J2571O3561J05700J18415r1596o4116
$$ 203173 216926 267273 324190 134196 -16535 -3964 59597 165297 283712 192116 128000
10223A28000l446R4477R0944j06327L210K1063p6877l1526p8254J84732j54933
$$ 128000 124554 219031 309975 203648 206858 227921 151044 119518 41264 225996 71063
10212G1063L3401Q4314q3081N3484N9243j02963J0697j8656J22070j1069j23631
$$ 71063 104464 188778 105697 159181 218424 115461 126158 107502 229572 218503 94872
10201I4872J17182j23260r8121J99888l4065m5511J15183j2311o5618j4623N6742
$$ 94872 212054 88794 -9327 190561 156496 110985 226168 213857 148239 133616 190358
10190A90358j13796j07178J31352K8416j06499Q0159q6705l6822k7085J54109
$$ 190358 76562 -30616 100736 129152 22653 102812 16107 -20715 -47800 106309
10180A06309K8791j08068J80192J41983p3942Q8802o4039p236Q5536M3822J7521
$$ 106309 135100 27032 207224 349207 275265 364067 300028 292792 378328 422150 439671
10169D39671k8735j03825k8412k2225l0051j23329P2442N9475K8753J59837j4859
$$ 439671 410936 307111 278699 256474 226423 103094 175536 235011 263764 423601 408742
10158D08742m6356j56881l0949n8849P1010k6553j46097O7804J31565J21944L9328
$$ 408742 362386 205505 174556 115707 186717 160164 14067 81871 213436 335380 374708
10147C74708j35081R1180o2834r0120O1614M0565J4919J1862n6480j6281J6j6289
$$ 374708 239627 330807 267973 177853 239467 280032 294951 306813 250333 234052 234068 217779
10135B17779M2390P7105m1300l0612N5532N165n7724j4512J23494J0438o6463
$$ 217779 260169 337274 295974 265362 320894 326059 268335 253823 377317 387755 321292
10124C21292j07966J23580Q0888l6602j51389n8662Q5380P5258j62665P2082m5922
$$ 321292 213326 336906 417794 381192 229803 171141 256521 331779 169114 241196 195274
10113A95274P6329P7248j38571J74740m7533J37151n3801j33741J41236Q1959
$$ 195274 271603 348851 210280 385020 337487 474638 420837 287096 428332 510291
10103E10291j7574k0830j55087m8651J6805l6450m3465L48368M4846r5847j61905
$$ 510291 492717 471887 316800 268149 284954 248504 205039 553407 598253 502406 340501
10092C40501O949J28162J06391J46154j03559K84n9157K8981N8383K7673l237
$$ 340501 347450 475612 582003 728157 624598 624882 565725 594706 653089 680762 677525
10081F77525p1980M2161j7836M8448M0674L9440M2453l2487Q9124n448R732j19149
$$ 677525 605545 647706 629870 678318 718992 758432 800885 768398 857522 852074 861806 742657
10069G42657J26190J23268j25620M5237O7784N1816N2583o2017O3317l439N1203
$$ 742657 868847 992115 866495 911732 979516 1031332 1083915 1021898 1085215 1081776 1132979
10058A132979P7831L444L332O4929j6789O0445J76739j52128J64701J56653m6699
$$ 1132979 1210810 1214254 1217586 1282515 1265726 1326171 1502910 1350782 1515483 1672136 1625437
10047A625437N0602j67163k01502J14359j2986m8940l6498l4001J17825K5842
$$ 1625437 1676039 1508876 1307374 1421733 1408747 1359807 1323309 1289308 1407133 1432975
10037A432975o4583j44696o4505L9524J10148k28444R7344K11253m7708P6282
$$ 1432975 1368392 1223696 1159191 1198715 1308863 1080419 1177763 1389016 1341308 1417590
10027A417590j7673Q164P0428p374j633L6043p8947J8320K50688q0125o2855N6150
$$ 1417590 1399917 1408081 1478509 1471135 1469502 1505545 1426598 1444918 1695606 1615481 1552626 1608776
10015A608776O2895k80005k705k6169j46634L8364N9442Q7390j20511m6515Q0843
$$ 1608776 1671671 1391666 1388961 1362792 1216158 1254522 1313964 1401354 1280843 1234328 1315171
10004A315171M2046K05381j73134J15667J42153o7844j43591k2309J10894R5962
$$ 1315171 1357217 1562598 1389464 1505131 1647284 1579440 1435849 1413540 1524434 1620396
9994A620396J12807Q0209N9097Q3456J06489l508K461m2374r4250j80778N0692
$$ 1620396 1733203 1813412 1872509 1955965 2062454 2058946 2061407 2019033 1924783 1744005 1794697
9983A794697p0645O757J04127j73500j69654r9377o8980k4565j6136L8543Q9390
$$ 1794697 1724052 1730809 1834936 1661436 1491782 1392405 1323425 1298860 1282724 1321267 1410657
9972A410657J01666r5328q8720j27579N4662j5545m391j11743o116k9728O1581
$$ 1410657 1512323 1416995 1328275 1200696 1255358 1239813 1235422 1123679 1117563 1087835 1149416
9961A149416q9673O3465L5079N4079j50249J4972O5310j13329j08989J43605J43993
$$ 1149416 1059743 1123208 1158287 1212366 1062117 1077089 1142399 1029070 920081 1063686 1207679
9950A207679J6841n5135l3405K8035J39344j7527j72690J20396J1843Q2007j11151
$$ 1207679 1224520 1169385 1135980 1164015 1303359 1285832 1113142 1233538 1245381 1327388 1216237
9939A216237k19783J5824J98560K7203k7180K93422M3475q3343l1463j54975K44465
$$ 1216237 996454 1012278 1210838 1238041 1210861 1504283 1547758 1464415 1432952 1277977 1522442
9928A522442L2399q8237n4294j56507M7551J32541j12112O809J42781K4629L9726
$$ 1522442 1554841 1466604 1412310 1255803 1303354 1435895 1323783 1330592 1473373 1498002 1537728
9917A537728L2508l3241N377J09042O2762j01140j2037M8170J12561K0973o2703
$$ 1537728 1570236 1536995 1542372 1651414 1714176 1613036 1600999 1649169 1761730 1782703 1720000
9906A720000q0513j4282L584L4214N6235K7161L1131R1317r6811Q7977r0423j99038
$$ 1720000 1639487 1625205 1628789 1663003 1719238 1746399 1777530 1868847 1772036 1860013 1769590 1570552
9894A570552J99597J03222K8158j05111j05905J54298J48624O6160J05967Q4375
$$ 1570552 1770149 1873371 1901529 1796418 1690513 1844811 1993435 2059595 2165562 2249937
9884B249937q2338k5331m412n7904n8039k3913R1492J4681M2949M6782l4304k9164
$$ 2249937 2167599 2142268 2137856 2079952 2021913 1998000 2089492 2104173 2147122 2193904 2159600 2130436
9872B130436J25414Q246K6648l4057J64977j30110J5360R2135k6983r826O1468
$$ 2130436 2255850 2264096 2290744 2256687 2421664 2291554 2306914 2399049 2372066 2362240 2423708
9861B423708J06467q447j7685J16201j45583q9909J40319j5152n3514j01256Q5616
$$ 2423708 2530175 2521728 2504043 2620244 2474661 2384752 2525071 2509919 2456405 2355149 2440765
9850B440765J75300J67721j86292r3341K5569J66094j12502M0556J76874J33222
$$ 2440765 2616065 2783786 2597494 2504153 2529722 2695816 2583314 2623870 2800744 2933966
9840B933966N9866R1388k3981K9349M9191n5606J21056L3554j05109o6634Q9901
$$ 2933966 2993832 3085220 3061239 3090588 3139779 3084173 3205229 3238783 3133674 3067040 3156941
9829C156941K68798Q7416k19527P1967J01137n4839p6055J40782J28566N9921
$$ 3156941 3425739 3513155 3293628 3365595 3466732 3411893 3335838 3476620 3605186 3665107
9819C665107J10733P3213R24j2551J56703m323Q0650N4722L1482P729J24677l0535
$$ 3665107 3775840 3849053 3849977 3837426 3994129 3989806 4070456 4125178 4156660 4164389 4289066 4258531
9807D258531J92194J82725k4754j691J53158K46858J950Q3287J19771J75044o5266
$$ 4258531 4450725 4633450 4608696 4607005 4760163 5007021 5008971 5092258 5212029 5387073 5321807
9796E321807J33051r741J19772J96473R5915K75253l1569L6687n570J32720J47987
$$ 5321807 5454858 5445117 5564889 5761362 5857277 6132530 6100961 6137648 6132078 6264798 6412785
9785F412785J99759J26053J2249J93441r4430K32912L06757J55485J85150J45180
$$ 6412785 6612544 6738597 6750846 6944287 6849857 7082769 7389526 7545011 7730161 7875341
9775G875341N6083K62892K06198K24086K67795J32933J48630J55967L50458K74054
$$ 7875341 7931424 8194316 8400514 8624600 8892395 9025328 9173958 9329925 9680383 9954437
9765I954437P2788M51836K39081L14018M17192K98098L57923M09154M06843M63908
$$ 9954437 10027225 10479061 10718142 11032160 11449352 11747450 12105373 12514527 12921370 13385278
9755A3385278M60665M39169O34647O09873P55256M98331O12246P45631Q56557
$$ 13385278 13845943 14285112 14919759 15529632 16284888 16783219 17395465 18141096 18997653
9746A8997653J032786Q45454J211504J194185J046650J207304J323610J642163
$$ 18997653 20030439 20875893 22087397 23281582 24328232 25535536 26859146 28501309
9738B8501309J752317J708330K118032K354054K607077L172976L199090L666871
$$ 28501309 30253626 31961956 34079988 36434042 39041119 42214095 45413185 49080056
9730D9080056M012364L918178L869555L953158L367257K728918K247946K123336
$$ 49080056 53092420 57010598 60880153 64833311 68200568 70929486 73177432 75300768
9722G5300768J380881P95643J92670j9540L55294M22725O36723J094428J977774
$$ 75300768 76681649 77477292 77669962 77650422 78005716 78428441 79065164 80159592 82137366
9713H2137366K649606L193791L762617M171307M521138N021263N604468O164866
$$ 82137366 84786972 87980763 91743380 95914687 100435825 105457088 111061556 117226422
9705A17226422O808303P437888P612007P895803Q207691Q621664Q589408Q439040
$$ 117226422 124034725 131472613 139084620 146980423 155188114 163809778 172399186 180838226
9697A80838226P845789O788378N217518L759545J909823p84316l255579n049773
$$ 180838226 188684015 195472393 200689911 204449456 206359279 205574963 202319384 197269611
9689A97269611n932068o059653n888467n888728n125385m490820l430810k635000
$$ 197269611 191337543 185277890 179389423 173500695 168375310 163884490 160453680 157818680
9681A57818680k220826j353016p19547j48101M01295Q63107J007263R36867J280498
$$ 157818680 155597854 154244838 153525291 153377190 153778485 154641592 155648855 156585722 157866220
9672A57866220J824288J789829K528797K796874L330960L539413L635245L857474
$$ 157866220 159690508 161480337 164009134 166806008 170136968 173676381 177311626 181169100
9664A81169100L574404L063037K254384R67731o71746k667723m854192o707652
$$ 181169100 184743504 187806541 190060925 191028656 190356910 187689187 182834995 176127343
9656A76127343q179945q882103r348555r218147q355259p216537o107556n080476
$$ 176127343 167947398 159065295 149716740 140498593 132143334 124926797 118819241 113738765
9648A13738765m367335l465729l164968l108782k615172k733408l047457l180590
$$ 113738765 109371430 105905701 102740733 99631951 97016779 94283371 91235914 88055324
9640H8055324l406086l570532l884738m000642m038004l920031m033964l673863
$$ 88055324 84649238 81078706 77193968 73193326 69155322 65235291 61201327 57527464
9632E7527464l465512l139410k638764k333830k127936j983642j850729j645801
$$ 57527464 54061952 50922542 48283778 45949948 43822012 41838370 39987641 38341840
9624C8341840j401025j403670j406629j319164j189208j209343j160748r02058
$$ 38341840 36940815 35537145 34130516 32811352 31622144 30412801 29252053 28349995
9616B8349995j040168j055532q29439n42628p05948o53070o49350p38787o28681
$$ 28349995 27309827 26254295 25424856 24882228 24176280 23523210 22873860 22135073 21506392
9607B1506392n52009l99482n14273m41059m49446k92566n52536k59714j84836
$$ 21506392 20954383 20554901 20040628 19599569 19150123 18857557 18305021 18045307 17860471
9598A7860471l21685k52454k26148J8647j56298j25264j66421j80140q5399l20112
$$ 17860471 17538786 17286332 17060184 17078831 16922533 16797269 16630848 16450708 16365309 16045197
9588A6045197l64432m33534j42764m00583l99815l19649k19386k56176k72221
$$ 16045197 15680765 15247231 15104467 14703884 14304069 13984420 13765034 13508858 13236637
9579A3236637k94305k16113k38707m82556m941n1577m17472k96035k40779j25633
$$ 13236637 12942332 12726219 12487512 12004956 12000015 11948438 11530966 11234931 10994152 10868519
9569A0868519l40510l14286k58654j82500k78336k96260l10853j18252k04453
$$ 10868519 10528009 10213723 9955069 9772569 9494233 9197973 8887120 8768868 8564415
9560H564415k16388k33651j32601Q8070l01806j40277L2268j52008L0145k48655
$$ 8564415 8348027 8114376 7981775 8069845 7768039 7627762 7660030 7508022 7538167 7289512
9550G289512j22368L0763J79O5591j74258r358n0915P4933J74031n026j10330
$$ 7289512 7167144 7197907 7198086 7263677 7089419 7080061 7029146 7104079 7278110 7273084 7162754
9539G162754p7171j40193Q0493N0879P5032j56912q5904l68015o6670L6710j13328
$$ 7162754 7085583 6945390 7025883 7076762 7151794 6994882 6908978 6540963 6474293 6511003 6397675
9528F397675j70099l52765j53396O2572j54404j36505m9699q9406l1556p4100
$$ 6397675 6227576 5874811 5721415 5783987 5629583 5493078 5443379 5353973 5322417 5248317
9518E248317j38169M8357j31211k28983l6286n1547J0029J03506j34110o6397
$$ 5248317 5110148 5158505 5027294 4798311 4762025 4710478 4720507 4824013 4689903 4623506
9508D623506j33071M9554k907j13870k0355L0791M8599j53529j62146P0351N1961
$$ 4623506 4490435 4539989 4537082 4423212 4402857 4433648 4482247 4328718 4166572 4236923 4288884
9497D288884k7169k6339j36659j73996L8800l4434j81111Q5434L0638O4976j33677
$$ 4288884 4261715 4235376 4098717 3924721 3963521 3929087 3747976 3833410 3864048 3929024 3795347
9486C795347j25064J37182J52682j19889q9447o4300M297l6596J0514j4321j26854
$$ 3795347 3670283 3807465 3960147 3840258 3750811 3686511 3690808 3654212 3664726 3650405 3523551
9475C523551Q2286J8119j39665j58553R6757Q0020Q2914q2404r3520q4420J17184
$$ 3523551 3605837 3623956 3484291 3325738 3422495 3502515 3585429 3503025 3409505 3325085 3442269
9464C442269J2988J12842j19482j21315r6673j21671K58463o7285Q7355Q7125
$$ 3442269 3455257 3568099 3448617 3327302 3230629 3108958 3367421 3300136 3387491 3474616
9454C474616J29333J9109m9299K7510J11602j8440l8814K90946n6440N0416N214
$$ 3474616 3603949 3623058 3573759 3601269 3712871 3694431 3655617 3946563 3890123 3940539 3945753
9443C945753J51004K62258N3217P5832O862K8018j87J89106j85483r307o4006
$$ 3945753 4096757 4359015 4412232 4488064 4494926 4522944 4522757 4711863 4526380 4517073 4453067
9432D453067p1597o2013k13271O6248K00287j68115o534n8760J26612q1855n6166
$$ 4453067 4381470 4319457 4106186 4172434 4372721 4204606 4198072 4139312 4265924 4184069 4127903
9421D127903O7144k2123j30017M7441o0042j4767K9701J15112q2592p4384M4286
$$ 4127903 4195047 4172924 4042907 4090348 4030306 4015539 4045240 4160352 4077760 4003376 4047662
9410D047662Q1087N7297J49139o2679q2683n5046J76594J05461O5982L37796K53659
$$ 4047662 4128749 4186046 4335185 4272506 4189823 4134777 4311371 4416832 4482814 4820610 5074269
9399E074269K73531K29606L35048J84052r7168J51993K20963l8065M0905r1371
$$ 5074269 5347800 5577406 5912454 6096506 5999338 6151331 6372294 6334229 6375134 6283763
9389F283763J54512Q9814M2591j35503M3425o2818j14830k42854j45002k40766
$$ 6283763 6438275 6528089 6570680 6435177 6478602 6415784 6300954 6058100 5913098 5672332
9379E672332l40523k48894p0171j1777j04662k06217L0920r9113o2947l7166j29220
$$ 5672332 5331809 5082915 5012744 5000967 4896305 4690088 4721008 4621895 4558948 4521782 4392562
9368D392562p0067r5798M6096k0246J5840J82523M0877j38030N195k3029N4849
$$ 4392562 4322495 4226697 4272793 4252547 4268387 4450910 4491787 4353757 4358952 4335923 4390772
9357D390772o0446r306M2248l1221l5073J05193N2535j5077j00527q569n1878
$$ 4390772 4330326 4321020 4363268 4332047 4296974 4402167 4454702 4439625 4339098 4330529 4278651
9346D278651Q5554J18747N308J56439j18342J78974J79764J71552J01313N3758
$$ 4278651 4364205 4482952 4488260 4644699 4526357 4705331 4885095 5056647 5157960 5211718
9336E211718J8235n757M8893O6727K716p4617J58796O8255J57189j2230K8101
$$ 5211718 5229953 5224196 5273089 5339816 5342532 5267915 5426711 5494966 5652155 5639925 5668026
9325E668026J87887J37218j60318m4344L45353J22575j75558K8540J53039j9733
$$ 5668026 5855913 5993131 5832813 5788469 6133822 6256397 6080839 6109379 6262418 6242685
9315F242685N3856J12174J7854J3248M6804j84085N2796o8512Q9727L1048J30091
$$ 6242685 6296541 6408715 6426569 6439817 6486621 6302536 6355332 6286820 6376547 6407595 6537686
9304F537686p4397P0150o0404M8297l2687O8327Q8861n9873M9024K16709N7405
$$ 6537686 6463289 6533439 6473035 6521332 6488645 6556972 6645833 6585960 6634984 6851693 6909098
9293F909098M3534M4045M7496K91674J27981J16065J92382R8089J73398K46020
$$ 6909098 6952632 6996677 7044173 7335847 7463828 7579893 7772275 7870364 8043762 8289782
9283H289782Q9148L1151J07101L40310J18633P8734P9197R0716J02589j62495
$$ 8289782 8378930 8410081 8517182 8857492 8976125 9054859 9134056 9224772 9327361 9164866
9273I164866j04985j88366j57245m3620m7432j08316k53330j31982m3133K3590
$$ 9164866 9059881 8871515 8714270 8670650 8623218 8514902 8261572 8129590 8086457 8110047
9263H110047j8087K29219p3525q232j02645j6560K03229J95794J33892P8095K01748
$$ 8110047 8091960 8321179 8247654 8239422 8136777 8120217 8323446 8519240 8653132 8731227 8932975
9252H932975J85364K30941K00486R9773J96884K00095L52244L27025K62975L12555
$$ 8932975 9118339 9349280 9549766 9649539 9846423 10046518 10398762 10725787 10988762 11301317
9242A1301317N17225K39328N82711L50855P2194K63600L66114L15513J35757J69092
$$ 11301317 11818542 12057870 12640581 12991436 13063630 13327230 13693344 14008857 14144614 14313706
9232A4313706J83837K98055N28922M15904L27511O28318Q71857J085537J347199
$$ 14313706 14497543 14795598 15324520 15740424 16067935 16696253 17568110 18653647 20000846
9223B0000846J365706J129342R16534M51323K38601l75092r17643j173559j022558
$$ 20000846 21366552 22495894 23412428 23863751 24102352 23727260 22809617 21636058 20613500
9214B0613500j011417p23778n57220n90331m67227l63140k47747j4407n6310j98843
$$ 20613500 19602083 18878305 18321085 17730754 17263527 16900387 16652640 16638233 16581923 16383080
9204A6383080J382P8654K50815J29595P4918L19452M77933L70102L54771M63117
$$ 16383080 16384462 16463116 16713931 16843526 16918444 17237896 17715829 18085931 18440702 18903819
9194A8903819P07049P74140R76612P23375J032773J142062J054887J543855J691338
$$ 18903819 19610868 20385008 21361620 22084995 23117768 24259830 25314717 26858572 28549910
9185B8549910J666742J913403J989250J781180J260782Q93851L85857j23608o32794
$$ 28549910 30216652 32130055 34119305 35900485 37161267 38055118 38440975 38317367 37684573
9176C7684573j177226j410926j061084q06352k35811k73352J4337M95267M16414
$$ 37684573 36507347 35096421 34035337 33228985 32993174 32719822 32734159 33229426 33645840
9167C3645840M58729N72048J037588J059181J270878J464371J525416J709532
$$ 33645840 34104569 34676617 35714205 36773386 38044264 39508635 41034051 42743583
9159D2743583K180384K384383K616091K762438L012863L089601K991446L134464
$$ 42743583 44923967 47308350 49924441 52686879 55699742 58789343 61780789 64915253
9151F4915253L036560K567204K179214J745842Q02778O58042L11827m10919q33121
$$ 64915253 67951813 70519017 72698231 74444073 75246851 75904893 76216720 75805801 74972680
9142G4972680q03134n23277j90227K6016n4986L73432O93083J116037J352072
$$ 74972680 74169546 73646269 73456042 73482058 73427072 73800504 74493587 75609624 76961696
9133G6961696J401191J274180O79167M05189p0400j75712k39885l47421j50632
$$ 76961696 78362887 79637067 80316234 80721423 80651023 80475311 80235426 79888005 79737373
9124G9737373K1868Q16774J576725K028798K518977K784013K889564L387912L693871
$$ 79737373 79759241 80576015 82152740 84181538 86700515 89484528 92374092 95762004 99455875
9115I9455875L452138K719941K716953K816634L069223K987002K320713K216728
$$ 99455875 102908013 105627954 108344907 111161541 114230764 117217766 119538479 121755207
9107A21755207K520034K413690K902222K547937K092233J635045Q36831m93312
$$ 121755207 124275241 126688931 129591153 132139090 134231323 135866368 136703199 136209887
9099A36209887j676208k858824l445711m125562m897748m886092m876356m471584
$$ 136209887 134533679 131674855 128229144 124103582 119205834 114319742 109443386 104971802
9091A04971802l796156l158698k311140j684738j178679n11993K98074P92502
$$ 104971802 101175646 98016948 95705808 94021070 92842391 92330398 92628472 93420974
9083I3420974J332289K031079K749245L287769M039428M819180N389009N840204
$$ 93420974 94753263 96784342 99533587 102821356 106860784 111679964 117068973 122909177
9075A22909177N812758N922752N671253N367888N080406M672834M593707M607582
$$ 122909177 128721935 134644687 140315940 145683828 150764234 155437068 160030775 164638357
9067A64638357M520172L965347L252248K279606R67395q18106k730356m620334
$$ 164638357 169158529 173123876 176376124 178655730 179623125 178805019 176074663 171454329
9059A71454329n753845o649966p074205p167635p035565o071385n123525m002204
$$ 171454329 165700484 159050518 151976313 144808678 137773113 131701728 126578203 122575999
9051A22575999k960167j907169j100492m96141M06580J197558J683015K444742
$$ 122575999 119615832 117708663 116608171 116112030 116518610 117716168 119399183 121843925
9043A21843925K950317L638053M223114M849176N565305O138167O587238O260211
$$ 121843925 124794242 128432295 132655409 137504585 143069890 149208057 155795295 162055506
9035A62055506N551908M769896L511107K072235M36425j610748l262179m325284
$$ 162055506 167607414 172377310 175888417 177960652 178397077 176786329 173524150 169198866
9027A69198866n359543o302353p187275p932090p784227p276604o631000n579276
$$ 169198866 163839323 157536970 150349695 142417605 134633378 127356774 120725774 115146498
9019A15146498m596921l705399l088025k171745j667637r38594o41258j04031
$$ 115146498 110549577 106844178 103756153 101584408 99916771 98978177 98336919 98232888
9011I8232888M76561M33843L71074L12684L23227J47358l56767o87098r67463
$$ 98232888 98709449 99143292 99514366 99827050 100150277 100297635 99940868 99253770 98286307
9002I8286307j311339j550593j750074j894634j958132j772208j460429j199218
$$ 98286307 96974968 95424375 93674301 91779667 89821535 88049327 86588898 85389680
8994H5389680q41492l31285P7749O54386J222565J384653J603839J514522J838741
$$ 85389680 84548188 84216903 84294652 84949038 86171603 87556256 89160095 90674617 92513358
8985I2513358J889453J708068J792663J898790K046573K303514K131264K477883
$$ 92513358 94402811 96110879 97903542 99802332 101848905 104152419 106283683 108761566
8977A08761566K211530J992584J827797K057490K424343K990819L401390M039076
$$ 108761566 110973096 112965680 114793477 116850967 119275310 122266129 125667519 129706595
8969A29706595M341018M902252N400813O062458O773347P791755Q533725R638489
$$ 129706595 134047613 138949865 144350678 150413136 157186483 164978238 173511963 183150452
8961A83150452J0335730J1511400J2769838J3996255J5123537J6376098J7245882
$$ 183150452 193486182 204997582 217767420 231763675 246887212 263263310 280509192
8954B80509192J7529971J7313893J6211830J4462276J1499748P492320K992897
$$ 280509192 298039163 315353056 331564886 346027162 357526910 365019230 368012127
8947C68012127j556851m915814p752164j0031861j1757078j1825900j0654591
$$ 368012127 366455276 361539462 353787298 343755437 331998359 320172459 309517868
8940C09517868r150674p554393n694253l589765j578090K48290L161063M902092
$$ 309517868 300367194 292812801 287118548 283528783 281950693 282198983 285360046 290262138
8932B90262138P231972J0187540J3152207J7983390K6498286L1793216L2744891
$$ 290262138 297494110 307681650 320833857 338817247 365315533 397108749 429853640
8925D29853640L1220996K1248446J5601958R794594M468957j6543363k3260179
$$ 429853640 461074636 482323082 497925040 507719634 512188591 495645228 472385049
8918D72385049j6250216j3112016r452413q051057p194958q217520j0154550j3419243
$$ 472385049 456134833 443022817 433570404 425519347 418324389 410106869 399952319 386533076
8910C86533076j5483540j7005153j7315768j7847690j7439445j6775241j5678939
$$ 386533076 371049536 354044383 336728615 318880925 301441480 284666239 268987300
8903B68987300j4698768j3241004j2040447j0567289r627264q711309p888493
$$ 268987300 254288532 241047528 229007081 218439792 208812528 200101219 192212726
8896A92212726o900954o340496n233852m126073l007729k418845j657905j133665
$$ 192212726 185311772 178971276 173737424 169611351 166603622 164184777 162526872 161393207
8888A61393207n06571q6354N18905Q24210P19185N08119K83356l50121o49079
$$ 161393207 160886636 160800282 161319187 162143397 162862582 163370701 163654057 163303936 162654857
8879A62654857k014087l559154m336634m878151n614842o112758o379710o293756
$$ 162654857 160640770 157081616 152744982 147866831 142251989 136139231 129759521 123465765
8871A23465765n955967n505648n141638m953181m590254m274761m081978l485669
$$ 123465765 117509798 112004150 106862512 101909331 97319077 93044316 88962338 85476669
8863H5476669l238572k960714k850486k426757j973058j592841j134676r73081
$$ 85476669 82238097 79277383 76426897 74000140 72027082 70434241 69299565 68326484
8855F8326484p22293n68267r10707o30216o11676p84409p00469q98466r40383
$$ 68326484 67604191 67035924 66125217 65495001 64883325 64098916 63398447 62499981 61559598
8846F1559598j203041j021066j086687r93725j237804j409656j416512j542731
$$ 61559598 60356557 59335491 58248804 57255079 56017275 54607619 53191107 51648376
8838E1648376j443867j608624j745914j844505j723938j921898j495959j525657
$$ 51648376 50204509 48595885 46849971 45005466 43281528 41359630 39863671 38338014
8830C8338014j514332j275236j077962j041949j070843r55279r29451q12016q29557
$$ 38338014 36823682 35548446 34470484 33428535 32357692 31402413 30472962 29660946 28831389
8821B8831389o17036p66183r09140p81732n69321l38768n47137o56291l60763
$$ 28831389 28214353 27448170 26539030 25757298 25187977 24849209 24302072 23645781 23285018
8812B3285018l10000l39412m85031m16400l86410l94502k67119l19330l52658
$$ 23285018 22975018 22635606 22150575 21734175 21347765 20953263 20686144 20366814 20014156
8803B0014156l08328m76401m48181k32718k30750k38565j68801j41776k75790
$$ 20014156 19705828 19229427 18781246 18548528 18317778 18079213 17910412 17768636 17492846
8794A7492846l51771l46938l34784k30688j63918l20154j89480j76231q6566l29799
$$ 17492846 17141075 16794137 16459353 16228665 16064747 15744593 15555113 15378882 15292316 14962517
8784A4962517j98206K2965k46306p2793j03481j09372k09682k66704k01045m9278
$$ 14962517 14764311 14787276 14540970 14468177 14364696 14255324 14045642 13778938 13577893 13528615
8774A3528615J37324q9440l13383m7049j6996q1690k39992N9020J65453l07828
$$ 13528615 13665939 13576499 13263116 13216067 13199071 13117381 12877389 12936409 13101862 12794034
8764A2794034l829P4815m6121J57615J11023J3120k0894M3876J10808K78797K73786
$$ 12794034 12790205 12865020 12818899 12976514 13087537 13100657 13079763 13123639 13234447 13513244 13787030
8753A3787030L57686K27113J19309L10813L95022M02901N02837N94776N37290
$$ 13787030 14144716 14371829 14491138 14801951 15196973 15599874 16102711 16697487 17234777
8744A7234777Q47956O15484R41570J100229J047659J022715R02614Q86508P34236
$$ 17234777 18082733 18698217 19639787 20740016 21787675 22810390 23713004 24599512 25333748
8735B5333748N16766K50612K18926k57451o08937o43262r26176j139505j124390
$$ 25333748 25850514 26101126 26320052 26062601 25453664 24810402 23884226 22744721 21620331
8726B1620331j195471j060571r89600q92648o13640p21885o46148l51407l63585
$$ 21620331 20424860 19364289 18374689 17482041 16868401 16146516 15500368 15148961 14785376
8717A4785376j24565q9934r5447p3827O3737J74351l3369K66089M54328K49573
$$ 14785376 14660811 14570877 14475430 14401603 14465340 14639691 14606322 14872411 15326739 15576312
8707A5576312O15696N44642N52236O57764O98520R34371O30286M02902N45105
$$ 15576312 16192008 16736650 17288886 17946650 18645170 19579541 20209827 20612729 21157834
8698B1157834J98201Q1227r1751k89481o23960r52997r07864j116027j044615
$$ 21157834 21356035 21437262 21345511 21056030 20432070 19479073 18571209 17455182 16410567
8689A6410567j183889r67035p91298o93562p25915o45169m97881n02270m27649
$$ 16410567 15226678 14259643 13468345 12774783 12048868 11403699 10905818 10403548 9975899
8680I975899l53275k46503l55051l47650j94934k02812k39091j25860j51034j40678
$$ 9975899 9622624 9376121 9021070 8673420 8478486 8275674 8036583 7910723 7759689 7619011
8670G619011j67881q6483j94685j39730J7817o7795m5937j39715q0762M5343N5631
$$ 7619011 7451130 7364647 7169962 7030232 7048049 6980254 6934317 6794602 6713840 6759183 6814814
8659F814814J14152k99182j95863l8778l1294k02309q8805j24327j20075j14452
$$ 6814814 6928966 6629784 6433921 6395143 6363849 6161540 6072735 5948408 5828333 5713881
8649E713881o6251p7605L7467J31052k1531O878m7226k14498N6620M0940j36828
$$ 5713881 5647630 5570025 5607492 5738544 5717013 5723891 5676665 5462167 5518787 5559727 5422899
8638E422899j76710q5992N3527j03003p1704Q9303j3981J68964M3390j67143L3628
$$ 5422899 5246189 5160197 5213724 5110721 5039017 5128320 5114339 5283303 5326693 5159550 5193178
8627E193178K692P0693k3763j94681L1089M6497K0753m9919j14704M0059r1463
$$ 5193178 5195870 5266563 5242800 5048119 5079208 5125705 5146458 5096539 4981835 5021894 4930431
8616D930431Q5072n284M42q6738q8617L02J66171j86421m5086L4794N6933j4999
$$ 4930431 5015503 5010219 5010661 4923923 4835306 4835608 5001779 4815358 4770272 4805066 4861999 4847000
8604D847000J8985o1307m8131q4255Q6037J40172l730k2866N3897L17227J0464
$$ 4847000 4865985 4804678 4756547 4672292 4758329 4898501 4894771 4871905 4925802 5243029 5253493
8593E253493p270R163K7105K9290j0251K6543K4321j78971P1535P3614K9023j59584
$$ 5253493 5246223 5255386 5282491 5311781 5301530 5328073 5352394 5173423 5244958 5318572 5347595 5188011
8581E188011j49725j25760j8599q8640j38362k02689r1500K9838N8412n0248q0206
$$ 5188011 5038286 4912526 4893927 4805287 4666925 4464236 4372736 4402574 4460986 4410738 4330532
8570D330532O1503j08017j01699m9072P7990n8259J92152J55510J9442P922J36637
$$ 4330532 4392035 4284018 4182319 4133247 4211237 4152978 4345130 4500640 4520082 4528004 4664641
8559D664641j028J81029J00545j3922j03610J69808J75647N8140j04947J06506
$$ 4664641 4663613 4844642 4945187 4931265 4827655 4997463 5173110 5231250 5126303 5232809
8549E232809k2595j24909K4673l4662m4627O8536p4540r0569j9675p7142k76723
$$ 5232809 5210214 5085305 5109978 5075316 5030689 5099225 5024685 4934116 4914441 4837299 4560576
8538D560576m8607J87619p4189r6555j92535j03519r6466L5858J64199k6102j15653
$$ 4560576 4511969 4699588 4625399 4528844 4336309 4232790 4136324 4172182 4336381 4310279 4194626
8527D194626l6534j52229M471K34272M8768N512k4490P0394K19533j58846p9456
$$ 4194626 4158092 4005863 4010334 4244606 4293374 4298886 4274396 4344790 4564323 4405477 4326021
8516D326021K41986M1999o0897M5872K8306O8777j01570j6471M2707p0337R2255
$$ 4326021 4568007 4610006 4549109 4594981 4623287 4692064 4590494 4574023 4616730 4546393 4638648
8505D638648k0184o9324j30567O9400K65224j5359j03135j59271Q1162J4515j5605
$$ 4638648 4618464 4549140 4418573 4487973 4753197 4737838 4634703 4475432 4556594 4571109 4555504
8494D555504l4185K36465R7782R5894q0070K23431K94758Q2058K37264K05350
$$ 4555504 4521319 4757784 4855566 4951460 4871390 5094821 5389579 5471637 5708901 5914251
8484E914251K36555K2237P6340J53658N5523N0285k0719O2250P2659m5417o0819
$$ 5914251 6150806 6173043 6249383 6403041 6458564 6508849 6488130 6550380 6623039 6577622 6516803
8473F516803J01565J12966j9532O2917J1357j0091j01718r1530J52589K39408
$$ 6516803 6618368 6731334 6711802 6774719 6786076 6775985 6674267 6582737 6735326 6974734
8463F974734J01645K2772J330K46505L88781K25368J98801K86704L14618L15925
$$ 6974734 7076379 7099151 7100481 7346986 7735767 7961135 8159936 8446640 8761258 9077183
8453I077183M24499L81180N63541N97194N35930R32828P16148N95457R09877P96747
$$ 9077183 9501682 9882862 10446403 11043597 11579527 12512355 13228503 13823960 14733837 15530584
8443A5530584O42479K48516M80085N09014M26885L53890N21511O11464R91011
$$ 15530584 16173063 16421579 16901664 17410678 17837563 18191453 18712964 19324428 20315439
8434B0315439J118695J174581J503016J634456J422436J335831J286647Q76129
$$ 20315439 21434134 22608715 24111731 25746187 27168623 28504454 29791101 30667230
8426C0667230R02959L93883j30744n29561p79470l33691j91354J72386N76677
$$ 30667230 31570189 31964072 31833328 31303767 30524297 30190606 29999252 30171638 30748315
8417C0748315N87056N78534N10234K32085k96754o52667j070502j726295j908396
$$ 30748315 31335371 31913905 32424139 32656224 32359470 31706803 30636301 28910006 27001610
8408B7001610j791872j583074j419862j208907j070473r90705p74795n56186m32255
$$ 27001610 25209738 23626664 22206802 20997895 19927422 18936717 18161922 17605736 17173481
8399A7173481m50009k51975k12861K338j4811M5589J78556k9735J42110J53782
$$ 17173481 16723472 16471497 16258636 16260974 16246163 16291752 16470308 16440573 16582683 16736465
8389A6736465j16969p3469k8027r5990l47902l39194l31308l95154k81827k87399
$$ 16736465 16619496 16546027 16518000 16422010 16074108 15734914 15403606 15008452 14726625 14439226
8379A4439226l69492J43921n6482n1805N2865J73457M7103j55648j13796J7486
$$ 14439226 14069734 14213655 14157173 14105368 14158233 14331690 14378793 14223145 14109349 14126835
8369A4126835j72222k56038j92543O8355J09837k02917L7093L19326L28377K13082
$$ 14126835 13954613 13698575 13506032 13574387 13684224 13481307 13518400 13837726 14166103 14379185
8359A4379185K19299K67463J88446L35125K32659K79534K65514O09305P91921
$$ 14379185 14598484 14865947 15054393 15389518 15622177 15901711 16167225 16776530 17568451
8350A7568451P39230O86790O97842M94332K05075L7368l14260m20657m67059m69236
$$ 17568451 18307681 18994471 19692313 20186645 20391720 20429088 20114828 19694171 19227112 18757876
8340A8757876k49048M5750P3348K76732K23334O7691J28829J63967l48494m78264
$$ 18757876 18508828 18554578 18627926 18904658 19127992 19195683 19324512 19488479 19139985 18661721
8330A8661721n84761n98505m21462m03487l54833l96422k22593k36371k35045
$$ 18661721 18076960 17478455 17056993 16653506 16298673 15902251 15679658 15443287 15208242
8321A5208242j35286q7551L7548R7325K52222K41072J61094M11035O88166N12001
$$ 15208242 15072956 14985405 15022953 15120278 15372500 15613572 15774666 16185701 16873867 17385868
8311A7385868N91648O62565P99583O55100N34828L96189L22724L20175j6537k07913
$$ 17385868 17977516 18640081 19439664 20094764 20629592 21025781 21348505 21668680 21652143 21444230
8301B1444230j90632n3483J74864O89992M27934J87909L0335o5926J22932j95841
$$ 21444230 21253598 21200115 21374979 22064971 22492905 22680814 22711149 22645223 22768155 22572314
8291B2572314m62935n82448n28275m53476m53530l99157j70059k05968l85723
$$ 22572314 22109379 21526931 20998656 20545180 20091650 19692493 19522434 19316466 18930743
8282A8930743m47531p65260n23679o43075o39260n42198m62385o6331k96634j62872
$$ 18930743 18483212 17717952 17194273 16551198 15911938 15369740 14907355 14841024 14544390 14381518
8272A4381518o2451o5564k20149j27854O5306J02m4569L5393j5677j37548J78669
$$ 14381518 14319067 14253503 14033354 13905500 13970806 13970908 13926339 13961732 13946055 13808507 13987176
8261A3987176J46117J97947k6327j29190J41080J40639j9895j62743j67259j82847
$$ 13987176 14133293 14331240 14304913 14175723 14316803 14457442 14437547 14274804 14107545 13924698
8251A3924698l2412j91622n8867j94740j86832k3857j64210m15011k87497k5005
$$ 13924698 13892286 13700664 13641797 13447057 13260225 13236368 13072158 12657147 12369650 12344645
8241A2344645j25881j67677l48024l10787k26094m47622p5680j0042j32963r0498
$$ 12344645 12218764 12051087 11703063 11392276 11166182 10718560 10642880 10632838 10499875 10409377
8231A0409377p0753j03607j08655j77919j28699R9346K7386p2863K02596O3040
$$ 10409377 10338624 10235017 10126362 9948443 9819744 9919090 9946476 9873613 10076209 10139249
8221A0139249p5589J92237Q8235O8025j24151J7340J30630L9007j72886j41104
$$ 10139249 10063660 10255897 10344132 10412157 10288006 10305346 10435976 10474983 10302097 10160993
8211A0160993O6493j88467k43126L5412n1252k96130M6385q0615o129L027N7330
$$ 10160993 10227486 10039019 9795893 9831305 9780053 9483923 9530308 9449693 9443564 9446591 9503921
8200I503921k20234q4497k48129q6158j71163J25001j43525N14580K15677j741838
$$ 9503921 9283687 9199190 8951061 8864903 8693740 8818741 8675216 9189796 9405473 7663635
8190G663635r8741j14889K4657p0566p5188O690Q62r540k45322J7073Q8803Q8676
$$ 7663635 7564894 7450005 7474662 7404096 7328908 7335598 7336460 7326920 7081598 7098671 7187474 7276150
8178G276150L7213k69732L0422j56308m8188M3281j40958J14817j86613j06503
$$ 7276150 7313363 7043631 7074053 6917745 6869557 6912838 6771880 6886697 6700084 6593581
8168F593581k7132O0741J22148P6853j70818o9425n2620N3626p7678m1652n9576
$$ 6593581 6566449 6627190 6749338 6826191 6655373 6585948 6533328 6586954 6509276 6467624 6408048
8157F408048L0509r029p0030J96953J50124l2284j85026J6311Q1999l6642M5498
$$ 6408048 6438557 6429528 6359498 6556451 6706575 6674291 6489265 6505576 6587575 6550933 6596431
8146F596431L1077O3806j17428r9449p3445R8084l6130M6235k23459k05208R4529
$$ 6596431 6627508 6691314 6573886 6474437 6400992 6499076 6462946 6509181 6285722 6080514 6175043
8135F175043j26639n0435j78930l2926r1365L5769J04939O1747k34601r5260j51620
$$ 6175043 6048404 5997969 5819039 5786113 5694748 5730517 5835456 5897203 5662602 5567342 5415722
8124E415722J19676j9757j10306R4881M7468m3814q7857L8034K0165k301j75766
$$ 5415722 5535398 5515641 5405335 5500216 5547684 5503870 5416013 5454047 5474212 5471911 5296145
8113E296145q0113Q0511Q8706j58215p7155J45597o702k3107k3323O0837O2214
$$ 5296145 5216032 5296543 5385249 5227034 5149879 5295476 5288774 5265667 5242344 5303181 5365395
8102E365395l5699q0721q4552l3215R2394j56157j55170l7609o1587p2247j51684
$$ 5365395 5329696 5248975 5164423 5131208 5223602 5067445 4912275 4874666 4813079 4740832 4589148
8091D589148J01509o1914p926j5189k1695p4017r4813j33071j84024P5425j74262
$$ 4589148 4690657 4628743 4620817 4605628 4583933 4509916 4415103 4282032 4098008 4173433 3999171
8080C999171L0012P6355q8442r2787l8805J5598o7741J05123j15035j28781o5616
$$ 3999171 4029183 4105538 4017096 3924309 3885504 3901102 3833361 3938484 3823449 3694668 3629052
8069C629052J73520L15348o0558n7380q581K1775J45649q5770J70851q7265r1827
$$ 3629052 3802572 4117920 4057362 3999982 3991401 4013176 4158825 4073055 4243906 4156641 4064814
8058D064814M3432j55068l7865J19853L2733j11821r4433K5671R5970j16573J53096
$$ 4064814 4108246 3953178 3915313 4035166 4067899 3956078 3861645 3887316 3983286 3866713 4019809
8047D019809M0521j64668k35027j26984J5757J9082j76320l2746L4494r8200L0033
$$ 4019809 4060330 3895662 3660635 3533651 3549408 3568490 3392170 3359424 3393918 3295718 3325751
8036C325751j59488m1137J25450m4337r841j2086N9159K8849Q8441J0107j57373
$$ 3325751 3166263 3125126 3250576 3206239 3196398 3184312 3243471 3272320 3360761 3370868 3213495
8025C213495J36903K978j79927k1614p0447o1517J16233J0899q8191o76j38867
$$ 3213495 3350398 3353376 3173449 3151835 3081388 3019871 3136104 3147003 3058812 3058136 2919269
8014B919269j81675J62859r843k01582k05997p5559J51869k9564q3432R0630J0113
$$ 2919269 2737594 2900453 2890610 2689028 2483031 2407472 2559341 2529777 2446345 2536975 2547088
8003B547088j16136M489O1358N608q2794J9186K20320r9497j04894J1054r637
$$ 2547088 2430952 2435441 2496799 2502407 2419613 2438799 2659119 2559622 2454728 2465782 2456145
7992B456145M6559j58884j32520O7019m3089j7516j94873j08923Q7920l6438M2970
$$ 2456145 2502704 2343820 2211300 2278319 2235230 2217714 2022841 1913918 2001838 1965400 2008370
7981B008370j3398j49110j13675j299J67392N2733j1746O0883J03827j08951j93890
$$ 2008370 1994972 1845862 1732187 1730888 1898280 1951013 1939267 2000150 2103977 1995026 1801136
7970A801136j51638J98655J83137m0213J03725J11049j82826j08960J9195r6231
$$ 1801136 1649498 1848153 2031290 1991077 2094802 2205851 2023025 1914065 1933260 1837029
7960A837029l1896j26003M8325r1790o0421J2564J55219m264p5382O8991j4063
$$ 1837029 1805133 1679130 1727455 1635665 1575244 1587808 1743027 1738763 1663381 1732372 1718309
7949A718309q2039n7894K0066l5979L9291J2895J27681o4392l205J5021N6494
$$ 1718309 1636270 1578376 1598442 1562463 1601754 1614649 1742330 1677938 1674733 1689754 1746248
7938A746248l7668M4405N9034K8168Q2431p0121M874J49495Q5610k42815j27707
$$ 1746248 1708580 1752985 1812019 1840187 1922618 1852497 1857371 2006866 2092476 1849661 1721954
7927A721954j41912N6549n4976k19197J56825M5628j01616j06589j9798j17928
$$ 1721954 1580042 1636591 1581615 1362418 1519243 1564871 1463255 1356666 1336868 1218940
7917A218940j571J7900k6824J45714m5250r4466J73197P9089m2949j8016L8458
$$ 1218940 1217369 1235269 1208445 1354159 1308909 1214443 1387640 1466729 1423780 1405764 1444222
7906A444222j21778l2578N4619q536J78486j4984j51653p7788P4027k30457o6113
$$ 1444222 1322444 1289866 1344485 1335949 1514435 1499451 1347798 1270010 1344037 1113580 1047467
7895A047467p8953R875J36582r2317j94944j17293M2706k44273N0394P1865j95440
$$ 1047467 968514 978389 1114971 1022654 827710 710417 753123 508850 559244 631109 435669
7884D35669O2692j03191J5953P0466k1111k4760J04095n4389J16902m5136o4132
$$ 435669 498361 395170 411123 481589 460478 435718 539813 485424 602326 557190 493058
7873D93058j7749N9089j84720n0230n9932q3974O8702K5305J9804r8359K0546
$$ 493058 475309 534398 349678 299448 239516 155542 224244 249549 269353 170994 191540
7862A91540J21257N7222m5017J33338j61933K7421N5369l8495J9954j98757r6865
$$ 191540 312797 370019 325002 458340 296407 323828 379197 340702 360656 161899 65034
7851F5034J9070R976L0370k5952q2984J4786p0912J9441p5356J17472J2422M9427
$$ 65034 84104 94080 124450 98498 15514 30300 -40612 -21171 -96527 20945 33367 82794
7839H2794M5266j31197J80364l5758j10501l8253J7785n9289P8881L1063l1395
$$ 82794 128060 -3137 177227 141469 30968 -7285 10500 -48789 30092 61155 29760
7828B9760J7123l6535R0720j11945k42018J49256J89544j24805k2374N3393M8862
$$ 29760 46883 10348 101068 -10877 -252895 -103639 85905 -38900 -61274 -7881 40981
7817D0981j85508k6103J26687P3129P2135p649l4070k6664r817j53556J75248
$$ 40981 -144527 -170630 -43943 29186 101321 93672 59602 32938 23121 -130435 44813
7806D4813Q2721j76065j31546J5135J0959L1236L6170R7550k021p7164J07738
$$ 44813 127534 -48531 -180077 -164942 -153983 -122747 -86577 10973 8952 -68212 39526
7795C9526J43174o0750m6706J8282J39350l7981P7385m1813j93970j9523J58475
$$ 39526 182700 121950 75244 93526 232876 194895 272280 230467 36497 16974 175449
7784A75449r5771k4627L9041n3417M8824J32148K097N835M642m7496m0275P8502
$$ 175449 79678 55051 94092 40675 89499 221647 223744 229579 234221 186725 146450 224952
7772B24952P0591J426q247J47066O1317K767L5741q948L8133J55512j31791j66316
$$ 224952 295543 296969 288722 435788 497105 499872 535613 526665 564798 720310 588519 422203
7760D22203r8610o3480j26499j37296O3903O101J9444L6389q0060j03544l5216
$$ 422203 323593 260113 133614 -3682 60221 66322 85766 122155 42095 -61449 -96665
7749i6665j5789P7932k8995j51368K8181K7076O2052l1018o3272j6187l8930J28738
$$ -96665 -112454 -34522 -63517 -214885 -186704 -159628 -97576 -128594 -191866 -208053 -246983 -118245
7737a18245o238J7034J98841q1609j53395J25325Q7249n9359l3453k33027J3330
$$ -118245 -124483 -107449 91392 9783 -143612 -18287 68962 9603 -23850 -256877 -243547
7726b43547K76671l3336j35938l7315Q7934q7289j17981K4968n4606k02752J73490
$$ -243547 33124 -212 -136150 -173465 -85531 -172820 -290801 -265833 -320439 -523191 -349701
7715c49701j13131J8748l2774k12274n535P8826l7274R7930M3002O0Q2397Q2741
$$ -349701 -462832 -444084 -476858 -689132 -694667 -615841 -653115 -555185 -512183 -512123 -429726 -346985
7703c46985m3764J4219K7884j85488j28398K05352K0849m4459P9310k2726j15852
$$ -346985 -390749 -376530 -348646 -534134 -662532 -457180 -436331 -480790 -401480 -424206 -540058
7692e40058j08450K8254J09020N8727n5251j51873M8991k7921j27988N423J54196
$$ -540058 -648508 -620254 -511234 -452507 -507758 -659631 -610640 -638561 -766549 -761126 -606930
7681f06930p5602P9785J2176p7363Q8652o4277p413p9804j13864n1530j41982
$$ -606930 -682532 -602747 -590571 -667934 -579282 -643559 -650972 -730776 -844640 -896170 -1038152
7670a038152K4834j0052J40729n8413P3463O2407J54247k23489j16779J17940
$$ -1038152 -1013318 -1023370 -882641 -941054 -867591 -805184 -650937 -874426 -991205 -873265
7660h73265p1964j81520L7288J37662Q3727P5903r4263N5206K6243K2189p9523
$$ -873265 -945229 -1126749 -1089461 -951799 -868072 -792169 -886432 -831226 -804983 -782794 -862317
7649h62317L838J850O1097n1060L3400j15647L5548m3047l3717P1694J34769j56842
$$ -862317 -858479 -856629 -795532 -846592 -813192 -928839 -893291 -936338 -970055 -898361 -763592 -920434
7637i20434Q7656l0492J17487O2332o4028l0634o3107J5878J57243r0900j36497
$$ -920434 -832778 -863270 -745783 -683451 -747479 -778113 -841220 -825342 -668099 -758999 -895496
7626h95496Q4037r535k6521k0431j33709J3005k0921J02135m22J7629J7161j03990
$$ -895496 -811459 -820994 -847515 -867946 -1001655 -988650 -1009571 -907436 -907858 -890229 -873068 -977058
7614i77058J07863L8953q2367N7334k18620j70523L8613J17489M4458o0083N9850
$$ -977058 -869195 -830242 -912609 -855275 -1073895 -1244418 -1205805 -1088316 -1043858 -1103941 -1044091
7603a044091M4939J91944p3774r9947n169K7171K1033k0250n1914m1071l7334
$$ -1044091 -999152 -807208 -880982 -980929 -986098 -958927 -937894 -958144 -1010058 -1051129 -1088463
7592a088463J66127K5604O692j50536N5297K3054j1184J26747q3610P6780O8239
$$ -1088463 -922336 -896732 -890040 -1040576 -985279 -962225 -973409 -846662 -930272 -853492 -785253
7581g85253q2497l0010j32124K4610J24268n1962j27868J15662K8002r1548J1077
$$ -785253 -867750 -897760 -1029884 -1005274 -881006 -932968 -1060836 -945174 -917172 -1008720 -997643
7570i97643m1203M8239k0953J3704j61681k6582J89550j014j48300K07106N7076
$$ -997643 -1038846 -990607 -1011560 -997856 -1159537 -1186119 -996569 -997583 -1145883 -938777 -881701
7559h81701p2525O7820J8755k838m8894j33111Q4397R1126o3159k5443L4506j4601
$$ -881701 -954226 -886406 -867651 -870489 -919383 -1052494 -968097 -876971 -940130 -965573 -931067 -945668
7547i45668k5227o6363J68114j16739j48192O783j00012J08532j3869K06653N7138
$$ -945668 -970895 -1037258 -869144 -985883 -1134075 -1127292 -1227304 -1118772 -1132641 -925988 -868850
7536h68850o0414J01038l1008j85759M9459j9369j7773j02971J07611J36230j13312
$$ -868850 -929264 -828226 -859234 -1044993 -995534 -1014903 -1032676 -1135647 -1028036 -891806 -1005118
7525a005118K5205k2547N7463M12j7181q1693J9412J37642l4369L8536j6441r1220
$$ -1005118 -979913 -1002460 -944997 -944585 -961766 -1043459 -1024047 -886405 -920774 -882238 -898679 -989899
7513i89899l7981M3013l497J03375R5811j61766q8508N4044l0013j0155M46J18584
$$ -989899 -1027880 -984867 -988364 -884989 -789178 -950944 -1039452 -985408 -1015421 -1025576 -1025130 -906546
7501i06546l0367K990J14485j61907j54488p1617N3494J08478J39693j00501r0873
$$ -906546 -936913 -933923 -819438 -981345 -1135833 -1207450 -1153956 -1045478 -905785 -1006286 -1097159
7490a097159n4466O8355J62841m2355j18599r0320J25889J03754q5765n0902K00194
$$ -1097159 -1151625 -1083270 -920429 -962784 -1081383 -1171703 -1045814 -942060 -1027825 -1078727 -878533
7479h78533j42311j43242o9863J54983J31080j6916m9395r8256P5800M2925O7579
$$ -878533 -1020844 -1164086 -1233949 -1078966 -947886 -964802 -1014197 -1112453 -1036653 -993728 -926149
7468i26149j26144K5729J03203j59519m3947R8867k6133L6007K2256O0918J20088
$$ -926149 -1052293 -1026564 -923361 -1082880 -1126827 -1027960 -1054093 -1018086 -995830 -934912 -814824
7457h14824N7751p6742j10861m925L9115j10870J58727J6299j86091L5287N0437
$$ -814824 -757073 -833815 -944676 -949601 -910486 -1021356 -862629 -846330 -1032421 -997134 -946697
7446i46697J80330j04091q0399J848j5726l1608O0307K2782m2558J3982J34869
$$ -946697 -766367 -870458 -950857 -949009 -964735 -996343 -936036 -913254 -955812 -941830 -806961
7435h06961j43045l3695L1549N4767Q5089r7552m4319k5905J21919o8184K032
$$ -806961 -950006 -983701 -952152 -897385 -812296 -909848 -954167 -980072 -858153 -926337 -924305
7424i24305R6587j61218Q7510K0050j78606n0940J9530N6194p2930n9397R548
$$ -924305 -827718 -988936 -901426 -881376 -1059982 -1110922 -1091392 -1035198 -1108128 -1167525 -1157977
7413a157977n7180n2304J38522J03069j4067q6373M4795p4717J9279J9624K7470
$$ -1157977 -1215157 -1267461 -1128939 -1025870 -1039937 -1126310 -1081515 -1156232 -1136953 -1117329 -1089859
7402a089859N8679K0772J14982j49720k8727J3749m1206M4457j1897L9325L4404
$$ -1089859 -1031180 -1010408 -895426 -1045146 -1073873 -1060124 -1101330 -1056873 -1068770 -1029445 -995041
7391i95041o4394K7743P0376k4250m5734J9383j98292q4865L6237M0557N8320
$$ -995041 -1059435 -1031692 -961316 -985566 -1031300 -1011917 -1210209 -1295074 -1258837 -1218280 -1159960
7380a159960M9782k1864j36818J67346j8142J16120N7232k4669k16788N9916K6244
$$ -1159960 -1110178 -1132042 -1268860 -1101514 -1119656 -1003536 -946304 -970973 -1187761 -1127845 -1101601
7369a101601k3467J08356q7377p4481p784R2762m4411L6562j11631Q5306J88993
$$ -1101601 -1125068 -1016712 -1104089 -1178570 -1186354 -1093592 -1138003 -1101441 -1213072 -1127766 -938773
7358i38773j10932R795J7479n0795n4081P1981m1435Q3248K3653N3954j24110
$$ -938773 -1049705 -1039910 -1022431 -1073226 -1127307 -1055326 -1096761 -1013513 -989860 -935906 -1060016
7347a060016j04407M5387J4082K4631Q4283O7414j63673M2015p6881m2616j7589
$$ -1060016 -1164423 -1119036 -1104954 -1080323 -996040 -928626 -1092299 -1050284 -1127165 -1169781 -1187370
7336a187370R3679o36O6892k0977K3057j3243k7707K5192R8488J06253k23135
$$ -1187370 -1093691 -1094327 -1027435 -1048412 -1025355 -1038598 -1066305 -1041113 -942625 -836372 -1059507
7325a059507j8234J14642l4297j343R287k8337J47187l6648q7014J10965M3633
$$ -1059507 -1077741 -963099 -997396 -998739 -989452 -1017789 -870602 -907250 -994264 -883299 -839666
7314h39666n9977J4217j57372J3932R8151m3306j80221P6638M6537O8583J23081
$$ -839666 -899643 -885426 -1042798 -1028866 -930715 -974021 -1154242 -1077604 -1031067 -962484 -839403
7303h39403l0436J4696p3792p0519j33925j7104J80547M0923r8505J95090Q3498
$$ -839403 -869839 -855143 -928935 -999454 -1133379 -1150483 -969936 -929013 -1027518 -832428 -748930
7292g48930j11163q0060k5822J00106n9087j49911m7788P3148J10282N9262n155
$$ -748930 -860093 -940153 -965975 -865869 -924956 -1074867 -1122655 -1049507 -939225 -879963 -885118
7281h85118j16502j9515j31600J32256j4788p1689n810Q411J09828J06398k7646
$$ -885118 -1001620 -1021135 -1152735 -1020479 -1035267 -1106956 -1112766 -1104355 -994527 -888129 -915775
7270i15775L3650j85339O4028K4144k8388P049N010K38219j17470k34092k7988
$$ -915775 -882125 -1067464 -1003436 -979292 -1007680 -1000631 -995621 -757402 -874872 -1108964 -1136952
7259a136952m251J07474J6953N0510l1337o4883J33L9962k5023p6430Q1800j1084
$$ -1136952 -1141203 -1033729 -1016776 -966266 -997603 -1062486 -1062353 -1022391 -1047414 -1123844 -1042044 -1053128
7247a053128j5352j0232J54533O1666j84280l9061J12647q6225j60304Q6322K07230
$$ -1053128 -1068480 -1078712 -924179 -862513 -1046793 -1085854 -973207 -1059432 -1219736 -1133414 -926184
7236i26184j21267K3516m3599j73482J75088r2810J43293K11861k54321j26259
$$ -926184 -1047451 -1023935 -1067534 -1241016 -1065928 -1158738 -1015445 -803584 -1057905 -1184164
7226a184164j11876J18514R7822J18185r3497J4298j27489p6128Q7002K02433
$$ -1184164 -1296040 -1177526 -1079704 -961519 -1055016 -1040718 -1168207 -1244335 -1157333 -954900
7216i54900J55765r2611j71529k00524m5428R8181R6026M8166o5330j23575R615
$$ -954900 -799135 -891746 -1063275 -1263799 -1309227 -1211046 -1115020 -1066854 -1132184 -1255759 -1246144
7205a246144j9768J26235n3771K4952J35329O758j6858R6379M754m0526K4379
$$ -1246144 -1265912 -1139677 -1193448 -1168496 -1033167 -1026409 -1043267 -946888 -942134 -982660 -958281
7194i58281J4714J0625j96728O1558J65907o5192o1780p9805m867J65034j58331
$$ -958281 -943567 -932942 -1129670 -1068112 -902205 -967397 -1029177 -1108982 -1113849 -948815 -1107146
7183a107146K6472J23598r5581Q444J49868M1506l0370j87969k9428l5056j27442
$$ -1107146 -1080674 -957076 -1052657 -1044213 -894345 -852839 -883209 -1071178 -1100606 -1135662 -1263104
7172a263104Q784J6338k8734o0828J47879R9923J29777p4138n3542n5925J59633
$$ -1263104 -1254320 -1237982 -1266716 -1327544 -1179665 -1079742 -949965 -1024103 -1077645 -1133570 -973937
7161i73937K2299r6865j0577N1012L9125l4824q6303J57803J55960l8514j25636
$$ -973937 -951638 -1048503 -1059080 -1008068 -968943 -1003767 -1090070 -932267 -776307 -814821 -940457
7150i40457p3473J10549J2415j0269n6054k603N3955M8770j3230P3417k854j03394
$$ -940457 -1013930 -903381 -890966 -901235 -957289 -959892 -905937 -857167 -870397 -796980 -799834 -903228
7138i03228N3120K02681R4069m9378j59120k07047J09559R4368M5954M4863j0733
$$ -903228 -850108 -647427 -553358 -602736 -761856 -968903 -859344 -764976 -719022 -674159 -684892
7127f84892n5116K7331J37498p3350k3848R0205R0388m3037j6070N7806R787P0988
$$ -684892 -740008 -712677 -575179 -648529 -672377 -582172 -491784 -534821 -550891 -493085 -483298 -412310
7115d12310K23790K2453M8827M0214J10390J79181Q6470K63798K70341O2066J99422
$$ -412310 -188520 -166067 -117240 -77026 33364 212545 299015 562813 833154 895220 1094642
7104A094642L29386J97401J39688J05165Q1785n533j59580J17294r8037k12598
$$ 1094642 1424028 1621429 1761117 1866282 1948067 1942534 1782954 1900248 1802211 1589613
7094A589613k10477k06655j15303k05304k15768j57598k39026k646o3105j82201
$$ 1589613 1379136 1172481 1057178 851874 636106 478508 239482 236836 173731 -8470
7084h470k0810j57424L9753l136M2631k0021j17039j72113Q493O8652j66513j31244
$$ -8470 -29280 -186704 -146951 -150087 -107456 -127477 -244516 -416629 -408136 -339484 -505997 -637241
7072f37241j8951j36443q9218K739J72495m6034K13657P150j55722o9995j0550
$$ -637241 -656192 -792635 -881853 -879114 -706619 -752653 -538996 -531846 -687568 -757563 -768113
7061g68113j39503N599J19479J12256n5320K3122j0626j67469q9512P082Q6787
$$ -768113 -907616 -902017 -782538 -670282 -725602 -702480 -713106 -880575 -970087 -963005 -876218
7050h76218o6069J50114J03146L052J6105j91295j57131J81238J1794m9700o6095
$$ -876218 -942287 -792173 -689027 -685975 -669870 -861165 -1018296 -837058 -825264 -874964 -941059
7039i41059J24447Q6376l1595o4248M7145O0207r8368r2672O1783P6461M568n8741
$$ -941059 -816612 -730236 -761831 -826079 -778934 -718727 -817095 -909767 -847984 -771523 -766955 -825696
7027h25696k4715q7255J31012n3206j2223j10113Q8520K30808P4953l5099p4843
$$ -825696 -850411 -937666 -806654 -859860 -872083 -982196 -893676 -662868 -587915 -623014 -697857
7016f97857l4885l0987L5983J06421J81616j51637j55733r809l5169J00855J21746
$$ -697857 -732742 -763729 -727746 -621325 -439709 -591346 -747079 -756888 -792057 -691202 -569456
7005e69456J12188j36890j6778r5069l9J12051j84196r0653O169m8769q5546N7795
$$ -569456 -457268 -594158 -610936 -706005 -706044 -593993 -778189 -868842 -862673 -911442 -996988 -939193
6993i39193m9821J36160K4550k9771J6619J00067j62349p7768J19339J12180j10238
$$ -939193 -989014 -852854 -828304 -858075 -841456 -741389 -903738 -981506 -862167 -749987 -860225
6982h60225k8450k627O5625J4070l2507k5037j02455k0576O6709J28257k0878
$$ -860225 -888675 -891302 -825677 -811607 -844114 -869151 -971606 -992182 -925473 -797216 -818094
6971h18094r6821K3081j6802Q5282n8231L9766Q8250n3647j51927N6699l6410
$$ -818094 -914915 -891834 -908636 -823354 -881585 -841819 -753569 -807216 -959143 -902444 -938854
6960i38854R9246K83253k14275j3141k1498Q6616k3493j11523p5465m453J25236
$$ -938854 -839608 -556355 -770630 -783771 -805269 -718653 -742146 -853669 -929134 -933587 -808351
6949h08351N1357J0075L8954J2174J75063j76298k76412p7496K77348M1474k28491
$$ -808351 -756994 -746919 -707965 -695791 -520728 -697026 -973438 -1050934 -773586 -732112 -960603
6938i60603q988K15646Q8915p6992o7519O1817O6004l5186J65355N9529l0748
$$ -960603 -969591 -753945 -665030 -742022 -809541 -747724 -681720 -716906 -551551 -492022 -522770
6927e22770M9068n455o8328q1015n2687l477O8545r6159j33700J5218J37951p819
$$ -522770 -473702 -479157 -547485 -628500 -681187 -684664 -616119 -712278 -845978 -830760 -692809 -700628
6915g00628l3883l6876q8661J4253j26475J75748R3049j1902n0404j25728L6611
$$ -700628 -734511 -771387 -860048 -845795 -972270 -796522 -703473 -715375 -765779 -891507 -854896
6904h54896N9351n7026L4354J29121J9792K9452K4337k6009j12087m0755r6111
$$ -854896 -795545 -852571 -818217 -689096 -669304 -639852 -615515 -641524 -753611 -794366 -890477
6893h90477K4838J17406q1836k4408J12042j30001j37459J02673J7190J09090
$$ -890477 -865639 -748233 -830069 -854477 -742435 -872436 -1009895 -907222 -890032 -780942
6883g80942L1565Q2107n763M8064j06266n7533K1141L2727L6433L4032n1426O5077
$$ -780942 -749377 -667270 -673033 -624969 -731235 -788768 -767627 -734900 -698467 -664435 -715861 -650784
6871f50784J71794m0123q1855J33359j05323q8802P2169m8230M1612q6854N9926
$$ -650784 -478990 -519113 -600968 -467609 -572932 -661734 -589565 -637795 -596183 -683037 -623111
6860f23111L7865j65326J2682m7998n9089M0381j14042J15677J47916m2627J04453
$$ -623111 -585246 -750572 -737890 -785888 -844977 -804596 -918638 -802961 -655045 -697672 -593219
6849e93219J66478k08213M5379K1792L0302R640n5584P7462L5215o8165Q5436
$$ -593219 -426741 -634954 -589575 -567783 -537481 -527841 -583425 -505963 -470748 -538913 -453477
6838d53477J8246R1488n8602o0823J4875k1132k5865r2647J38450K24447J31245
$$ -453477 -435231 -343743 -402345 -463168 -448293 -469425 -495290 -587937 -449487 -225040 -93795
6827i3795j05428q7654j70685N4570J84892J56906N5136k15292M3265P8110K4687
$$ -93795 -199223 -286877 -457562 -402992 -218100 -61194 -6058 -221350 -178085 -99975 -75288
6816g5288M6580K3615J98063K0340j32803J03779P8356P0405J86097j39921P6910
$$ -75288 -28708 -5093 192970 213310 80507 184286 262642 333047 519144 379223 456133
6805D56133J75462K35540Q8938J52058K57539p7283j09158K06057K79294J62264
$$ 456133 631595 867135 956073 1108131 1365670 1288387 1179229 1385286 1664580 1826844
6795A826844L06124L07397M43658L53115K59817K80008K08911K08985J64989J0236
$$ 1826844 2132968 2440365 2884023 3237138 3496955 3776963 3985874 4194859 4359848 4370084
6785D370084r1600k21530j63852j64185j34595l94233m59903l79761j71208N655
$$ 4370084 4278484 4056954 3893102 3728917 3594322 3200089 2740186 2360425 2189217 2194872
6775B194872k17162l50132p5890k7062j59426j65551q3256j68678j50073O4516
$$ 2194872 1977710 1627578 1551688 1524626 1365200 1199649 1116393 947715 797642 862158
6765H62158L649J12424j24096l5491p6121j42513m1116l2825n1971m4666n8029
$$ 862158 865807 978231 854135 818644 742523 600010 558894 526069 474098 429432 371403
6754C71403J21506J45592K5278j14295P7129p2087j14620j39572l8584P854m5282
$$ 371403 492909 638501 663779 549484 626613 554526 439906 300334 261750 269604 224322
6743B24322N9257r2454q4816j4380J74988J13541K9820k1404J45688N9541r2284
$$ 224322 283579 191125 106309 91929 266917 380458 410278 388874 534562 594103 501819
6732E01819N5833j12592q7137L4134k991J16016J26021l6347M7861M4738k14827
$$ 501819 557652 445060 357923 392057 389066 505082 631103 594756 642617 687355 472528
6721D72528L8134J7558R0197n8790j33345m8957M3363m8517L02834j04491k21615
$$ 472528 510662 528220 618417 559627 426282 377325 420688 372171 675005 570514 348899
6710C48899N936K1659m9660l7148J24402q1920J05497l0265j5940J4896k8786
$$ 348899 354835 376494 326834 289686 414088 332168 437665 407400 391460 406356 377570
6699C77570k3040j68927J1315J40818J7003J31864n684J16412l0473j10308O1374
$$ 377570 354530 185603 196918 337736 354739 486603 480919 597331 566858 456550 517924
6688E17924k4539r0725Q1358Q5981L9064o49O4110M3382o3291J15870k663o9396
$$ 517924 493385 402660 484018 569999 609063 608414 672524 715906 652615 768485 765822 696426
6676F96426K25850r2271k9870Q518J58674k5922j13889M3633n336K7460K42621
$$ 696426 922276 830005 800135 808653 967327 941405 827516 871149 865813 893273 1135894
6665A135894K11568R926k1164M1254P3761j07960j4310J93279J67766j48086n0287
$$ 1135894 1347462 1357388 1336224 1377478 1451239 1343279 1328969 1522248 1690014 1541928 1491641
6654A491641J74218J1318k2202J10602K8431N3304M3463j5226J50185r661m5073
$$ 1491641 1665859 1677177 1654975 1765577 1794008 1847312 1890775 1875549 2025734 2016073 1971000
6643A971000J82753J26992J4522J37386N0620j71193J07391J50374J06549J70168
$$ 1971000 2153753 2280745 2295267 2432653 2483273 2312080 2419471 2569845 2676394 2846562
6633B846562J26636J35382J68930n7118K18722K42597J13388R1605K08492L3735
$$ 2846562 2973198 3108580 3277510 3220392 3439114 3681711 3795099 3886704 4095196 4128931
6623D128931Q1974K85039M08849K76209J53225Q6248K74419J44098K30820J57651
$$ 4128931 4210905 4495944 4904793 5181002 5334227 5420475 5694894 5838992 6069812 6227463
6613F227463J72298L03499J29829K13084K26383J25704K00636J51131K60787K51581
$$ 6227463 6399761 6703260 6833089 7046173 7272556 7398260 7598896 7750027 8010814 8262395
6603H262395L06402M09874J78168J68799P4145L01894K96987M03874L40288N30604
$$ 8262395 8568797 8978671 9156839 9325638 9399783 9701677 9998664 10402538 10742826 11273430
6593A1273430K81989M13701L04826J64867K21670K13053M21840K82042K21063
$$ 11273430 11555419 11969120 12273946 12438813 12660483 12873536 13295376 13577418 13798481
6584A3798481N8844K49171K74374K60860L34589K75746K20377J93716K89625K98752
$$ 13798481 13857325 14106496 14380870 14641730 14976319 15252065 15472442 15666158 15955783 16254535
6574A6254535J54161L33143K61149L34721M87115K79448K95735M03087L32284
$$ 16254535 16408696 16741839 17002988 17337709 17824824 18104272 18400007 18803094 19135378
6565A9135378J96372L71295M93635K70640J97697L56266K19129K27692J20075
$$ 19135378 19331750 19703045 20196680 20467320 20665017 21021283 21240412 21468104 21588179
6556B1588179J47767N5155k231q8994L7980N3567q675L6194K929J2099J44905
$$ 21588179 21735946 21791101 21788870 21699876 21737856 21791423 21782748 21818942 21821871 21833970 21978875
6545B1978875M6667k3956J35718R5388K45803K83086K79575N7084J56008M59409
$$ 21978875 22025542 22001586 22137304 22232692 22478495 22761581 23041156 23098240 23254248 23713657
6535B3713657L79978N69913N07312K78437K75584K98528K27761l16771l22931
$$ 23713657 24093635 24663548 25170860 25449297 25724881 26023409 26251170 25934399 25611468
6526B5611468m33495n98320m46403m64696l91044m16133j49687o2294p8789k35629
$$ 25611468 25177973 24579653 24133250 23668554 23277510 22861377 22711690 22649396 22570607 22334978
6516B2334978k00117p8550k59707l98205o37890o92535p06478q70325o00952p77010
$$ 22334978 22134861 22056311 21796604 21398399 20760509 20067974 19361496 18491171 17890219 17113209
6506A7113209o29035k05119m12115k62592n27849n48686m65778l98790l86757
$$ 17113209 16484174 16279055 15866940 15604348 15076499 14527813 14062035 13663245 13276488
6497A3276488l22354j33691k16155k64300l74815k03243l12500l26144k10880
$$ 13276488 12954134 12820443 12604288 12339988 11965173 11761930 11449430 11123286 10912406
6488A0912406k14370j80196j79323k15202n0781o7449j19289k9198J11100j45805
$$ 10912406 10698036 10517840 10338517 10123315 10072534 10005085 9885796 9856598 9967698 9821893
6478I821893j27359K91642N0411m6227J58750J22486K15477K76663K99522N05723
$$ 9821893 9694534 9986176 10036587 9990360 10149110 10271596 10487073 10763736 11063258 11568981
6468A1568981N04750L35915N80902P19148Q93767J093202P78612R07440Q10709
$$ 11568981 12073731 12409646 12990548 13709696 14603463 15696665 16475277 17382717 18193426
6459A8193426P96991P23325M25539R9440j76795m98462l86065l40134j07059J75618
$$ 18193426 18990417 19713742 20139281 20238721 20061926 19563464 19177399 18837265 18730206 18905824
6449A8905824K25209M44157O63595N02448K54728M40232M28129J2413k70360m56187
$$ 18905824 19131033 19575190 20238785 20741233 20995961 21436193 21864322 21876735 21606375 21150188
6439B1150188p63585p46487p74389o85647n72493o04721k13778j73544k54196
$$ 21150188 20386603 19640116 18865727 18180080 17607587 17002866 16789088 16615544 16361348
6430A6361348l01981j45012j71596j86890o6815M2658J23656K76276J69754L60753
$$ 16361348 16059367 15914355 15742759 15555869 15489054 15531712 15655368 15931644 16101398 16462151
6420A6462151M70740L65320O35952P84298R05567P87150P22739Q16447J163107
$$ 16462151 16932891 17298211 17934163 18718461 19624028 20411178 21133917 21950364 23113471
6411B3113471J296134J295829J195215J100775Q68832Q61398N39041K71191J22816
$$ 23113471 24409605 25705434 26900649 28001424 28870256 29731654 30270695 30541886 30664702
6402C0664702p8710l71369n02962o15414p41656p44797p39388p71024q06630o04045
$$ 30664702 30585992 30214623 29711661 29096247 28354591 27609794 26870406 26099382 25292752 24688707
6392B4688707n05694l38311l63298l58382k40405J06436p2983J92815J83177J48309
$$ 24688707 24183013 23844702 23481404 23123022 22882617 22989053 22916070 23108885 23292062 23440371
6382B3440371M25247N05272M96768O47683P29299Q49757Q32573O77670Q74882
$$ 23440371 23865618 24370890 24867658 25515341 26244640 27094397 27926970 28604640 29479522
6373B9479522Q76614P88967N77862N93825N57528M37188K47637J95043r6667k3748
$$ 29479522 30356136 31145103 31722965 32316790 32874318 33311506 33559143 33754186 33657519 33633771
6363C3633771l41459j45125j30776j6827o0859m9443J25889L20880N33502P19981
$$ 33633771 33292312 33147187 33016411 32999584 32938725 32889282 33015171 33336051 33869553 34589534
6353C4589534Q84049J183420J059852J290357J623267J826798K025892K247195
$$ 34589534 35473583 36657003 37716855 39007212 40630479 42457277 44483169 46730364
6345D6730364K297270K443290K658766K494388K584386K278886K036290J844890
$$ 46730364 49027634 51470924 54129690 56624078 59208464 61487350 63523640 65368530
6337F5368530J496791R76409L52225k38427k33347p87221j193394j466264j379102
$$ 65368530 66865321 67841730 68193955 67955528 67722181 66934960 65741566 64275302 62896200
6328F2896200j266858r40368r65018o53732n37663l33685k05374n6290M85504
$$ 62896200 61629342 60688974 59723956 59070224 58532561 58198876 57993502 57937212 58422716
6319E8422716M14822N54469O81495Q22989R11999J119446J021495R83020P60676
$$ 58422716 58837538 59392007 60073502 60896491 61808490 62927936 63949431 64932451 65693127
6310F5693127N09555M07556K02783R9923J02460M2426r322j43205k71398m65363
$$ 65693127 66202682 66610238 66813021 66912944 67015404 67057830 67048508 66905303 66633905 66168542
6300F6168542o03426n90990p25490p17655o03764n95309r76639j024365j045040
$$ 66168542 65565116 64974126 64248636 63530981 62927217 62331908 61355269 60330904 59285864
6291E9285864j209137j218954j470711j739554j609318j579041j570135j162604
$$ 59285864 58076727 56857773 55387062 53647508 52038190 50459149 48889014 47726410
6283D7726410q35707p80643p10002n09848k57932k68212J28500L31107L25748
$$ 47726410 46890703 46110060 45400058 44890210 44632278 44364066 44492566 44823673 45149421
6274D5149421M04332O87554Q94194J228793J575458J686778K041425J867873K062266
$$ 45149421 45553753 46241307 47135501 48364294 49939752 51626530 53667955 55535828 57598094
6265E7598094K305486K158470K050771K019208J800385J249633J113073P61350
$$ 57598094 59903580 62062050 64112821 66132029 67932414 69182047 70295120 71056470
6257G1056470M94251J47430k19089l25360m11563l16520n1544k12698r5693K46186
$$ 71056470 71550721 71698151 71479062 71153702 70742139 70425619 70374075 70161377 70065684 70311870
6247G0311870M55372O85734O14197J049363J050027O84510O36093L67719r2396
$$ 70311870 70767242 71452976 72067173 73116536 74166563 74851073 75487166 75854885 75762489
6238G5762489m44072r71690r13202j456926j572600j643956j704251j709127j629287
$$ 75762489 75318417 74346727 73433525 71976599 70403999 68760043 67055792 65346665 63717378
6229F3717378j521209j230057j194972j192301j107804j007600p13445o52470
$$ 63717378 62196169 60966112 59771140 58578839 57471035 56463435 55749990 55097520
6221E5097520o48599q78076r15981r05974j146637j234490j255625j158891j029120
$$ 55097520 54448921 53570845 52654864 51748890 50602253 49367763 48112138 46953247 45924127
6212D5924127r32640q85671r95157p01012n50986o39767o83059n00383m28233
$$ 45924127 44991487 44105816 43110659 42409647 41858661 41218894 40535835 40035452 39607219
6203C9607219l65956k04386O0630J71425M07932K40380M26124K65353K34001L22900
$$ 39607219 39241263 39036877 39097507 39268932 39676864 39917244 40343368 40608721 40842722 41165622
6193D1165622J22855j74898j56100k01451o34649p48838p52425o82723p52538
$$ 41165622 41288477 41113579 40957479 40756028 40121379 39372541 38620116 37937393 37184855
6184C7184855o33044n31206o53734l15235l19566k36232J39146k2149j59971K7096
$$ 37184855 36551811 36020605 35366871 35051636 34732070 34495838 34634984 34612835 34452864 34479960
6174C4479960K92895K16259q7945n6365k36736l19679m68028o68546p31585o59215
$$ 34479960 34772855 34989114 34901169 34844804 34608068 34288389 33820361 33151815 32420230 31761015
6164C1761015r17148r77820q54535q07568p54593p85879o73402p82646o56208
$$ 31761015 30843867 29866047 29011512 28203944 27449351 26663472 25990070 25207424 24551216
6155B4551216o16005o01782n99253o94084n05752o57720n83838n64774n55912
$$ 24551216 23935211 23333429 22734176 22040092 21534340 20876620 20292782 19728008 19172096
6146A9172096m90312m31340l03738k78423l71347m75261n30118k74735m23415
$$ 19172096 18681784 18250444 17946706 17668283 17296936 16821675 16291557 16016822 15593407
6137A5593407n21631l73559n12787m95989m70695l69638n58483l64206m90272
$$ 15593407 15071776 14698217 14185430 13689441 13218746 12849108 12290625 11926419 11436147
6128A1436147j82864m15844j76403k09576m19975l54276k44952j83211l25481
$$ 11436147 11253283 10837439 10661036 10451460 10031485 9677209 9432257 9249046 8923565
6119H923565k49458j11546n6143k86846j57850j5511j09747J625j60229j62525
$$ 8923565 8674107 8562561 8506418 8219572 8061722 8046211 7936464 7938089 7777860 7615335
6109G615335j00944k2202j59203n7623j51233j91365q5770O2389j6680K7200r1293
$$ 7615335 7514391 7492189 7332986 7275363 7124130 6932765 6846995 6909384 6892704 6919904 6828611
6098F828611k52652j89170N5395K129k6155k99540j52847J2536j06832p3621n5391
$$ 6828611 6575959 6386789 6442184 6444313 6418158 6118618 5965771 5978307 5871475 5797854 5742463
6087E742463Q7185m0764O2975J43991Q6556j42162q2612J46827p3681P9668L3112
$$ 5742463 5829648 5788884 5851859 5995850 6082406 5940244 5857632 6004459 5930778 6010446 6043558
6076F043558q7997n0841j10428j45538p6597Q9109k79481k4498r5639j06845k34528
$$ 6043558 5955561 5904720 5794292 5648754 5572157 5661266 5381785 5357287 5261648 5154803 4920275
6065D920275k5482j76L262j75068K5659j62994L1450m6849j08840M3798q8692
$$ 4920275 4894793 4894617 4897879 4722811 4748470 4585476 4616926 4570077 4461237 4505035 4416343
6054D416343K55379M6909n4025j9564m0398K02140r6785N6913j6321L8607j54229
$$ 4416343 4671722 4718631 4664606 4645042 4604644 4806784 4709999 4766912 4750591 4789198 4634969
6043D634969n0264j09665j27852J09517n9809j24773o8430j24134j53601r3710
$$ 4634969 4584705 4475040 4347188 4456705 4396896 4272123 4203693 4079559 3925958 3832248
6033C832248L1104j07509r9929o1418j44646j07394j00193R5722J47795p5865
$$ 3832248 3863352 3755843 3655914 3594496 3449850 3342456 3242263 3337985 3485780 3409915
6023C409915j02551R4240n7353q1808M2252n6313N2728M496k52830R4227K4586
$$ 3409915 3307364 3401604 3344251 3262443 3304695 3248382 3301110 3305606 3052776 3147003 3171589
6012C171589N4144K2102j13902q6760K1466R0696J39481j02965j22566L4360Q0799
$$ 3171589 3225733 3247835 3133933 3047173 3068639 3159335 3298816 3195851 3073285 3107645 3188444
6001C188444O8929J5659j0296M0291p7072m9604N546k648O5229J0225m6614Q6744
$$ 3188444 3257373 3273032 3262736 3303027 3225955 3176351 3181897 3179249 3244478 3254703 3208089 3294833
5989C294833O8580K06358P5705m0122M3459O3998J37034K51475j96432k14713
$$ 3294833 3363413 3569771 3645476 3605354 3648813 3712811 3849845 4101320 3904888 3690175
5979C690175p3327K08836O8175j8112J06701p5597j9808J44584m6863J09839j98691
$$ 3690175 3616848 3825684 3893859 3875747 3982448 3906851 3887043 4031627 3984764 4094603 3895912
$$ [...]
##END NTUPLES=NMR SPECTRUM
##END=
