##TITLE=1H_EC-3356(2-1)
 200.13MHz, CDCl3,
 8 sc
 
 15.8.2025
##JCAMPDX= 6.0         $$ Bruker NMR JCAMP-DX V2.0
##DATA TYPE= NMR SPECTRUM
##DATA CLASS= NTUPLES
##ORIGIN= UXNMR, Bruker Analytische Messtechnik GmbH
##OWNER= pz
$$ XWIN-NMR		Version 3.5
$$ Fri Aug 15 13:40:35 2025 Russian Standard Time (UT+4h)  she@DPX200
##.OBSERVE FREQUENCY= 200.1313
##.OBSERVE NUCLEUS= ^1H
##.ACQUISITION MODE= SIMULTANEOUS
##.ACQUISITION SCHEME= undefined
##.AVERAGES= 8
##.DIGITISER RES= 18
##SPECTROMETER/DATA SYSTEM= spect
##.PULSE SEQUENCE= zg30
##.SOLVENT NAME= CDCl3
##.SHIFT REFERENCE= (INTERNAL, CDCl3, 0, 15.3712)
##AUDIT TRAIL= $$ (NUMBER, WHEN, WHO, WHERE, WHAT)
$$ ##TITLE= Audit trail, XWIN-NMR		Version 3.5
$$ ##JCAMPDX= 5.01
$$ ##ORIGIN= Bruker BioSpin GmbH
$$ ##OWNER= she
$$ F:/spectra/data/she/nmr/H-C/1/pdata/1/auditp.txt
$$ ##AUDIT TRAIL=  $$ (NUMBER, WHEN, WHO, WHERE, WHAT)
(   1,<2025-08-15 13:38:44.09 +0400>,<she>,<DPX200>,
      <created by zg, POWCHK disabled, PULCHK disabled
       configuration hash MD5:
       00 E9 B6 7A A2 85 ED C7 34 08 36 98 17 FE 4E 26
       data hash MD5: 16K
       BA 4D 19 88 C9 C8 73 5B D2 CD 6E 45 BE ED 0A 01>)
(   2,<2025-08-15 13:38:46.21 +0400>,<she>,<DPX200>,
      <Start of raw data processing
       efp BC_mod = 2 LB = 0.25 FT_mod = 6 PKNL = 1 PHC0 = -1563.183 PHC1 = 11.59228 SI = 16K 
       data hash MD5: 16K
       E7 34 0E 78 2C 64 9E 5D D4 1D FE 4B 22 83 A3 A7>)
(   3,<2025-08-15 13:39:11.51 +0400>,<she>,<DPX200>,
      <pk PHC0 = 4.330255 PHC1 = -1.8 
       data hash MD5: 16K
       D1 0F 1D 6E FC 16 6B 78 C9 B5 56 7C 46 0A CE 80>)
(   4,<2025-08-15 13:39:15.65 +0400>,<she>,<DPX200>,
      <abs ABSG = 5 
       data hash MD5: 16K
       35 79 8C 39 12 2C F2 7C A1 00 5D 0E 1F 76 03 03>)
(   5,<2025-08-15 13:39:44.78 +0400>,<she>,<DPX200>,
      <pk PHC0 = 2.025088 PHC1 = -3.2 
       data hash MD5: 16K
       4E C5 26 42 A2 41 0C BC C6 68 88 69 9A A4 57 09>)
(   6,<2025-08-15 13:39:48.81 +0400>,<she>,<DPX200>,
      <abs ABSG = 5 
       data hash MD5: 16K
       89 2E 64 E4 0A B3 0B A3 84 AD 3A DF 0D 61 31 0B>)
$$ ##END=
$$ 
$$ hash MD5
$$ DB 85 17 02 D2 F0 82 3B 1F D5 C4 1B 6C A1 51 BA
##$RELAX= 
##$RELAX= 
##$RELAX= 
##$RELAX= 
##$RELAX= 
##$RELAX= 
$$ Bruker specific parameters
$$ --------------------------
##$DU= <F:/spectra>
##$EXPNO= 1
##$NAME= <H-C>
##$PROCNO= 1
##$TYPE= <nmr>
##$USER= <she>
##$AMP= (0..31)
100 100 100 100 100 100 100 100 100 100 100 100 100 100 100 100 100 100 
100 100 100 100 100 100 100 100 100 100 100 100 100 100 
##$AQSEQ= 0
##$AQ_mod= 1
##$AUNM= <au_zg>
##$AUTOPOS= <>
##$BF1= 200.13
##$BF2= 200.13
##$BF3= 200.13
##$BF4= 200.13
##$BF5= 200.13
##$BF6= 200.13
##$BF7= 200.13
##$BF8= 200.13
##$BYTORDA= 1
##$CFDGTYP= 0
##$CFRGTYP= 5
##$CHEMSTR= <none>
##$CNST= (0..31)
1 1 145 1 1 1 1 1 1 1 1 1 1 1 1 1 1 1 1 1 1 1 1 1 1 1 1 1 1 1 1 1 
##$CPDPRG= <>
##$CPDPRG1= <>
##$CPDPRG2= <>
##$CPDPRG3= <>
##$CPDPRG4= <mlev>
##$CPDPRG5= <mlev>
##$CPDPRG6= <mlev>
##$CPDPRG7= <mlev>
$$ [...]
##$SUBNAM3= <"">
##$SUBNAM4= <"">
##$SUBNAM5= <"">
##$SUBNAM6= <"">
##$SUBNAM7= <"">
##$SUBNAM8= <"">
##$SUBNAM9= <"">
##$SW= 18.0517328524113
##$SWIBOX= (0..15)
0 0 2 0 0 0 0 0 0 0 0 0 0 0 0 0 
##$SW_h= 3612.71676300578
##$TD= 16384
##$TD0= 1
##$TE= 0
##$TE2= 300
##$TE3= 300
##$TEG= 300
##$TL= (0..7)
0 120 120 120 120 120 120 120 
##$TP= (0..7)
150 150 150 150 150 150 150 150 
##$TP07= 0
##$TPNAME0= <>
##$TPNAME1= <>
##$TPNAME2= <>
##$TPNAME3= <>
##$TPNAME4= <>
##$TPNAME5= <>
##$TPNAME6= <>
##$TPNAME7= <>
##$TPOAL= (0..7)
0.5 0.5 0.5 0.5 0.5 0.5 0.5 0.5 
##$TPOFFS= (0..7)
0 0 0 0 0 0 0 0 
##$TUNHIN= 0
##$TUNHOUT= 0
##$TUNXOUT= 0
##$USERA1= <user>
##$USERA2= <user>
##$USERA3= <user>
##$USERA4= <user>
##$USERA5= <user>
##$V9= 5
##$VALIST= <valist>
##$VCLIST= <CCCCCCCCCCCCCCC>
##$VD= 0
##$VDLIST= <DDDDDDDDDDDDDDD>
##$VPLIST= <PPPPPPPPPPPPPPP>
##$VTLIST= <TTTTTTTTTTTTTTT>
##$WBST= 1024
##$WBSW= 4
##$XGAIN= (0..3)
0 0 0 0 
##$XL= 0
##$YL= 0
##$YMAX_a= 937217
##$YMIN_a= -749945
##$ZGOPTNS= <>
##$ZL1= 120
##$ZL2= 120
##$ZL3= 120
##$ZL4= 120
##$ABSF1= 15.53865
##$ABSF2= -2.513202
##$ABSG= 5
##$ABSL= 3
##$ALPHA= 0
##$AQORDER= 0
##$ASSFAC= 0
##$ASSFACI= 0
##$ASSFACX= 0
##$ASSWID= 0
##$AUNMP= <proc_1d>
##$AZFE= 0.1
##$AZFW= 0.1
##$BCFW= 0
##$BC_mod= 2
##$BYTORDP= 0
##$COROFFS= 0
##$CY= -3
##$DATMOD= 1
##$DC= 0
##$DFILT= <>
##$DTYPP= 0
##$F1P= 0
##$F2P= 0
##$FCOR= 1
##$FTSIZE= 16384
##$FT_mod= 6
##$GAMMA= 0
##$GB= 0
##$INTBC= 1
##$INTSCL= 3.241238e-09
##$ISEN= 128
##$LB= 0.25
##$LEV0= 0
##$LPBIN= 0
##$MAXI= 10000
##$MC2= 0
##$MEAN= 0
##$ME_mod= 0
##$MI= 1.114404
##$NCOEF= 0
##$NC_proc= -6
##$NLEV= 6
##$NOISF1= 3.799351
##$NOISF2= 2.8
##$NSP= 0
##$NTH_PI= 0
##$NZP= 0
##$OFFSET= 15.37117
##$PC= 1
##$PHC0= -1556.828
##$PHC1= 6.59228
##$PH_mod= 1
##$PKNL= yes
##$PPARMOD= 0
##$PSCAL= 0
##$PSIGN= 0
##$REVERSE= no
##$SF= 200.130030124198
##$SI= 16384
##$SIGF1= 3
##$SIGF2= 2
##$SINO= 0.751879
##$SIOLD= 32768
##$SREGLST= <19F.Aceton>
##$SSB= 0
##$STSI= 16384
##$STSR= 0
##$SW_p= 3612.71676300578
##$SYMM= 0
##$S_DEV= 0
##$TDeff= 16384
##$TDoff= 0
##$TI= <>
##$TILT= no
##$TM1= 0
##$TM2= 0
##$TOPLEV= 0
##$USERP1= <user>
##$USERP2= <user>
##$USERP3= <user>
##$USERP4= <user>
##$USERP5= <user>
##$WDW= 1
##$XDIM= 16384
##$YMAX_p= 436505024
##$YMIN_p= -856574
$$ End of Bruker specific parameters
$$ ---------------------------------
##NTUPLES= NMR SPECTRUM
##VAR_NAME=  FREQUENCY,     SPECTRUM/REAL,   SPECTRUM/IMAG
##SYMBOL=    X,             R,               I
##VAR_TYPE=  INDEPENDENT,   DEPENDENT,       DEPENDENT
##VAR_FORM=  AFFN,          ASDF,            ASDF
##VAR_DIM=   16384,         16384,           16384
##UNITS=     HZ,            ARBITRARY UNITS, ARBITRARY UNITS
##FACTOR=    0.220516191357247, 1,           1
##FIRST=     3076.23272393895, 0,            0
##LAST=      -536.484039066835, 0,           0
##MIN=       -536.484039066835, -856574,     0
##MAX=       3076.23272393895, 436505024,    0
$$ Real data points
##PAGE= N=1
##DATA TABLE= (X++(R..R)), XYDATA
$$ [...]
11902b4770O5707j8160J15693j51889n5035K3083l2576o1045l8176K2861K7249
11891a27058J28224K9205N6088r3123j23806R3851N7131J7869k39236J33684J67042
11880I9871m0010L7241P7968k4468k13671L4781J05799q5256j8778l7624N5966
11869h181j75305R1561K18472J0554q8209K1890j29652n9668J14102N424M3016
11858D4004n8505j22418K62402K1649k07035N8844j16052l7076J94953o167k302
11847C2297k6665K14247p5331k26812N6180J18959k1759r9894N8557k6843m551
11836a615j32176n1083J24987R9076R5445M9059k61877n6239p7240J60721P7368
11825B6426m9564L14729j11354j61783j8045o1205J41400J52972n2153J4573N2349
$$ y = [-24770, 40937, 22777, 138470, -13419, -68454, -45371, -77947, -138992, -177168, -154307, -127058, 1166, 30371, 86459, -6664, -130470, -36619, 20512, 38381, -200855, -67171, 99871, 59861, 97102, 175070, 150602, -63069, -28288, 77511, -7745, -26523, -64147, -8181, -183486, -91925, 126547, 137101, 48892, 70782, -58870, -118538, -4436, 988, 44004, -14501, -136919, 125483, 147132, -59903, -1059, -117111, -154187, 40766, 34599, 32297, 5632, 219879, 144548, -82264, -26084, 92875, 71116, -28778, 29779, 2936, -1615, -133791, -184874, -59887, 39189, 134634, 183693, -78184, -134423, -211663, -50942, 26426, -23138, 291591, 180237, 18454, 409, -60796, 80604, 233576, 181423, 195996, 248345]
11814B48345l55435j14512q9301J94963K04073l6616N1014q6954o0168J05094
11804F0503k0642r3275P7750k5610L107l0323l6008Q8572N0926n0226k64679O7527
11792a72378L7417o6668R8862J16556J03801o6075j31326L3811r0932j84403J00177
11781b21158J36281J8053J94927k7472M6005J24206M3326j55635J54090J10995
11771D23618k15759k34364N881J2828K701P9135l2280J49449l3128k8076j36054
11760f049p2067Q2684j1707J1983J6266K594R4952q0075q4067j12912J14040J22057
11748G7699q0732m322k028o023Q6986n5277j47167P2984Q6290k4860j9823O2532
11736D6259j01710q053p6662P694L7345R7077j46880p3533p2766Q5820J79901
$$ y = [248345, -107090, -221602, -310903, -115940, 88133, 51517, 102531, 15577, -44591, 60503, 39861, -53414, 24336, -1274, 1833, -28490, -64498, 24074, 75000, 24774, -239905, -172378, -134961, -201629, -102767, 13789, 117590, 51515, -79811, -46000, -136932, -321335, -221158, -84877, -66824, 128103, 100631, 146636, 270842, 314168, 158533, 312623, 423618, 207859, -26505, -20624, -7796, -5095, 74040, 41760, 191209, 158081, 130005, -6049, -78116, 4568, -7139, 4844, 21110, 23704, 118656, 38581, -45486, -158398, -44358, 77699, -3033, -7355, -9383, -15406, 71580, 16303, -130864, -57880, 28410, 3550, -16273, 46259, -55451, -63504, -140166, -132472, -95127, 1950, -144930, -218463, -291229, -205409, -25508]
11725b5508J25333m429j47167j28426k6758N1748k8170N9957J84913r0914j0668
11714d0089J31016m0585m6527R0756L1357j01044N4000j0468o6692q5789j9711
11703a03776m618M3665l186J30452j4767k7581P288K1590l2791j96065N2196m2798
11691a70391L2223J13149O7921O3659J01927P9042j60289q2268j88080N2624K7169
11680f3314J52917k8789q9649n4419L3638j28352J55906J22622p8271m7573J24544
11669I9260n060l6221O4951R8895j17918L409j88655q427P3801J21775L5127r421
11657A31516j89695m3158L3512J1971K0650q0973j1110J52705M5771M2348L3953
11646A47490k4398p8188k31008Q459J70711j87688o3755K33569K6369J50122j06692
$$ y = [-25508, 99825, 95396, -51771, -180197, -206955, -155207, -183377, -123420, 61493, -29421, -40089, 90927, 50342, 3815, 94571, 125928, 24884, 78884, 68416, 1724, -84065, -103776, -108394, -64729, -67915, 62537, 47770, 20189, 27477, 49067, 16276, -179789, -127593, -170391, -138168, -25019, 42902, 106561, 208488, 287530, 127241, 44973, -143107, -90483, -63314, 89603, 60814, -28835, -83254, -49616, -177968, -22062, 100560, 22289, -25284, 99260, 94200, 57979, 122930, 221825, 103907, 107316, -81339, -89766, -15965, 105810, 140937, 131516, -58179, -101337, -67825, -55854, -35204, -116177, -127287, 25418, 71189, 113537, 147490, 123092, 44904, -186104, -177645, -6934, -194622, -258377, -24808, 1561, 151683, 44991]
11635D4991j55637n4712P1725l5631R6595m9444P0335K2330r8362M4677r6807
11624a39940M0932R3939l9100J9399O9415K0402J0812K8131k17925P1915R4760
11613E2740L0287N0387j13916j74171P73l0440K54673R1313j22315o1368J10248
11602H8211p7l4175q4781n4016Q8944J88255j44246j21925J6972j19816K02680
11591B6026l7580j26682k2934M2948J99893j44671n2182L4573J68861j9737K2830
11580I1345j08114p0459M4896J92886N05q7263p5249R0769p8094p8307l0340J51643
11568D4218r1399k7683O0328N8895R7893j00725j8141j59312J06779J69845Q9959
11557B30657q9911j30387M481R0405k048Q964r8135O1319M9464Q662q1482j06058
$$ y = [44991, -110646, -165358, -93633, -129264, -32669, -82113, -11778, 10552, -87810, -43133, -139940, -99008, -5069, -44169, -24770, 44645, 65047, 75859, 103990, -113935, -42020, 52740, 83027, 133414, 19498, -154673, -153900, -184340, 70333, 161646, 39331, -22037, 88211, 88134, 53959, -30822, -84838, 4106, 192361, 48115, -73810, -56838, -176654, 26026, -11554, -138236, -161170, -118222, 81671, -63000, -115182, -80609, 88252, 68515, 91345, -16769, -87228, -42332, 150554, 151059, 63796, -11453, 79316, 1222, -77085, -107425, 44218, -47181, -74864, -14536, 44359, 142252, 41527, 23386, -135926, -29147, 140698, 230657, 140746, 10359, 14840, 105245, 103197, 112161, 14026, 75345, 124809, 133471, 51989, -54069]
11545e4069J76141o4659j43496K4854j8341J52946k5575n2359L6884K7957j01144
11534d0861R1731Q9964j18699J1047K300p2199J44532m1893L3791p879l1110q0884
11522b0160J895J25223m3298K1739n0823q1214L7882J79384J26618k43308m2500
11511A1438J17005M7131n1418k03884o5986J17323m5439q5637Q2790N4016q2209
11500a04870K5713M3592p7208q2226J01358k7033J47361r090j01157P5145Q5046
11489G6631r4520j16303J17999N027n4367J48563K3627m1751j1635k1388k35907
11478b04024o4673K07510m5466J30660Q9464o7483N6745K6372P1248p3504m0969
11467H5880k59p0258m5375K21709n7156j30395j54147R4141Q2648j14012j0025
$$ y = [-54069, 122072, 57413, -86083, -61229, -79570, 73376, 47801, -4558, 32326, 60283, -40861, 50870, 140834, 22135, 33182, 35482, -36717, 107815, 65922, 99713, 91834, 60724, -20160, -18265, 106958, 63660, 85399, 34576, -46638, -8756, 170628, 297246, 53938, 11438, 128443, 175574, 124156, -79728, -145714, -28391, -73830, -159467, -76677, -22661, -104870, -79157, -35565, -112773, -194999, -93641, -120674, 26687, 17597, -83560, -8415, 76631, -17889, -134192, -16193, -11166, -65533, 83030, 106657, 64906, 53271, 31883, -204024, -268697, -61187, -106653, 24007, 113471, 45988, 102733, 129105, 200353, 126849, 85880, 85621, 15363, -30012, 191697, 134541, 4146, -150001, -55860, 26788, -87224, -97249]
11456i7249l5929J09446o9662J12810K4016Q0670j139k14650J5740J13826R2399
11445A30278r5165j28650J04421L7187N7289M8206K4073j65942N3335q3690M1944
11434B3286J04702p8863l1003K6695p6207o3347M1587j18275j5900J69572k0697
11423c8450n82M6729j40476J09346J04352Q5558m0357n2766m1674J51733P3256
11412B56669j33623n7363k59946P3033J83341q0751p3694J47671K9281k9432o7369
11401a2183P3918m0201k7560n5456p7759R8428L6777L1814j45674L2450J2418
11390g3028k6030P8698N3600M9665M2154J75627j04348j03165k4595j08976j6655
11379e7053P5843J9217j36452j50307M4118K28251O4380p3764j6952l683J2306
$$ y = [-97249, -133178, -23732, -93394, 19416, 43432, 124102, 122963, -91687, -75947, 37879, 130278, 35113, -93537, 10884, 48071, 105360, 153566, 177639, 11697, 65032, -18658, 23286, 127988, 49125, 18122, 44817, -31390, -94737, -53150, -171425, -187325, -17753, -38450, -39032, 7697, -132779, -23433, 80919, 166477, 126120, 73354, 31680, 183413, 256669, 123046, 65683, -194263, -121230, 62111, -18640, -92334, 55337, 84618, 55186, -12183, 61735, 21534, -6026, -61482, -139241, -40813, -4036, 27778, -117896, -85446, -73028, -99058, -20360, 33240, 82905, 125059, 300686, 196338, 93173, 68578, -40398, -57053, 18790, 38007, -98445, -248752, -204634, 23617, 87997, 14233, -2719, -6402, 5904]
11368E904l8323L5865M7696j14047Q1340N876r915Q652l7381J1661o862J59765
11356A50231q4977j59624l6271l3439J45635P6202k5879J58978j53750p0925m6596
11345h0415K03121K7434j62384o0471O6345J3402r9194M8189o5415m1876J82323
11334C1059P0847q3207m0455k94897J36820J42163j6210L4511p4350L1443k2460
11323h4736M519R6286j06318n9184J22167J63624r6212r42M711q2619j2517K2079
11311b9142N9611q1751k0600j1445l1965o7594L9412K9698R5756N5999k02400
11300a64421O8508Q4223L2223k51509q3416J50768J10889J0469j4598J26790O9515
11289A39441j8105m5598q9813j27872p421p112j21107K25698J61563q1414j32575
$$ y = [5904, -32419, 3446, 51142, -62905, 18435, 24311, 14396, 23048, -14333, -2672, -9534, 150231, 65254, -94370, -130641, -164080, -18445, 57757, 31878, 190856, 37106, -33819, -80415, 122706, 150140, -12244, -72715, -6370, 7032, -92162, -43973, -109388, -151264, 31059, 101906, 18699, -21756, -316653, -179833, -37670, -53880, -19369, -93719, -62276, -84736, -80217, 16069, -90249, -149433, -27266, 136358, 40146, 39204, 43915, -38704, -51221, -29142, 30469, -51282, -71882, -83327, -115292, -182886, -143474, -113776, -18020, 37979, -164421, -95913, -11690, 20533, -230976, -314392, -163624, -52735, -42266, -56864, 69926, 139441, 121336, 75738, -14075, -141947, -149368, -156480, -277587, -51889, 109674, 28260, -104315]
11278a04315j17921J85021N4067q6025o9580J52713k0409K128R403j37221J79814
11267D7675K15419p947j89370p068L2501j10758o8231P3178J9585k41673J84239
11256e2450J45411Q8027o2379j20772j59034r4778J10312l9572l3871k3210J07879
11245a34437O4266J79436k31587J28003k0735L4687l2539N6984j11935q5609M5285
11234a08181L0133R6212j4758J32536j13182q732l0369L9785N4467P6267J00846
11223B55024l6331O0658j39796K9476j38176J40093n4418k55919J0655j00293
11213b29027q7200K80958P8728r4392J7685j36991J8722q502K02471R0743K4956
11202A58151K9878j33679k57225K48253n9520m7603N5715Q0498m1646k10799m6617
$$ y = [-104315, -222236, -37215, 16852, -69173, -138753, 13960, -6449, -4321, 5082, -132139, 47675, 263094, 255147, 65777, 58709, 91210, -19548, -87779, -14601, 4984, -236689, -52450, 92961, 180988, 118609, -2163, -161197, -255975, -145663, -185235, -219106, -242316, -134437, -70171, 109265, -122322, 5681, -15054, 19633, -12906, 44078, -67857, -153466, -108181, -78048, 18164, 3406, 135942, 22760, 14028, -16341, 23444, 77911, 154178, 255024, 218693, 279351, 139555, 169031, 30855, 170948, 116530, -139389, -128734, -229027, -316227, -35269, 43459, -50933, -33248, -170239, -151517, -160019, 42452, 133195, 158151, 188029, 54350, -202875, 45378, -14142, -61745, -6030, 74468, 32822, -177977, -224594]
11191b24594N7549M7680l8803L2007N3154J75432J3326j31640l9991o5276J17681
11180c475m4493j08008L0427J18604j18105k3680o168O2085O1451K8430j8417
11169b1349p3407O782r4918N7397O1393j19311M3640J53281o1699j3426k4587
11158h6204r730J36732j55189P3334o8512J3626P3304j04685l9624J74915J732
11147I699k0938l0155p5574N9549M3562K7530r0636l4354n6504m3617P9608j28985
11135b60815k0960J87781J01657q7176J34381m0541p2772M4222M6816r2758q0912
11124a41077K7405n5594J20840O8886j58922J15841R4673j88237k5503J84808
11114D3120j19351k05401J8694P1404O5154N2322J9260j06028K91097M9508p6996
$$ y = [-224594, -167045, -119365, -158168, -126161, -73007, 102425, 115751, -15889, -55880, -121156, -3475, -47968, -155976, -125549, -6945, -125050, -148730, -154898, -92813, -31362, -2932, -21349, -94756, -87974, -182892, -125495, -64102, -183413, -139773, 13508, -48191, -61617, -86204, -95934, 40798, -114391, -41057, -109569, -95943, -22639, -127324, -166948, 7967, 9699, -11239, -41394, -116968, -57419, -13857, 13673, -76963, -111317, -167821, -211438, -131830, -260815, -281775, -93994, 7663, -79513, 54868, 14327, -58445, -14223, 32593, -60165, -141077, -113672, -169266, -48426, 20460, -138462, -22621, 72052, -116185, -141688, 43120, -76231, -281632, -262938, -191534, -126380, -74058, -54798, -160826, 130271, 179779, 102783]
11103A02783m8095J04357j93165M9067P6784j19536j79602O1767J35304k1424
11093c1760p9642M2905R0837m5859L4977K7614r1920J25425m7572J4708k80062
11082b40349O3878L32500J4179q6178p5918l990N0498J6248j19420n1095P4690
11071b4957k7513j73148p5228K31023R7536j2133j04370m6757k5906M9410p2679
11060a84722K02666m4961n6391M518q9831K14381M2936p5230j03907m4955K57844
11049A22348R1753k14456j5901l2126L6180J19790j845j32215M4934j2420J4528
11038B0570m0906J89241k6173k10171L4513M3764k4065r7108k9038J5607Q1646
11027d2120J56363j26573L8889r5025j66624k8448J46695o352N0120J02041m1231
$$ y = [102783, 54688, 159045, -34120, 14947, 91731, -27805, -207407, -145640, -10336, -31760, -111402, -68497, 22340, -23519, 11458, 39072, -52848, 72577, 25005, 39713, -240349, -176471, 156029, 170208, 84030, 8112, 4122, 54620, 70868, -48552, -99647, -24957, -52470, -225618, -300846, -69823, 27713, 15580, -88790, -135547, -161453, -112043, -184722, 17944, -27017, -83408, -78890, -168721, 45660, 88596, 13366, -90541, -135496, 122348, 214101, -355, -16256, -48382, -12202, 107588, 105743, -26472, 18462, 6042, 20570, -20336, 168905, 142732, -67439, -32926, 10838, -13227, -110335, -139373, -123766, -42120, 114243, -12330, 26559, -68466, -235090, -263538, -116843, -123195, -73075, 28966, -12265]
11016a2265j11483p6007J47877K7787o4023K44357m5482p7809J01056K7448j47849
11005A3607l0822m9565p0101J59232L2850K4105m2600m2438L0449K1219o2103
10994a6167j42712p1211J77600j1603j06844M1555J19106j2423l7896J65182j25319
10983b0732j62340j43082J10941L7049j7264R5347j03470m2569M0612J69314j6347
10972e2541M3216K8000m2994J00227j67696R7797L6819n0363j4070N7397k1060
10961A4732J02318J8922Q4719Q484o9614j6555j46716K6033p8478n5617k0067
10950a31839J72869j1733L8307n3382k04118O4617o4270P3012J45957j1922j0739
10939F759j14773l2376J35665r2124O6107J53426j72257j9747M9808J01017o8052
$$ y = [-12265, -123748, -199755, -51878, -24091, -88114, 156243, 110761, 32952, 134008, 161456, 13607, -17215, -66780, -136881, 22351, 55201, 79306, 36706, -5732, 24717, 45936, -16167, -158879, -230090, -52490, -64093, -170937, -129382, -10276, -22699, -60595, 104587, -20732, -183072, -326154, -215213, -178164, -195428, -100081, -203551, -246120, -205508, -36194, -52541, -9325, 18675, -24319, 75908, -91788, 6009, 42828, -7535, -21605, 35792, 14732, 117050, 135972, 220691, 229175, 159561, 143006, -3710, 22323, -56155, -111772, -131839, 41030, 29297, 67604, 14222, -189896, -125279, -189549, -116537, 29420, 17498, 6759, -108014, -140390, -4725, -96849, -30742, 122684, -49573, -69320, -19512, 81505, 13453]
10928A3453l9426o0855R1149m117j07134j2820l645O8794K0112j980j24374J74847
10916A4004K2555l4051J5481j4114N602N8392Q5365r0528o2522N4185k42673J29034
10904e9270K22517j43690M8749j06047k8534L9484m6729M0947J6463o2699M0180
10893c8629n4241Q4717j8281m713o818J9933m2152J44186L853q5066j16271j2786
10881a26268N4481j10837J03747J21043j95253M2664N1628l7588J6795l234R275
10870g3547J38563J42988j92123q1128J10457j33946j42924p814J62107M8912
10860b8455m0868r2324P161J68415O332m777l3806j7295r3983o4206J94158o9320
10848f8968j89901N6803J95609J68716k07858q7196j8598O6525J08902j65775
$$ y = [13453, -25973, -86828, 4321, 204, -106930, -119750, -123395, -54601, -34489, -36469, -160843, 14004, 36559, 2508, 17989, 3875, 9477, 67869, 153234, 62706, 184, 54369, -188304, -59270, 163247, 19557, 68306, -37741, -66275, -26791, -73520, -32573, -16110, -78809, -38629, -92870, -8153, -26434, -31147, -37965, -18032, -60184, 84002, 87855, 2789, -113482, -126268, -71787, -182624, -78877, 42166, -153087, -110423, -58795, -96383, -79588, -82822, -73547, 65016, 208004, 15881, -65247, 45210, -88736, -231660, -239474, -77367, -28455, -69323, -161647, -154486, 13929, 20261, 15484, -18322, -35617, -129600, -193806, 352, -68968, -258869, -202066, -6457, 162259, -45599, -132795, -151393, -84868, 24034, -141741]
10838a41741l8475j13020L5173M9798K18956J17906k09726q3773k4296M7903l891
10827a45186P1398j3695K2307m0171k564j38297O3376R4553J0597J2427N4223
10816a1032J13294l8898q2365m6600J4833R5703k8658m9664P6620n8465N2797
10805C7565n2602j68726J07363l2532k6250O5490K6435m2817l3635n8723P359
10794a71073J61308J36914k0455k1989j63610Q9952j520o1034n8733L4845j14471
10783a89866j321P1711p2864j20682k7416J05052q6607N2807L0215J50868P9962
10772h141o8429J10441L5296r1288m8228j9920O3158M5007k846M7731J8611M3161
10760A24553m2942P2229o9830p4006P4086M170J6325j1631n2827o3559j26336
$$ y = [-141741, -180216, -293236, -258063, -208265, 10691, 128597, -81129, -164902, -189198, -141295, -145186, -73788, -87483, -65176, -105347, -107911, -246208, -182832, -88279, -77682, -65255, -11032, 102262, 63364, -19001, -65601, -50768, 44935, 16277, -33387, 43233, -15232, 37565, -15037, -183763, -76400, -108932, -135182, -69692, -43257, -86074, -119709, -178432, -171073, -9765, 127149, 106694, 84705, -78905, 11047, 9527, -51507, -110240, -75395, -189866, -191187, -119476, -192340, -313022, -340438, -235386, -321993, -269186, -238971, -88103, -8141, -76570, 33871, 69167, -22121, -70349, -90269, -27111, 17896, 15050, 62781, 81392, 124553, 81611, 153840, 84010, 10004, 84090, 88260, 104585, 92954, 40127, -23432, -149768]
10749a49768o313J20472l0942m0101q4650J13463R3903m6969M507K1268j49446
10738a54576N9092K8529J5210K0447M9248o3190j5392n0046K3411L825l4573l2130
10726a50145n5283J07169L7357K1471L3916M6403M8367j82612m7560j35500J6049
10715b60368J29677n1334j7985J79481L3778o5907J3444q2628M5218r5769J9084
10704a53309J27203k5724P813M2520o7756K2630n6572K0354L6924K0271J53637
10693A27991o4229j31406m5024J7763Q8782L4077j21237M5261K31193r1536j68976
10682g7341n7909J4005M8564l4356P5888K4891j03502l4217k22604L2524J13843
10671b20214J00141L5745o2199J07856M8479q3265r155P600k32k7026m1531N1012
$$ y = [-149768, -156081, -35609, -66551, -106652, -191302, -77839, 16064, -30905, -26398, -5130, -154576, -95484, -66955, -51745, -31298, 17950, -45240, -60632, -110678, -87267, -83442, -118015, -150145, -205428, -98259, -60902, -39431, -5515, 40888, 89255, -93357, -140917, -276417, -260368, -130691, -182025, -200010, -20529, 13249, -52658, -39214, -121842, -76624, -172393, -153309, -26106, -51830, -44017, -1497, -69253, -46623, -103195, -82841, -45917, -25646, 127991, 63762, -67644, -112668, -94905, -6123, 27954, -93283, -48022, 183171, 91635, -77341, -135250, -121245, -72681, -107037, -31149, -6258, -109760, -143977, -366581, -334057, -220214, -120073, -84328, -146527, -38671, 9808, -73457, -82612, -75012, -75244, -102270, -143801, -92789]
10659i2789J64802j22532r3850Q4506n3514P0424J19191j13584j83768M3174J87553
10648I613j38028j2882J20805P778J3316p7074M4516n1379k42714m6225K00372
10637a71902J48864j6539q5848L6456K7318L4293L9197o2011j30479p131J61261
10626b6521j20675R8100J84413o1968O5511j25819Q1450j5710k00280K6885o006
10615a00620n5655J43513Q4492q3073k13830P6523p1266K37613n5598o8905l0047
10604a36853K002k378M1325L3360j29457J05967j38687q8186J01296m7149J63780
10593i4980P4542j14490r2532M3242q941j62768J19748P1492J39099j0360k1042
10582e6990n3428K7271L7003L3660j49738O6465n5596k2754J307M7470J16961
$$ y = [-92789, 72013, -50519, -144369, -59863, -113377, -42953, 76238, -37346, -221114, -177940, 9613, -128415, -141297, -20492, -12714, 602, -76472, -31956, -83335, -326049, -372274, -171902, -23038, -39577, -125425, -88969, -61651, -27358, 11839, -50172, -180651, -187782, -26521, -147196, -49096, 135317, 73349, 138860, 13041, 94491, 78781, -121499, -94614, -100620, -156275, -12762, 71730, -11343, -225173, -148650, -219916, 17697, -37901, -106806, -136853, -134851, -137229, -95904, -62544, -192001, -86034, -224721, -312907, -211611, -258760, -94980, -20438, -134928, -227460, -184218, -193159, -355927, -236179, -164687, -25588, -35948, -56990, -110418, -83147, -46144, -12484, -162222, -95757, -151353, -174107, -172800, -125330, -8369]
10571h369q4685M196p5082J61969r59j33575q7528l4467O179j82495J07077K25823
10559a01916N2947j21303R4354l5898j00701Q7550K2534j665K472L5237l006m1414
10547a10809q1311N8494R2970q3968J39683R276k07748K6649Q4176J18483J75430
10536B21325k09946j08116r5519J53360J29133K3584j04512j3850J34305j03255
10526B6509M0490o2374m8471J09339M4587l2163j83080m2060Q5301J23574r881
10515E1771q5287j1311L5474j26897M0391O6432r8256J8245j10307K0086j6370
10504b16029J56J4372K9937k1789R2658Q2587o7574L0005M4602p1970k4391N4112
10492e3324j52829j73838K43145o0250J29173N845J36635r1034o0603p167O2769
$$ y = [-8369, -93054, -88858, -163940, -1971, -2930, -136505, -224033, -258500, -252321, -434816, -327739, -101916, -48969, -170272, -75918, -111816, -212517, -124967, -102433, -104098, -101626, -66389, -69395, -110809, -192120, -133626, -40656, -124624, 15059, 24335, -183413, -156764, -72588, 45895, 221325, 11379, -96737, -192256, -38896, 90237, 113821, 9309, -4541, 129764, 26509, 66999, 4625, -43846, 65493, 110080, 77917, -105163, -147223, -61922, 61652, 51771, -33516, -44827, -9353, -136250, -95859, -29427, -127683, -109438, -219745, -199659, -216029, -215873, -201501, -171564, -193353, -100695, -18108, -85682, -55677, -11075, -83045, -107436, -53324, -206153, -379991, -136846, -197096, -67923, -62078, 74557, -16477, -77080, -84247, -21478]
10481b1478K4553k96293N044J03116J89210j16613L222J7030l5871J600L4133
10470i2347m290R0497J32611M0666j6021R2531o5084o2901n1192k1933k12639
10459a70102j8375J41869k0261m6486J60218N8546j28181r9293J55938N5716l06312
10448b16723k725m6058j2436j7362J70619J4999K9500J29423J14833k17570o4807
10437a18307j0939Q5487N6650k5491q9240r6556R4456L1141J09840j09683q0096
10426a52738O6803p6949N9N823L0489q1672j1951J76440m5951n1564N6239P0917
10414a4055j21734n3226Q027L01793j18365K6996O1999p6926k07978j94651J93588
10403a94532N4081L0238L569L6367j81100l5820m231j4351J42629J34105p9120
$$ y = [-21478, 3075, -293218, -288174, -185058, 4152, -112461, -109239, -92209, -128080, -126480, -92347, -96637, -6140, 126471, 167137, 151116, 243647, 178563, 115662, 64470, 42537, -170102, -188477, -46608, -66869, -113355, 46863, 105409, -22772, -122065, 33873, 89589, -216723, -219448, -265506, -277942, -295304, -124685, -109686, -80186, 49237, 164070, -53500, -118307, -129246, -43759, 12891, -12600, -101840, -198396, -103940, -72799, 37041, -72642, -152738, -85935, -162884, -162825, -157002, -126513, -208185, -220136, -43696, -89647, -141211, -84972, -14055, -135789, -189015, -180988, 120805, 2440, 29436, 91435, 14509, -193469, -388120, -194532, -140451, -110213, -106644, -70277, -251377, -287197, -291428, -305779, -163150, -29045, -108165]
10392a08165J88799q188L2332r7484J24333r3955J5661j1167p3665o4958Q7022
10381i435K12480o1095L1298m7425j30053m9565N5379q6475P1249J41630K2103
10370A50091j95489j71437J51800J11445j22172l386J1240R9096n1349J02634
10360H2473K6784q9752p8287J7336O3672n7453j05797M1604J48195J48648j67184
10349C0239o7864p3508Q7467j61409k9035j43582Q8035k8578J81458k6148J64647
10338B1722K8579L3743j44264J28724J29728j00631p0281r9251J14942j2591n7455
10327b7035j07600J0254O2628R7756n5359n1951q7987K76103q9569M4176j07481
10316c6065K3384J8682j368J9749q2272J23300o2427j56705J16648N7653J65732
$$ y = [-108165, 80634, 72446, 104778, 7294, 131627, 37672, 53333, 42166, -31499, -96457, -9435, 203045, 141950, 173248, 125823, -4230, -53795, 1584, -84891, -13642, 127988, 150091, -45398, -216835, -65035, 46410, -75762, -79148, -67908, 31188, -20161, 82473, 109257, 19505, -58782, -41446, 22226, -35227, -141024, -99420, 48775, 197423, 30239, -37625, -111133, -23666, -185075, -214110, -357692, -269657, -298235, -116777, -142925, 21722, 50301, 84044, -60220, 68504, 198232, 97601, 27320, -71931, 43011, 30420, -27035, -134635, -124381, -61753, 36003, -19356, -71307, -159294, 116809, 27240, 71416, -36065, -12681, 6001, 4633, 24382, -57890, 65410, 2983, -153722, -37074, 20579, 186311]
10305A86311j61722L7967l4349o8971J34492N9776l1127k8495K7966p078p3345
10294D1425j2561p0864R1789R0338o0239r7601J69714o9394J5005j3184J03007
10283A87435L6217j52947N2460k944M3118J6905k3651j21211R6451M4654J25313
10272C01800l5651l6982O8669j03693k8782p2262j83236K60297J64388k11955
10262A22593L1966M8671O468l4092j3875L340k155m5771J56088J76744P5922n916
10250E19983j20411m658j99927J51361O6513R169j31217j20524O7408j27576J53209
10239B63330P2163j03541O0275m5848M1017l7465j42203L4291J49723j7988M2266
10228C16020J9419o5708Q5492Q670L4519J7818j61697l0982P7273K178J52J72808
$$ y = [186311, 24589, 62556, 28207, -40764, 93728, 153504, 122377, 93882, 121848, 114770, 41425, 28864, -42000, 49789, 140127, 79888, -17713, 152001, 82607, 97612, 84428, 187435, 223652, 70705, 123165, 120221, 163339, 180244, 156593, 35382, 131833, 176487, 301800, 266149, 229167, 297836, 194143, 165361, 93099, -90137, 170160, 334548, 122593, 154559, 203230, 209698, 175606, 161731, 165071, 162916, 117145, 273233, 449977, 525899, 519983, 399572, 394914, 194987, 346348, 412861, 422030, 290813, 170289, 237697, 110121, 263330, 335493, 231952, 292227, 246379, 287396, 249931, 107728, 142019, 291742, 273754, 316020, 335439, 269731, 355223, 363893, 398412, 416230, 254533, 223551, 300824, 303002, 303154, 475962]
10216D75962j4724k13165l6699p2805j5542M410N8260r2357J15321J56074r1267
10205B73468r9348J9973n9395N7882M4470R210R505k735j47551M1536r5288k7983
10193B3744J25313J02374J66876k03506p8310q4541L7657J9581m8561J81822p5706
10182A66743p8650J75616k216K959q9305J934Q360K69778L2163n4457n9988J23560
10170D96497k21916k4071M0953J13041J4649j85413o5265J6051N5882o2919R4610
10159B72099R9417L3693j05105R4544J19930K3420k48901J00005P83j4128j18986
10148B56771K2013J17737q5600K8198l5790p150K4757r5955M5303J72229j6448
10137D26065r2820J53875r6029j82056l8186j23280J26753M1058q1878J85789
$$ y = [475962, 461238, 248073, 211374, 138569, 123027, 127437, 185697, 93340, 208661, 364735, 273468, 174120, 194093, 134698, 192580, 237050, 246260, 255765, 253030, 105479, 147015, 51727, 23744, 149057, 251431, 418307, 214801, 136491, 51950, 89607, 109188, 60627, 242449, 166743, 88093, 263709, 261493, 264452, 175147, 177081, 185441, 455219, 487382, 432925, 372937, 496497, 274581, 250510, 291463, 404504, 419153, 233740, 168475, 184526, 240408, 177489, 272099, 371516, 405209, 300104, 394648, 514578, 537998, 289097, 389102, 389885, 375757, 256771, 278784, 396521, 310921, 339119, 303329, 296179, 320936, 224981, 270284, 442513, 426065, 333245, 487120, 391091, 209035, 170849, 47569, 174322, 215380, 133502, 319291]
10127C19291J23767k15389o0360J46164J24949J22018l2152j55823J28049J62845
10117F63359L3078J0135k80724N8816K9021L6460K0579n6585L4351P8087m8261
10106E78316R05O7163j10318Q0179K42820k4597P7683q8435q5112K38316j4310
10095I62610k08796q849J54657L3905l5163J0113O9319N6906J73622j31637l3977
10084A042710Q7038q2617m155O2537m1606L3662p8281k9631K6688N8280R8472
10073A173097o6997M0199M9183N2435j10548r5133K3935r6837Q5247N4656J04791
10062A214028m3486l6905L6494K43150J59913M3669j11J04818o4873J32302k7371
10051A761628k3850K7296j465q268p7803q9996j15334N3823K2626m1090k4606
$$ y = [319291, 443058, 227669, 167309, 313473, 438422, 560440, 528288, 372465, 500514, 663359, 696437, 706572, 425848, 484664, 513685, 550145, 570724, 514139, 548490, 626577, 578316, 579221, 646384, 536066, 616245, 859065, 834468, 912151, 823716, 738604, 976920, 962610, 753814, 744965, 899622, 933527, 898364, 908477, 977796, 1034702, 1208324, 1076687, 1042710, 1129748, 1047131, 1042976, 1105513, 1063907, 1097569, 1019288, 989657, 1016345, 1074625, 1173097, 1106100, 1146299, 1195482, 1247917, 1137369, 1042236, 1066171, 969334, 1054581, 1109237, 1214028, 1170542, 1133637, 1170131, 1413281, 1573194, 1616863, 1616752, 1721570, 1656697, 1788999, 1761628, 1737778, 1765074, 1763609, 1755341, 1677538, 1587542, 1472208, 1526031, 1548657, 1507567, 1482961]
10040A482961j16688L8497O1676j59278J0486o5962l2992J4949k0775m3610R8112
10029A267376j58344K80J58345K33894j75359J2552J26302j487J11970j3108J19864
10018A682285P1991R6762m4221o766K00114J31244N6726J83008K2230R4342K63341
10007B751056M10035J07725O3856M67744K77900M00167L55586L17641J88699j22653
9997E217756k37674m3368k51151l09402m72583j86339l57228k31490j62953l39019
9987B626549r7533j02952j98263j32443j14415q0313j54925j45978l410j9531
9977A576786j79984j09837k113j3938N9079k8355o5374L3266l2439j54134J63404
9966A246361Q2838p4867r2890q66n2258l1960L8067J07472Q1022n8879j5736r1106
$$ y = [1482961, 1366273, 1404770, 1466446, 1307168, 1317654, 1251692, 1218700, 1233649, 1212874, 1169264, 1267376, 1109032, 1109312, 1267657, 1501551, 1326192, 1338744, 1465046, 1463559, 1575529, 1562421, 1682285, 1754276, 1851038, 1806817, 1800051, 2000165, 2131409, 2188135, 2371143, 2393373, 2487715, 2751056, 3161091, 3268816, 3332672, 3800416, 4078316, 4478483, 4834069, 5151710, 5340409, 5217756, 4980082, 4936714, 4685563, 4376161, 3903578, 3717239, 3360011, 3128521, 2965568, 2626549, 2529016, 2426064, 2227801, 2095358, 1980943, 1900630, 1745705, 1599727, 1596317, 1576786, 1396802, 1286965, 1284852, 1270914, 1329993, 1301638, 1236264, 1269530, 1237091, 1082957, 1246361, 1329199, 1254332, 1161442, 1160576, 1108318, 1076358, 1114425, 1221897, 1302919, 1244040, 1228304, 1137198]
9954A137198k3559O8546n3342M3121J15808P783J22245R5189r6088m5317L1899
9943A403483j1331j606P1569j58077m6936J02374K9571j07752j12276O1909j5629
9932A215299J3059J7811k47922P236M3324M7892p5764L4838K7417q4690J59989
9921A158489J26614j66771J45402N1939J73638j82253j63661L5792r554k7582
9911A142053O2611p05k06129Q8245K05797P4560j00410k4293K33817L1729j23681
9900A383594P4544j15357j4699J94565k3568n097O3571j30997J30680j00652J8987
9889A475571L1471p3499J33766Q7343m6405Q9230p3150K0659o7606Q8251k7322
9878A638309J08798m2986l9298k4174m0696M2154j01694P8651J41064J59795r6638
$$ y = [1137198, 1113639, 1182185, 1128843, 1171964, 1287772, 1295555, 1417800, 1512989, 1416901, 1371584, 1403483, 1392152, 1390546, 1462115, 1304038, 1257102, 1359476, 1389047, 1281295, 1169019, 1230928, 1215299, 1228358, 1246169, 998247, 1005483, 1048807, 1096699, 1020935, 1055773, 1083190, 998500, 1158489, 1285103, 1118332, 1263734, 1315673, 1489311, 1307058, 1143397, 1179189, 1169635, 1142053, 1204664, 1203959, 997830, 1086075, 1291872, 1366432, 1266022, 1241729, 1475546, 1507275, 1383594, 1458138, 1342781, 1328082, 1522647, 1499079, 1493982, 1557553, 1426556, 1557236, 1456584, 1475571, 1507042, 1433543, 1567309, 1654652, 1608247, 1697477, 1624327, 1644986, 1577380, 1665631, 1638309, 1747107, 1704121, 1664823, 1640649, 1599953, 1642107, 1540413, 1619064, 1760128, 1919923, 1823285]
9867A823285l4353J00353N6398j04606K4906N9539J24811J3852o3619J2782K4939
9856B038287r1867J49907J84241n2915r8489J67400L3904K9730K13374l7428M369
9845B540513L2545J242j14556J44332K9388M5966J06582P7064j37533p8220K08998
9834B856321J20755O1071N2590N1188J28434J16882m4347j20582k6501R7857J84192
9823C477860Q5416j5404M2787j76399R9758R5205P7949Q9762Q2000K29125J13433
9812D201492l8950J90532O2081M2185J53939L0214J62627Q2259P2308J6920J11206
9801E086813R2174L3796J07700Q606K03813p2407K27632L29987O5052K89982J20745
9790F493893J62785K63165L4034J21739K62394R5998K20083J31468K12794J40361
$$ y = [1823285, 1788932, 1889285, 1945683, 1841077, 1865983, 1925522, 2050333, 2064185, 2000566, 2013348, 2038287, 1946420, 2096327, 2280568, 2227653, 2129164, 2296564, 2330468, 2360198, 2573572, 2536144, 2540513, 2573058, 2574300, 2459744, 2604076, 2633464, 2679430, 2786012, 2863076, 2725543, 2647323, 2856321, 2977076, 3038147, 3090737, 3141925, 3270359, 3387241, 3342894, 3222312, 3195811, 3293668, 3477860, 3563276, 3547872, 3590659, 3414260, 3514018, 3609223, 3687172, 3776934, 3858934, 4088059, 4201492, 4162542, 4353074, 4415155, 4457340, 4611279, 4641493, 4804120, 4886379, 4958687, 4975607, 5086813, 5178987, 5212783, 5320483, 5329089, 5532902, 5460495, 5688127, 6018114, 6083166, 6373148, 6493893, 6656678, 6919843, 6953877, 7075616, 7338010, 7434008, 7654091, 7785559, 7998353, 8138714]
9780H138714K60614L59759J56971L00249K91045K46699L99978N20713N51744K65004
9770A1491490K72734N49591M78671O54106P17265P01167Q43469Q75573R76037
9761A7560103R87634R92095J266689J317593J451459J391983J830655K110391
9753B8908602K069542K492096L224099L510418L864848M606435N326048N813781
9745E9815869N819968N810175N505563N277013M859438M186482L334901L014023
9737I7623432K707451K579965K424288L028528L993781M851868O225974P542265
9729A30977552P749095Q230695Q341097P471172N274466K837945J250378N65061
9721A72697461J0020j002855k011015l023697l602988l658589l299165k510624
$$ y = [8138714, 8399328, 8759087, 8916058, 9216307, 9507352, 9754051, 10154029, 10674742, 11226486, 11491490, 11764224, 12313815, 12792486, 13446592, 14163857, 14865024, 15708493, 16584066, 17560103, 18547737, 19539832, 20806521, 22124114, 23575573, 24967556, 26798211, 28908602, 30978144, 33470240, 36694339, 40204757, 44069605, 48676040, 54002088, 59815869, 65635837, 71446012, 76951575, 82228588, 87088026, 91274508, 94609409, 97623432, 100330883, 102910848, 105335136, 108363664, 112357445, 117209313, 123435287, 130977552, 138726647, 146957342, 155298439, 162769611, 168044077, 170882022, 172132400, 172697461, 172707481, 171704626, 169693611, 166669914, 163066926, 159408337, 156109172, 153598548]
9713A53598548r98681R16895K744187L615160M129715M707729N025720M750146
9705A78489419M624871M719216M678576M988968M879699M809680N218178N652784
9697B18061391O072475O157795O791827O760015O527057N706560M860335L830203
9689B64767658J756200j340758m783626q158761j0529044j1631251j2375884j3010553
9681B04693981j3034656j2529835j1763000j0427565q622579p356963n929433
9674A35029950m600006l359149k146736r24641K8628R56778J675966K472692K842066
9665A31975548L060144L020290K548054K130406J215061K84747q91150j865270
9657A41477830l261370m293045n275464n951675o499706o685797o545794o456995
$$ y = [153598548, 152599867, 153516762, 156260949, 159876109, 164005824, 168713553, 173739273, 178489419, 183114290, 187833506, 192512082, 197501050, 202380749, 207190429, 212408607, 218061391, 224133866, 230291661, 237083488, 243843503, 250370560, 256077120, 260937455, 264767658, 266523858, 265183100, 260399474, 252240713, 241711669, 230080418, 217704534, 204693981, 191659325, 179129490, 167366490, 156938925, 148316346, 140959383, 135029950, 130429944, 127070795, 124924059, 123999418, 124028046, 124984824, 126660790, 129133482, 131975548, 135035692, 138055982, 140604036, 142734442, 143949503, 144234250, 143343100, 141477830, 138216460, 133923415, 128647951, 122696276, 116196570, 109510773, 102964979, 96507984]
9649I6507984o282739n923327n132942m670705m166751l377260l102144k843021
9641F1009095k724724k305146k117769j908735j942667j687292j669333j816889
9633D4836540j605809j445396j381467j357697j326418j075578q47672j027264
9625C4769239n65143o42451p01395n15294p04505o86803n07063m63113n59204
9616B9424268l51977k34330j94958j68314k90866k36310N4194k44213m09899l15671
9606B7031924l39440o04048o04393m63133p29731n74210n43676n72191o90820
9597B1910282n38322m18809n59726n35268o56426m71051l38190n00400k37618
9588A7654472k98902o21627n18304k13087k41255n24239k78595m37784l33071
$$ y = [96507984, 90225245, 84301918, 79168976, 74498271, 70331520, 66954260, 63852116, 61009095, 58284371, 55979225, 53861456, 51952721, 50010054, 48322762, 46653429, 44836540, 43230731, 41785335, 40403868, 39046171, 37719753, 36644175, 35796503, 34769239, 34204096, 33561645, 32860250, 32344956, 31640451, 30953648, 30446585, 29983472, 29424268, 29072291, 28837961, 28643003, 28474689, 28183823, 27947513, 28001707, 27757494, 27347595, 27031924, 26692484, 26088436, 25484043, 25020910, 24291179, 23716969, 23173293, 22601102, 21910282, 21371960, 20953151, 20393425, 19858157, 19201731, 18730680, 18392490, 17892090, 17654472, 17355570, 16733943, 16215639, 16002552, 15761297, 15237058, 14958463, 14520679, 14187608]
9579A4187608k93374m46698l67361l22254m09968l90190k64775j77208k81147
9570A1234633k04460j18783j79272k22433j58885j67762L6304P7134k73942L3373
9560A0055907q6838Q3636p8954L6360J62737Q1899j9489j57547k22479j513K31321
9549A0085040L3806l62564k43916j64180m2984k72899k81184k07119k34608j09954
9539H199438k07822j68102k18630l06508j81547R5675j2487k7581j58217j65836
9529F848383q33j30087k11722N8227P6929k4418o1116k9317o2179o124j50383
9518F307360j205J5053j19890Q6880L7223J1349k24092K7155l1144p3595l7330
9507E997764j05785J56565M6867j14329p4350J29708j72723O4118J36465j25496
$$ y = [14187608, 13894234, 13447536, 13080175, 12757921, 12347953, 11957763, 11692988, 11515780, 11234633, 11030173, 10911390, 10732118, 10509685, 10350800, 10183038, 10219342, 10296476, 10022534, 10055907, 9969069, 10052705, 9973751, 10010111, 10172848, 10254747, 10235258, 10077711, 9855232, 9853719, 10085040, 10118846, 9756282, 9512366, 9348186, 9305202, 9032303, 8751119, 8544000, 8309392, 8199438, 7991616, 7823514, 7604884, 7298376, 7116829, 7212504, 7200017, 7172436, 7014219, 6848383, 6847550, 6717463, 6505741, 6563968, 6640897, 6616479, 6555363, 6526046, 6463867, 6457743, 6307360, 6306155, 6321208, 6201318, 6288198, 6325421, 6336770, 6112678, 6139833, 6108689, 6035094, 5997764, 5891979, 6048544, 6095411, 5981082, 5906732, 6036440, 5863717, 5927835, 6064300, 5938804]
9497E938804m0042m0307M7573L1783J27908J15201J78942j1545o3158j7351Q3624
9486F351432p6947O73P1313J31678R1926j20005J22978p0726m3435O3712k7199
9475F495400j65236m5366N3460j51352k32894j31785j08216n5029J6439J65139
9465E840560j80348k2819L940k533j50315L5779J225J2423j98158p195j3735j7575
9453E301249K74132j67932K4590M5200j17267m3358J1103N2544j5373j49351L7458
9442E252995j11638j9275p5128o5728j55188j00200m1551J18720J7034q5391k31908
9431D502742j57347M3403J44758J8175k68697Q1844K5285j13298J44888K513o0874
9420D363392K94333o2300M1038L1564M6943J34382r6911j99204K3626j75304m99
$$ y = [5938804, 5898762, 5858455, 5906028, 5937811, 6065719, 6180920, 6359862, 6348317, 6285159, 6267808, 6351432, 6274485, 6275158, 6346471, 6478149, 6570075, 6450070, 6573048, 6502322, 6458887, 6522599, 6495400, 6330164, 6284798, 6338258, 6186906, 5954012, 5822227, 5714011, 5658982, 5675421, 5840560, 5660212, 5637393, 5641333, 5638800, 5488485, 5524264, 5525489, 5537912, 5339754, 5332559, 5318824, 5301249, 5575381, 5407449, 5432039, 5477239, 5359972, 5316614, 5327717, 5380261, 5364888, 5215537, 5252995, 5141357, 5122082, 5046954, 4981226, 4826038, 4725838, 4684287, 4803007, 4820041, 4734650, 4502742, 4345395, 4388798, 4533556, 4551731, 4283034, 4364878, 4390163, 4276865, 4421753, 4424266, 4363392, 4657725, 4595425, 4636463, 4668027, 4714970, 4849352, 4752441, 4553237, 4576863, 4401559, 4401060]
9409D401060J23287j8371J60602m1183j35901K9315J26404O2985L4981J63775
9399D906954O974J2634K89239q4109j09393N3693m5104j20986n0490o6926l9Q7163
9387D879610J51937j07381l7393R4691O8222n568m2465j14821o5857P6150O6369
9376D963494L0023m2737p2647N2865L534n9629j65077M7862R7129K0051J05974
9365D980842J19479Q0017n5880J13033J22629L6573L4732j73356j03467j756O4307
9354E217153j8937J01443J077K4249J35456P8143R3482m9005O8565M6332J04555
9343E802513J52027r6782j52543K2612R3348L16019P3293j37068P8513K20739
9333F372671O051n2832K22853L9425K6417Q8405P2654q4504q0225J2349l8848
$$ y = [4401060, 4524347, 4505976, 4666578, 4625395, 4489494, 4518809, 4645213, 4708198, 4743179, 4906954, 4913928, 4926562, 5215801, 5131692, 5022299, 5075992, 5030888, 4909902, 4859412, 4792486, 4792447, 4879610, 5031547, 4924166, 4886773, 4981464, 5049686, 5044118, 5001653, 4886832, 4820975, 4897125, 4963494, 4993517, 4950780, 4878133, 4930998, 4934532, 4874903, 4709826, 4757688, 4854817, 4874868, 4980842, 5100321, 5180338, 5124458, 5237491, 5360120, 5396693, 5431425, 5258069, 5154602, 5152846, 5217153, 5198216, 5299659, 5300736, 5324985, 5460441, 5538584, 5632066, 5583061, 5651626, 5697958, 5802513, 5954540, 5857758, 5705215, 5727827, 5821175, 6137194, 6210487, 6073419, 6151932, 6372671, 6378722, 6325890, 6548743, 6588168, 6614585, 6702990, 6775644, 6691140, 6610915, 6623264, 6584416]
9322F584416j6739j00870j50202R8288l2122k40932K5527r0363n7932J34750j7938
9311F135883N8911j1673n2613j0043J51923k9633M0656j668k43700R4107Q3475
9300F215625l639n0615J3449J35432K19380L7547K6920R0377q1541l1827J97858
9289F768966l3950q0280q4807j07970k25060L3119J09165m5232j42796j17055
9279F074100K0409J21998M9166n0148M7913j0085Q08J04929o2042j56904J21743
9268F261887K8523k36592M8632J62927l432J38819m2102j59052P0342J60771o9364
9257F361359O320j043q5018R8341L8163J21448Q8636P9425l8409J39548J38737
9246F947507j15664k8100K06571o334L0780j53145m03K54687Q9586j0245N1922
$$ y = [6584416, 6567677, 6466807, 6316605, 6414893, 6382771, 6141839, 6167366, 6077003, 6019071, 6153821, 6135883, 6194794, 6183121, 6130508, 6120465, 6272388, 6242755, 6283411, 6281743, 6038043, 6132150, 6215625, 6211986, 6161371, 6174820, 6310252, 6529632, 6567179, 6594099, 6684476, 6602935, 6571108, 6768966, 6735016, 6654736, 6569929, 6461959, 6236899, 6270018, 6379183, 6333951, 6191155, 6074100, 6094509, 6216507, 6265673, 6215525, 6263438, 6253353, 6254161, 6359090, 6297048, 6140144, 6261887, 6290410, 6053818, 6102450, 6265377, 6261945, 6400764, 6358662, 6199610, 6269952, 6430723, 6361359, 6367679, 6366636, 6281618, 6379959, 6418122, 6539570, 6628206, 6707631, 6669222, 6808770, 6947507, 6831843, 6803743, 7010314, 7003980, 7034760, 6881615, 6881212, 7135899, 7225485, 7215240, 7267162]
9235G267162J62381K27876J43034J8822q9873J11334Q6083J78466Q4594J15827
9225H305706K93575K73481J86966N3917J68104J06116K11967K05213K46259L49228
9215A0400532K69974L63023L59883K48896M12130M93686P61841N18102N84052
9206A4412119J054196J083580R19852J169792J197939J305292J142496Q26410
9198B3111676M76938L73020M23707J66627n9595m99531o04232o26865m36328l05126
9188B2020291j00717q1996J03880J86485P5111L72813L23684O45128R62947J177995
9178B5685621J177874J461175J497044J786449K024043K257688K330746K551280
9170D0771920K419441K263962K531591K576626K929742L568103L171347K221167
$$ y = [7267162, 7429543, 7657419, 7800453, 7819275, 7729402, 7840736, 7926819, 8105285, 8189879, 8305706, 8599281, 8872762, 9059728, 9113645, 9281749, 9387865, 9599832, 9805045, 10051304, 10400532, 10670506, 11033529, 11393412, 11642308, 12054438, 12548124, 13309965, 13828067, 14412119, 15466315, 16549895, 17469747, 18639539, 19837478, 21142770, 22285266, 23111676, 23588614, 23961634, 24385341, 24551968, 24492373, 23992842, 23388610, 22761745, 22325417, 22020291, 21919574, 21837578, 21941458, 22127943, 22203054, 22575867, 22899551, 23544679, 24507626, 25685621, 26863495, 28324670, 29821714, 31608163, 33632206, 35889894, 38220640, 40771920, 43191361, 45455323, 47986914, 50563540, 53493282, 57061385, 60232732, 62453899]
9162F2453899J450176Q39169M71027Q9015N9308n10144j507809k180309k562827
9153E8601505k279817j635057j186047p72287k94020L0333O13760J002021J247390
9144E5327781J697362K047814K604775L126257L639770M987635N790971O578182
9136H5800547P522785Q452076Q941283Q239984O707558N079486L743592L337208
9128A37824519L352493K401095J106291J67924p7797Q88691K032630K847042L224356
9119A53767244L051367K685712K154920J750231J317656Q70354k0133q34266k156177
9110A62586908l202764l722870m169818m264802l401034j793309Q2930J673087
9102A43788328L425448M397485M811931M904539M240093L604235K422290J036396
$$ y = [62453899, 63904075, 64743244, 65214271, 65303286, 65362594, 64852450, 63344641, 61164332, 58601505, 56321688, 54686631, 53500584, 52728297, 52434277, 52464610, 53078370, 54080391, 55327781, 57025143, 59072957, 61677732, 64803989, 68443759, 73431394, 79222365, 85800547, 93323332, 101775408, 110716691, 118956675, 125664233, 130743719, 134487311, 137824519, 141177012, 143578107, 144684398, 144852322, 144774525, 145663216, 147695846, 150542888, 153767244, 156818611, 159504323, 161659243, 163409474, 164727130, 165597484, 165577351, 164743085, 162586908, 159384144, 155661274, 151491456, 147226654, 143825620, 142032311, 142115241, 143788328, 147213776, 151611261, 156423192, 161327731, 165567824, 169172059, 171594349, 172630745]
9094A72630745J48983j26611O2537Q41663J474888J232046L82706o07647j207792
9085A74831518j652728j558541k062645k006488k291706k897208l297594l636173
9077A55428435m068940l685502k958390k573412j633944p22788L28650J510327
9069A41624436K917786M116104N501178O658633P549914P621315O833666N453700
9061A88276732L818491L149418K479357J526008k30304k102212l643111m992000
9053A88282379n777055n913368n985414o200601o276719o256156o232582n811720
9045A39828764n760882n250784m981781m670551m269404l678910k738274j858744
9037A06619434j179896l69997K19851P47678J531891K270765K624316K622703
$$ y = [172630745, 172779728, 172653117, 172715654, 173557317, 175032205, 176264251, 176646957, 176039310, 174831518, 173178790, 171620249, 169557604, 167551116, 165259410, 162362202, 159064608, 155428435, 151359495, 147673993, 144715603, 142142191, 140508247, 139785459, 140114109, 141624436, 144542222, 148658326, 154159504, 160818137, 168368051, 175989366, 182823032, 188276732, 192095223, 195244641, 197723998, 199250006, 199019702, 196917490, 193274379, 188282379, 182505324, 176591956, 170606542, 164405941, 158129222, 151873066, 145640484, 139828764, 134067882, 128817098, 123835317, 119164766, 114895362, 111216452, 108478178, 106619434, 105439538, 105069541, 105289392, 106037070, 107568961, 109839726, 112464042, 115086745]
9029A15086745K890167K893766K857385K429992J816225O33790P5492m41800j277364
9020A26964398k028908k817935l167856l297504l551871l498007l337912k446551
9012A02817854j551639j043069j04877P37336J085873K010879K426324J983371
9004A08362052J554740J969452K337014K297772K579934K982203K713465K483640
8996A27280272K716775K710296J825356J443225J958725K041748K208038K757640
8988A44942075K946505L184786L925804M943223N826192P156147Q496518R225454
8980A90646704R775459R850363R785460R438829Q045855N952348L595276K050228
8972B49140522K645062L768388M570233N609387O771096Q082313Q894987Q800631
$$ y = [115086745, 117976912, 120870678, 123728063, 126158055, 127974280, 128608070, 128683562, 128241762, 126964398, 124935490, 122117555, 118949699, 115652195, 112100324, 108602317, 105264405, 102817854, 101266215, 100223146, 100118269, 100855605, 101941478, 103952357, 106378681, 108362052, 109916792, 111886244, 114223258, 116521030, 119100964, 122083167, 124796632, 127280272, 129997047, 132707343, 134532699, 135975924, 137934649, 139976397, 142184435, 144942075, 147888580, 151073366, 154999170, 159942393, 165768585, 172924732, 181421250, 190646704, 200422163, 210272526, 220057986, 229496815, 237542670, 243495018, 247090294, 249140522, 251785584, 255553972, 260124205, 265733592, 272504688, 280587001, 289481988, 298282619]
8964B98282619Q128196N930767L371951K063508K013696Q07813j648333m486400
8956C14463817o690251o825587n752891m503851l482689j648098O19556K421240
8948B88601246L541486M257458M375463L942869K548486J139855l01412j596228
8940C06509223l312614m361314m329217l759145l206575j844320M74590L173889
8932B89344517N799167R629765J3679550J7849256K0077071K0120650K1454302
8925C97954278K2230139J3177721L142886j0581758k5780015k5491236k1293506
8918C53358509j8734959j7172170j5074331j2968585j0994945r808863q914032
8911B59690624q767969q659055q018975p789500p715259p158029o864014o179846
$$ y = [298282619, 306410815, 312341582, 315713533, 317777041, 319790737, 320598550, 318950217, 314463817, 307773566, 300947979, 295195088, 290691237, 287208548, 285560450, 286180006, 288601246, 292142732, 296400190, 300775653, 304718522, 307267008, 308406863, 308105451, 306509223, 303196609, 298835295, 294506078, 290746933, 287540358, 285696038, 286170628, 289344517, 295143684, 304773449, 318452999, 336302255, 356379326, 376499976, 397954278, 420184417, 433362138, 436505024, 425923266, 400143251, 374652015, 353358509, 334623550, 317451380, 302377049, 289408464, 278413519, 268604656, 259690624, 250922655, 242263600, 234244625, 226455125, 218739866, 211581837, 204717823, 198537977]
8903A98537977n105702l757660k488415j089144l41253N48740O68878O34065K17276
8894A87824762o41920j412179k116291k359193k991070l622092l365827k825456
8886A68490734k823016k544132k016733j479671j386544j732179k010247k578778
8878A51919434k928925l605370m233401m513761m897785m817270m667090m517325
8870A17738507l782661l235977k606494j641278j282787m09364L2713M15940N71401
8861A05800000M41371J48688k08182o00922j184507j826981k180086k393242k302222
8852I5693917k289826j803914j389016q23659m18317p8361L39664K63597p7263
8843H9416822n30478r65972j535326k092182k790280l189491l367135l349297
$$ y = [198537977, 193432275, 189674615, 187186200, 186097056, 185755803, 186304543, 186973421, 187607486, 187824762, 187182842, 185770663, 183654372, 181295179, 178304109, 174682017, 171316190, 168490734, 165667718, 163123586, 161106853, 159627182, 158240638, 156508459, 154498212, 151919434, 148990509, 145385139, 141151738, 136637977, 131740192, 126922922, 122255832, 117738507, 113955846, 110719869, 108113375, 106472097, 105189310, 104779946, 104812659, 105228599, 105800000, 106241371, 106390059, 106181877, 105580955, 104396448, 102569467, 100389381, 97996139, 95693917, 93404091, 91600177, 90211161, 89387502, 88969185, 88890824, 89230488, 89494085, 89416822, 88886344, 87920372, 86385046, 84292864, 81502584, 78313093, 74945958, 71596661]
8835G1596661l395650l502226l167061k891438k689741k395108k230796k112365
8827D9212276j919801j739031j484527j295227j368663j304779j294389j071213
8819C7734646r63324j276817j020899p97025j158996j014053p14713p76883o33033
8810B9378903o11528p09233o63017l93186n90331o90926n88697m46290k72934
8801B4412761n16324l43980j33881k09730k51508j74320k24623l7956k10980j68255
8791B2141204j97038k03351l50k19562k43087l1629r0141j76156k49799j36813
8781B0593278q0620j66592j10899p530J52994N7367l6015J28561M12641L06159
8771B1249344L27745K23912J47000O11508N96547M97382P97364R81925J103130
$$ y = [71596661, 68201011, 64698785, 61531724, 58640286, 55950545, 53555437, 51324641, 49212276, 47292475, 45553444, 44068917, 42773690, 41405027, 40100248, 38805859, 37734646, 36771322, 35494505, 34473606, 33676581, 32517585, 31503532, 30788819, 30011936, 29378903, 28767375, 28058142, 27395125, 27001939, 26411608, 25720682, 25131985, 24685695, 24412761, 23896437, 23552457, 23418576, 23208846, 22957338, 22783018, 22558395, 22520439, 22309459, 22141204, 21944166, 21740815, 21740465, 21520903, 21277816, 21246187, 21156046, 20979890, 20730091, 20593278, 20512658, 20346066, 20235167, 20227637, 20380631, 20437998, 20401983, 20530544, 20943185, 21249344, 21577089, 21801001, 21948001, 22559509, 23156056, 23653438, 24450802, 25432727, 26535857]
8762B6535857J144716J278863J320598J608626J972567K101208K487927K885654
8754D1336016L211694L530824L820006M055888L675221L515141K846500K124769
8746F8116059J345850K08873n52084j544305k488985k952641l570517l656595
8738E4905655l517599l056234k781236k245466j936050j841272j640816j419897
8730C6467085r46899q23651n79055l56908r0897N8346K25404L96114O57766J266383
8720C6273688J330018J518774J886582K158649K612471K536840K589471K287895
8712E3194388J736940J427267Q35723J74438o46344j579315k080666k439598k818548
8703D7804285l093163k990884k973298k734204k239886k005277j951658j795395
$$ y = [26535857, 27680573, 28959436, 30280034, 31888660, 33861227, 35962435, 38450362, 41336016, 44547710, 48078534, 51898540, 55954428, 59629649, 63144790, 65991290, 68116059, 69461909, 69670782, 69118698, 67574393, 65085408, 62132767, 58562250, 54905655, 51388056, 48331822, 45550586, 43305120, 41369070, 39527798, 37886982, 36467085, 35520186, 34696535, 34117480, 33760572, 33669675, 33728021, 33953425, 34349539, 35007305, 36273688, 37603706, 39122480, 41009062, 43167711, 45780182, 48317022, 50906493, 53194388, 54931328, 56358595, 57194318, 57368756, 56722412, 55143097, 53062431, 50622833, 47804285, 44711122, 41720238, 38746940, 36012736, 33772850, 31767573, 29815915, 28020520]
8695B8020520j591194j178682j271300j125016j068145p03566o19767q33135p45911
8686A8883804p49472n89741l70552m92940n13952k80019l59777m74255k67940
8677A4785156m66902m30902k23115m45108l14991k59999k68568l69037k61460
8668A1745074m95133k72877k52627j23027k71211j51965j8361l64973j62218j52410
8658I480272k01093k11765J48457Q6049j03686p7872q2887j56586P2438q993k12159
8647H732175J6951n057l8400j25862n3645p6771k60939j79220j22809j07842j26584
8636G651997k00962j33866p2236q6596k27305j52235N2723k27478l1395k7206
8626F545441k8452j76423j61868J38497M300J34604M9892j70029j03109j14340
$$ y = [28020520, 26429326, 25250644, 23979344, 22854328, 21786183, 21082617, 20462850, 19629715, 18883804, 18134332, 17544591, 17174039, 16681099, 16167147, 15887128, 15527351, 15053096, 14785156, 14318254, 13887352, 13664237, 13219129, 12904138, 12644139, 12375571, 12006534, 11745074, 11249941, 10977064, 10724437, 10601410, 10330199, 10178234, 10159873, 9794900, 9632682, 9480272, 9279179, 9067414, 9215871, 9301920, 9198234, 9120362, 9037475, 8880889, 8953327, 8944334, 8732175, 8749126, 8744069, 8705669, 8579807, 8526162, 8449391, 8188452, 8009232, 7886423, 7778581, 7651997, 7451035, 7317169, 7244933, 7158337, 6931032, 6778797, 6831520, 6604042, 6572647, 6545441, 6516989, 6340566, 6178698, 6317195, 6321495, 6456099, 6505991, 6335962, 6232853, 6118513]
8616F118513J05414J8193m3721n3328p3759M1663m6300R0873l2790j27109m3153
8605E954496L1082J74331m1664j7177m7879k08808r3727q106o1918k68502j32864
8594E279264p2127J63902j63548j8282O7893j94923o9735m898o1271R2002k05212
8583D813065k02770K42738p4814P0926j77498N018J59485j30582j99624r0071
8573D415873Q273m5416L1825m412q2759Q4462J32850j20347j70713N1554P5470
8562D376660J1244j44052j78305j26719j32251j17193J4482K27898j91014l3767
8552C706983J02911j74911j98781J79881L3665q8362m2297j34494m7356j41903
8542C195336J14826O0939n192N568p6865L4354N4814J32804q8064j39685J50554
$$ y = [6118513, 6223927, 6242120, 6198399, 6145071, 6071312, 6112975, 6066675, 6157548, 6124758, 5997649, 5954496, 5985578, 6159909, 6118245, 6101068, 6053189, 5844381, 5750654, 5742548, 5680630, 5412128, 5279264, 5207137, 5371039, 5207491, 5189209, 5257102, 5062179, 4992444, 4987546, 4926275, 5018277, 4813065, 4610295, 4853033, 4778219, 4849145, 4671647, 4676665, 4836150, 4705568, 4505944, 4415873, 4424146, 4378730, 4410555, 4406143, 4323384, 4407846, 4540696, 4420349, 4249636, 4301190, 4376660, 4387904, 4243852, 4065547, 3938828, 3806577, 3689384, 3703866, 3931764, 3740750, 3706983, 3809894, 3634983, 3436202, 3616083, 3649748, 3561386, 3519089, 3384595, 3337239, 3195336, 3310162, 3371101, 3365909, 3371477, 3294612, 3328966, 3383780, 3516584, 3428520, 3288835, 3439389]
8531C439389O6050J34424p41L0060J49042Q630J00735j19761K19128R4074l4294
8520D086736m3460j82835r8331q1864n8685j0016k14951j64499M7089j51197l5632
8509C092355L5493k1672N4722J4885j15883k35761m9446J34961j6574M7536j32833
8498B807783K7607n3072l3168J84801K23679k0779m1723k71580M3548J01362j69753
8487B798705J73365k8843N936j3224m8631j1796j5374k3436L0001r9936k49661
8476B517106l5184k02033o1019L8360k4060r7533P1214m5750k97484j36885K2375
8465A749107J07051L2941R0297j62863l1484R2610J9107J04288R9520R1677K10640
8454B402891K479J76502J82427M60627K84182J47570L51062L19399L23370j8769
$$ y = [3439389, 3505439, 3639863, 3639122, 3669182, 3818224, 3826854, 3927589, 3807828, 4026956, 4121030, 4086736, 4043276, 3860441, 3762110, 3680246, 3621561, 3611545, 3396594, 3232095, 3279184, 3127987, 3092355, 3127848, 3106176, 3160898, 3175783, 3059900, 2824139, 2774693, 2909654, 2893080, 2940616, 2807783, 2835390, 2782318, 2749150, 2933951, 3157630, 3136851, 3095128, 2823548, 2867096, 2968458, 2798705, 2972070, 2943227, 2949163, 2935939, 2887308, 2875512, 2860138, 2836702, 2866703, 2766767, 2517106, 2481922, 2279889, 2218870, 2257230, 2233170, 2135637, 2206851, 2161101, 1863617, 1726732, 1749107, 1856158, 1889099, 1979396, 1816533, 1785049, 1877659, 1896766, 2001054, 2100574, 2192251, 2402891, 2405370, 2581872, 2764299, 3224926, 3509108, 3656678, 4007740, 4327139, 4650509, 4631740]
8444D631740k44968j0074j52462l6940k6299j5875q7059J100K15742j4877N8606
8433D318634m5170j33488k04191n0264j93671k60640j88293l08483j78101m5476
8423B710857q1473k22395j48145k30527l6473p6465r4634j82536Q4202J850j02697
8412A621564j08210k30412O2075N5980L2701j49643n6939j20550R8473j80053
8402A024986k809P4094p7765j30883Q499J3285j2630K4976R9994j75394j32745
8391G13608O5541J10675l8344j349K9296R2565k0522N6986j60419l0155O9840
8380H87722N8930r8758k1306m6248j06550K9554j37236J76064L3318J06499K3220
8369I05209Q0854n7958j43662n7693o2974K1753j47095J7407K01348m681J72654
$$ y = [4631740, 4386772, 4376698, 4224236, 4187296, 4160997, 4145122, 4058063, 4059163, 4274905, 4260028, 4318634, 4273464, 4139976, 3935785, 3885521, 3691850, 3431210, 3242917, 2934434, 2756333, 2710857, 2629384, 2406989, 2258844, 2028317, 1991844, 1915379, 1820745, 1638209, 1722411, 1724261, 1621564, 1513354, 1282942, 1345017, 1400997, 1433698, 1284055, 1227116, 1106566, 1205039, 1024986, 1022177, 1096271, 1018506, 887623, 896122, 909407, 896777, 921753, 1021747, 846353, 713608, 779149, 889824, 851480, 850131, 879427, 971992, 951470, 1008456, 848037, 817882, 887722, 946652, 847894, 826588, 780340, 673790, 703344, 566108, 742172, 775490, 881989, 905209, 986063, 928105, 784443, 726750, 663776, 685529, 538434, 555841, 757189, 752508, 925162]
8358I25162j96925o2000J51828R1836j62090r3651l3970R6145J32916j42689J33833
8347H40395J11237P81j66935J04039M9244j42109j04255J03842j14878o2455K25842
8336H44748j36221j73215q0036J70222P3271j95591o1845O9531J76656j36951
8326E50569j35986K01585r374q0014J13284m5667j63982l8380J80570O6677j84240
8315D55042P0172L8973m2934L0313l5237j17231J56224k311L5234k02404m4890
8304C40951J60775k559R0608l7120O3211j2601J76809P5014j45140M38j46202
8293E64184P0668p82k6865N5492L0258J12001K19950j05918K5856L8190m1374
8282I41660j916k23324j4244q8583N6649N9191j25088j4382L5605O1216j21511
$$ y = [925162, 728237, 666237, 818065, 909901, 747811, 654160, 620190, 716335, 849251, 706562, 840395, 951632, 952413, 785478, 889517, 938761, 796652, 692397, 796239, 681361, 618906, 844748, 708527, 535312, 455276, 625498, 698769, 503178, 441333, 510864, 687520, 550569, 414583, 616168, 606794, 526780, 640064, 594397, 430415, 392035, 572605, 639282, 455042, 525214, 564187, 521253, 551566, 516329, 399098, 555322, 553011, 588245, 385841, 340951, 501726, 499167, 589775, 552655, 615866, 603265, 780074, 855088, 709948, 710386, 564184, 634852, 634070, 607205, 662697, 692955, 804956, 1024906, 918988, 944844, 983034, 941660, 939744, 716420, 702176, 613593, 670242, 729433, 604345, 589963, 625568, 686784, 565273]
8271E65273K2643k2151o3993j46623j91131K4688L8841J04766q7942Q5840p1873
8260B58338j68936J44489K3706p963o6920J13883L1420p1113j18649O068j22682
8249B1641O050J09487J16231J55749k17156j14845j05355J85879R7881q0257r9704
8238G5601p6158q775M2393L3358K8306m167J39542J78553L28j11598p931k9938
8226B59514J83117n7471j10239J25300N2771k58272R3400o480n2987J10138J6072
8215C54863j08647j62805P2722m5042J39201k27730P1291K03874j69876j02219
8205B5632m6455o4254m8962O2110Q6300J70419J3325J9296m3395l2489j04907
8194C6620O7102j58138p38894N21531L99854J03070M2777r9907k2480j79709Q8339
$$ y = [565273, 587916, 565765, 501772, 355149, 164018, 188706, 227547, 332313, 244371, 330211, 258338, 89402, 233891, 257597, 249634, 182714, 296597, 328017, 256904, 138255, 144323, 21641, 27691, 137178, 253409, 409158, 192002, 77157, -28198, 157681, 255562, 175305, 75601, -557, -9332, 33061, 66419, 94725, 90558, 230100, 408653, 408981, 297383, 289452, 259514, 442631, 385160, 274921, 400221, 452992, 194720, 288120, 281640, 228653, 338791, 354863, 246216, 83411, 156133, 111091, 250292, 22562, 93853, 297727, 127851, 25632, -20823, -85077, -134039, -71929, 14371, 184790, 198115, 217411, 174016, 141527, 36620, 103722, -54416, -793310, -271779, 128075, 231145, 273922, 174015, 151535, -28174, 60165]
8183F0165N7062j18212j01327J96409j1990j46063O0979P9439l536K27757l8315
8172B62368p7469k8898l346q7457q513n1554K4771J9284j84631J0353N3148P2740
8160G96j9097R9206o5099J9063l635n0071M8826n2918r3424L5202O0305j05699
8148a26545j9347j2141n9534O3242J21682N1880j48268J3265J00926r90L4839
8137A9009k9149K8279r0650R470L573L0469P2418J62137o6451q0888N0719J20379
8125B29315j16181j2397J95674K0098n4922P6840K7883j23963M5416J38548J58812
8114E85123M9388n344J29187K84695P8102Q9642J99108p2158k28011o0910J5967
8103A064789j2588J09718m9176M0335J30301M7010K5538L3850R9915j51243k81959
$$ y = [60165, 117227, -985, -102312, 94097, 82107, -63956, -2977, 76462, 72926, 300683, 262368, 184899, 156001, 152655, 65198, 56685, 5131, 29902, 49186, -135445, -125092, -71944, 796, -18301, 80905, 15806, 34869, 31234, -18837, 29989, -22929, -116353, -81151, -20846, -126545, -145892, -158033, -217567, -154325, -32643, 19237, -129031, -115766, -14840, -15830, 19009, -10140, 18139, -72511, -63041, -59468, -28999, 43419, 205556, 139105, 58217, 108936, 229315, 113134, 100737, 296411, 316509, 261587, 338427, 366310, 242347, 287763, 426311, 585123, 634511, 629167, 758354, 1043049, 1121151, 1210793, 1409901, 1337743, 1109732, 1048822, 1064789, 1052201, 1161919, 1112743, 1153078, 1283379, 1330389, 1355927, 1389777, 1489692, 1338449, 1056490]
8092A056490j00255k9342j01847l2337q3151k519j44555J16700N8063k3882j55951
8081E57414m109J79321J6235j60621J13039j8373l7317K13709N6099J39293O4625
8070A119315m5801M1291J15559O8456J01867n3630o0672j20897M3602q3471l4959
8059A090660J24484j5999J52710j37218Q9281L4791m9032j24126j50995j23664
8049H90892n4858j31718j26129K23231j62564k50273m1691J64155j43561o7940
8039B99544k32891J878K04659o2785k8098j22599p7797J1540Q3290L3555L2258
8028A42554r3546k42253K885J70791l5775j4888j22435L4830K10431R9854j98903
8017d6455m7075J63391n3967O5153m5483k07284Q5848j6850M6930o5763j00897
$$ y = [1056490, 956235, 926893, 825046, 792709, 709558, 707039, 562484, 679184, 737247, 713365, 557414, 553305, 732626, 748861, 588240, 701279, 682906, 645589, 859298, 915397, 1054690, 1119315, 1073514, 1114805, 1230364, 1298820, 1400687, 1347057, 1286385, 1165488, 1209090, 1125619, 1090660, 1215144, 1199145, 1351855, 1214637, 1303918, 1338709, 1289677, 1165551, 1014556, 890892, 836034, 704316, 578187, 801418, 638854, 388581, 346890, 511045, 367484, 299544, 66653, 68531, 273190, 210405, 182307, 59708, -18089, -6549, 76741, 110296, 142554, 49008, -193245, -190360, -19569, -55344, -70232, -192667, -157837, 52594, 152448, -46455, -93530, 69861, 15894, 81047, 35564, -171720, -85872, -102722, -55792, -121555, -222452]
8006b22452J00283L4943r0951k3870j61176o3809J64853k7894K128j35310j17348
7995e40603J67658L14107l8638j29316P0313J0773m0128o696l0614l6492j77098
7984d36734K71J92543R2497j01968j54474j77157J9951N0661n3669K91065R127
7973b67887o2151L2117j10147n6365L8582m4849j8178J27362J467p3427p4991
7962e08467K4960O9573J99740N5261n3531p8750j73674n7798R2640q4969j23049
7951f38064J98689o8031j07029J92158L250J45414L2724j85775J3586O6833p5743
7940d21988o4056J5258J07566R6121p946K3119M5600l5749L906o3507P4335J20531
7928a06810n8488n5440J9311p6465q135k6475J29244K3803n6559J2595J4090j2704
$$ y = [-222452, -122169, -87226, -178177, -202047, -363223, -427032, -262179, -290073, -287945, -423255, -540603, -372945, -58838, -97476, -226792, -156479, -145706, -185834, -192530, -223144, -259636, -436734, -436463, -243920, -151423, -253391, -407865, -585022, -565071, -514410, -568079, -277014, -267887, -330038, -297921, -408068, -464433, -425851, -470700, -488878, -361516, -360049, -433476, -508467, -483507, -413934, -214194, -158933, -212464, -291214, -464888, -522686, -430046, -515015, -638064, -439375, -507406, -614435, -422277, -419027, -273613, -240889, -426664, -413078, -346245, -421988, -486044, -470786, -363220, -267099, -275045, -251926, -206326, -242075, -238169, -301676, -227341, -106810, -165298, -220738, -201427, -277892, -286027, -312502, -183258, -159455, -216014, -203419, -189329, -202033]
7916b02033J7742l6241p0797J5088r3537j62593J18045R9855L7409p8046j65924
7905e21032o72O7495J25933j1241m1415K2828K8073Q223p112M5974k8250n5226
7893c66422o430j81091J05914M3512j32540k8Q6221m5211J6370J68908p6147j54549
7881e41493K9999P4304j5204J60466o9114j17674j65562J75838K09508J21461
7871a37471k15182j69104Q3796j126J31232k19169o5020J16763K21120j98234
7861d52395k2254K19492r5012j07455O2824o09Q2222k04493J14433O8348j93335
7850e28234o6131m7009J69730L5857p5726R9702m1220n3955k5188J74078j15909
7839d74005P0681j01234j19339j05412Q8148J24470j4303K9589j7382m7277o8468
$$ y = [-202033, -184291, -220532, -291329, -276241, -369778, -532371, -414326, -314471, -277062, -355108, -521032, -521704, -454209, -328276, -339517, -380932, -358104, -330031, -321808, -328920, -282946, -311196, -366422, -372852, -553943, -448029, -404517, -537057, -537085, -450864, -496075, -479705, -310797, -386944, -541493, -511494, -437190, -452394, -291928, -361042, -478716, -644278, -468440, -258932, -137471, -352653, -521757, -437961, -439087, -307855, -527024, -592044, -475281, -254161, -452395, -474649, -255157, -350169, -457624, -394800, -395409, -313187, -517680, -403247, -334899, -528234, -594365, -641374, -471644, -435787, -511513, -411811, -453031, -506986, -532174, -358096, -474005, -403324, -504558, -623897, -729309, -641161, -516691, -530994, -501405, -518787, -566064, -634532]
7828f34532J06113J40285J75557j21326n2813M9990K386n1505r0791n6461J15704
7817d17393J63947j23371j10534l6841r2400J55912L0850L6520P1670R3535j10428
7806c38533p8628j40945j8496K09342J16652r5766K6575J7263n0143m8722j05900
7795e07301M5455O9374M5875M7909r0284p3745J03834l3026K13948j06146L1513
7784b52594L97j01678n1830k65974R4725M3726O9940J3764P3331P5690O2312J02564
7772a35627R8360J80363M8883q2645K4591J18744p8852q744j518j65044P994K6922
7760C3427R720j57951J50170m9959j60238n0429j39122J39228J00024p6777P7080
7749a24827n4902j00607k56607Q1913J02690r0764N8159j0980P3798O2298P1677
$$ y = [-634532, -528419, -388134, -212577, -333903, -386716, -336726, -334340, -385845, -476636, -533097, -417393, -253446, -376817, -487351, -524192, -616592, -460680, -429830, -393310, -321640, -228105, -338533, -417161, -558106, -576602, -367260, -250608, -346374, -319799, -302536, -352679, -401401, -507301, -461846, -392472, -346597, -298688, -388972, -462717, -358883, -391909, -177961, -284107, -252594, -252197, -353875, -405705, -671679, -576954, -533228, -463288, -449524, -376193, -300503, -238191, -135627, -37267, 143096, 191979, 109334, 133925, 252669, 173817, 165073, 163555, -1489, 6505, 33427, 43147, -114804, 35366, -14593, -174831, -225260, -364382, -225154, -125130, -201907, -124827, -179729, -280336, -536943, -455030, -352340, -443104, -384945, -395925, -322127, -259829, -188152]
7738a88152j67625j26855J48171Q3421M4305m9570j0515j39516M4187Q6278n0640
7727c26511J37022J00451j47344j18094o9211L5586L2040K1440m6098j41941J17450
7716d05210N6446R6955k7294j23226P4319m0147j17998L2437j7362P0745J28302
7705b72033P2137n9466m4979L3958p1243R870r570n1200j9934Q0933P223P7465
7693b46839R6104j18051j69057m5019J20438M5199P8629n0641j13569m956r4210
7682e01972l081Q5786n7113j01578R2382j2505j44431O6313m3364O5631o0608
7671f14540j1403J61577j2420r4304o744j49560J37838N7518J41119j04607O8506
7660d27020q2323k24837O1048Q98O846N1580p233o5106J1306P7876K9045j01312
$$ y = [-188152, -355777, -482632, -334461, -251040, -206735, -256305, -266820, -406336, -362149, -275871, -326511, -189489, -89038, -236382, -354476, -423687, -388101, -356061, -334621, -380719, -522660, -405210, -348764, -251809, -279103, -402329, -328010, -368157, -486155, -453718, -471080, -400335, -272033, -199896, -259362, -304341, -270383, -341626, -331756, -341326, -392526, -412460, -331527, -324304, -246839, -150735, -268786, -437843, -482862, -362424, -317225, -238596, -289237, -402806, -407762, -501972, -505053, -419267, -476380, -577958, -485576, -498081, -642512, -576199, -619563, -553932, -614540, -625943, -464366, -476786, -571090, -577834, -727394, -589556, -532038, -390919, -495526, -427020, -509343, -734180, -673132, -672234, -665388, -613808, -621041, -686147, -674841, -596965, -567920, -669232]
7648f69232R2141O9963p25q6149j26375R016J75873L7361L0888Q2252m795j768
7636c91550o6530L7135L3973j59150n5070N7621J67855j56549n9461r6145O9850
7625f18021L2269J14497M9974j59846j55972O6831J76002K5821j61900K9286J3145
7614e87914L6459r1391J2233o0233q1139J20903J81592K5135j57095P2051J8045
7603e11354J4284j40878k0927M0061K1206j2707m9085L8826K9933q1173J1199
7592f60615j17368J21005p1775L3891m458J43695P2683j09620O5509K0497O6726
7581d39830p1710R330m5603r4597L9976J1442L9482k5065P5887J47844j17205
7570d70049j48018K4342j10481J29939J44214j24239j32269N6352k2140J1244
$$ y = [-669232, -577091, -507128, -507853, -594002, -720377, -711361, -535488, -498127, -467239, -384987, -389782, -391550, -458080, -420945, -386972, -546122, -601192, -543571, -375716, -532265, -591726, -687871, -618021, -585752, -471255, -421281, -581127, -737099, -670268, -494266, -468445, -630345, -601059, -587914, -551455, -642846, -630613, -690846, -771985, -651082, -469490, -444355, -601450, -529399, -511354, -497070, -637948, -658875, -618814, -597608, -610315, -659400, -620574, -590641, -671814, -660615, -777983, -656978, -728753, -694862, -699320, -555625, -482942, -592562, -527053, -506556, -439830, -511540, -502210, -547813, -642410, -602434, -590992, -551510, -576575, -500688, -352844, -470049, -618067, -593725, -704206, -574267, -430053, -554292, -686561, -630209, -652349, -641105]
7560f41105j52664J22495J62687n0033O3424m8127o4787R8355r5990k4128j8416
7549f48289m0544L3206O7714m1669q3345Q9632n2711M2513J06921Q6750L2100
7538d07722l8682n5114q3856j15797Q8137M1761J3349Q7032j06255O3689J28248
7527c85210j32258J13311j04887r9788l2910J21733p8869J9191J21074J61617
7517b96996k0081l7620j43563R854k0204j51971J06017p5032n1366J65654q4573
7506e99881R3290m5412j39167J5020k7996J82116J03853k02936Q402K06905r2086
7495d97892n9183N0780K1282J7774j23551j43454m571J19853o0654J03169M764
7484e71683q8721o6363j4685J17800L37R20p1986N102J40062R0780j72506j73466
$$ y = [-641105, -793769, -671274, -508587, -558620, -495196, -543323, -608110, -509755, -605745, -629873, -648289, -688833, -655627, -587913, -629582, -712927, -623295, -676006, -633493, -526572, -439822, -407722, -446404, -501518, -585374, -701171, -613034, -571273, -557924, -470892, -577147, -513458, -385210, -517468, -404157, -509044, -608832, -641742, -520009, -598878, -579687, -458613, -296996, -317077, -354697, -498260, -488406, -508610, -660581, -554564, -629596, -680962, -515308, -599881, -506591, -552003, -691170, -676150, -704146, -522030, -418177, -621113, -612711, -405806, -497892, -557075, -506295, -485013, -467239, -590790, -734244, -738815, -618962, -679616, -576447, -571683, -660404, -726767, -741452, -623652, -623315, -622395, -694381, -689279, -549217, -458437, -630943, -804409]
7472h04409J33768L393q901P6894K3325o9712l0340L7998J49835N2305o7400J447
7460e01797M2603M0739j31074N8836L8370k169K6774J4418k21195j928o8091J22847
7448e81667J03608p2284j20285Q3153Q9180M0556j67627j15662K47758P2470j05701
7437e26501m1364n1220R0609k16311Q5230K21169j28674j7994k1356M7426R1466
7426d67520L9716j82713O782k0039p9569J77678N7122j30431J17031l9618l0631
7415e52192J52510p6191P8747p2292k03782J67046K3056k7886m0071j16643K47217
7404d20481K8419m1796j81312O4615J30139r9239j79498j15259j9451J15902L039
7393g14922j13413J29523J8255J02380o0408K8168M7072L00j02708m1304l1014
$$ y = [-804409, -670641, -667248, -676149, -599255, -575930, -645642, -675982, -637984, -488149, -435844, -503244, -501797, -459194, -418455, -549529, -490693, -452323, -454492, -427718, -413300, -634495, -636423, -704514, -581667, -478059, -550343, -670628, -587475, -498295, -457739, -625366, -741028, -493270, -420800, -526501, -567865, -619085, -528476, -744787, -659557, -438388, -567062, -585056, -606412, -558986, -467520, -427804, -610517, -603735, -623774, -703343, -525665, -468543, -598974, -481943, -521561, -552192, -399682, -475873, -397126, -469418, -673200, -506154, -483098, -510984, -551055, -667698, -420481, -392062, -433858, -615170, -550555, -420416, -519655, -699153, -814412, -833863, -717961, -714922, -828335, -698812, -680557, -578177, -638585, -610417, -563345, -563045, -665753, -707057, -738071]
7382g38071R9756R8982n7241j64201P6010p590o9594m6248J09399J01457N6199
7371e41142q1745N4133K7220p2376k8669p1103J41280j412q7699o6830n9030o9201
7359h56574J65424Q5074N5418o6886N2613M1131J98631k79980k21988Q9195L7917
7348g00025L5927L3739r1488J20408N99j34403k5467Q1768J17154J087Q1662N7583
7336d21456r588J3712j6243p0717l5025j05399J04738Q0662J39032j76874k4472
7325e21630k4101Q2137j0192m6144m5197K5350J30550j93270j19850J7819L4263
7314f70265J79885J19827M7891R933j75942k66984R5360J27189k5416L2268Q5395
7303d40859L4075j21100J58896R3282j48630j20951L0320K4944l3905K2600j130
$$ y = [-738071, -638315, -539333, -596574, -760775, -684765, -692355, -761949, -808197, -698798, -597341, -541142, -622887, -568754, -541534, -613910, -642579, -713682, -572402, -573814, -661513, -728343, -787373, -856574, -691150, -606076, -550658, -617544, -564931, -523800, -325169, -605149, -827137, -737942, -700025, -664098, -630359, -721847, -601439, -600840, -735243, -760710, -678942, -561788, -560701, -479039, -421456, -431044, -417332, -433575, -504292, -539317, -644716, -539978, -459316, -320284, -497158, -521630, -545731, -463594, -473786, -519930, -565127, -539777, -409227, -602497, -722347, -704528, -670265, -490380, -370553, -322662, -312729, -488671, -755655, -660295, -533106, -558522, -526254, -440859, -406784, -527884, -368988, -275706, -424336, -545287, -514967, -490023, -523928, -501328, -502458]
7292e02458p2903q1011J40702M3758q1881j279k1131P7667O1304M5962K0682j31957
7280e02545N1282Q0754j72554p6364Q527j16449J51535O0027j28109q0244J04163
7269f19977k8645N4703J53616O1438r4639n9746O0004j43855K80P0469K18852
7258c27500j95375P5024K2862N8261p1465j46407J25477J2204O3497j3042n1101
7247d47565k4289M2977j25190J5679M3635L1321j39000P9049j9943k0855q266
7236e72447p3478J43092l0206K0258k4666q2880P8946J22154K633j19598O6110
7225d70082k263M0936J8749p8241l7033l5620l8135o1816k8332J29125J21167
7214d41545j04902p3242r5555J26199J26898p9862K4025Q4435j70382r8479J370
$$ y = [-502458, -575361, -656372, -515670, -471912, -553793, -555072, -576203, -498536, -437232, -391270, -370588, -502545, -451263, -370509, -543063, -619427, -610900, -727349, -575814, -515787, -643896, -724140, -619977, -648622, -593919, -440303, -378865, -473504, -533250, -473246, -617101, -616821, -546352, -327500, -522875, -447851, -424989, -366728, -438193, -584600, -459123, -446919, -383422, -396464, -447565, -471854, -428877, -554067, -538388, -494753, -463432, -602432, -523383, -543326, -564181, -572447, -645925, -502833, -533039, -512781, -537447, -620327, -541381, -419227, -416594, -536192, -470082, -472345, -431409, -412660, -490901, -527934, -563554, -601689, -663505, -691837, -562712, -441545, -546447, -619689, -715244, -589045, -462147, -542009, -517984, -433549, -603931, -702410, -701040]
7203g01040J20967K204m106J25430K3021j49776P5546j22804N2371O55Q688m2802
7191f11646r4042Q3539j32730J74807J05595J05134J031j16370l2013J41237p2370
7180d47828m7738j02467P055J428o2298J61165j28284J7170L8341k1375N8301
7169e26530N5669M1364J3633n0403j33808O9816J53335j6068n0157m2426O2608
7158d22967O3392k20174J9222m0444j49960l7581J48551Q4489p803q8521L5659
7147f16137O0441J05052j08910J24164J26216j99656P7249j64723R9210J57912
7137c39182N4161o6354J37988k3958K357r2277k62107L2971j00099L9785N9524
7126e57191J3979n2205P8814M8275k9434J7961j74630j8808O3246J41841m7183
$$ y = [-701040, -580073, -577869, -581975, -456545, -433524, -583300, -507754, -630558, -578187, -577532, -568844, -611646, -705688, -622149, -754879, -580072, -474477, -369343, -368312, -484682, -516695, -375458, -447828, -495566, -598033, -590978, -589550, -651848, -490683, -618967, -601797, -563456, -584831, -526530, -470861, -429497, -415864, -466267, -600075, -530259, -376924, -392992, -443149, -485575, -422967, -359575, -579749, -560527, -600971, -750931, -788512, -639961, -555472, -563275, -651796, -616137, -555696, -450644, -559554, -435390, -309174, -508830, -431581, -596304, -497094, -339182, -285021, -351375, -213387, -237345, -234988, -327265, -589372, -556401, -656500, -616715, -557191, -543212, -595417, -516603, -468328, -497762, -479801, -654431, -673239, -609993, -468152, -515335]
7115e15335j28460n378o8217m8330K24995L9052r157m5559o5276K5918N4219J10911
7103d30617o4484k02583R1230P1915L5012K3411K9456R1539j89476N4600J11178
7092c78819R628r3770l7594l3459M1913R6405j73031k7346R2006P9630J1574K6552
7080c86311l6318k0222q9165O5590n5400M4297J48719l2581j35814P77O0325j06074
7068e42177J3337L8877K27443j59150k04252Q4095R1070m9086J4040M7433J2204
7057d26166L4945j02444K2585j6127r7243o8981O4861J07724m2985k6384l868
7046e54083l4210r844K42105k5315K7906j36418j65902p7428J89064J03504P5588
7035c65033m3300j7808m4712o586n8201o0835o6103J51658M8357L944J00499R7829
$$ y = [-515335, -643795, -649173, -717390, -765720, -540725, -501673, -510830, -556389, -621665, -595747, -541528, -430617, -495101, -697684, -606454, -534539, -499527, -476116, -446660, -355121, -544597, -489997, -378819, -369191, -462961, -500555, -534014, -492101, -395696, -568727, -596073, -504067, -424437, -412863, -386311, -422629, -442851, -532016, -466426, -521826, -477529, -328810, -361391, -497205, -496428, -436103, -542177, -528840, -489963, -262520, -421670, -625922, -541827, -450757, -499843, -485803, -438370, -426166, -391221, -493665, -471080, -487207, -584450, -653431, -588570, -480846, -523831, -550215, -554083, -588293, -598137, -356032, -381347, -353441, -489859, -655761, -733189, -544125, -440621, -365033, -408333, -426141, -470853, -477439, -535640, -596475, -662578, -510920, -462563, -458619, -358120, -260291]
7023b60291j9777j06241k8789l4937J07153p5587j4138Q0034q323l5914q6719
7012d83529L5569k587q6423J09425l1004J06302l8128j00004j5237J22149P1327
7001c12140K5825n3049m9138R664n0578q4772K3975K9771q1208Q495P4681J16771
6989c41703j1231P6627O1734k69057l1862r2143J51774p283p6767J3327M0661
6978d85923N3180l0978j32130N661o302J12251m7972q3960j235k2421L4503p9441
6966f84767J35649L5282N854N7347M5808J5915j07170p7002Q4785q5126O5013
6955e08412J03136K3033j34505k5646J63460M5681j56604O53j6588j71715J70079
6944e07428l98n8267J7991m4851R8687J3089q6788j01877J07580Q8333j97422
$$ y = [-260291, -280068, -386309, -415098, -450035, -342882, -418469, -432607, -352573, -360896, -396810, -483529, -447960, -450547, -536970, -427545, -458549, -352247, -390375, -490379, -505616, -383467, -312140, -286315, -339364, -388502, -378838, -429416, -514188, -490213, -460442, -541650, -533155, -458474, -341703, -352934, -276307, -214573, -483630, -515492, -607635, -455861, -463144, -539911, -526584, -485923, -432743, -463721, -595851, -590190, -596492, -484241, -532213, -616173, -617408, -639829, -605326, -684767, -549118, -513836, -507982, -450635, -404827, -388912, -496082, -573084, -488299, -573425, -508412, -405276, -382243, -516748, -542394, -378934, -333253, -489857, -489204, -505792, -677507, -507428, -507826, -566093, -548102, -592953, -494266, -481177, -567965, -669842, -562262, -473929, -671351]
6933f71351L8241J70491J23927j8126q4653Q0158o0951j29987Q0594J37846J9196
6922c14615M1247j19488j99100K23638R0955k19707j45489J18946j7315p2309
6912f13237k8250P4206Q7603N0956L5797P2646J15676K8059O0076j52803j14849
6901c84120r4323J25008J64763m9091j18776k3417q3287L2242k6835P625n2148
6890e02359J61998P3408j6707j6279R9068L3187k92482Q9296o2319J25351Q0416
6879b27422n2174L3877q7249Q8122R729j04804J20488J9043j85789j29671q946
6868e24796M2946j1872k0286J49362R080o0378j33290q680p9078K51259R5496
6857b90237J24414j35853m9149K5934r4305J44243m8658P4851j5551M3528l4086
$$ y = [-671351, -633110, -462619, -338692, -356818, -441471, -361313, -422264, -552251, -471657, -333811, -314615, -273368, -392856, -591956, -368318, -277363, -497070, -642559, -523613, -540928, -613237, -641487, -567281, -479678, -428722, -392925, -320279, -204603, -176544, -116468, -269271, -384120, -478443, -353435, -188672, -237763, -356539, -379956, -463243, -431001, -457836, -450211, -502359, -340361, -266953, -283660, -299939, -200871, -167684, -460166, -370870, -433189, -307838, -227422, -279596, -245719, -332968, -244846, -235117, -339921, -219433, -200390, -386179, -515850, -524796, -481850, -493722, -514008, -364646, -355566, -415944, -549234, -557914, -636992, -385733, -290237, -165823, -301676, -350825, -324891, -419196, -274953, -323611, -248760, -264311, -220783, -254869]
6846b54869j59587l895J25992m267q1295J7883J21135j04362j0341P8423r3858
6835c69041R8745Q9599M4051J87597k1302q7565k41919O5887K26979o653j39390
6824a53012l7890j32638j00528J20714J83059j9963L713J28794J18205p0517k82517
6813b42580k5758J09198q8833K6189J0881J12113J839p4556o7400m7636J7308
6802b69235M3337k5496P7374j1721j81159M7480J153L8345L6921R4783K809J4010
6790a31399r3386K3195m7279k5361K9701o6290J51082J15601j0918Q0953m8439
6779b2540j78505r0009M3551j5220p8903K51986n5n5975k7376L1006N7528N6525
6767b7987J0034r6974k9697m16j752M9247q9994k4196K14886l0300j24470K8176
$$ y = [-254869, -414456, -418351, -292359, -296626, -377921, -360038, -238903, -343265, -353606, -275183, -369041, -270296, -180697, -136646, 50951, 29649, -57916, -299835, -233948, -6969, -13622, -153012, -190902, -323540, -424068, -303354, -120295, -140258, -136545, -7751, 110454, 39937, -242580, -268338, -159140, -247973, -221784, -210903, -98790, -96951, -171507, -238907, -286543, -269235, -225898, -251394, -174020, -185741, -366900, -319420, -318267, -279922, -243001, -148218, -145409, -131399, -224785, -201590, -248869, -274230, -244529, -310819, -159737, -44136, -55054, 25899, -22540, -201045, -291054, -247503, -262723, -341626, -89640, -89695, -145670, -173046, -142040, -84512, -27987, -17953, -114927, -144624, -145040, -146792, -97545, -187539, -211735, 3151, -27149, -151619, -123443]
6755a23443J79313o400o0261q3378n7734j9152J52450m0849M5052J80697p2703
6744I3592j25558m5317Q7815k1348n5360k5527J7548P1805M0300j70542J08704
6733b3888j02399J197O8517k3584j28969J13971J72278r042n703N570J12582r1775
6721H8755J10548j733k40571O3079m215m6766p1527Q9319j4164j04132J28190
6710c217J16384K23129m2543o3878l3547m9934o7955r6722J73628R0369J7105
6699B62819O0382q1785o5105J9704O5551j07821J04l3520M2423j35186J89591
6688B17157J11000p8618O2162R901K4042n3749r896Q1488p9109J91980M5658L6157
6676E58173k08776Q0839o2662J11364K38159O3147r7062L6841r8211k13141J36
$$ y = [-123443, 55870, 49470, -10791, -94169, -151903, -171055, -18605, -59454, -14402, 166295, 93592, -31966, -77283, 10532, -10816, -66176, -91703, -74155, -2350, 37950, -132592, -23888, -126287, -125090, -56573, -80157, -209126, -95155, 77123, 68081, 62378, 67948, 180530, 88755, 199303, 197570, -43001, 20078, 15863, -30903, -102430, -13111, -27275, -131407, -3217, 113167, 336296, 293753, 229875, 196328, 146394, 78439, -18283, 155345, 245714, 262819, 323201, 241416, 176311, 196015, 261566, 153745, 153849, 120329, 162752, 27566, 217157, 328157, 249539, 311701, 321602, 345644, 291895, 281999, 363487, 284378, 476358, 522016, 558173, 349397, 430236, 367574, 478938, 717097, 780244, 683182, 720023, 621812, 408671, 408807]
6665D08807N7010J22938J71110j8102j90320j8566J40295j06622j28649R3877
6655E31778J1131P8420L95R8197J29553O6236J8642q5175J7482Q1194L0643n6209
6643I22287K4103n2108p8653K52994l0851J2286l5663q3867O7488K0655o1155
6632I57516K25640J9797M8435n3598O9134J6336K01368r1165O1999j28838J025
6621A327649J45817k8524J34865J98808j01406M8018J62890Q5813J97247K00856
6611B372033j40875l0852K04068P1892J90628J57069R3788P6610J32900M9658
6601C176919J12874L048J61698m5197J20661L57804J06008J10146O4278K20817
6591D389056K65506K87222J00468J68021L19873Q6758J31765L40023J76775O9919
$$ y = [408807, 465817, 588755, 759865, 741763, 551443, 532877, 673172, 566550, 437901, 531778, 542909, 621329, 621724, 719921, 849474, 915710, 934352, 849177, 866659, 947853, 978496, 922287, 946390, 894282, 815629, 1068623, 1037772, 1050058, 1014395, 930528, 998016, 1018671, 957516, 1183156, 1202953, 1251388, 1197790, 1266924, 1283260, 1484628, 1393463, 1455462, 1326624, 1327649, 1473466, 1444942, 1579807, 1778615, 1677209, 1725227, 1888117, 1973930, 2171177, 2372033, 2231158, 2200306, 2404374, 2476266, 2666894, 2823963, 2917751, 2994361, 3127261, 3176919, 3289793, 3292841, 3454539, 3409342, 3530003, 3887807, 3993815, 4103961, 4168239, 4389056, 4654562, 4941784, 5042252, 5210273, 5530146, 5616904, 5748669, 6088692, 6265467, 6335386]
6581F335386L35749J89888J84811L70902K05138K91285K29979L19548K39542J80734
6571H882962J41160K19548L92630L05611K16527J69033R4394L96351J62927K90996
6561A1272139N66775K90672L08763K60498L78598J43272K90806K87026L93107
6552A4191656L95937L65261M55037M57789M58644J94340L56745K78439M52419
6543A7606267O28352L71902N50792N08320Q24733O16157Q78817R42052R93124
6534B3920516J097918J127703J039372O15863N35546J25570p9736l33054m53582
6525B7596116k81535l54081J79198K06718L56796K68369L00535M82208K97199
6516B9051523L68931J22015l39146o51785j005055r18477r65805r57234r61492
$$ y = [6335386, 6671135, 6861023, 7045834, 7416736, 7621874, 7913159, 8143138, 8462686, 8702228, 8882962, 9024122, 9243670, 9636300, 9941911, 10158438, 10327471, 10421865, 10818216, 10981143, 11272139, 11838914, 12129586, 12438349, 12698847, 13077445, 13220717, 13511523, 13798549, 14191656, 14587593, 14952854, 15407891, 15865680, 16324324, 16518664, 16875409, 17153848, 17606267, 18234619, 18606521, 19157313, 19665633, 20490366, 21106523, 21985340, 22927392, 23920516, 25018434, 26146137, 27185509, 27801372, 28336918, 28462488, 28382752, 28049698, 27596116, 27314581, 26960500, 27139698, 27346416, 27703212, 27971581, 28272116, 28754324, 29051523, 29420454, 29542469, 29203323, 28551538, 27546483, 26628006, 25662201, 24704967, 23743475]
6507B3743475r37353o65588p95803o84202p83083n64886n42538l59243n22321
6498A7888458n99111m40750l66278m31201m30098m00562m79108m34201j61299
6489A4145850k97320l19507j40818k48663r3681k11531q1395q4866j64052J26629
6479A2630646j0524J78446R5870p3055J39374K06087L50774M93739N18989M21560
6469A4951906N56702O76861Q96272Q46926J475854J645665J802368K007707J738645
6460B6598906J604123J445599Q84152J59096k45948p92024o22844m52029l27915
6451B8251116K3376M77799P74586Q31630R06287J004488Q13849P49973K48398
6442C4081502o65041r90286j652097j576626j447522j215890j237068j134659
$$ y = [23743475, 22806122, 22140534, 21344731, 20660529, 19877446, 19312560, 18770022, 18410779, 17888458, 17289347, 16848597, 16482319, 16051118, 15621020, 15220458, 14741350, 14307149, 14145850, 13848530, 13529023, 13388205, 13139542, 13045861, 12834330, 12752935, 12668069, 12504017, 12630646, 12620122, 12798568, 12894438, 12821383, 12960757, 13166844, 13517618, 14011357, 14530346, 14951906, 15508608, 16185469, 17081741, 17928667, 19404521, 21050186, 22852554, 24860261, 26598906, 28203029, 29648628, 30532780, 30691876, 30445928, 29653904, 29031060, 28579031, 28251116, 28274492, 28752291, 29526877, 30358507, 31264794, 32269282, 33083131, 33833104, 34081502, 33416461, 32426175, 30774078, 29197452, 27749930, 26534040, 25296972, 24162313]
6434B4162313j069450r58646p84465p07430o71048q44946m20756k84135l31637
6425A8089800k84163l21718k23069n3340m8950k21962r394k5431K55046J57742
6415A7314561R9381K92299K60691L89278N03808M39505O06720R06364R31517J104077
6405B2848201J234943J146610J411402J417911J257103J341582J024870J077091
6397C2759713M29397J52247k59144m95590o69717q90755p21619o34470o60158
6388B9009904n48224n43307o63197n77931l74655m45241m13682l45569P3026M1801
6378B5212925R5467K34996Q8477L07819N18829O94939P12707Q91456J097944Q91786
6368C0747345J099414Q33681R92790Q80844R10426O41253K36307J61394q7910
$$ y = [24162313, 23092863, 22134217, 21349752, 20642322, 19971274, 19126328, 18705572, 18421437, 18089800, 17805637, 17483919, 17260850, 17207510, 17158560, 16936598, 16927204, 16901773, 17156819, 17314561, 17413942, 17706241, 17966932, 18356210, 18860018, 19299523, 19906243, 20812607, 21744124, 22848201, 24083144, 25229754, 26641156, 28059067, 29316170, 30657752, 31682622, 32759713, 33189110, 33341357, 33082213, 32586623, 31916906, 31026151, 30304532, 29670062, 29009904, 28461680, 27918373, 27255176, 26677245, 26302590, 25857349, 25443667, 25098098, 25171124, 25212925, 25308392, 25543388, 25631865, 25939684, 26458513, 27153452, 27866159, 28757615, 29855559, 30747345, 31846759, 32680440, 33673230, 34554074, 35464500, 36105753, 36342060, 36503454, 36415544]
6359C6415544q679j95233k77221j84327j88774j56140j37381l474K47355K02034
6349C5713704K29505N51880O53683O72478R32212J221636J288005J648854J785889
6340D4697846K036697K064874K389657K912302K784086L017689L048818K809720
6332F5761689K743883K505365J867768J239397L94783n88488m50724k77562j92841
6323G3003270K82751Q9457L08971L14718K74345j3099k01138p25077j391539j697176
6313G0245483j562405j116895q78768o97816m21379j75634P0220N41187Q95863
6304F6899856J177896J818343K055997K380105K762961K648677K390001J915976
6296H4049812P78460p7902j173093k054771k304249k384461k326445k083452j791787
$$ y = [36415544, 36406865, 36211632, 35934411, 35750084, 35561310, 35405170, 35267789, 35264315, 35511670, 35713704, 35943209, 36495089, 37148772, 37821250, 38753462, 39975098, 41263103, 42911957, 44697846, 46734543, 48799417, 51189074, 54101376, 56885462, 59903151, 62951969, 65761689, 68505572, 71010937, 72878705, 74118102, 74512885, 73924397, 73473673, 73196111, 73003270, 73286021, 73375478, 73684449, 73999167, 74273512, 74260413, 74059275, 73334198, 71942659, 70245483, 68683078, 67566183, 66687415, 65989599, 65568220, 65392586, 65462806, 66003993, 66899856, 68077752, 69896095, 71952092, 74332197, 77095158, 79743835, 82133836, 84049812, 84828272, 84750370, 83577277, 81522506, 79218257, 76833796, 74507351, 72423899, 70632112]
6287G0632112j633158j808507j498533j398895r69163r14736r46159n11949l84357
6278F0566655k65461j14370L13089N77681O22565J061190J171773J406051J568925
6269F6908098J821807J961236J707304J529510J154034R65610K35439l75123o10553
6260G5297362p07250q23423q34672n74884m50695m49700j51664J44373N90726
6251G2040173J109152J569361J775100J900092J965561J938639J852858J248901
6243H5399837O37914J31681l59353m95525p97514j094617j259077j187550j004102
6234G9971694r47914n93524l12376j94074R0745K99646L74794P48900O58746L12364
6224H0409001M7109k43499n06391r34333j070824j085628r74917p82823q89594
$$ y = [70632112, 68998954, 67190447, 65691914, 64293019, 63323856, 62409120, 61462961, 60951012, 60566655, 60301194, 60186824, 60499913, 61077594, 61700159, 62761349, 63933122, 65339173, 66908098, 68729905, 70691141, 72398445, 73927955, 75081989, 76047599, 76283038, 75907915, 75297362, 74590112, 73766689, 72932017, 72357133, 71906438, 71456738, 71305074, 71449447, 72040173, 73149325, 74718686, 76493786, 78393878, 80359439, 82298078, 84150936, 85399837, 86037751, 86169432, 85810079, 85314554, 84517040, 83422423, 82163346, 80975796, 79971694, 79023780, 78430256, 78117880, 77923806, 78014551, 78314197, 78688991, 79437891, 80096637, 80409001, 80456110, 80212611, 79706220, 78771887, 77701063, 76615435, 75640518, 74857695, 73968101]
6215G3968101r53703r36943r67616j010756j054813j279884j267770j272631j565547
6206F3658438j442188j286130j088884j126429j120721r12452o06058r75154r18096
6197E4182326j036210j163861j283613j823697j724135j755790j723938j458779
6189D2212303j551461j470876j091409j035522r87281q64559o50380m66961l22910
6180C3770944k91284k24191n0156R7933Q7382j82091J39924k63833m74032n15583
6170C2095013m20064k02997n58001m67203n31024o00037o49253n01753l30679
6161B7834002k45486k64404k58169j66844m2648r369o8377k1091j50419k11523
6151B6395672j75041n49500o97218l83596n56665n90599n93636n77052n32025
$$ y = [73968101, 73014398, 72077455, 71109839, 70099083, 69044270, 67764386, 66496616, 65223985, 63658438, 62216250, 60930120, 59841236, 58714807, 57594086, 56681634, 56075576, 55100422, 54182326, 53146116, 51982255, 50698642, 48874945, 47150810, 45395020, 43671082, 42212303, 40660842, 39189966, 38098557, 37063035, 36075754, 35211195, 34560815, 34093854, 33770944, 33479660, 33255469, 33205313, 33303246, 33390628, 33208537, 33348461, 33084628, 32610596, 32095013, 31674949, 31471952, 30913951, 30446748, 29915724, 29315687, 28666434, 28164681, 27834002, 27588516, 27324112, 27065943, 26899099, 26856451, 26847082, 26778705, 26757614, 26607195, 26395672, 26220631, 25671131, 24973913, 24590317, 24033652, 23443053, 22849417, 22272365, 21740340]
6142B1740340o59740o29874m65700m45274n92169n13859n20568o24254n85179
6133A6703723n11549o61618o87844n96113o75348o83283n46257m58097o00780
6124A1282834n16104m21208l69333l39099l80476m62788l44915k77463k37170
6115G934278l40673j79215k11729l39057q1421j28846k56733j85858p8561k27017
6105E905168k59310j76913j95675n3332j22221j1089k23690q0819q0906J2533
6095D713746L2066j80436j57052o2192m8959j01460o9224j21063l5134o1387L3616
6084C942521m265k65515j07079L5872j77328K4713Q6594q535M880j37657k02564
6073C191637p9630M318o3338j51735p06J23089J01123o4250j44415j66724N973
$$ y = [21740340, 21080600, 20450726, 19985026, 19539752, 18947583, 18433724, 17913156, 17288902, 16703723, 16192174, 15530556, 14842712, 14246599, 13571251, 12887968, 12341711, 11883614, 11282834, 10766730, 10345522, 9976189, 9637090, 9256614, 8793826, 8448911, 8171448, 7934278, 7593605, 7414390, 7202661, 6863604, 6782183, 6653337, 6396604, 6210746, 6132185, 5905168, 5645858, 5468945, 5273270, 5219938, 5097717, 5086628, 4862938, 4782119, 4701213, 4713746, 4745812, 4565376, 4408324, 4346132, 4297173, 4195713, 4126489, 4005426, 3970292, 3908905, 3942521, 3938256, 3672741, 3565662, 3601534, 3424206, 3448919, 3535513, 3526978, 3531858, 3394201, 3191637, 3112007, 3116325, 3052987, 2901252, 2900546, 3023635, 3124758, 3060508, 2916093, 2749369, 2755342]
6062B755342j9489l8219J1464J04541j30204O5043O4102r2962l526K9155j62802
6051B582445L938l6806j53753j40769J39540o5391m7223Q1797j6740q2984o267
6040B257787j35433R6700p756j29645P5582j16445j44524m9481K3158P7682p9610
6029A868015m4032M6897P9613J03329M0974j77210K1506m5625k2186l1257Q3281
6018A923305k3688r486L3255j9229j01951O8824J52388o2582M241O8577K5768
6007B059422j05264k11361R1990K8764j43411J41750p5459m5350L2427J5550j4013
5996A775045K9520l2029q2334M5478R0295m3564O256o6208K6753m7765j48031
5985A553416o4165J27824J14333Q4723n8299j12331o1149J80117j57325j7191
$$ y = [2755342, 2735853, 2697634, 2709098, 2813639, 2683435, 2748478, 2812580, 2719618, 2716092, 2745247, 2582445, 2586383, 2549577, 2395824, 2255055, 2394595, 2329204, 2281981, 2363778, 2347038, 2264054, 2257787, 2122354, 2219054, 2211298, 2081653, 2157235, 2040790, 1896266, 1846785, 1869943, 1947625, 1868015, 1823983, 1870880, 1950493, 2053822, 2094796, 1917586, 1939092, 1893467, 1871281, 1840024, 1923305, 1899617, 1890131, 1923386, 1904157, 1802206, 1871030, 2023418, 1960836, 1965077, 2033654, 2059422, 1954158, 1742797, 1834787, 1863551, 1720140, 1861890, 1786431, 1741081, 1773508, 1789058, 1775045, 1804565, 1772536, 1690202, 1735680, 1825975, 1782411, 1788667, 1722459, 1749212, 1701447, 1553416, 1489251, 1617075, 1731408, 1816131, 1757832, 1645501, 1584352, 1764469, 1607144, 1589953]
5975A589953J5071M4853j35331r2366L7177K3841j2169R4755k09174J25601P2741
5964A554952p6586p4518J38934J34273L3268r8410j755p619m5095j04203k7052
5953A426189j41800J22761J37440J418M8725P8594n9711l4753L3357j89199j10684
5942A312337N2613J54206J26713J65668q2231r9200O8527M4828k7933J37578J73601
$$ y = [1589953, 1605024, 1649877, 1514546, 1422180, 1459357, 1483198, 1471029, 1565784, 1356610, 1482211, 1554952, 1478366, 1403848, 1542782, 1677055, 1710323, 1611913, 1610158, 1602539, 1557444, 1453241, 1426189, 1284389, 1407150, 1544590, 1546008, 1594733, 1673327, 1613616, 1578863, 1612220, 1423021, 1312337, 1364950, 1519156, 1645869, 1811537, 1729306, 1630106, 1698633, 1743461, 1715528, 1853106, 2026707]
$$ [...]
##END NTUPLES=NMR SPECTRUM
##END=
