##TITLE=1H_EC-3356(1-2)
 200.13MHz, CDCl3,
 8 sc
 
 32.8.2025
##JCAMPDX= 6.0         $$ Bruker NMR JCAMP-DX V2.0
##DATA TYPE= NMR SPECTRUM
##DATA CLASS= NTUPLES
##ORIGIN= UXNMR, Bruker Analytische Messtechnik GmbH
##OWNER= pz
$$ XWIN-NMR		Version 3.5
$$ Wed Aug 13 13:49:39 2025 Russian Standard Time (UT+4h)  she@DPX200
##.OBSERVE FREQUENCY= 200.1313
##.OBSERVE NUCLEUS= ^1H
##.ACQUISITION MODE= SIMULTANEOUS
##.ACQUISITION SCHEME= undefined
##.AVERAGES= 8
##.DIGITISER RES= 18
##SPECTROMETER/DATA SYSTEM= spect
##.PULSE SEQUENCE= zg30
##.SOLVENT NAME= CDCl3
##.SHIFT REFERENCE= (INTERNAL, CDCl3, 0, 15.4097)
##AUDIT TRAIL= $$ (NUMBER, WHEN, WHO, WHERE, WHAT)
$$ ##TITLE= Audit trail, XWIN-NMR		Version 3.5
$$ ##JCAMPDX= 5.01
$$ ##ORIGIN= Bruker BioSpin GmbH
$$ ##OWNER= she
$$ F:/spectra/data/she/nmr/H-C/1/pdata/1/auditp.txt
$$ ##AUDIT TRAIL=  $$ (NUMBER, WHEN, WHO, WHERE, WHAT)
(   1,<2025-08-13 13:47:50.32 +0400>,<she>,<DPX200>,
      <created by zg, POWCHK disabled, PULCHK disabled
       configuration hash MD5:
       00 E9 B6 7A A2 85 ED C7 34 08 36 98 17 FE 4E 26
       data hash MD5: 16K
       F7 2B CF F0 34 FB 0F 57 9B 0A E0 63 97 BD 8F 23>)
(   2,<2025-08-13 13:47:52.45 +0400>,<she>,<DPX200>,
      <Start of raw data processing
       efp BC_mod = 2 LB = 0.25 FT_mod = 6 PKNL = 1 PHC0 = -1558.476 PHC1 = 9.592279 SI = 16K 
       data hash MD5: 16K
       94 74 D2 3A 6C E9 24 C6 F9 6D C7 FD 65 EE B2 36>)
(   3,<2025-08-13 13:48:16.18 +0400>,<she>,<DPX200>,
      <pk PHC0 = 0.1908168 PHC1 = -2.8 
       data hash MD5: 16K
       A2 2D CA 18 81 9F 89 24 5C 72 B0 DE CA 6E 54 CE>)
(   4,<2025-08-13 13:48:42.40 +0400>,<she>,<DPX200>,
      <abs ABSG = 5 
       data hash MD5: 16K
       8F 00 AF 67 EF 4B 3E 19 DF 1A BB 08 A0 8E 47 FC>)
$$ ##END=
$$ 
$$ hash MD5
$$ FE B5 FF 0B F7 CD B0 EE 87 C1 54 7B 48 13 D5 1F
##$RELAX= 
##$RELAX= 
##$RELAX= 
##$RELAX= 
##$RELAX= 
##$RELAX= 
$$ Bruker specific parameters
$$ --------------------------
##$DU= <F:/spectra>
##$EXPNO= 1
##$NAME= <H-C>
##$PROCNO= 1
##$TYPE= <nmr>
##$USER= <she>
##$AMP= (0..31)
100 100 100 100 100 100 100 100 100 100 100 100 100 100 100 100 100 100 
100 100 100 100 100 100 100 100 100 100 100 100 100 100 
##$AQSEQ= 0
##$AQ_mod= 1
##$AUNM= <au_zg>
##$AUTOPOS= <>
##$BF1= 200.13
##$BF2= 200.13
##$BF3= 200.13
##$BF4= 200.13
##$BF5= 200.13
##$BF6= 200.13
##$BF7= 200.13
##$BF8= 200.13
##$BYTORDA= 1
##$CFDGTYP= 0
##$CFRGTYP= 5
##$CHEMSTR= <none>
##$CNST= (0..31)
1 1 145 1 1 1 1 1 1 1 1 1 1 1 1 1 1 1 1 1 1 1 1 1 1 1 1 1 1 1 1 1 
##$CPDPRG= <>
##$CPDPRG1= <>
##$CPDPRG2= <>
##$CPDPRG3= <>
##$CPDPRG4= <mlev>
##$CPDPRG5= <mlev>
##$CPDPRG6= <mlev>
##$CPDPRG7= <mlev>
##$CPDPRG8= <mlev>
##$CPDPRGB= <>
##$CPDPRGT= <>
##$D= (0..31)
0 0.7 0 0 0 0 0 0 0 0 0 0.03 0 0 0 0 0 0 0 0 0 0 0 0 0 0 0 0 0 0 0 0 
##$DATE= 1755078469
##$DBL= (0..7)
120 120 120 120 120 120 120 120 
##$DBP= (0..7)
150 150 150 150 150 150 150 150 
##$DBP07= 0
##$DBPNAM0= <>
##$DBPNAM1= <>
##$DBPNAM2= <>
##$DBPNAM3= <>
##$DBPNAM4= <>
$$ [...]
##$SUBNAM3= <"">
##$SUBNAM4= <"">
##$SUBNAM5= <"">
##$SUBNAM6= <"">
##$SUBNAM7= <"">
##$SUBNAM8= <"">
##$SUBNAM9= <"">
##$SW= 18.0517328524113
##$SWIBOX= (0..15)
0 0 2 0 0 0 0 0 0 0 0 0 0 0 0 0 
##$SW_h= 3612.71676300578
##$TD= 16384
##$TD0= 1
##$TE= 0
##$TE2= 300
##$TE3= 300
##$TEG= 300
##$TL= (0..7)
0 120 120 120 120 120 120 120 
##$TP= (0..7)
150 150 150 150 150 150 150 150 
##$TP07= 0
##$TPNAME0= <>
##$TPNAME1= <>
##$TPNAME2= <>
##$TPNAME3= <>
##$TPNAME4= <>
##$TPNAME5= <>
##$TPNAME6= <>
##$TPNAME7= <>
##$TPOAL= (0..7)
0.5 0.5 0.5 0.5 0.5 0.5 0.5 0.5 
##$TPOFFS= (0..7)
0 0 0 0 0 0 0 0 
##$TUNHIN= 0
##$TUNHOUT= 0
##$TUNXOUT= 0
##$USERA1= <user>
##$USERA2= <user>
##$USERA3= <user>
##$USERA4= <user>
##$USERA5= <user>
##$V9= 5
##$VALIST= <valist>
##$VCLIST= <CCCCCCCCCCCCCCC>
##$VD= 0
##$VDLIST= <DDDDDDDDDDDDDDD>
##$VPLIST= <PPPPPPPPPPPPPPP>
##$VTLIST= <TTTTTTTTTTTTTTT>
##$WBST= 1024
##$WBSW= 4
##$XGAIN= (0..3)
0 0 0 0 
##$XL= 0
##$YL= 0
##$YMAX_a= 495496
##$YMIN_a= -529501
##$ZGOPTNS= <>
##$ZL1= 120
##$ZL2= 120
##$ZL3= 120
##$ZL4= 120
##$ABSF1= 15.51661
##$ABSF2= -2.535239
##$ABSG= 5
##$ABSL= 3
##$ALPHA= 0
##$AQORDER= 0
##$ASSFAC= 0
##$ASSFACI= 0
##$ASSFACX= 0
##$ASSWID= 0
##$AUNMP= <proc_1d>
##$AZFE= 0.1
##$AZFW= 0.1
##$BCFW= 0
##$BC_mod= 2
##$BYTORDP= 0
##$COROFFS= 0
##$CY= -3
##$DATMOD= 1
##$DC= 0
##$DFILT= <>
##$DTYPP= 0
##$F1P= 0
##$F2P= 0
##$FCOR= 1
##$FTSIZE= 16384
##$FT_mod= 6
##$GAMMA= 0
##$GB= 0
##$INTBC= 1
##$INTSCL= 3.241238e-09
##$ISEN= 128
##$LB= 0.25
##$LEV0= 0
##$LPBIN= 0
##$MAXI= 10000
##$MC2= 0
##$MEAN= 0
##$ME_mod= 0
##$MI= 1.114404
##$NCOEF= 0
##$NC_proc= -6
##$NLEV= 6
##$NOISF1= 3.799351
##$NOISF2= 2.8
##$NSP= 0
##$NTH_PI= 0
##$NZP= 0
##$OFFSET= 15.40974
##$PC= 1
##$PHC0= -1558.285
##$PHC1= 6.792279
##$PH_mod= 1
##$PKNL= yes
##$PPARMOD= 0
##$PSCAL= 0
##$PSIGN= 0
##$REVERSE= no
##$SF= 200.130022406655
##$SI= 16384
##$SIGF1= 3
##$SIGF2= 2
##$SINO= 0.751879
##$SIOLD= 32768
##$SREGLST= <19F.Aceton>
##$SSB= 0
##$STSI= 16384
##$STSR= 0
##$SW_p= 3612.71676300578
##$SYMM= 0
##$S_DEV= 0
##$TDeff= 16384
##$TDoff= 0
##$TI= <>
##$TILT= no
##$TM1= 0
##$TM2= 0
##$TOPLEV= 0
##$USERP1= <user>
##$USERP2= <user>
##$USERP3= <user>
##$USERP4= <user>
##$USERP5= <user>
##$WDW= 1
##$XDIM= 16384
##$YMAX_p= 325272241
##$YMIN_p= -452645
$$ End of Bruker specific parameters
$$ ---------------------------------
##NTUPLES= NMR SPECTRUM
##VAR_NAME=  FREQUENCY,     SPECTRUM/REAL,   SPECTRUM/IMAG
##SYMBOL=    X,             R,               I
##VAR_TYPE=  INDEPENDENT,   DEPENDENT,       DEPENDENT
##VAR_FORM=  AFFN,          ASDF,            ASDF
##VAR_DIM=   16384,         16384,           16384
##UNITS=     HZ,            ARBITRARY UNITS, ARBITRARY UNITS
##FACTOR=    0.220516191357247, 1,           1
##FIRST=     3083.95170113859, 0,            0
##LAST=      -528.765061867193, 0,           0
##MIN=       -528.765061867193, -452645,     0
##MAX=       3083.95170113859, 325272241,    0
$$ Real data points
##PAGE= N=1
##DATA TABLE= (X++(R..R)), XYDATA
$$ [...]
11947H6840K365o0852j61017m3716J11343P946K023n071q986Q4174l3042M9047
11935C1054q5943Q2717M5863m6263J17199m4266j79908J19617P6212j0841K3205
11924A28646k25153O0941K6229K8201L8594L242j51855r1482M0653K7152l7717
11913a52549j07701N2227J87087M92J5796p5341Q9942P9139r768K9329o3485L691
11901D8859j21051j31461P4972P796J08669m2074j14918Q1803M3388J1930Q7995
11890E5908j40766q321R0746J71570n1852j5123P3818n2497o5005j01195J1843
11879c0874j47164j28205J29302J45521J7561K9316J4292r059j70667q0633J20789
11868a09821j8598N3748N3658J52765k22099o422Q6971M0991r2767N1365j8209
$$ plain form
11947 86840 89205 28353 -132664 -176380 -65037 -57091 -55068 -60139 -69125 15049 -17993 31054
11935 31054 -54889 27828 73691 27428 144627 100361 -79547 40070 116282 105441 128646
11924 128646 -96507 -35566 -9337 18864 57458 60700 -91155 -182637 -141984 -114832 -152549
11913 -152549 -260250 -208023 -20936 -20444 -4648 -79989 9953 89092 79324 108653 45168 48859
11901 48859 -72192 -203653 -128681 -120885 -12216 -54290 -169208 -87405 -44017 -32087 55908
11890 55908 -84858 -93179 -2433 169137 117285 102162 175980 123483 58478 -42717 -30874
11879 -30874 -178038 -306243 -176941 -31420 -13859 15457 29749 20690 -149977 -230610 -109821
11868 -109821 -128419 -74671 -21013 131752 -90347 -96769 -9798 31193 -61574 -10209 -28418
11857b8418j02318Q7783P3528J51275p2147k19664k8195J05472K0538N3811j75268
11846a33603Q9072K8301k2090K1135M8836l8730O3981N5770N5768p7565l842N6969
11834A44002m667j6183j00423q0011P8229p2100j49837o6506J18431J40571J03003
11823I4509J36670j79840j9200K2455o6810p7705P6607J13135q7286O3497o2885
11812A3147M447J6712j68637L3612L5300p4003J34359J9754n3364N6158r9881
11801h2396O6997J1970J3215L7445j91819J21639k5731r269M2777J3073j7205
11790a9304o6228K7692L3192k2110n7176J36376J20032j75902m7271J16448l3119
11779A2630r514K1096p9839Q7257J02359j3125l594P87L6761j57573l6635Q299
$$ plain form
11857 -28418 -130736 -42953 30575 181850 109703 -109961 -138156 -32684 -12146 41665 -133603
11846 -133603 -44531 -16230 -38320 -17185 31651 -7079 56902 112672 168440 90875 87033 144002
11834 144002 139335 123152 22729 -57282 20947 -51153 -200990 -267496 -149065 -8494 94509
11823 94509 231179 51339 32139 54594 -12216 -89921 -13314 99821 12535 76032 13147
11812 13147 17594 34306 -134331 -100719 -65419 -139422 -5063 14691 -38673 17485 -82396
11801 -82396 -15399 -3429 9786 47231 -144588 -22949 -48680 -57949 -15172 -2099 -19304
11790 -19304 -85532 -57840 -24648 -46758 -103934 32442 152474 -23428 -70699 45749 12630
11779 12630 3116 24212 -55627 31630 133989 120864 117270 118057 154818 -2755 -39390 -31091
11767c1091k053p454O9014L6991J612j94502j7604R460J579J20558o260j38496
11755a58246L1998J51686j25651M1254l8205J19484j0299l2596M3224n8076j6104
11744e1531k2874M9843J32027p7666m1211r5691J9251m5902L9581M0521j30308
11733a83960k8866p949j7449l2786J16770L7127L9631r0534J37560L1748j13171
11722a11879j0430L4220N960M1911n3510l8422k0187k4387l866J40667Q6171k6438
11710A9810L2860J29468j91527j48255J07744p3481j37498R7699O7275Q8047l0203
11699c8061j65339o6826K93714N5990j4023N3047j34257j17867j58178J04278
11689a87522J27232J27087k1335j6350l674J72341m1490p7753j71562j27226O0801
$$ plain form
11767 -31091 -33144 -40598 28416 65407 67019 -127483 -145087 -135627 -134048 -13490 -19750 -158246
11755 -158246 -126248 25438 -100213 -58959 -97164 22320 12021 -20575 22649 -35427 -51531
11744 -51531 -74405 -24562 107465 29799 -11412 -107103 -87852 -133754 -94173 -53652 -183960
11733 -183960 -212826 -220775 -238224 -271010 -154240 -117113 -77482 -168016 -30456 1292 -111879
11722 -111879 -122309 -88089 -82129 -40218 -93728 -132150 -152337 -176724 -180590 -39923 46248 19810
11710 19810 52670 182138 -9389 -157644 -49900 -123381 -260879 -163180 -95905 -7858 -38061
11699 -38061 -203400 -270226 23488 79478 65455 118502 -15755 -133622 -291800 -187522
11689 -187522 -60290 66797 45462 29112 25438 197779 156289 78536 -93026 -220252 -159451
11678a59451P7971J10177K7410L8365r6320N6569k1721q4895K1757r7864N2920
11667g5082M9532k02452J70355J06736L3988o7821p5001J48866m1498L7006M8260
11656A32889J328j20763K1192m396m770L0669k12208N9694J08376j1159M9757
11645E0609o846J8033L8511q4100j67530n9289J29844K1353j04190J01958P884
11634e3763k6239K1905j9207P1526K4099j02478j04318R2639N8664Q211r0201
11623a19162n2047J66637q5741o3566K5392O1031p8367q370M9176r0402J2190
11612a83229K3990Q2072l6256o2795M044J55034P1201j05104N8323J2053m8947
11601b9614l6931j5146j5351q4101o068Q9629k9179K4867j4916o817J20535J30077
$$ plain form
11678 -159451 -81480 28697 56107 94472 -1848 54721 33000 -51895 -30138 -128002 -75082
11667 -75082 -25550 -228002 -57647 49089 83077 15256 -59745 89121 47623 84629 132889
11656 132889 134217 13454 34646 30250 25480 56149 -156059 -96365 12011 852 50609
11645 50609 43763 61796 100307 16207 -151323 -210612 -80768 -59415 -163605 -61647 -53763
11634 -53763 -80002 -58097 -77304 -5778 18321 -84157 -188475 -95836 -37172 -28961 -119162
11623 -119162 -171209 -4572 -90313 -153879 -128487 -67456 -145823 -154193 -105017 -195419 -183229
11612 -183229 -159239 -77167 -113423 -176218 -172174 -17140 54061 -51043 7280 19333 -29614
11601 -29614 -66545 -81691 -97042 -181143 -187211 -97582 -126761 -101894 -116810 -123627 -3092 126985
11589A26985N8596o9252q5136J17609j70934L058M8900N181j11588k3698L7627
11578f2652J3943k4911p0687O4913r3597J96113O1125k7771J8411j45305J44356
11567G3938o8248M1138j7951n1330M1949m9459K1317L2623p4820k6163Q8118J00418
11555A11530n6689j79565Q2545J5476Q8234J29563j56974r9452N2334J61470L1564
11544A80036k49366N9901k3496j1369o4468J26605L4657j34053r5426L7661N7823
11533h1495Q2873p1839j5432k39L8088j41893J02389Q4106n6919J15148j3288
11522D1499k82996n5645O5906Q5422M0993l5613N6981m2693M1885p4079Q869o9233
11510b18704J17254J774N4759R7610j49632J27453J09714j93365j40407J39884
$$ plain form
11589 126985 185581 116329 31193 148802 -22132 -19074 29826 35007 -76581 -100279 -62652
11578 -62652 -48709 -73620 -144307 -79394 -172991 23122 84247 56476 74887 -70418 73938
11567 73938 5690 46828 28877 -22453 19496 -29963 -8646 23977 -50843 -77006 11112 111530
11555 111530 54841 -124724 -42179 -26703 61531 191094 34120 -65332 -12998 148472 180036
11544 180036 -69330 -9429 -32925 -44294 -108762 17843 52500 -81553 -176979 -139318 -81495
11533 -81495 1378 -70461 -85893 -86132 -48044 -189937 -87548 -3442 -60361 54787 41499
11522 41499 -241497 -297142 -231236 -145814 -104821 -140434 -83453 -126146 -84261 -158340 -149471 -218704
11510 -218704 -101450 -99676 -44917 52693 -96939 30514 140228 -53137 -193544 -53660
11500e3660R130l3297j233J23879O4536k36642j4454k4435l2400J24399Q7529
11489A3352J00457j11428j8278l7350j0389J00992j232M4142n7226j67287P6644
11478f7603R8726j07635k2194j09684J5332q412J48676R9207l0109J28291r6943
11467D7652N3760l284j50251R1940Q0566o7118L3336l912n9541M5952j4207q0144
11455b5251m8634l8878n6259J7469Q0199q4773j19747k2584J09285Q1341K525
11444a05307J44795k35127p4436J04145J42119Q9275r3088j35427M9699P7198
11434c6154j5720M8599K4894N1910J46483k43118J1272R5231m5601j09821J39292
11423F7267J0439j31055j62975K9638P4533Q5027K2399q9712R2777Q2063n437
$$ plain form
11500 -53660 -44530 -77827 -79060 44819 109355 -127287 -141741 -166176 -198576 -74177 13352
11489 13352 113809 2381 -15897 -53247 -63636 37356 36124 80266 23040 -144247 -67603
11478 -67603 31123 -76512 -98706 -208390 -193058 -201470 -52794 46413 16304 144595 47652
11467 47652 101412 98128 -52123 39817 120383 53265 86601 82689 23148 69100 54893 -25251
11455 -25251 -73885 -112763 -169022 -151553 -71354 -156127 -275874 -298458 -189173 -107832 -105307
11444 -105307 39488 -195639 -270075 -165930 -23811 65464 -27624 -163051 -113352 -36154
11434 -36154 -51874 -3275 21619 73529 220012 -23106 -11834 83397 37796 -72025 67267
11423 67267 77706 -53349 -216324 -186686 -112153 -27126 -4727 -94439 -1662 80401 74964
11412G4964k8978l2590j34527L2713j9955M1503j2868O9905l8452L9208K44163
11401B35086J3979j84226l3478K526Q3192j4258j02545N0524k6875j17759M1448
11390e2386R586Q5061N2071n9821j0795J61070q0604n0883l2322j01126M4891
11379c5258Q0761N8966p7866o6487r673j36746J42037k2187J16483J12677j51526
11368A1181l1285L1012k8049m6585m0690j2047l3719k455J28891J77307p6949
11357G6612r2232J8121m651M6706j1040j16699r5517R4273R0379r5450j42330
11346b31828J67079M0450Q4541k3937J40119n1798n1641q6105r1070p0705j5415
11335a90310l5429J90467P6352j27283J5236L5644j17616O2960O8636K460m6752
$$ plain form
11412 74964 45986 13396 -121131 -88418 -108373 -66870 -79738 -9833 -48285 -9077 235086
11401 235086 249065 64839 31361 33887 117079 102821 276 50800 23925 -93834 -52386
11390 -52386 -42800 42261 94332 34511 23716 184786 104182 53299 20977 -80149 -35258
11379 -35258 45503 104469 26603 -39884 -49557 -186303 -44266 -66453 50030 162707 11181
11368 11181 -20104 10908 -17141 -63726 -104416 -116463 -150182 -152637 -23746 153561 76612
11357 76612 -15620 2501 -2150 44556 33516 -83183 -178700 -84427 5952 -89498 -231828
11346 -231828 -64749 -24299 60242 36305 176424 124626 72985 -13120 -104190 -174895 -190310
11335 -190310 -225739 -35272 41080 -86203 -70967 -35323 -152939 -89979 -21343 -18883 -65635
11324f5635L9948L0938K0060J14345j42817R4036K4997j06553j59298J29424j62919
11313a83474M855J12805r7760M2366R4332M6257m1732j86867O9416K33046L9756
11302A33000j07039o0275q0821M2280N3526l4565j21350J21145j7311M0022J335
11291c0053J297J44806q0556k2155l6524k4596J23247j28761n1007J70937j9595
11280D7040J0845j26666J18558K3360q7327j7050L3693L0967l3755K7240q7071
11269f0166R078M4091P4054j35246m800M8587R0715K8255j50816k0437j8781J06023
11257A0557J32395m89j58332j03177k5382n5268k7756N5217J28156J52714r0159
11246A8476R0363o0610j18995O5346J68697p2690j51395K2843R0479j04442L7479
$$ plain form
11324 -65635 -25687 5251 25311 139656 -3161 90875 115872 9319 -149979 -20555 -183474
11313 -183474 -178619 -65814 -163574 -121208 -26876 19381 -22351 -209218 -139802 93244 133000
11302 133000 25961 -34314 -115135 -72855 -19329 -53894 -175244 -54099 -71410 -31388 -30053
11291 -30053 -28756 116050 35494 13339 -23185 -47781 75466 -53295 -104302 66635 47040
11280 47040 57885 -68781 49777 73137 -14190 -31240 2453 33420 -335 26905 -60166
11269 -60166 -51088 -6997 67057 -68189 -72989 -24402 66313 94568 -56248 -76685 -95466 10557
11257 10557 142952 142463 -15869 -119046 -144428 -199696 -227452 -172235 -44079 108635 18476
11246 18476 108839 48229 -70766 -5420 163277 90587 -60808 -37965 52514 -51928 -14449
11235a4449Q9836k360n9246m7043l0277k2504N7215k5536j4135N1830o0688N8307
11223a9050L8140o6284K1161Q2491j06838j6474J04405J207p37P5749O7802o7532
11211A14040j00467m5145j3508L0672P7646p2594j2465N284Q1543m7264o4720
11200d6978r1395J66582Q2104r3104m632J15717l9398O592k2039o9978n318o3530
11188f5377j05386O6831K17754j28038j8388l0974N9523L833m9700j9480n8043
11177a27445O5134R414L5899J81810O9837k561J3282K9972k06551k51776k7988
11166b10973P8588J11379L530N8607q8963k6017J62996K363o9058J40137m9173
11155A13416k8805m9133j35170J37607l5021J31432Q4614j33510k9729Q5979q5548
$$ plain form
11235 -14449 75387 73027 13781 -33262 -63539 -86043 -28828 -54364 -68499 -16669 -77357 -19050
11223 -19050 19090 -47194 -26033 56458 -50380 -66854 37551 38758 38021 113770 181572 114040
11211 114040 13573 -31572 -45080 -14408 63238 -9356 -21821 -16537 65006 17742 -46978
11200 -46978 -138373 28209 110313 17209 12577 128294 88896 95488 73449 3471 -1847 -65377
11188 -65377 -170763 -103932 113822 -14216 -32604 -63578 -4055 -222 -49922 -69402 -127445
11177 -127445 -62311 -52897 -16998 164812 234649 232088 245370 275342 68791 -182985 -210973
11166 -210973 -132385 -21006 -17476 41131 -47832 -73849 89147 91510 22452 162589 113416
11155 113416 84611 35478 -99692 37915 2894 134326 218940 85430 55701 141680 56132
11144E6132k2933L3747Q689k7609j55983K2976J40558k662J1870O6166j09931
11133B1020j4280O1861Q9071k16902J28298n9291J0779J05908J723j22292k6319
11122b0424K4120o1987J54506j6580o0093O2145l7134k02664q8922K1768J64131
11111f1134Q9598k8867J22712q5944j28313J32865J0644K8228j00629j2676J46799
11100A13283J23450j7014j63671r8342M0020J26298q3066q3718J44373N2381M810
11089A58804l9707K11617Q0268j01455L7849n1400j27612K994L0209q2897l127
11078A15543j07462n4483o5982r7332K38444q1714k6185J18221m2053O5790J32028
11067A94815k20281J7746R3361M4925O2767j00851k24372J8605J59272r9181k0825
$$ plain form
11144 56132 33199 66946 75635 48026 -107957 -84981 55577 52915 64785 130951 21020
11133 21020 6740 68601 157672 -59230 69068 9777 20556 126464 128187 5895 -20424
11122 -20424 3696 -58291 96215 79635 19542 81687 44553 -158111 -247033 -225265 -61134
11111 -61134 28464 -403 122309 36365 -91948 40917 51561 79789 -20840 -33516 113283
11100 113283 236733 219719 56048 -42294 -2274 124024 40958 -42760 101613 153994 158804
11089 158804 119097 330714 410982 309527 347376 295976 168364 171358 201567 118670 115543
11078 115543 8081 -46402 -112384 -209716 28728 -52986 -79171 39050 -3003 62787 194815
11067 194815 -25466 -7720 85641 130566 193333 92482 -131890 -113285 45987 -53194 -74019
11056g4019p628J38915O4938K7935K79j08053r1102P6830J04706n8222j60682
11045h6103M9414L6851K43926l1979j26673o955L7731L9971L0517m5185K2468
11034A63983m7466l1795M1924Q9371J53773j02606k2487p1256j33015q8105J29646
11023H1967O0342k784j42619J70337l3881N0962N5647j45734R9945m4174O4261
11012B14269q9030k42053J1566J34688j2985j27449K10903M9184r2264J1003n7130
11001A0702P0862j05848p5666J15926J57520k6186q1487o0960q2507l42J21695
10990D3709n1983J8363o243L5757q528m4003K3191j4650J08759k373o187K7577
10978A23389k7785o6777m8671k8892j01424J01542N7693j62366R0993N4153k3569
$$ plain form
11056 -74019 -81647 57268 122206 150141 150420 42367 -48735 28095 132801 74579 -86103
11045 -86103 -36689 162 244088 212109 85436 78481 116212 156183 186700 141515 163983
11034 163983 116517 84722 126646 216017 369790 267184 244697 173441 40426 -47679 81967
11023 81967 142309 139525 -3094 167243 133362 184324 239971 94237 194182 150008 214269
11012 214269 125239 -116814 -105248 29440 16455 -110994 99909 149093 56829 67832 10702
11001 10702 81564 -24284 -99950 15976 173496 147310 65823 4863 -77644 -77986 43709
10990 43709 -8274 10089 3846 39603 31075 -12928 10263 -4387 104372 101999 95812 123389
10978 123389 95604 28827 -19844 -48736 -150160 -48618 9075 -153291 -62298 -8145 -31714
10967c1714j1705j53522J14834J08844k4675K9768P5855o0945M8712p692p1218
10956A6542k4676j95128J18945J30761m4358j74895N2651J11686m6971M7165R2635
10945H4357o4087k6456L0403p2457J08856n508j17969L0069m2254K3709m1040
10934i2377q5426l3189K4898R3950J85703m9804k4659K6668p7668n1058J09486
10923B6524N2999q7779k8188m714Q5273J569q5481J20922M8710j90447j75438
10912b36050J82050J93861j60097k24908J48054J54463l7899n3363p1251K2739
10902h2401J02833m9358k00791j4275J58577p4650J68417N1659r8084M5704r6275
10891h8644R9808N8650o9962r0991K03110j14316Q1470J51864O2985k39622j05002
$$ plain form
10967 -31714 -43419 -196941 -82107 26737 2062 31830 107685 46740 95452 87760 16542
10956 16542 -8134 -203262 -84317 46444 2086 -172809 -120158 -8472 -55443 -8278 84357
10945 84357 20270 -6186 24217 -48240 60616 55108 -62861 -32792 -75046 -51337 -92377
10934 -92377 -177803 -210992 -186094 -92144 93559 43755 19096 45764 -31904 -82962 26524
10923 26524 79523 -8256 -36444 -41158 44115 45684 -39797 81125 129835 -60612 -236050
10912 -236050 -54000 139861 -20236 -245144 -97090 57373 19474 -33889 -105140 -82401
10902 -82401 20432 -28926 -229717 -243992 -85415 -160065 8352 60011 -38073 7631 -88644
10891 -88644 11164 69814 -148 -91139 111971 -2345 79125 230989 293974 54352 -50650
10880e0650O5940J20593j47175j49575J61203K3922J13011N2961M8482j9444k68896
10869d9628N4280J36069n8451m5284r1771L6602J34072j10112m0638P8971J4494
10858E8604k0786P542o0936N8668l7093o162r484j12761l1866J56665P0331r1318
10846a8596L04M7502J7698m1591J62719p4471N745r9901K9913J05879J09123k5328
10834B18996r9948m467k36j16063M9296L0430L1635m8849m6509j49193J21074
10823a3834J13514o2451J2578N143j44252P5389Q0164M3582L9466n9145J2567
10812A02721j52065j7847M3393J50990k1179q674j29885J09119M9828n5247p8401
10801g247P4619J23559l0544m7237N1768m199p1735p4371l5607M1357j10217k0708
$$ plain form
10880 -50650 15290 135883 -11292 -160867 336 24258 137269 190230 238712 219268 -49628
10869 -49628 4652 140721 82270 36986 -54785 -18183 115889 5777 -34861 44110 58604
10858 58604 37818 45360 -15576 43092 5999 -163 -9647 -122408 -154274 2391 72722 -18596
10846 -18596 -18292 29210 46908 5317 168036 93565 99310 -591 29322 135201 244324 218996
10834 218996 119048 114581 114345 -1718 47578 78008 109643 60794 14285 -134908 -13834
10823 -13834 99680 37229 49807 54950 -89302 -13913 66251 109833 149299 90154 102721
10812 102721 -49344 -67191 -23798 127192 106013 97339 -32546 76573 126401 71154 -7247
10801 -7247 67372 190931 160387 113150 164918 160719 88984 14613 -20994 20363 -89854 -110562
10789a10562k6747K8123J49366j33739o1984P1313J51198j5045j19568j2563J25443
10778D5235M6448J4002r0529q7569N4643J28026O0892l1991n2132m2832P4175
10767A18368r8992J03786p3031M7288M7008J82470j44285l4265p0946N9087j6853
10756A19635j48742r4844Q5086P4826m5629M5664N3429p0394r0844j15208N3691
10745a33330L96091Q2755k31518J9402O2575j05094M635P8712J3626r1274J47261
10734B43841j93406K7583j04497p3517M1378L8865M2291M6389Q4302K7660k17246
10723c6357k37467J21932N4573P0676J6802J86720j06845k91161L02462q3193
10713a858j20883m936M8706J08670q1647Q1618J90261o8962J25840l1777p0477
$$ plain form
10789 -110562 -137309 -109186 40180 -93559 -155543 -84230 66968 51923 -67645 -80208 45235
10778 45235 91683 105685 15156 -72413 -17770 110256 171148 139157 87025 44193 118368
10767 118368 19376 123162 50131 97419 144427 326897 182612 148347 77401 136488 119635
10756 119635 -29107 -123951 -38865 35961 -9668 35996 89425 19031 -71813 -187021 -133330
10745 -133330 262761 345516 113998 133400 195975 90881 95516 174228 187854 96580 243841
10734 243841 50435 78018 -26479 -99996 -58618 -19753 22538 68927 153229 180889 -36357
10723 -36357 -273824 -151892 -97319 -26643 -9841 176879 70034 -221127 81335 -1858
10713 -1858 -122741 -127677 -78971 29699 -51948 29670 219931 150969 276809 245032 174555
10702A74555j32818J39718J7646o8157l8550L8573l9368n8239o8180j15507J51887
10691A560O507L9787K3220J03860l6701k0685j59443P7166J13756J28970j13168
10680A64829n1904N4658K4310L390O8748N554j94138p1768Q4160l1706K2947P5208
10668A54288N9956k9050j36592O8124p7m702k6970M2178J07802o8248k86121J07494
10656a1918Q5498O6114j5531q1040l28Q6032O8154j65679j2616m7599L4126O7002
10644G2215j04791O017K6699q9786J29765J43589j30612K9642N2927l2205M437
10633A07897q6832J48487k2827L8877l1950k3112M4067R2772m5474Q2225n8974
10622B45156j1615J00667j61610j00635j78586M9745J91488J19385j45312k65110
$$ plain form
10702 174555 41737 181455 199101 130944 92394 130967 91599 33360 -34820 -150327 1560
10691 1560 8067 47854 71074 174934 138233 117548 -41895 35271 149027 277997 164829
10680 164829 112925 167583 191893 195283 264031 269585 75447 3679 87839 56133 79080 154288
10668 154288 214244 185194 48602 116726 116649 111947 84977 127155 234957 166709 -119412 -11918
10656 -11918 73580 139694 124163 43123 42795 128827 196981 31302 18686 -28913 5213 72215
10644 72215 -32576 -26559 140 -89646 40119 183708 53096 82738 135665 103460 107897
10633 107897 21065 169552 146725 185602 153652 130540 174607 267379 221905 304130 245156
10622 245156 233541 334208 172598 71963 -106623 -56878 134610 253995 108683 -156427
10612a56427p9852M1041L5447J23566j43308J6969J28488p382k9742O5013j74220
10601a80407M1612J9053L0944Q8744K7711M9807j83978J74480R1043m6121J5875
10590A28763J15225j08298l3010R1273o8148j57444l657O4044J19496j6107p2601
10579E9536m4418q1048K5496K4200r6071p480M4171L9556P9953L6286j25117l1712
10567g6648l4177N4122J00188J5661O755o2405j05902K2081J2196R9643K02961
10556B34475j75003k4287k9713q4847l6274J40134L8798j05761l4705K61210l5077
10545A48950j56994M3461l9571O1299J09988q8916j1572N6754k40541J7569N8910
10534d0663n8541K10393j81010J1701J21411N0978Q834l2166O4830m4023l3835
$$ plain form
10612 -156427 -236279 -195238 -159791 -36225 -179533 -162564 -34076 -41458 -71200 -6187 -180407
10601 -180407 -138795 -119742 -88798 -54 27657 77464 -106514 67966 159009 112888 128763
10590 128763 243988 135690 102680 193953 125805 -31639 -35296 28748 148244 132137 59536
10579 59536 15118 -65930 -40434 -16234 -112305 -119785 -75614 -36058 43895 80181 -44936 -76648
10567 -76648 -110825 -56703 43485 59146 65901 3496 -102406 -80325 -68129 31514 234475
10556 234475 59472 35185 5472 -79375 -115649 24485 63283 -42478 -77183 184027 148950
10545 148950 -8044 35417 -4154 57145 167133 78217 66645 123399 -117142 -99573 -40663
10534 -40663 -99204 111189 -69821 -58120 63291 114269 123103 90937 155767 111744 77909
10523G7909n9010P4024l3972m9519l6809n0753J49958j38817J5506R9901j60224
10512a11806m6456O4327Q9527N9872J40232j74807l6787M8898J0168l9775k6108
10501b2715J04148J2326n0823M9147j3736J7797j7679n9241o0304p8892Q9807
10490c0165n6765q868L20914q5770j33947J12611p8467J8719Q8179J3300j4873
10479A44868n2060n2543r3941K8907M0039J857O9245L6868R5758j7075k6485p0294
10467A05144R3413O9529Q114p3502l9640L004P2285l5156j54860m8222K6236J63003
10455A89348m1418j97862n6594J5091m8697l1492O7199J5477q2254O1046k2300
10444a32456R7352L5624O7985J518o1661O6815L9427p0320p1860L0070m5243j34723
$$ plain form
10523 77909 18899 92923 58951 9432 -27377 -78130 71828 -66989 -51483 48418 -111806
10512 -111806 -158262 -93935 -4408 55464 195696 20889 -15898 33000 43168 3393 -22715
10501 -22715 81433 93759 42936 92083 78347 96144 78465 19224 -41080 -119972 -30165
10490 -30165 -86930 -95798 225116 139346 5399 118010 39543 58262 146441 159741 144868
10479 144868 92808 40265 -53676 -24769 15270 17127 86372 123240 218998 201923 175438 105144
10467 105144 198557 268086 276200 202698 163058 166062 238347 203191 48331 109 26345 189348
10455 189348 147930 -49932 -106526 -91435 -140132 -171624 -104425 -88948 -171202 -110156 -132456
10444 -132456 -35104 520 68505 70023 8362 75177 114604 44284 -27576 2494 -42749 -177472
10432a77472J58843J52269p643n9232O2458l5601j15538J16060J06379m0531N1495
10421B11487O2454k59810j03595J53338J9019q4112j17361J65709M0928N4736
10411A42793J79982r6740j58620k09500J32201J58076p3622O0145j3570j5371
10401A05774R1222j63588j9966J4610J75555n1289j21222P0463j4158j17553M2524
10390A2372m7824k0791O8514K124N5047L1123l8437J6151P5223q3541J02867N7165
10378B29993j08002l0279p340Q242m27j85836J51298Q7234p5867n9527J70473
10367A79962J79793j48541l4886l5728J1800j73255J63773R7857j02961K5762
10357A63576M08r8183R6608J3615m359J28840r6840j14807L7393J88869N3951
$$ plain form
10432 -177472 -18629 133640 125997 66765 129223 93622 -21916 94144 200523 159992 211487
10421 211487 273941 14131 -89464 63874 82893 -1219 -118580 47129 88057 142793
10411 142793 322775 226035 67415 -142085 -9884 148192 74570 134715 121145 105774
10401 105774 196996 33408 13442 28052 203607 152318 31096 101559 87401 -30152 12372
10390 12372 -35452 -56243 12271 14395 69442 100565 62128 78279 153502 69961 172828 229993
10378 229993 121991 91712 84372 92614 92187 -93649 57649 144883 69016 9489 179962
10367 179962 359755 211214 176328 140600 152400 -20855 142918 240775 137814 163576
10357 163576 163984 65801 162409 176024 171665 300505 203665 88858 126251 315120 369071
10346C69071q4210q7714p7754p0678j3497l5854Q1837J79810m3953J7407m9231
10335A85234O2310j13157j36892J36109Q3912Q0724r4950j05993J6722R4225P9515
10324B87759N4622j04045r4655j04826j43717L5466P9n9061J81662Q2953O7253
10313B03490L6160k6320L1448J12078q8408O9558k12733l4528L8875n0505K5872
10302A04987j8082Q2275J8598Q168m1093m2689J10873r2770j12824K10200O6292
10291B93935j51011N756J1611j03542k5060l6370M3157M1425o5032M5373J3155
10280G3397p3554K11700p5795j41117J93601P9711K2865j02325n2590o9766k192
10269F3935J31363J16891j07468j4312J19765j45020n9130k3723Q7862K0922l0693
$$ plain form
10346 369071 284861 197147 119393 48715 35218 -636 81201 261011 217058 234465 185234
10335 185234 247544 134387 -2505 133604 217516 298240 203290 97297 114019 208244 287759
10324 287759 342381 238336 143681 38855 -104862 -69396 -69317 -128378 53284 136237 203490
10313 203490 239650 213330 244778 356856 268448 338006 125273 90745 129620 79115 104987
10302 104987 86905 169180 187778 195946 154853 112164 223037 130267 17443 227643 293935
10291 293935 142924 148680 160291 56749 31689 -4681 38476 79901 14869 60242 73397
10280 73397 -157 211543 135748 -5369 188232 267943 290808 188483 135893 66127 63935
10269 63935 195298 312189 204721 190409 310174 165154 106024 82301 170163 191085 160392
10258A60392j51475J70923K02421k72820K5305k5236j19788J38156R944N4267
10248A92089r7335o3501R8004K1625p8730J09785n3961p7682p111J90958N8386
10237B92527o0581J94199j13071p7307m8523o2223J89003N8637o9861j31050o0230
10226A11520l0383J14574m0297J05607j8748k05633K17357J26172o0001l09793
10216A0375K4281K83441P6369j79866q9800J03103J2471q4182m4402K35040l6711
10205C10119p4761j2887j15621k9641m9563n1884m6329K90657Q0609q8950O418
10194B18167M9661J50398j31437j57538Q9924L7128j52629J2434P6008p3725J38504
10183B56895n7237o9066j5143l3024J82288L4445L7159j05520n3909O4931L8525
$$ plain form
10258 160392 8917 179840 382261 109441 134746 109510 -10278 127878 137822 192089
10248 192089 94754 31253 129257 150882 72152 181937 127976 50294 43183 234141 292527
10237 292527 231946 426145 313074 235767 187244 125021 314024 372661 302800 171750 111520
10226 111520 81137 195711 155414 261021 242273 36640 253997 380169 320168 10375
10216 10375 34656 318097 394466 214600 124800 227903 240374 156192 111790 346830 310119
10205 310119 235358 222471 106850 77209 27646 -24238 -70567 220090 300699 211749 218167
10194 218167 267828 418226 286789 129251 219175 256303 103674 116108 192116 118391 256895
10183 256895 199658 130592 115449 82425 264713 299158 336317 230797 176888 241819 280344
10172B80344M9407j21113j03460N1970J13775j8182m6043q0827j3191j3794O1414
10161A60300J77253M3196J8092Q6265j39645m7954J72753J3729Q0163j86518j55894
10150B21740O3506J96629J01409k34474J60558q1915k3999K17831L7594j74039
10140D84840j34724M1282j13410J38729K3331P8376n6715K8636j9480J741R7906
10129E70512j35918j74171q7592R1843q9409J12778L14238K6978r2012J05130
10119F42377m1634k7821n2876K3011J7631K2571q0173K43618J0676j03221J3750
10108F67909q6413M64M7466J30064J21390p1753j01224j5437n923K19302K07547
10097A113392J26346N6043j8362J14705J38176N6565J58614K43965J69146J40522
$$ plain form
10172 280344 329751 208638 105178 157148 270923 252741 206698 125871 112680 98886 160300
10161 160300 337553 380749 398841 485106 345461 297507 470260 483989 564152 377634 221740
10150 221740 285246 481875 583284 348810 509368 427453 403454 621285 658879 484840
10140 484840 350116 391398 277988 416717 440048 518424 461709 490345 470865 472606 570512
10129 570512 434594 260423 172831 264674 175265 288043 602281 629259 537247 642377
10119 642377 600743 572922 520046 543057 560688 583259 503086 746704 757380 654159 667909
10108 667909 581496 581960 629426 759490 880880 809127 707903 692466 686543 905845 1113392
10097 1113392 1239738 1295781 1277419 1392124 1530300 1586865 1745479 1989444 2158590 2299112
10087B299112K2545k94887J25272p7734l44737o3839j30070j14317q9243j6452
10077A315650l0409L2587j05102O3142l4130m9396M5007J8991m3806r3175O6609
10066A185968R251o6367J27075J15172J2426K4379o6254N1202j39160L9304o2378
10055A230618J12016J7766J02118K0777l939j0343o4669q7350j36916j3162J42195
10044A309111j36219l1658p3667j40917n9696J16021L9640Q452q0872J15308J33351
10033A198854O3470j11720j10038J3483O519j00023j47221J23399Q2287n6389
10023I62621k8273J24214L139R6457j75401j44670m9506Q2650L5448K22066j60011
10012I68734j62220J10278k4919r8945K29J50706j7144j00912P0992K63264j2529
$$ plain form
10087 2299112 2321657 2026770 2152042 2074308 1729571 1665732 1535662 1421345 1332102 1315650
10077 1315650 1285241 1317828 1212726 1275868 1241738 1192342 1237349 1256340 1212534 1119359 1185968
10066 1185968 1195219 1128852 1255927 1371099 1383525 1407904 1341650 1392852 1253692 1292996 1230618
10055 1230618 1342634 1360400 1462518 1483295 1479356 1469013 1404344 1316994 1180078 1166916 1309111
10044 1309111 1172892 1141234 1067567 926650 866954 982975 1022615 1031067 950195 1065503 1198854
10033 1198854 1262324 1150604 1040566 1054049 1060568 960545 813324 936723 1019010 962621
10023 962621 934348 1058562 1061701 1158158 982757 838087 788581 871231 906679 1128745 968734
10012 968734 806514 916792 891873 792928 793157 943863 926719 825807 896799 1160063 1147534
10001A147534k4002Q3614j47613R9987L4377r1137N9221j00124r7692j81436J48066
9990I30795J25387j85945O3766q2880j2802k9474L7569l0074J068L3483Q8701
9979I39594k13432J16332J3894k18351p526K18908j31598n8853R5915P6914k0677
9968H11120p5452K18J0546L5220J03344o8312J56099L1713o2779p1168l386K2482
9956H89645j8336k0511q8197p887j09035K46593P2460m8104J2017L4769m4916
9945I18498R0j17247M1491L35O5065M1425M0990J6804K4242j97136R937m4118
9933H00376J22805j05528k6338J81192N4004N413j8466q7757J6705M2129m6681
9922I37854J16622r6017k2068N431L2510J04484K1780K0753J9372J25831j32925
$$ plain form
10001 1147534 1123532 1207146 1059533 1159520 1193897 1102760 1161981 1061857 964165 782729 930795
9990 930795 1056182 870237 934003 851123 838321 808847 846416 816342 817410 850893 939594
9979 939594 726162 842494 856388 638037 630511 849419 717821 658968 754883 831797 811120
9968 811120 735668 735886 746432 781652 884996 816684 972783 1004496 941717 870549 867163 889645
9956 889645 871309 850798 762601 754714 645679 892272 964732 916628 928645 963414 918498
9945 918498 918588 801341 842832 843167 908232 949657 990647 1007451 1031693 834557 844494 800376
9933 800376 923181 817653 791315 972507 1026511 1031924 1013458 925701 942406 984535 937854
9922 937854 1054476 958459 936391 941822 974332 1078816 1100596 1121349 1140721 1266552 1133627
9911A133627K1074n4845m4839K25263l249j11094M1001Q3392o3076j4318J87006
9900A399942l6469n6326m0599m4984O084R5167m4936l3969m3899J99467Q9256
9889A488734L4011J17488j73747j55903M3389L9957o266P1304l3849J59800r4309
9878A490609k4243R6470R6563p7354K3667O8389l0934n3348o3945J55540J00318
9867A781732N36L4566P835J25749K9315L7958p6900K7126j20879J45195o881p9939
9855A905413J47792j0163J4625J82337j1428J6796j36362N4178J17112n0101N5037
9844B285236o6338J37885m7646J40013O3136o014n0666j95585P1680J03366j7054
9833B418013J83398K9735j23043R174J15368O6582n7143Q3941M9390J05089j32512
$$ plain form
9911 1133627 1154701 1099856 1055017 1280280 1277031 1165937 1206938 1290330 1227254 1212936 1399942
9900 1399942 1363473 1307147 1266548 1221564 1227648 1322815 1277879 1243910 1200011 1399478 1488734
9889 1488734 1522745 1640233 1466486 1310583 1353972 1393929 1387663 1458967 1425118 1584918 1490609
9878 1490609 1466366 1562836 1659399 1582045 1605712 1674101 1643167 1589819 1525874 1681414 1781732
9867 1781732 1782268 1816834 1824669 1950418 1979733 2017691 1940791 1967917 1847038 1992233 1985352 1905413
9855 1905413 2053205 2043042 2057667 2240004 2228576 2245372 2109010 2163188 2280300 2230199 2285236
9844 2285236 2218898 2356783 2309137 2449150 2512286 2506272 2455606 2260021 2331701 2435067 2418013
9833 2418013 2601411 2631146 2508103 2517277 2632645 2699227 2642084 2726025 2775415 2880504 2747992
9822B747992r3651J20877J46338k1797O4110J89256j53331P8857J2848N0328q2322
9811C059505J57046O4714k894Q2952k219J54543J15035J13179k5167p9323J0553
9800C647924K12601K2415J18368o8551J07499P2657J18226J19843L9662N8638
9790D449282J84484m4983j11681J85053L36620J84408j14134M0693J41281Q4746
9780E335769K1551K70990K20312K4064O9722K31867J68713K00720L08102L48795
9770G200605M3260R0749K94819K40438L25228M41472K10892K26572L64087N13955
9760I952077L68403O13176N92157O11331N35532N99672Q03502P30253R91665J103122
9750A6900890J120426J286109J242725J561027J823211J849309K060846K405175
$$ plain form
9822 2747992 2654341 2775218 2921556 2899759 2963869 3153125 2999794 3078651 3091499 3141827 3059505
9811 3059505 3216551 3281265 3278371 3361323 3359104 3513647 3628682 3741861 3716694 3637371 3647924
9800 3647924 3860525 3882940 4001308 3932757 4040256 4112913 4231139 4350982 4390644 4449282
9790 4449282 4633766 4588783 4477102 4662155 4998775 5183183 5069049 5109742 5251023 5335769
9780 5335769 5357320 5628310 5848622 5872686 5942408 6174275 6342988 6543708 6851810 7200605
9770 7200605 7243865 7334614 7629433 7869871 8195099 8636571 8847463 9074035 9438122 9952077
9760 9952077 10320480 10933656 11525813 12137144 12672676 13272348 14075850 14806103 15797768 16900890
9750 16900890 18021316 19307425 20550150 22111177 23934388 25783697 27844543 30249718
9742C0249718K956273L537405L954988M343404M968087N562821O251250O637083
9734F8461029O830968O382527N562954M739887L860862K995862J592053j13400
9726A00312742j018158j564610k008352k498703l026906k868006j767197j133547
9718H4427263n79541l26444M59763R82077J317551J849044K339172K720276L166834
9709I6355995L706706L998588M617706N070026N441811N019077N094192N436544
9701A34740645N462382N344224N251633M240882L029281K276767J693426J219259
9693A63258499J17713j517484k701663k836566k410761k937184l505484l537937
9685A43929133k952583k437480k303684k494084k393063j974153k182531j836816
$$ plain form
9742 30249718 33205991 36743396 40698384 45041788 50009875 55572696 61823946 68461029
9734 68461029 75291997 81674524 87237478 91977365 95838227 98834089 100426142 100312742
9726 100312742 99294584 97729974 95721622 93222919 90196013 87328007 85560810 84427263
9718 84427263 83847722 83521278 83981041 84963118 86280669 88129713 90468885 93189161 96355995
9709 96355995 100062701 104061289 108678995 113749021 119190832 124209909 129304101 134740645
9701 134740645 140203027 145547251 150798884 155039766 158069047 160345814 162039240 163258499
9693 163258499 163376212 161858728 159157065 156320499 153909738 150972554 147467070 143929133
9685 143929133 140976550 138539070 136235386 133741302 131348239 129374086 127191555 125354739
9677A25354739j765094j734345j269680j128725j039770o11761n73056r35684
9669A16296624j310662j722394k220080k563135k725537l349468l744937l793770
9661I4866641l604068l151939k740279k154207j597079j287604q78079n48857
9653G8904529l08261l24350k36313n20152o98443j220063j781541j952720k319990
9644F9542696k562733k874337k994348l305473l268528k824960k673402k545659
9636D6493256k063484k011823j665515j412308j212250j092178j170134r49915
9628C4915649n87504q98390q88227q44352p50371p39281p39726q19802o99833
9619B7948163o67550n85717n72143p19184q27671n76990p84001p28799n26729
$$ plain form
9677 125354739 123589645 121855300 120585620 119456895 118417125 117805364 117232308 116296624
9669 116296624 114985962 113263568 111043488 108480353 105754816 102405348 98660411 94866641
9661 94866641 91262573 88110634 85370355 83216148 81619069 80331465 79453386 78904529
9653 78904529 78596268 78271918 78035605 77515453 76817010 75596947 73815406 71862686 69542696
9644 69542696 66979963 64105626 61111278 57805805 54537277 51712317 49038915 46493256
9636 46493256 44429772 42417949 40752434 39340126 38127876 37035698 35865564 34915649
9628 34915649 34328145 33429755 32541528 31697176 30946805 30207524 29467798 28647996 27948163
9619 27948163 27280613 26694896 26122753 25403569 24575898 23998908 23214907 22486108 21959379
9610B1959379n61696l99835m82272m11683m18209m19039k48848j34150k33168
9601A8650479k79658k68133K6016L9545r8641q9415j25487l1603j60189p4276
9591A7588638k17190k88218j41624l65452j05873l44685l25608m07113l36538
9582A5056337m59127k94758n39600n17873l70833k95955m03481n52086l25789
9573A1296835j72388k41716l83349l94608l16517m7203j92937l20244l10856p4723
9563H842294k22249k25845k33451k74761k00270k06895R0399j13319j87164j14069
9553G154670j18913j89690m3160j01765j61804j43246k82523m0969N0531J2209
9543F135340J12319k54599j16679J19605j20603l8285q5029k9520k9603j18379
$$ plain form
9610 21959379 21397683 20997848 20515576 20103893 19685684 19266645 19017797 18883647 18650479
9601 18650479 18370821 18102688 18128704 18168249 18069608 17980193 17854706 17823103 17662914 17588638
9591 17588638 17371448 17083230 16941606 16576154 16470281 16125596 15799988 15392875 15056337
9582 15056337 14597210 14302452 13762852 13244979 12874146 12578191 12174710 11622624 11296835
9573 11296835 11124447 10882731 10499382 10104774 9788257 9741054 9548117 9227873 8917017 8842294
9563 8842294 8620045 8394200 8160749 7885988 7685718 7478823 7569222 7455903 7268739 7154670
9553 7154670 7035757 6846067 6802907 6701142 6539338 6396092 6113569 6072600 6123131 6135340
9543 6135340 6247659 5993060 5876381 5995986 5875383 5837098 5752069 5722549 5692946 5574567
9533E574567l4375l6406j96474j73037j58778j17768n0033k22275k03127R067
9523D391361O2989j13750J6464j23527Q9268o1424j07643J00515j50405l7235
9513D066613Q5582O8288J75p8883m6347J23706o791m8527j1511o5764L4560p3898
9501D047203j22165j29174j40113J69989n5977R1908M3214j76030p2739m837j46774
9490C504505N6906l430L5470o4830o7540j41019j22161Q588J04557n0207p4491
9479C186348o5291R8083K12788l61256k50073J13176J32392K34480O466j44206
9469C162907j96391J73951K19j02527L1383M0588J0318k09138j65968J91910j11907
9458B825345k7601J15277k1830R6009Q7170l6917O7Q178j00643p6675m9552R2741
$$ plain form
9533 5574567 5540192 5503786 5307312 5134275 4975497 4857729 4807696 4585421 4382294 4391361
9523 4391361 4454350 4340600 4357064 4233537 4322805 4261381 4153738 4254253 4103848 4066613
9513 4066613 4152195 4220483 4220658 4141775 4095428 4219134 4212343 4163816 4152305 4086541 4121101 4047203
9501 4047203 3925038 3795864 3655751 3825740 3769763 3861671 3904885 3728855 3656116 3651279 3504505
9490 3504505 3561411 3557981 3593451 3528621 3461081 3320062 3197901 3206489 3311046 3260839 3186348
9479 3186348 3121057 3219140 3431928 3070672 2820599 2933775 3066167 3300647 3307113 3162907
9469 3162907 2966516 3140467 3140686 3038159 3069542 3110130 3120448 2911310 2745342 2937252 2825345
9458 2825345 2797744 2913021 2891191 2987200 3074370 3037453 3037520 3045698 2945055 2868380 2818828 2911569
9446B911569k51014M6695j13887q7343M343J20363n7557q2068k2809k651q4802
9435B380839J68882K1855r5446m985R9333k1361r8764M5003O567n2479Q6723K8519
9423B564686o3854l4721J2443N801n2026n0234L4320m0137o9180K4264j5336M9586
9411B365612n6938J26427J22024J20066L0909k2639J4284R7909J6501L39515P3342
9400C227012r4435L33089O8394L7619l3811j01259N8427j48758k25397O3176m7195
9389C136862k3525l7810k265n0287j83665M1848M829p2031Q7497L613k7468O2887
9377B940485n8327K5519N9083p2347K04359R1323N7626l8776J8416K22417O0318
9366C510096o6965M7176k7167L2377k00037o3311K27067L2794k5071n4684J11559
$$ plain form
9446 2911569 2660555 2707250 2593363 2506020 2510363 2630726 2573169 2491101 2468292 2465641 2380839
9435 2380839 2549721 2571576 2476130 2471145 2570478 2549117 2450353 2495356 2501923 2449444 2536167 2564686
9423 2564686 2500832 2466111 2478554 2484355 2432329 2382095 2416415 2376278 2307098 2331362 2316026 2365612
9411 2365612 2308674 2435101 2557125 2677191 2708100 2685461 2699745 2797654 2814155 3153670 3227012
9400 3227012 3132577 3465666 3534060 3571679 3537868 3436609 3495036 3346278 3120881 3184057 3136862
9389 3136862 3113337 3075527 3073262 3022975 2839310 2881158 2885987 2813956 2901453 2905066 2877598 2940485
9377 2940485 2882158 2907677 2966760 2894413 3098772 3190095 3247721 3208945 3227361 3449778 3510096
9366 3510096 3443131 3490307 3463140 3495517 3295480 3232169 3459236 3492030 3466959 3412275 3523834
9355C523834m8476M3530M1635m747L167L5790J88218m1718L9419Q07R2293R429
9343C883181j38862J50233J24217R5132N2552J59095n5990k8003J3416R496Q5779
9332D350246J24443k8499P0762L86Q1318R9147q6066j23060L6956N1484j7J3466
9320D590566J6889j21453J51157L2396O8726o3668J16743J19278J42251k4853
9310E028032j5994N6050q7002N0323p763j638L1729L4656R8403M7147M020J47706
9298E385669j70163M3386O5209R5424k7614L7764l0930l9991K07936J75212J59600
9287E901502J56356K8402n4205K65467R9652j39172R3933L9775l1624J02978N3376
9276F516440j28111R5137K68448J3326K22986K39460J51065K62603K01261L06727
$$ plain form
9355 3523834 3475358 3518888 3560523 3555776 3558943 3594733 3782951 3741233 3780652 3781459 3873752 3883181
9343 3883181 3744319 3894552 4018769 4113901 4166453 4325548 4269558 4241555 4254971 4264467 4350246
9332 4350246 4474689 4446190 4516952 4517338 4598656 4697803 4611737 4488677 4525633 4577117 4577100 4590566
9320 4590566 4607455 4486002 4637159 4669555 4738281 4674613 4791356 4910634 5052885 5028032
9310 5028032 5012038 5068088 4981086 5031409 5023646 5022008 5053737 5088393 5186796 5233943 5237963 5385669
9298 5385669 5215506 5258892 5324101 5419525 5391911 5429675 5398745 5358754 5566690 5741902 5901502
9287 5901502 6057858 6086260 6032055 6297522 6397174 6258002 6351935 6391710 6360086 6463064 6516440
9276 6516440 6388329 6483466 6751914 6765240 6988226 7227686 7378751 7641354 7842615 8149342
9266H149342L15908K49331K19726K52702J99902K68158J57467N452J5415J4921
9256I848324r4961l5492j40356N2179J01648j6437O6971P5302J23122K49779K02331
9245A0432410K23322L91624N05239L86856L61710K51530R2224M0004K07266J96786
9235A3088971J19040J42217K40123J99264K12904L97276M58408N05598O33723
9226A5997524K63397L12337K16670J97939p5306n1154j63498j12744r1146r2409
9216A6401610k32777l51177O3069j37227J42970J89577J48060K28038M85014K55056
9206A7192213L52739M31367M07507O99480N01569O51724Q38618P96051O40484
9197B2511752O40787Q85845O23123J010093J141832J256196J330541J169817R42098
$$ plain form
9266 8149342 8465250 8714581 8934307 9187009 9386911 9655069 9812536 9817988 9833403 9848324
9256 9848324 9753363 9717871 9577515 9629694 9731342 9714905 9781876 9857178 9980300 10230079 10432410
9245 10432410 10655732 11047356 11552595 11939451 12301161 12552691 12644915 12684919 12892185 13088971
9235 13088971 13208011 13350228 13590351 13789615 14002519 14399795 14858203 15363801 15997524
9226 15997524 16260921 16573258 16789928 16987867 16912561 16861407 16697909 16585165 16494019 16401610
9216 16401610 16168833 15817656 15880725 15743498 15886468 16076045 16224105 16452143 16937157 17192213
9206 17192213 17544952 17976319 18383826 19083306 19584875 20236599 21075217 21871268 22511752
9197 22511752 23152539 24038384 24661507 25671600 26813432 28069628 29400169 30569986 31512084
9188C1512084N01458M39372O47480O75311M67296J23779j68818K3947L53561L80552
9178C4956022L79496N83052M15705P17066Q77874Q62675R60622J152102J560657
9169D2465271J670939J909356K192239K475745K610149K934289L058443L706059
9161F3022490L510284L666717L538309L579366L727828M015976M025030L787861
9153I2873861L044705J731774P75072q1691K50314P53567j62279j614486k655943
9144I4914894k949902j989110j256486p15427j34413N53025J168681J839468K141767
9135I3572497L092010M015377N235800O503990P798445Q843801R783253J1306433
9127A50151606J2456271J2945973J2429082R666120O121536K634446J458930J865056
$$ plain form
9188 31512084 32013542 32452914 33100394 33775705 34243001 34366780 34197962 34221909 34575470 34956022
9178 34956022 35335518 35918570 36334275 37051341 37929215 38791890 39752512 40904614 42465271
9169 42465271 44136210 46045566 48237805 50713550 53323699 56257988 59316431 63022490
9161 63022490 66532774 70199491 73737800 77317166 81044994 85060970 89086000 92873861
9153 92873861 95918566 97650340 98425412 98343721 98594035 99347602 99185323 97570837 94914894
9144 94914894 91964992 89975882 88719396 88003969 87869556 88422581 89591262 91430730 93572497
9135 93572497 96664507 100679884 105915684 112419674 120218119 129061920 138845173 150151606
9127 150151606 162607877 175553850 187982932 197649052 203770588 206405034 207863964 209729020
9119B09729020J17996k246232m286893m842795n021480o560755p751350q085999
9111A71051512q626497r623193r553973q281010p079591o261932n584457n182222
9103A10858637m580071m145418l929307l349094l019504k777120k257156j869912
9095H4931055j566917r58796m11514L0668L70439P87839Q12415J035520J137353
9086H6168062Q98354L88171L11737N75995M21088N92069Q93266J302127J691063
9077I3241932J499318J365662J235415J369708Q90290N85710K53320k99580p97032
9068I9344743j446400j567899j873634k220803k263743k632339k479933k291236
9060H2568756k126604j722676j304047j024567o25645j64410K76917M47907Q68652
$$ plain form
9119 209729020 209847016 207600784 203313891 198471096 193449616 186888861 179137511 171051512
9111 171051512 162425015 152801822 143247849 134966839 127887248 121625316 116040859 110858637
9103 110858637 106278566 102133148 98203841 94854747 91835243 89058123 86800967 84931055
9095 84931055 83364138 82405342 81993828 82024496 82394935 83182774 83995189 85030709 86168062
9086 86168062 87066416 87454587 87766324 88342319 88763407 89355476 90248742 91550869 93241932
9077 93241932 94741250 96106912 97342327 98712035 99602325 100188035 100441355 100141775 99344743
9068 99344743 97898343 96330444 94456810 92236007 89972264 87339925 84859992 82568756
9060 82568756 80442152 78719476 77415429 76390862 75765217 75600807 75877724 76325631 77194283
9051G7194283J212009J614304J962299J995654K193271K338066K959328K896488
9043I4365702K794118K642747K693231K426351J919764J274366N22268k23161
9035A08415386q05775j325398j849680k517449k864216l105148l028047l184359
9027H9735314l059496k751108k478516k021693j739289j328757j244576q06939
9019G4304940l16630k59435K64165L15131N93257P02135R46811J103647Q89918
9010G8543939P22479L64444k3515L14786J36778k7852j05082k00599k17801j44568
9000G9363009M4175L59731R73787J191390J847870K327040K955668L140790L584794
8991I5788254M266002M580955M499814M229154L719410L362641K685055L184858
$$ plain form
9051 77194283 78406292 80020596 81982895 83978549 86171820 88509886 91469214 94365702
9043 94365702 97159820 99802567 102495798 104922149 106841913 108116279 108638547 108415386
9035 108415386 107609611 106284213 104434533 101917084 99052868 95947720 92919673 89735314
9027 89735314 86675818 83924710 81446194 79424501 77685212 76356455 75111879 74304940
9019 74304940 73988310 73728875 73993040 74308171 74901428 75603563 76550374 77654021 78543939
9010 78543939 79266418 79630862 79607347 79922133 80058911 80031059 79925977 79725378 79507577 79363009
9000 79363009 79407184 79766915 80740702 81932092 83779962 86107002 89062670 92203460 95788254
8991 95788254 100054256 104635211 109135025 113364179 117083589 120446230 123131285 126316143
8983A26316143L941648M666431M665770M352645L584656K458824J175833l3425
8975A51128525m34159o97475j274491j863626j786383j876729j549393j062035
8967A40584234l51704J45427N09261J063857K130818K707929L165950L664689
8959A53620461L468782K948824K655742L121423L988976M369154M323058L610861
8951A82107281K865346J827405Q83904M20091R95924J232369J078694J010542
8943A92421556N00229m7710p36678p43783j46258J09710L04556N92209J297857
8934A93551688K017186L409135N665522Q590671J1918144J3938644J4771608J6943831
8926B70806429J8052481J7812024J2531068O070239n768220k1645598k1010230
$$ plain form
8983 126316143 130257791 134924222 139589992 143942637 147527293 149986117 151161950 151128525
8975 151128525 150694366 149996891 148722400 146858774 145072391 143195662 141646269 140584234
8967 140584234 140232530 140377957 140887218 141951075 144081893 146789822 149955772 153620461
8959 153620461 157089243 160038067 162693809 165815232 169804208 174173362 178496420 182107281
8951 182107281 184972627 186800032 187683936 188104027 189099951 190332320 191411014 192421556
8943 192421556 192921785 192874075 192137397 191393614 191247356 191357066 191661622 192253831 193551688
8934 193551688 195568874 198978009 204643531 213234202 225152346 239090990 253862598 270806429
8926 270806429 288858910 306670934 319202002 325272241 319504021 297858423 276848193
8919B76848193j4662093j0128716q763824q453941q169594p781634q034333q498190
8911B02355868p997079o908047n835098n017946m501025m272040m012607m180876
8903A59631150l763595l587328l700283l873768l738610l847355l786381l585215
8895A29748615l289478k728991k374926k078622j627159j326817j114996o88876
8887A14518750n63751o75272p11521r48261j289586j625861j982410k348109k435909
8878A01938070k647365k698375k688255k497969k510531k322184k016720j732516
8870H2824155k020149j661036j570665j615419j424898j339875j469908j476019
8862G0246186j386685j197580j229585j423316j375978j576382j282878j079042
$$ plain form
8919 276848193 262186100 252057384 243293560 234839619 226670025 218888391 210854058 202355868
8911 202355868 194358789 187450742 181615644 176597698 172096673 167824633 163812026 159631150
8903 159631150 155867555 152280227 148579944 144706176 140967566 137120211 133333830 129748615
8895 129748615 126459137 123730146 121355220 119276598 117649439 116322622 115207626 114518750
8887 114518750 113954999 113279727 112568206 111619945 110330359 108704498 106722088 104373979 101938070
8878 101938070 99290705 96592330 93904075 91406106 88895575 86573391 84556671 82824155
8870 82824155 80804006 79142970 77572305 75956886 74531988 73192113 71722205 70246186
8862 70246186 68859501 67661921 66432336 65009020 63633042 62056660 60773782 59694740
8854E9694740r61107r71523r30648p60635p85932j026121j273990j208338j354158
8845E0422288j526211j521454j305956j380613j538297j707097j410774j550446
8837C8481440j129757r29076j216822q37923j268158r39761p56594p04173p14149
8828B9985027n08354m92019n29097m20892p94113n38069n36093n34368m66063
8819B5165959m28850l99028n16834m14459m09378m24444j00178m06095k16501
8810B1850192k99888j34849l77002m14747j05684j18644k68838l99911m49468
8801A9281161l16924k10012k56808k67588k77902l18167l97154j96460k08035
8792A6832111l24017k41246j60731k54651k65474k96293j37683k68294j7623p8761
$$ plain form
8854 59694740 58733633 57762110 56831462 56070827 55284895 54258774 52984784 51776446 50422288
8845 50422288 48896077 47374623 46068667 44688054 43149757 41442660 40031886 38481440
8837 38481440 37351683 36422607 35205785 34367862 33099704 32159943 31403349 30699176 29985027
8828 29985027 29476673 28984654 28455557 28034665 27240552 26702483 26166390 25632022 25165959
8819 25165959 24737109 24338081 23821247 23406788 22997410 22572966 22472788 22066693 21850192
8810 21850192 21550304 21415455 21038453 20623706 20518022 20399378 20130540 19730629 19281161
8801 19281161 18964237 18754225 18497417 18229829 17951927 17633760 17236606 17040146 16832111
8792 16832111 16508094 16266848 16106117 15851466 15585992 15289699 15152016 14883722 14866099 14787338
8782A4787338j20573k23451j06143m8518l8618K5007L4251Q5682J42800J59905
8772A4697680K6695j3897q4872J37057K17492K30099K59298L01827L47659K92770
8762A6411808K28404N01652N90438N68547O05088O12312Q29188J007491J235007
8753B2589935R23255J142780R51587P53791Q26344O16500K64376N0102q8297n52956
8743B7477417p41530q07331p58440r41620j139110r20940r79127q14123n39548
8734A9835648o67122n92488m84882o14783m89198j39166k17390j95866J3335m451
8724A6443637Q270J23821K29273L99143N27798O50468O11702N78169P73739P11593
8714B1057613P68087N40032K14546L99083O0710k59625n30532o26926o07668q70521
$$ plain form
8782 14787338 14666765 14443314 14337171 14288653 14250035 14275042 14309293 14394975 14537775 14697680
8772 14697680 14724375 14710478 14625606 14762663 14980155 15210254 15469552 15771379 16119038 16411808
8762 16411808 16640212 17141864 17732302 18300849 18905937 19518249 20347437 21354928 22589935
8753 22589935 23513190 24655970 25607557 26361348 27187692 27804192 28068568 28118670 28030373 27477417
8743 27477417 26735887 25928556 25170116 24228496 23089386 22168446 21189319 20375196 19835648
8734 19835648 19168526 18576038 18091156 17476373 16987175 16848009 16630619 16434753 16448088 16443637
8724 16443637 16451907 16575728 16805001 17204144 17731942 18382410 18994112 19572281 20346020 21057613
8714 21057613 21825700 22365732 22580278 22979361 23040071 22780446 22249914 21622988 21015320 20144799
8704B0144799q13820q30969q38582r31676q80145p56282m97064p45525n35446
8695A3315290p68377o64214n34575l61333l10472l81723l42733k57333l28031
8686I366499k42192n8741j73340j26984j26509K9638j54310N372N0394P2293j54150
8675H487970J4286j16905p6837N4734o3913j70280k74541q8317r5135l1887j35416
8664G503759j84231r6071j28131l67968j71840m1644r7628k8109k7818O6339p2141
8653F354517j59100j15223K9470k35412K4993j19926L4005J93345K0443l6081
8643E991031Q4963m5852k0075k17892O4289J57722Q2561j09406q1438L3663K5643
8632E965209l8121r485p7787p1539K5703j03980L5165j94279j48229j25832N8936
$$ plain form
8704 20144799 19330979 18500010 17661428 16729752 15849607 15093325 14596261 13850736 13315290
8695 13315290 12546913 11882699 11348124 10986791 10676319 10294596 9951863 9694530 9366499
8686 9366499 9124307 9065566 8892226 8765242 8638733 8668371 8514061 8519433 8569827 8642120 8487970
8675 8487970 8502256 8385351 8308514 8363248 8299335 8129055 7854514 7766197 7671062 7639175 7503759
8664 7503759 7319528 7223457 7095326 6727358 6555518 6513874 6416246 6388137 6360319 6426658 6354517
8653 6354517 6195417 6080194 6109664 5874252 5899245 5779319 5813324 6006669 6027112 5991031
8643 5991031 6075994 6030142 6010067 5792175 5856464 6014186 6096747 5987341 5905903 5939566 5965209
8632 5965209 5927088 5917603 5839816 5768277 5793980 5690000 5725165 5530886 5382657 5256825 5315761
8621E315761K6912K1097j72633j21775R222L1596p690j27328K8442n9073r0814
8610D853717k43717j07694p4687p2794J28495L7738p9237L5589J9984j89007m2875
8599D265512K5768O5829o6686K08647m8518o2632J49491J07614P264m65O8211
8588D720035K47589k02345k04429P4417J10384K17644J37022M3343l2075j39245
8578D972340m1109J09218j8140k5161j41112J19909k63584j39593j4854k6596
8568D531318l2745n1050j07767p9873J8868p8366n8815n6846M6898j43350O9114
8557D057386N7580j17575J52264J46412l3730M8769j09518Q0727Q1445P198J0763
8546D381721J5881M5219O4997J6724j06907m978k0008k01203n7645l2538R914
$$ plain form
8621 5315761 5342673 5363770 5191137 5069362 5078584 5110180 5102490 4975162 5003604 4944531 4853717
8610 4853717 4610000 4502306 4427619 4354825 4483320 4521058 4441821 4477410 4497394 4308387 4265512
8599 4265512 4291280 4357109 4290423 4499070 4450552 4387920 4537411 4645025 4652289 4651824 4720035
8588 4720035 4967624 4765279 4560850 4635267 4745651 4963295 5100317 5143660 5111585 4972340
8578 4972340 4931231 5040449 5022309 4997148 4856036 4975945 4712361 4572768 4557914 4531318
8568 4531318 4498573 4447523 4339756 4259883 4278751 4200385 4141570 4084724 4131622 3988272 4057386
8557 4057386 4114966 3997391 4149655 4296067 4262337 4311106 4201588 4282315 4363760 4370958 4381721
8546 4381721 4397602 4442821 4507818 4524542 4417635 4412657 4392649 4191446 4133801 4101263 4111177
8535D111177q2620k34250l5371m4132k8495J38108l5988o4685n5190N035q6083
8524C587506k02993J41934J25808J62748Q4699m2365M0850J20215R9572k1957
8514D096017L1590p4843p1552m839J8496j09493j64051M7755J1846J55163j17128
8503C818961l6941r9619j00331J24130l0963J17608K1634l07496l9549L7587j41779
8492C363242q1987K05487O0331l2678N5244J6001R070j9062J15582K09765o5860
8481C835135l5455j5337m9778J75616k5056R9851J65583j74399O5123P0780m4330
8470D067733k5638J956Q5661L1175Q6072J08831R0634J47273P461J99516J42620
8459D943294R9668K52485m9542K84118K93722J71683O4840M36068J60726J70354
$$ plain form
8535 4111177 4028557 3794307 3758936 3714804 3686309 3824417 3788429 3723744 3668554 3673589 3587506
8524 3587506 3384513 3526447 3652255 3815003 3899702 3857337 3898187 4018402 4117974 4096017
8514 4096017 4127607 4052764 3981212 3976373 3994869 3885376 3721325 3769080 3780926 3936089 3818961
8503 3818961 3782020 3682401 3582070 3706200 3675237 3792845 3814479 3506983 3467434 3505021 3363242
8492 3363242 3281255 3486742 3547073 3514395 3569639 3585640 3594710 3575648 3691230 3900995 3835135
8481 3835135 3799680 3784343 3734565 3910181 3885125 3984976 4150559 3976160 4041283 4112063 4067733
8470 4067733 4042095 4044051 4129712 4160887 4246959 4355790 4446424 4593697 4601158 4800674 4943294
8459 4943294 5042962 5295447 5245905 5530023 5823745 5995428 6060268 6496336 6657062 6827416
8449F827416L30901J77437j18090J71205K41178j60607p2735p0555o094J31517
8439G451573J62574K06999M14844L39152L16124M17381M87076M29578M83714L07373
8429A1016388L70308L65480m8155K2555j34540N8798J06242J54860M36140K02061
8419A2550137M34513L91013K86159Q2488N893k04262m13915k98272l03199m64004
8409A2066551m91320k65456l33549m33546n02146l38069j32712k49103j79734
8400I140916j23074j8542J834P763k09549l07614r1842j82446k92275j32784j00194
8389G692193j95049j82294j52350J35893j2443j76539k96545k42013R6092j40474
8379F526471k56083k8237j0162p2663m0354J01397j45955j0436K15826m5076o1841
$$ plain form
8449 6827416 7158317 7335754 7217664 7388869 7630047 7469440 7396705 7326150 7320056 7451573
8439 7451573 7614147 7821146 8235990 8575142 8891266 9308647 9795723 10225301 10709015 11016388
8429 11016388 11386696 11752176 11704021 11726576 11592036 11650834 11757076 11911936 12348076 12550137
8419 12550137 12984650 13375663 13661822 13744310 13750203 13545941 13132026 12833754 12530555 12066551
8409 12066551 11575231 11309775 10976226 10542680 10040534 9702465 9569753 9320650 9140916
8400 9140916 9017842 8999300 9001134 9008897 8799348 8491734 8399892 8217446 7925171 7792387 7692193
8389 7692193 7497144 7314850 7162500 7298393 7285950 7109411 6812866 6570853 6666945 6526471
8379 6526471 6270388 6242151 6231989 6159326 6118972 6220369 6074414 6063978 6279804 6234728 6172887
8368F172887L06403M40109K23823L02790J78902R3906j61385q1549q1471m6343
8358G348072p4382Q7629J62982J51295J11016K23331J77432J07042J42595j888
8348H435124M1733R6925O8227n5390j11399j80726j21789L6296j28621j28926
8338G951454k70641l9625J30533k34938M6748p4904j13110Q682L6749J06121P9468
8327G626537J53652N7248L3619p669R579j69234j08088r0576k44821j05107o9864
8316G085276R4710L7173j21603k6897P9398n6298J28982n1264j53688q08q3527
8305F931454j33344k41241j03348M8169l85772o6119l6015k98870j33804J24507
8295E705617L3178r9019n2177J8010J09088j61398m6186L7629o9630k0297n5748
$$ plain form
8368 6172887 6479290 6919399 7143222 7446012 7624914 7718820 7557435 7475886 7394415 7348072
8358 7348072 7273690 7361319 7524301 7675596 7786612 8009943 8187375 8294417 8437012 8435124
8348 8435124 8476857 8573782 8642009 8586619 8475220 8294494 8172705 8209001 8080380 7951454
8338 7951454 7680813 7641188 7771721 7536783 7583531 7508627 7395517 7404199 7440948 7547069 7626537
8327 7626537 7780189 7837437 7871056 7863387 7872966 7703732 7595644 7505068 7260247 7155140 7085276
8316 7085276 7179986 7217159 7095556 7068659 7148057 7091759 7220741 7169477 7015789 7014981 6931454
8305 6931454 6798110 6556869 6453521 6501690 6115918 6049799 6013784 5714914 5581110 5705617
8295 5705617 5738795 5639776 5587599 5605609 5714697 5553299 5507113 5544742 5475112 5454815 5399067
8284E399067J34659q6087J9258O1465m1177m3755q362j93597j29413K65201K1032
8273E398291M8053q1779J6727J09362o4282k12636j93198j49171J6257J1948o0123
8262D839449p5872j00718j77753j54983M4050L306q9335l4856j199j31485l9748
8251D080856J11503k19487J8984l6661k3604K80026l3124r9648l0029j4853o409
8240D027554p2947L3666K39516l155j31216q6486J8645Q8553n0708j93959K2112
8229C891575P1920L7879q017j39797j96180p7691N0638J60331j03837j58374j05665
8218C422782m8145j8210j93887J06390n3351j05214P1233Q351R3926Q4003j14026
8207C253852m6505j46024j0774J0979Q7189m9701k0187j4739q0363J7061N0688
$$ plain form
8284 5399067 5533726 5447639 5466897 5528362 5487185 5443430 5435068 5241471 5112058 5377259 5398291
8273 5398291 5446344 5364565 5381292 5490654 5426372 5213736 5020538 4871367 4887624 4899572 4839449
8262 4839449 4763577 4662859 4485106 4330123 4374173 4377479 4288144 4253288 4252089 4120604 4080856
8251 4080856 4192359 3972872 3991856 3955195 3931591 4211617 4178493 4078845 4048816 4033963 4027554
8240 4027554 3954607 3988273 4227789 4224634 4093418 4006932 4025577 4114130 4063422 3869463 3891575
8229 3891575 3963495 4001374 3993357 3853560 3657380 3579689 3630327 3790658 3686821 3528447 3422782
8218 3422782 3374637 3356427 3162540 3268930 3215579 3110365 3181598 3189949 3283875 3367878 3253852
8207 3253852 3207347 3061323 3050549 3061528 3148717 3099016 3078829 3064090 2983727 3000788 3051476
8196C051476M0512L7301j021J41901L97570n87034l75048j72016n5901P2052N0879
8185B600671p4592n6091J00402j7754M6724J10072k3181q8725q966O2267k5670
8174B625157k1990J63558j74384o3373Q3j11397K8185l2126N5793Q4227J6767
8163B570500j0011K182K1773p97k11263K4426L6911m185J23987k9257J33670j62309
8151B495627j22353N5503M8364l8139O4267j83290n2993l4067M7106l6644K4194
8140B267575k08509N0172J90484n2204j01811Q2250O3634r4358n5521N1746j13713
8129B079745r2870p4731k44588R2368k1835J14079n5777L9032p6228L1601n0510
8118A740286l0475Q5688M339j8222l6047J02150j04399j4847N7298l7947j31811
$$ plain form
8196 3051476 3091988 3129289 3128268 3270169 3667739 3080705 2705657 2533641 2477740 2549792 2600671
8185 2600671 2526079 2469988 2570390 2552636 2599360 2709432 2686251 2597526 2588560 2650827 2625157
8174 2625157 2603167 2766725 2592341 2528968 2529051 2417654 2445839 2413713 2469506 2553733 2570500
8163 2570500 2560489 2562671 2584444 2583647 2372384 2396810 2433721 2429536 2553523 2524266 2657936 2495627
8151 2495627 2373274 2428777 2477141 2439002 2503269 2319979 2266986 2232919 2280025 2243381 2267575
8140 2267575 2059066 2109238 2299722 2247518 2145707 2227957 2291591 2197233 2141712 2193458 2079745
8129 2079745 1986875 1912144 1667556 1759924 1738089 1852168 1796391 1835423 1759195 1790796 1740286
8118 1740286 1709811 1795499 1799838 1781616 1745569 1847719 1743320 1728473 1785771 1747824 1616013
8107A616013L0901O8718O2334j12380o9309O1964p0165K2467r1754J6566M414
8096A539769p0090j9596J6087J21362o8827j27705J40380j47489j5291R5450J37800
8085A601850m2255p297J57472j49206K03988o2010j96024O305O1211M7730p2854
8074A548910n7513L654O2182M4116m1112o5359o4837J6840J46304Q5117o1367
8063A616935j8464j03326r5822R7891K03131n6347r8097l6718p4205M4793N5330
8052A535101M5278j17282q5542k8929n9642p2308k0677J27299J0468o1724J30528
8041A402570N4374p5901l4102P7925M4723j09018P8554J55936q131J66962p2474
8030A681418k5432j49415J12022K7964j37774l9368j37975L6801O2950k18359
$$ plain form
8107 1616013 1646914 1715632 1777966 1665586 1596277 1658241 1588076 1610543 1518789 1535355 1539769
8096 1539769 1469679 1450083 1466170 1587532 1518705 1391000 1531380 1383891 1368600 1464050 1601850
8085 1601850 1559595 1552298 1709770 1560564 1764552 1702542 1506518 1512823 1574034 1621764 1548910
8074 1548910 1491397 1495051 1557233 1601349 1560237 1494878 1430041 1446881 1593185 1678302 1616935
8063 1616935 1598471 1495145 1399323 1497214 1700345 1643998 1545901 1509183 1434978 1479771 1535101
8052 1535101 1580379 1463097 1377555 1348626 1288984 1216676 1195999 1323298 1333766 1272042 1402570
8041 1402570 1456944 1381043 1346941 1424866 1469589 1360571 1439125 1595061 1586930 1753892 1681418
8030 1681418 1655986 1506571 1618593 1646557 1508783 1469415 1331440 1368241 1431191 1212832
8020A212832n7814J7739J29197J14843j7921j11724o4381O8935l2645j4707j19351
8009A125003j11303P4799J07774K5680q9442L5176L9077o8383K24679J2906j26475
7998A249491j23403J43481J55868O4508k4445r4419Q0798J04143J21742n6074
7988A621690K4226k03360N972K50042q1268j83197k1609n438O5707j271n3663
7977A417831p6376n8096j63146L5754J22975L8921J52466M9210O6328L913K15717
7966A805497K97088K85922n2149M8923J20605K4092M7588M473q0527j80887j4058
7955B306567k1471q9771j098k06700l6686N9283k0761r0937j91207n6067k8386
7944A622766K6164k4573j39538J66344J57294o0883J21249J75879q0632M5821
$$ plain form
8020 1212832 1155018 1172757 1301954 1416797 1398876 1287152 1222771 1291706 1259061 1244354 1125003
8009 1125003 1013700 1088499 1196273 1221953 1132511 1167687 1206764 1138381 1363060 1375966 1249491
7998 1249491 1126088 1269569 1425437 1489945 1465500 1371081 1451879 1556022 1677764 1621690
7988 1621690 1645916 1442556 1448528 1698570 1617302 1434105 1412496 1407058 1472765 1471494 1417831
7977 1417831 1341455 1283359 1120213 1155967 1278942 1317863 1470329 1519539 1585867 1589780 1805497
7966 1805497 2102585 2388507 2336358 2385281 2505886 2529978 2577566 2582039 2501512 2320625 2306567
7955 2306567 2285096 2195325 2194227 1987527 1950841 2010124 1989363 1898426 1707219 1651152 1622766
7944 1622766 1648930 1624357 1484819 1651163 1808457 1747574 1868823 2044702 1964070 2009891
7934B009891N9302J37922p2994r8882J15512J75892n697j02248j58215l6106L879
7923B028256K4195p5183j86586q470j5004j00007Q0838j05970J1017o0612j20021
7912A472453K09M7093J02069J31354o7871J97j02828k1768J10400J38058o9698
7901A739668K9415J59480N9705K45894J09064n2595J1686j3566k03008j91023
7891A894720K4791N610l47600m5172q3317J90538q7759j25519J9840J39413Q067
7880A593612k03865k11834j25024K9408Q4537R675J16838k4055n4820O67J71031
7869A386170L405j27668O2810Q9806K3131l4719j16208j24963L5120M0215J5222
7858A252321j852k28544j72962M7752R0336L9795p4870k62406K5069J47129j37654
$$ plain form
7934 2009891 2069193 2207115 2134121 2035239 2150751 2326643 2320946 2218698 2060483 2024377 2028256
7923 2028256 2052451 1977268 1790682 1782212 1767208 1667201 1748039 1642069 1653086 1592474 1472453
7912 1472453 1472662 1519755 1621824 1753178 1685307 1685504 1582676 1560908 1671308 1809366 1739668
7901 1739668 1769083 1928563 1988268 2234162 2343226 2290631 2302317 2288751 2085743 1894720
7891 1894720 1919511 1925121 1577521 1532349 1449032 1639570 1551811 1426292 1446132 1585545 1593612
7880 1593612 1389747 1177913 1052889 1082297 1166834 1176509 1293347 1269292 1214472 1215139 1386170
7869 1386170 1389575 1261907 1324717 1414523 1437654 1402935 1286727 1161764 1196884 1237099 1252321
7858 1252321 1250469 1021925 848963 896715 987051 1026846 951976 689570 714639 861768 724114
7847G24114j17602J75857M0879O8787j3658q9463N4855P9892l8808Q7798L3202
7836A005853l5794k9525Q012n4785r2316J1704J20157j0775j15722Q253l2181
7825G82881K02172K9288k04009K5244L7539J1959r550k9598K0704K4986K11300
7814A102916n4054P9585p1774Q9171J98146Q3115P3356k9323p6597J37902O2081
7803A594524n2116j26015q2864m8190j6363R5274n6444j48916r8226j46750j02137
7792H11777J40590j31399J8088J22574j7873K8913p7457K5413J47430P1472p936
7781A131592J7555J74361Q8662J1128n6008r0727Q7421J22593K0374k976R861
7770A513836P845O7191m5083k35815p9262L5958j3381k04090K2425r9693j47744
$$ plain form
7847 724114 606512 782369 823248 892035 878377 788914 843769 923661 884853 972651 1005853
7836 1005853 970059 940534 948546 893761 801445 813149 933306 922531 806809 815062 782881
7825 782881 985053 1014341 810332 835576 873115 885074 875524 845926 866630 891616 1102916
7814 1102916 1048862 1128447 1056673 1145844 1343990 1427105 1500461 1471138 1394541 1532443 1594524
7803 1594524 1542408 1416393 1333529 1285339 1268976 1364250 1307806 1158890 1060664 913914 811777
7792 811777 952367 820968 839056 961630 943757 972670 895213 920626 1068056 1139528 1131592
7781 1131592 1149147 1323508 1412170 1423298 1367290 1276563 1363984 1486577 1506951 1503975 1513836
7770 1513836 1521681 1588872 1543789 1307974 1228712 1264670 1251289 1047199 1069624 969931 822187
7759H22187O3312j14262k3753r7178j10718K985K7394n6234Q6030J37228R393
7748G46384j66635R9379O4164J15401j87727J09829j27442P1252R4711j51408
7738F67908J47510k18368j5979P1122o4527N9594Q0649J0431j19465j73529K09135
7727F54481q267r9297J19445o2648k28844m0056J8392N705J0308o0692o7138J22812
7715C64201K5283m2996J01449R7142m5691q2079o8740j23423R6502M2479l256
7704C60871j07333J24688N8366k54082l2568k5821K3041q4336J29089J26864j23709
7693A95070q9311j4021J00381J80383j39109n5632j17629k7754J63066P5081q2559
7682A87966J2739N2908K2795o8316L6289k3512K1524k8654p6760p5682p7443J02432
$$ plain form
7759 822187 885499 771237 747484 650306 539588 542573 569967 513733 599763 736991 746384
7748 746384 579749 679128 743292 858693 670966 780795 653353 724605 819316 667908
7738 667908 815418 597050 581071 652193 587666 647260 727909 738340 618875 445346 654481
7727 654481 646214 546917 666362 603714 374870 334814 353206 358911 369219 308527 241389 364201
7715 364201 389484 346488 447937 545079 499388 417309 348569 225146 321648 364127 360871
7704 360871 253538 378226 436592 182510 149942 124121 147162 62826 191915 318779 195070
7693 195070 105759 91738 192119 372502 233393 177761 60132 32378 195444 270525 187966
7682 187966 200705 253613 276408 208092 244381 220869 242393 213739 136979 61297 -16146 86286
7670H6286R901j19816o3598R0142J49269O2961k37948l0424o696J11743L7673
7659H9493K05799N428L9314j00320j14832o7259q848O6460q2691N1409N9141J20949
7647B64043n2089o2687q2160J5968k180J38994j95536q7375P8412k9216r1504
7636a05330R0750k3932Q6374Q9567K565j85452J29962K0676k56709K92915J22655
7625B64041j02713o3906j01041k78674J98522J60658J06255p7670o3501K6317
7615F8288l3803N7736K23377j44606m0850m0036j08343l2810O4202M0533o432
7604D7256Q1625o0533K2359J4603J38025n5528p5921j35634P2010J72701N0069
7593B71032k17105q8866R887J0488P9925p2980r568J3519J4168R3525Q7090r6946
$$ plain form
7670 86286 96187 -23629 -87227 2915 152184 215145 -22803 -53227 -59923 51820 89493
7659 89493 295292 300720 340034 239714 124882 57623 48775 115235 32544 83953 143094 264043
7647 264043 211954 149267 67107 83075 80895 219889 24353 -63022 15390 -13826 -105330
7636 -105330 -14580 -38512 47862 137429 139994 -45458 84504 105180 -151529 141386 264041
7625 264041 161328 97422 -3619 -282293 -83771 76887 183142 105472 41971 68288
7615 68288 34485 92221 315598 170992 130142 90106 -18237 -51047 13155 53688 47256
7604 47256 128881 68348 90707 105310 243335 187807 111886 -23748 48262 220963 271032
7593 271032 53927 -34939 -25052 -14564 65361 -7619 -17187 -3668 10500 104025 191115 94169
7581I4169k9344r0211J23195M0462l4743j70058K2660J78022j29930j01793P599
7570h9972n6432R2809j1905n3668m3384l0189J50275j8710l7835n5886n1297P9602
7558a26592J05147L944J65748j79236l9534J34692J9003k09933j18698J96731
7548d8728m0622j02581q838R5080K0380M8979N1605n3437p6108L2837j13931L0791
7536a64573J0037J77007L0573j78011N9073M5411L8192L878K0387j28790j7723
7525a04539M460J75333J56370j63877p2899J24334k43557J42470J48290j46293
7515B0092j59811j1944J23537O4757K5832P3572p515L1077M9798j05540R538p9925
7503C3468j6171q797j4346j57091L1427N1203m5219J36776p1512m105K8200m91
$$ plain form
7581 94169 64825 -25386 97809 138271 103528 -66530 -43870 134152 4222 -97571 -89972
7570 -89972 -146404 -53595 -65500 -119168 -162552 -192741 -42466 -61176 -99011 -154897 -206194 -126592
7558 -126592 -21445 -17501 148247 -30989 -70523 64169 83172 -126761 -245459 -48728
7548 -48728 -89350 -191931 -200769 -105689 -85309 -36330 15275 -38162 -114270 -81433 -195364 -164573
7536 -164573 -154536 22471 53044 -124967 -65894 -20483 17709 21587 41974 -86816 -104539
7525 -104539 -100079 75254 231624 67747 -5152 119182 -124375 18095 166385 20092
7515 20092 -139719 -151663 -28126 36631 62463 136035 128520 159597 209395 103855 113393 33468
7503 33468 17297 8500 -5846 -162937 -131510 -80307 -125526 11250 -60262 -64367 -36167 -36658
7491c6658J23322l8901O5931j1192m0558r4911Q5103M4618M6300n9520r0387J62281
7479A55428j29805P5012j56279j20003J26554Q729k7401p4685J21479k73N8474
7468C7230k1253j93474R34M9771J81226M8219o9218J24950j98122j3402J8153
7457c4986j6777K26566j27998n6989O4728p5184r5112j0695m5500K11879K2230
7446F2162j7830k02431L5207R3780m6954j26490J25565N983q2116J37921n4538
7435f9741J36225M5325N3798L9120k1148k14096j00387J31215J34875P6319n1375
7424A60130L6830K5170j85818j54050R2420J75377o3263K4427o2425J29378j28794
7413D9382J65935j06469m9181o6425J12638M0251M692k4136k17111p863L343l8341
$$ plain form
7491 -36658 86664 47763 113694 102502 61944 -32967 52136 96754 143054 83534 -6853 155428
7479 155428 25623 100635 -55644 -175647 -49093 -40364 -67765 -142450 -20971 -21244 37230
7468 37230 15977 -177497 -176563 -126792 54434 102653 33435 158385 -39737 -53139 -34986
7457 -34986 -51763 174803 46805 -10184 54544 -20640 -115752 -126447 -171947 39932 62162
7446 62162 44332 -158099 -122892 -29112 -76066 -202556 -76991 -71008 -153124 -15203 -69741
7435 -69741 66484 111809 165607 204727 183579 -30517 -130904 311 135186 211505 160130
7424 160130 196960 222130 36312 -117738 -25318 150059 86796 111223 48798 178176 49382
7413 49382 215317 108848 59667 -6758 105880 146131 150823 126687 -90424 -98287 -94944 -133285
7401a33285K9481M4076K5161j764J14359N916r0963j2688n0151N1185J6788l7518
7389c9403K1083O0783j7651R5258J15985r9563n2692M6105l2208l7495m1514J8942
7377C7630j8578J29135q754K8505q9065J86521k16420j29645O5875J22737q237
7366I9704j41304O8668j73559j7208m5936M1115J20446K6600J13720r9192J2589
7355E643k3383J921m4641j32035J28110K56637n7206R3361p8286j86063p8104
7344a14046L8072r134J42044q320O3489o5920L797j38416j913R6205p0972K5179
7332c9935r8300L1966O1528N4434j31626P0486j61694j4331J50334M9599j21376
7321a48915n4394k4043j9419N0183Q2369R7005K04412p0415j32648K2863j39248
$$ plain form
7401 -133285 -103804 -59728 -34567 -36331 78028 83944 -7019 -19707 -69858 -18673 -1885 -39403
7389 -39403 -18320 42463 24812 120070 236055 136492 83800 129905 97697 60202 18688 37630
7377 37630 19052 148187 139433 167938 78873 265394 48974 -80671 -14796 107941 99704
7366 99704 -41600 27068 -146491 -163699 -209635 -168520 -48074 -21474 92246 -6946 5643
7355 5643 -17740 -15819 -60460 -192495 -64385 192252 135046 228407 150121 -35942 -114046
7344 -114046 -75974 -85108 56936 48616 112105 46185 49982 -88434 -90347 5858 -65114 -39935
7332 -39935 -138235 -106269 -44741 9693 -121933 -51447 -213141 -227472 -77138 -27539 -148915
7321 -148915 -203309 -227352 -246771 -196588 -114219 -17214 187198 116783 -15865 6998 -132250
7310a32250j33919J72009Q424N453N8194j1864l3527j1216j8058j01635J98010
7299c79J62314j7235j1606l8473R3833N7942j78457n96P944r9979o2647J02353
7287A5014O0570J54743j34978j55502K15776j66204n1278K5382J23118M5273p4793
7276E7121p3498N4385R2172j86504R773j86918j7179k2438R8388P8287O7523k5735
7264e4623l1176k4300o3274M4920J24174K00303r3459j848M6221J377j16415j99675
7252a67775K5233J32464M931M2003J2154j5741j06509j2510j2226K6011p870K4342
7240e5493M1424p3176j96578J28075N8656R2911o7097p2370J28798J5374q7953
7229h7429O5184K0643O8751r401N4081j01952p1495q079O9043j37646J33396J28575
$$ plain form
7310 -132250 -266169 -94160 -85736 -80283 -22089 -33953 -67480 -78696 -96754 -198389 -379
7299 -379 161935 144700 133094 94621 188454 246396 67939 67343 75287 -24692 -87339 15014
7287 15014 75584 230327 95349 -60153 155623 -10581 -61859 -36477 86641 131914 57121
7276 57121 -16377 38008 130180 -56324 -46551 -233469 -250648 -273086 -174698 -96411 -28888 -54623
7264 -54623 -85799 -110099 -173373 -128453 -4279 196024 102565 100717 146938 148315 31900 -167775
7252 -167775 -142542 -10078 -5147 36856 49010 33269 -73240 -85750 -97976 -71965 -79835 -55493
7240 -55493 -14069 -87245 -283823 -155748 -97092 -4181 -71278 -143648 -14850 524 -87429
7229 -87429 -22245 -1602 67149 57748 111829 9877 -61618 -69697 -654 -138300 -4904 123671
7217A23671j53814K02040J46793j22418j52472Q6977J090k19340Q0717j7058r3887
7206a17701j1222J5155J21159j04537o4702L4582M038J899Q5052J9172j8997o5703
7194a01805K89851j3002r5011q6760J6933K3092J656k3331q3021J2367J23557
7183F4526m8313P3376j8099L2059q262k17959j787L8854M8070j55758j07216K02910
7171i7599Q1504n7687m0165m7537O2266q1037q4208j6655Q0308J32270l8124K29143
7159A22479l2212r3781Q0900J4690o6839j37569P9002J278k2852J54810j5533
7148H4373R6693k0883j15732N0275l4595q0833j400l8268j03649N8053O9687J71462
7136A35183j58157N6476J52357j20695J59701n8418j19512l7022L9813k90124
$$ plain form
7217 123671 -30143 171897 318690 196272 43800 130777 131867 -87473 -6756 -23814 -117701
7206 -117701 -128923 -113768 7391 -97146 -161848 -127266 -123228 -121329 -36277 -17105 -36102 -101805
7194 -101805 188046 175044 80033 -6727 10206 33298 34954 11623 -71398 -59031 64526
7183 64526 16213 89589 71490 103549 95287 -122672 -124459 -85605 -37535 -193293 -300509 -97599
7171 -97599 -16095 -73782 -113947 -161484 -99218 -180255 -264463 -281118 -200810 -68540 -106664 122479
7159 122479 90267 -3514 77386 92076 25237 -112332 -33330 -32052 -54904 99906 84373
7148 84373 181066 160183 44451 94726 60131 -20702 -22102 -60370 -164019 -105966 -36279 135183
7136 135183 -22974 33502 185859 65164 224865 166447 46935 9913 49726 -240398
7126b40398K11976J10100o6008J07865M1006J4971j12148M3907j807R3267j7061
7115A85670j45963k7130O2765j01737R4041K7856K7741r6200p0103O0122K7852
7104D4914L5443j13977K14574L9978r298j06638j3891J664p5955K6094J0525J31946
7092A85379o6615M1449j19373l1177J17952k6762q8501J4800L820O0991k2130
7081F9833j16892r5718J97686J33360o8862R0921N8981p7210k30582J02342O2857
7070A26716o4045l5358P1277j1206n640R4294n9231k5313J23578O9952j66001
7059A19023j79529j3838R3344j8063R7215q6175K4706J20782J79407K05817N9603
7048F02292r3233l27278j19434N9619L155n6502J08910n4488N4646K7429k4164
$$ plain form
7126 -240398 -28422 81678 15670 123535 164541 179512 67364 111271 109464 202731 185670
7115 185670 39707 12577 75342 -26395 67646 95502 123243 27043 -43060 17062 44914
7104 44914 80357 -33620 180954 220932 211634 104996 91105 92769 16814 42908 53433 185379
7092 185379 118764 160213 40840 9663 127615 100853 12352 27152 30972 91963 69833
7081 69833 -47059 -142777 54909 188269 119407 210328 269309 192099 -38483 63859 126716
7070 126716 62671 27313 98590 87384 81744 176038 116807 91494 215072 285024 119023
7059 119023 -60506 -74344 19000 937 98152 11977 36683 157465 336872 542689 602292
7048 602292 509059 181781 62347 121966 125121 68619 177529 123041 177687 205116 180952
7037A80952j10922J01834K6514j4083O0040Q0268N1494j75977L8478Q7505p8443
7026B47660j90518J03837j36181L2477J34887J01111O4142J35387p4774q958o0885
7015C48185J97228k5769j51119j19026J45762J62450k1508r3533n8620l2810L126
7004C54366l3620p7132j3521j66559K1323M502J46911J10775j3097r9693P9650
6993C13905n3325O8018k9779j58359J20575M3527q7154L5553l6327j35511R9825
6982A80948J20339k5855n891j6053K2838l2032L5482M8772q1412r045J44644j4303
6970C68432q9308k8205n0641K8000q509j49999n2612K78753J6171j93192O8175
6959A87065K00361Q6423j18410m3222m3433j08188J28589j9822j05386J03678
$$ plain form
7037 180952 70030 171864 198378 184295 244335 324603 376097 200120 238598 326103 247660
7026 247660 57142 160979 24798 57275 192162 293273 357415 492802 418028 409070 348185
7015 348185 545413 519644 368525 249499 395261 557711 536203 442670 384050 351240 354366
7004 354366 320746 243614 230093 63534 84857 89359 236270 347045 333948 234255 313905
6993 313905 260580 328598 298819 140460 261035 304562 217408 252961 216634 81123 180948
6982 180948 301287 275432 269541 253488 276326 244294 279776 328548 247136 238091 382735 368432
6970 368432 279124 250919 200278 228278 219769 69770 17158 295911 312082 118890 187065
6959 187065 387426 473849 355439 312217 268784 160596 289185 269363 163977 267655
6949B67655p7443p0977O6411J10972r5509j0176m0119r8237J34268p3947r8955
6938A3943P182q3876J10420j33690n9641J15412J54106Q7210L4867n878p1548
6927A68507l727J06178Q2159j60544p9386R4309l3380o414J13085J27463l6966
6916C71284p3262j6350p0127Q421K1455m8205J30864l0225O150j04387o8874k1872
6904A04872m4496L6382m4816J01117j22955J32007J68634j8184J09119J53036
6894E74716r9840k80809L4904J21975j10218j62932O1754K1681J03355M401L6651
6883C05638j06140M0031l6178j965J35537q5547J9117L2438J290K1940K2611k2247
6871C26525Q8077k3810K6482n9126j8412P9995j32516j1038J8290n0059M2238
$$ plain form
6949 267655 190212 119235 185646 296618 201109 190933 150814 52577 186845 112898 13943
6938 13943 21125 -62751 47669 -86021 -145662 -30250 123856 211066 245933 240055 168507
6927 168507 164780 270958 353117 192573 113187 207496 174116 167702 280787 408250 371284
6916 371284 298022 281672 211545 219966 241421 193216 324080 293855 300005 195618 126744 104872
6904 104872 60376 96758 51942 153059 30104 162111 330745 312561 421680 574716
6894 574716 474876 194067 228971 350946 240728 77796 139550 161231 264586 268987 305638
6883 305638 199498 239529 203351 201386 336923 251376 270493 302931 304221 326161 348772 326525
6871 326525 414602 390792 417274 358148 339736 419731 287215 276177 294467 244408 286646
6860B86646J83107j684r2637J00187P9669j00397r7074m0611J5928M4943J47865
6849E25942K20272j87547j6290O1763k8770j54535k665k49151n2118Q9012j9234
6838A86679J85629K1869R8069O3670r0648K1691j1387j06903J81040q71o5383
6827D83455j00891l425Q2399N1117L0936j12721J22472l350o7846j8084M8957
6816E13019l5353K4564J83965R780p8740O8010l4898L3645P7977L8008k03991
6805E95986j4433L5632l0398O413J28650j18074J35654O3880J9415p8185m3900
6794G00640j1464Q3633O6683N8446r9969J7467J34153j79921p5464K098O8761
6783G65063k5109Q5003p8288M5603Q547l2245j0358j64972J4032k8197N3411O7831
$$ plain form
6860 286646 469753 468069 375432 475619 555288 454891 357817 317206 333134 378077 525942
6849 525942 746214 558667 542377 604140 575370 420835 418170 169019 116901 205913 186679
6838 186679 372308 394177 492246 555916 465268 486959 475572 368669 549709 548838 483455
6827 483455 382564 379139 461538 512655 543591 430870 553342 549992 482146 464062 513019
6816 513019 477666 502230 686195 695975 617235 685245 650347 683992 761969 799977 595986
6805 595986 581553 617185 586787 593200 721850 603776 739430 803310 822725 744540 700640
6794 700640 689176 772809 839492 897938 797969 815436 949589 769668 694204 696302 765063
6783 765063 739954 824957 746669 792272 800819 768574 758216 593244 607276 579079 632490 700321
6771G00321O3405J61207l2828q3428p4500j1702m114J58861j10389j6616k01649
6760E48568o6289L9830m975L8058P0732J09224N5947L769K8804k4549J8073j36597
6748F80595l0850L8266L4146J32992J9591j64364L0121N828K7829J86660P8665
6737A039479p9668M8894k877p7813P776j1097n1447J6911l7502J30827O3927m3535
6725A003875R0967o9633J5417J41341m7142k21921Q5843O8817J7452M6845J2048
6714A143909M2804Q1064P0940j29036J1410J19901N8581K08288k6750j62449Q1341
6703A500003k07029j27820n7028J20793K08572j09138j5688M0502J45407L4431
6693A533005J77686L5510j44527k7074P9453K1266J63927J28676M9295k03606
$$ plain form
6771 700321 763726 924933 892105 808677 734177 722475 718361 877222 766833 750217 548568
6760 548568 482279 522109 517134 555192 625924 735148 791095 794864 823668 799119 817192 680595
6748 680595 649745 688011 722157 855149 874740 710376 740497 746325 774154 960814 1039479
6737 1039479 959811 1008705 1005828 928015 935791 924694 873247 890158 852656 983483 1047410 1003875
6725 1003875 1094842 1025209 1040626 1181967 1134825 912904 998747 1067564 1085016 1131861 1143909
6714 1143909 1186713 1267777 1338717 1209681 1221091 1340992 1399573 1607861 1581111 1418662 1500003
6703 1500003 1292974 1165154 1108126 1228919 1437491 1328353 1312665 1353167 1498574 1533005
6693 1533005 1710691 1746201 1601674 1574600 1654053 1675319 1839246 1967922 2017217 1813611
6683A813611P1732O9136O6011J34293j68289K1285O6998J14047l8037l5627K16185
6672B331345O8634O70J20724P4489O2516P1481J30599j5261J74051P252j2918
6661C013582J44632O5473J07354M7996J82728J84486L1851K20261P2367L0270
6651D101000K57549j3308n776R6692J94247P0511J4170J27742r94Q771J29483
6640D980087K61942K00926N977J38969J47183p5033K82478K45734Q7915L7981
6630F314159J04684J1620L64399J57818n2768N5608J59130J82828n9128K6218
6620G264568J84985R7566J2539J16845K08217J9106J38391J77872o824O9353J33062
6609H415680L26108K8188M3174Q5179p3014J09590Q1415M6011j7617K9871Q8894
$$ plain form
6683 1813611 1885343 1954479 2020490 2154783 1986494 2007779 2074777 2188824 2150787 2115160 2331345
6672 2331345 2399979 2400649 2521373 2595862 2658378 2729859 2860458 2845197 3019248 3026500 3013582
6661 3013582 3158214 3223687 3331041 3379037 3561765 3746251 3778102 3998363 4070730 4101000
6651 4101000 4358549 4345241 4339465 4436157 4630404 4700915 4715085 4842827 4841833 4850604 4980087
6640 4980087 5242029 5442955 5448932 5587901 5735084 5660051 5942529 6188263 6276178 6314159
6630 6314159 6418843 6430463 6794862 6952680 6899912 6955520 7114650 7297478 7238350 7264568
6620 7264568 7449553 7547119 7559658 7676503 7884720 7903826 8042217 8220089 8213265 8282618 8415680
6609 8415680 8741788 8769976 8813150 8898329 8825315 8934905 9016320 9062331 9044714 9074585 9163479
6598I163479J0854J38340m8215j32318j4470J7788Q1342J41714k2974K872j5796
6587I322616J92583o5553K07500L2887M1600L3245K9643j5589J40282J34029N0430
6576A0103673K65312K25110K50284K20014J9767M23821K36997K48648M75542M55244
6566A2924412N32512Q36186P34656R81782R63533J099663J419674J123429J007847
6557B1623694P53599K39774r153l75073o68487n57700n65715j52664R4596M87470
6547B0870341M32928M68932N54703M03124K91108K95886p7503n53266j125036
6538B1561217j189420j298180j299608j020586r51561q86175q36139p59130n57566
6529A2762852o32683o72122n36357r4832l11628l59589l65284l72980l27645j4422
$$ plain form
6598 9163479 9174333 9312673 9264458 9132140 9117670 9135458 9216800 9358514 9335540 9338412 9322616
6587 9322616 9515199 9449646 9657146 9690033 9731633 9764878 9794521 9778932 9919214 10053243 10103673
6576 10103673 10368985 10594095 10844379 11064393 11084160 11507981 11744978 11993626 12469168 12924412
6566 12924412 13456924 14293110 15027766 16009548 16973081 18072744 19492418 20615847 21623694
6557 21623694 22377293 22617067 22607914 22232841 21564354 21006654 20440939 20288275 20382871 20870341
6547 20870341 21303269 21772201 22326904 22730028 23021136 23317022 23239519 22686253 21561217
6538 21561217 20371797 19073617 17774009 16753423 15801862 14915687 14079548 13320418 12762852
6529 12762852 12130169 11458047 10921690 10826858 10515230 10155641 9790357 9417377 9089732 9075310
6519I075310j47779m0508j6416j48724J05485Q9185l4582l7221M2997O2621K30169
6508I180537J59665O9206K66410L87422M79304L20798M02728M23398M74393O73439
6498A2837300Q30066R43856Q61859R89801J303384J518696J934332K213631K319988
6489B5752913K522584K538131K278598K064701J663397N20889k33872o86627r14388
6480C5506326j028325n43310M9682L56718P83210J096255J399921J282491J127249
6471D0030217Q55304K65707k64855j098331j764391k261523k160702j995050j804239
6462B9802137j408208j314318j181556j179022j075019q04460q81462q39939n76585
6453B0541568m32963k47409k87825k03278k45883o0037j50778j86231N0849J8594
$$ plain form
6519 9075310 8927531 8887023 8870607 8721883 8827368 8916553 8881971 8844750 8887747 8950368 9180537
6508 9180537 9340202 9409408 9675818 10063240 10542544 10863342 11266070 11689468 12163861 12837300
6498 12837300 13667366 14611222 15473081 16462882 17766266 19284962 21219294 23432925 25752913
6489 25752913 28275497 30813628 33092226 35156927 36820324 37341213 37107341 36420714 35506326
6480 35506326 34478001 33934691 33984373 34341091 35124301 36220556 37620477 38902968 40030217
6471 40030217 40885521 41151228 40886373 39788042 38023651 35762128 33601426 31606376 29802137
6462 29802137 28393929 27079611 25898055 24719033 23644014 22839554 21958092 21118153 20541568
6453 20541568 20108605 19861196 19573371 19370093 19124210 19064173 18913395 18727164 18778013 18796607
6443A8796607K2503j81181m7390m1391j26956K09250K3807M5852N7498l0228m5993
6432A8682378M0421n5822K503M3233n2517j9548p0130l68063j19988p7092j29935
6421A7875440L0035Q3182K23953k13839N4992J79653n8590K4535K19430Q3030
6411A8501821J25138J45527J04293J31161K49047L28312M24936K23424L14397
6402B0548056L80114N62898N56602O41742N68140M33653N85138M14674N93425
6393B5284442N39510M65354M10427L08097K91205L56418L63533L01640M23372
6384B8743998M29917K38468K72057K52324J86212M69230K63989L37633K05299
6375C1399127K32255J14803J01502J14401O8615K14881K73112K26394K46456L85031
$$ plain form
6443 18796607 18819110 18637929 18590539 18549148 18422192 18631442 18655249 18701101 18758599 18728371 18682378
6432 18682378 18722799 18666977 18669480 18712713 18660196 18640648 18570518 18202455 18082467 18005375 17875440
6421 17875440 17905475 17988657 18212610 17998771 18053763 18233416 18174826 18199361 18418791 18501821
6411 18501821 18626959 18772486 18876779 19007940 19256987 19585299 20010235 20233659 20548056
6402 20548056 20928170 21491068 22047670 22689412 23257552 23691205 24276343 24691017 25284442
6393 25284442 25823952 26289306 26699733 27007830 27299035 27655453 28018986 28320626 28743998
6384 28743998 29173915 29412383 29684440 29936764 30122976 30592206 30856195 31193828 31399127
6375 31399127 31631382 31746185 31847687 31962088 32030703 32245584 32518696 32745090 32991546 33376577
6365C3376577M94026L16426L74866M56013K82865N01805L88852L42606M12141
6356C6946177L73572O30565N86783O43404O84234O83983N11418N72657Q75925
6347D2508718J158688J173667J458399J742307J657788J733837J533917J359616
6339E4326937P59651J88120o46814j508028j785895j843345j713102j322892j023922
6330D5430710o73322l93671k10547q1574J41862M36664J090367J245221J396703
6321D8382413J666210J696454J484712J218328O75695k95674j069347j657401
6313E2101390k019496j915159j537660j403362j165825r83870q42840q25444n83441
6304D0824293m62775m89755n05085m05006j92096j29455r9597j97400K4191j46897
$$ plain form
6365 33376577 33870603 34187029 34561895 35017908 35300773 35802578 36191430 36534036 36946177
6356 36946177 37319749 37950314 38537097 39180501 39864735 40548718 41060136 41632793 42508718
6347 42508718 43667406 44841073 46299472 48041779 49699567 51433404 52967321 54326937
6339 54326937 55086588 55274708 54627894 53119866 51333971 49490626 47777524 46454632 45430710
6330 45430710 44757388 44363717 44153170 44071596 44213458 44650122 45740489 46985710 48382413
6321 48382413 50048623 51745077 53229789 54448117 55123812 54828138 53758791 52101390
6313 52101390 50081894 48166735 46629075 45225713 44059888 43076018 42233178 41407734 40824293
6304 40824293 40361518 39871763 39366678 38961672 38769576 38640121 38540524 38343124 38367315 38220418
6294C8220418L7479j92478n4561l2499j47260p4433q5116K69783K21555j07302
6284C8055586m9497J55548J60535K57792K00466J65366J91694L52289M74429L14036
6274D0278244N13563O01820O99413P18393P91245O84447M76895K17737n6671m88127
6264D4436959r89415q57573q47923q18961o01332l14107j16289j99216N9619L78020
6254D0129782M51804Q49452P91313J058906J139713J163005J227898J014865O96231
6245D8522969O10228m8482o31313j031023j067676j018380j229617r63268p74521
6236D2368917p44992p04368n83649p65741q22906p83241o93550r10679p84690
6227C5575101o77892o84767o44382n85578p71673o84780n32756n35360m39714
$$ plain form
6294 38220418 38257897 38065419 38010858 37978359 37831099 37756666 37671550 37941333 38162888 38055586
6284 38055586 38006089 38161637 38322172 38579964 38780430 38945796 39137490 39489779 39964208 40278244
6274 40278244 40791807 41393627 42093040 42811433 43602678 44287125 44764020 44981757 44925086 44436959
6264 44436959 43447544 42589971 41742048 40923087 40321755 40007648 39891359 39692143 39751762 40129782
6254 40129782 40581586 41431038 42222351 43281257 44420970 45583975 46811873 47826738 48522969
6245 48522969 49133197 49084715 48453402 47422379 46354703 45336323 44106706 43143438 42368917
6236 42368917 41623925 40919557 40335908 39570167 38747261 37964020 37270470 36359791 35575101
6227 35575101 34897209 34212442 33568060 32982482 32210809 31526029 30993273 30457913 30018199
6218C0018199m45996m16651m03754m06974m13131l07237k30538l78391p6876k82741
6208B6655910k47633l57339l37949n01519m16607k67844m24796m24538n06759
6199B3170926l80309n86158n71453m02402l37041m87040l33847k73418j91426
6190A9607832j96668j65965Q171k03301j56924q0368k5215m2184L6964J896j18308
6179A8665930J93707O4511M6806k53954j6694k61910n6515j43326m30700l80244
6169A7427611m18749n86651o14121l45245m61886n34756l82287l93982m60999
6160A3228935n84435m24465l58378m45519k25898l96721m00075l30752l41874
6151I720818m6111l93310m53662k45996p3595j63258j89494j21266j43916r4764
$$ plain form
6218 30018199 29572203 29155552 28751798 28344824 27931693 27624456 27393918 27015527 26938651 26655910
6208 26655910 26408277 26050938 25712989 25211470 24794863 24527019 24102223 23677685 23170926
6199 23170926 22790617 22204459 21633006 21230604 20893563 20406523 20072676 19799258 19607832
6190 19607832 19411164 19245199 19253370 19050069 18893145 18812777 18787562 18745378 18782342 18784238 18665930
6179 18665930 18859637 18924148 18970954 18717000 18700306 18438396 18381881 18238555 17807855 17427611
6169 17427611 17008862 16422211 15808090 15462845 15000959 14466203 14083916 13689934 13228935
6160 13228935 12644500 12220035 11861657 11416138 11190240 10793519 10393444 10062692 9720818
6151 9720818 9674707 9281397 8827735 8581739 8508144 8344886 8155392 8034126 7890210 7795446
6141G795446j85596O7778n2480p5246n7253q0891j12299p0508j86724k36459n412
6130F800356L4978q029q7647j6436n3460l0252r0795n3908j9810l5727m0690N9304
6118F457884j14288p8563j10409J1741r8704J53154J6991j44855P530K5194J13995
6107F239670j14059L690O8760J02939n1791Q0903n0502L9004j91809k08940O2281
6096E980146J1595J12636m5279l06182j29923O8788O9094m4313j95196j39312
6086E382054m8133m9597M499M4726O6843j83353k9104r5524j97316R0069j7219
6075D967945m9699K2730k0730n4642j61645P943j56977K9306j05037P3925K8279
6064D581398p1896j7461n1234M459j775j62833r8673k0385j37239P0517J82302
$$ plain form
6141 7795446 7609850 7677628 7625148 7549902 7492649 7411758 7299459 7228951 7042227 6805768 6800356
6130 6800356 6835334 6827305 6739658 6723222 6669762 6639510 6548715 6494807 6474997 6439270 6398580 6457884
6118 6457884 6343596 6265033 6154624 6166365 6067661 6220815 6237806 6092951 6100481 6125675 6239670
6107 6239670 6125611 6129301 6198061 6301000 6249209 6330112 6279610 6318614 6126805 5917865 5980146
6096 5980146 5991741 6104377 6059098 5752916 5622993 5691781 5760875 5716562 5521366 5382054
6086 5382054 5333921 5284324 5288823 5333549 5400392 5217039 5187935 5092411 4895095 4985164 4967945
6075 4967945 4918246 4940976 4920246 4865604 4703959 4711902 4554925 4584231 4479194 4553119 4581398
6064 4581398 4509502 4492041 4440807 4445266 4443491 4280658 4181985 4161600 4024361 4094878 4277180
6053D277180O6823j87157j95395n0635r857K7609p6763l962K149j8507j57650
6042C673835j54612J23496K04667j0422J15727j13542k90910K2021J4862J63631
6032C748753K05m6797j1185N1520K2596P2809Q6912j6108m9607j76509M5923l5329
6020C693183N1351m9536j80654K73611J16462j98656l7012K06520J08090Q0652
6010D064011j56771j4486R9398J15347L4647j40993J63754J2921m4874L479R1068
5999D227501J01673q9345Q6280K2895R133O9501J39089J051k8178J96136K0920
5988D756656P5433J89593L8482K45832J62615K38818K49566j54860Q2740J72198
5978F057073J48533j65889R7641M247o4641P5139K02J27679k86005p0774j01351
$$ plain form
6053 4277180 4344003 4156846 3961451 3910816 3900959 3928568 3851805 3847843 3849992 3831485 3673835
6042 3673835 3519223 3642719 3847386 3836964 3952691 3839149 3548239 3570260 3585122 3748753
6032 3748753 3748958 3702161 3690976 3742496 3765092 3837901 3924813 3908705 3859098 3682589 3728512 3693183
6020 3693183 3744534 3694998 3514344 3787955 3904417 3705761 3668749 3875269 3983359 4064011
6010 4064011 3907240 3892754 3992152 4107499 4142146 4001153 4164907 4177828 4132954 4136433 4227501
5999 4227501 4329174 4239829 4326109 4349004 4358137 4427638 4566727 4567778 4539600 4735736 4756656
5988 4756656 4832089 5021682 5060164 5305996 5468611 5707429 5956995 5802135 5884875 6057073
5978 6057073 6205606 6039717 6137358 6141605 6076964 6152103 6152305 6279984 5993979 5923205 5821854
5967E821854r13L2216K7450k17212q8495k3486J760J18174J02736k01164N9673
5956E632593N1773Q9810J07383J65523J50008J57353O0435n903j88557m6048J6149
5945F190519N6590J82097p0854q9906l8350l9361k78995p3942j86460p4966o5176
5934E511196j20416r4785r0618j11948O482r6731k47835K1839j8271q727o677
5923D743509q7119p3590M5798L1485R3663J2700k63131p7294K2808j81384j17159
5912D150286J86802O5019l9744q0726k17375k9780m4468J91823J43745m7697K05682
5901D483567r2087N6692n1395Q8430M8281R1058k9256o5796j00035q1419J58073
5890D506113J43574j98248q6454M5171J8447m005j61215K7156L6114N7374m2791
$$ plain form
5967 5821854 5820941 5853157 5880607 5663395 5574900 5551414 5553174 5671348 5774084 5572920 5632593
5956 5632593 5684366 5774176 5881559 6047082 6197090 6354443 6414878 6408975 6220418 6174370 6190519
5945 6190519 6247109 6429206 6358352 6268446 6230096 6190735 5911740 5837798 5651338 5576372 5511196
5934 5511196 5390780 5295995 5205377 5093429 5099911 5003180 4755345 4777184 4758913 4750186 4743509
5923 4743509 4656390 4582800 4628598 4660083 4753746 4766446 4503315 4426021 4448829 4267445 4150286
5912 4150286 4337088 4402107 4362363 4281637 4064262 4034482 3990014 4181837 4325582 4277885 4483567
5901 4483567 4391480 4448172 4396777 4485207 4533488 4624546 4595290 4529494 4429459 4348040 4506113
5890 4506113 4649687 4451439 4364985 4410156 4428603 4424598 4263383 4290539 4326653 4384027 4341236
5879D341236j00048J65039R3280k06465j26809P1180J05823J13028L5750j11401
5869D380613O4563P4564L1531k9714K1434P2168J66075J11434J73028j05283k62174
$$ plain form
5879 4341236 4241188 4406227 4499507 4293042 4166233 4237413 4343236 4456264 4492014 4380613
5869 4380613 4445176 4519740 4551271 4521557 4542991 4615159 4781234 4892668 5065696 4960413 4698239
$$ [...]
##END NTUPLES=NMR SPECTRUM
##END=
