##TITLE=1H_EC-3355(II-2)xnkY
 200.13MHz, CDCl3,
 8 sc
 
 8.8.2025
##JCAMPDX= 6.0         $$ Bruker NMR JCAMP-DX V2.0
##DATA TYPE= NMR SPECTRUM
##DATA CLASS= NTUPLES
##ORIGIN= UXNMR, Bruker Analytische Messtechnik GmbH
##OWNER= pz
$$ XWIN-NMR		Version 3.5
$$ Fri Aug  8 13:44:22 2025 Russian Standard Time (UT+4h)  she@DPX200
##.OBSERVE FREQUENCY= 200.1313
##.OBSERVE NUCLEUS= ^1H
##.ACQUISITION MODE= SIMULTANEOUS
##.ACQUISITION SCHEME= undefined
##.AVERAGES= 8
##.DIGITISER RES= 18
##SPECTROMETER/DATA SYSTEM= spect
##.PULSE SEQUENCE= zg30
##.SOLVENT NAME= CDCl3
##.SHIFT REFERENCE= (INTERNAL, CDCl3, 0, 15.6367)
##AUDIT TRAIL= $$ (NUMBER, WHEN, WHO, WHERE, WHAT)
$$ ##TITLE= Audit trail, XWIN-NMR		Version 3.5
$$ ##JCAMPDX= 5.01
$$ ##ORIGIN= Bruker BioSpin GmbH
$$ ##OWNER= she
$$ F:/spectra/data/she/nmr/H-C/1/pdata/1/auditp.txt
$$ ##AUDIT TRAIL=  $$ (NUMBER, WHEN, WHO, WHERE, WHAT)
(   1,<2025-08-08 13:42:26.15 +0400>,<she>,<DPX200>,
      <created by zg, POWCHK disabled, PULCHK disabled
       configuration hash MD5:
       00 E9 B6 7A A2 85 ED C7 34 08 36 98 17 FE 4E 26
       data hash MD5: 16K
       EB E9 04 F6 E6 74 F0 25 08 EC 28 28 5B 6F 88 98>)
(   2,<2025-08-08 13:42:28.46 +0400>,<she>,<DPX200>,
      <Start of raw data processing
       efp BC_mod = 2 LB = 0.25 FT_mod = 6 PKNL = 1 PHC0 = -1355.11 PHC1 = 8.792299 SI = 16K 
       data hash MD5: 16K
       A2 F0 13 CD C2 04 B8 D1 FE DC 1D B4 AE 31 D1 7E>)
(   3,<2025-08-08 13:43:09.28 +0400>,<she>,<DPX200>,
      <pk PHC0 = -202.6243 PHC1 = 0.4 
       data hash MD5: 16K
       DB E7 11 17 68 10 DB 17 ED EB 48 F0 AE 1F 60 8A>)
(   4,<2025-08-08 13:43:15.06 +0400>,<she>,<DPX200>,
      <abs ABSG = 5 
       data hash MD5: 16K
       5B 37 F6 C3 09 62 C9 04 6D 4E C7 85 1F 6D 45 96>)
$$ ##END=
$$ 
$$ hash MD5
$$ B5 6F B1 CE E5 EE 67 23 FE B3 F9 33 E4 C2 B9 D4
##$RELAX= 
##$RELAX= 
##$RELAX= 
##$RELAX= 
##$RELAX= 
##$RELAX= 
$$ Bruker specific parameters
$$ --------------------------
##$DU= <F:/spectra>
##$EXPNO= 1
##$NAME= <H-C>
##$PROCNO= 1
##$TYPE= <nmr>
##$USER= <she>
##$AMP= (0..31)
100 100 100 100 100 100 100 100 100 100 100 100 100 100 100 100 100 100 
100 100 100 100 100 100 100 100 100 100 100 100 100 100 
##$AQSEQ= 0
##$AQ_mod= 1
##$AUNM= <au_zg>
##$AUTOPOS= <>
##$BF1= 200.13
##$BF2= 200.13
##$BF3= 200.13
##$BF4= 200.13
##$BF5= 200.13
##$BF6= 200.13
##$BF7= 200.13
##$BF8= 200.13
##$BYTORDA= 1
##$CFDGTYP= 0
##$CFRGTYP= 5
##$CHEMSTR= <none>
##$CNST= (0..31)
1 1 145 1 1 1 1 1 1 1 1 1 1 1 1 1 1 1 1 1 1 1 1 1 1 1 1 1 1 1 1 1 
##$CPDPRG= <>
##$CPDPRG1= <>
##$CPDPRG2= <>
##$CPDPRG3= <>
##$CPDPRG4= <mlev>
##$CPDPRG5= <mlev>
##$CPDPRG6= <mlev>
##$CPDPRG7= <mlev>
##$CPDPRG8= <mlev>
##$CPDPRGB= <>
##$CPDPRGT= <>
##$D= (0..31)
0 0.7 0 0 0 0 0 0 0 0 0 0.03 0 0 0 0 0 0 0 0 0 0 0 0 0 0 0 0 0 0 0 0 
##$DATE= 1754646145
##$DBL= (0..7)
120 120 120 120 120 120 120 120 
##$DBP= (0..7)
150 150 150 150 150 150 150 150 
##$DBP07= 0
##$DBPNAM0= <>
##$DBPNAM1= <>
##$DBPNAM2= <>
##$DBPNAM3= <>
##$DBPNAM4= <>
$$ [...]
##$SUBNAM3= <"">
##$SUBNAM4= <"">
##$SUBNAM5= <"">
##$SUBNAM6= <"">
##$SUBNAM7= <"">
##$SUBNAM8= <"">
##$SUBNAM9= <"">
##$SW= 18.0517328524113
##$SWIBOX= (0..15)
0 0 2 0 0 0 0 0 0 0 0 0 0 0 0 0 
##$SW_h= 3612.71676300578
##$TD= 16384
##$TD0= 1
##$TE= 0
##$TE2= 300
##$TE3= 300
##$TEG= 300
##$TL= (0..7)
0 120 120 120 120 120 120 120 
##$TP= (0..7)
150 150 150 150 150 150 150 150 
##$TP07= 0
##$TPNAME0= <>
##$TPNAME1= <>
##$TPNAME2= <>
##$TPNAME3= <>
##$TPNAME4= <>
##$TPNAME5= <>
##$TPNAME6= <>
##$TPNAME7= <>
##$TPOAL= (0..7)
0.5 0.5 0.5 0.5 0.5 0.5 0.5 0.5 
##$TPOFFS= (0..7)
0 0 0 0 0 0 0 0 
##$TUNHIN= 0
##$TUNHOUT= 0
##$TUNXOUT= 0
##$USERA1= <user>
##$USERA2= <user>
##$USERA3= <user>
##$USERA4= <user>
##$USERA5= <user>
##$V9= 5
##$VALIST= <valist>
##$VCLIST= <CCCCCCCCCCCCCCC>
##$VD= 0
##$VDLIST= <DDDDDDDDDDDDDDD>
##$VPLIST= <PPPPPPPPPPPPPPP>
##$VTLIST= <TTTTTTTTTTTTTTT>
##$WBST= 1024
##$WBSW= 4
##$XGAIN= (0..3)
0 0 0 0 
##$XL= 0
##$YL= 0
##$YMAX_a= 249366
##$YMIN_a= -255659
##$ZGOPTNS= <>
##$ZL1= 120
##$ZL2= 120
##$ZL3= 120
##$ZL4= 120
##$ABSF1= 15.45381
##$ABSF2= -2.59804
##$ABSG= 5
##$ABSL= 3
##$ALPHA= 0
##$AQORDER= 0
##$ASSFAC= 0
##$ASSFACI= 0
##$ASSFACX= 0
##$ASSWID= 0
##$AUNMP= <proc_1d>
##$AZFE= 0.1
##$AZFW= 0.1
##$BCFW= 0
##$BC_mod= 2
##$BYTORDP= 0
##$COROFFS= 0
##$CY= -3
##$DATMOD= 1
##$DC= 0
##$DFILT= <>
##$DTYPP= 0
##$F1P= 0
##$F2P= 0
##$FCOR= 1
##$FTSIZE= 16384
##$FT_mod= 6
##$GAMMA= 0
##$GB= 0
##$INTBC= 1
##$INTSCL= 3.241238e-09
##$ISEN= 128
##$LB= 0.25
##$LEV0= 0
##$LPBIN= 0
##$MAXI= 10000
##$MC2= 0
##$MEAN= 0
##$ME_mod= 0
##$MI= 1.114404
##$NCOEF= 0
##$NC_proc= -7
##$NLEV= 6
##$NOISF1= 3.799351
##$NOISF2= 2.8
##$NSP= 0
##$NTH_PI= 0
##$NZP= 0
##$OFFSET= 15.63671
##$PC= 1
##$PHC0= -1557.734
##$PHC1= 9.192299
##$PH_mod= 1
##$PKNL= yes
##$PPARMOD= 0
##$PSCAL= 0
##$PSIGN= 0
##$REVERSE= no
##$SF= 200.1299769831
##$SI= 16384
##$SIGF1= 3
##$SIGF2= 2
##$SINO= 0.751879
##$SIOLD= 32768
##$SREGLST= <19F.Aceton>
##$SSB= 0
##$STSI= 16384
##$STSR= 0
##$SW_p= 3612.71676300578
##$SYMM= 0
##$S_DEV= 0
##$TDeff= 16384
##$TDoff= 0
##$TI= <>
##$TILT= no
##$TM1= 0
##$TM2= 0
##$TOPLEV= 0
##$USERP1= <user>
##$USERP2= <user>
##$USERP3= <user>
##$USERP4= <user>
##$USERP5= <user>
##$WDW= 1
##$XDIM= 16384
##$YMAX_p= 474556585
##$YMIN_p= -846267
$$ End of Bruker specific parameters
$$ ---------------------------------
##NTUPLES= NMR SPECTRUM
##VAR_NAME=  FREQUENCY,     SPECTRUM/REAL,   SPECTRUM/IMAG
##SYMBOL=    X,             R,               I
##VAR_TYPE=  INDEPENDENT,   DEPENDENT,       DEPENDENT
##VAR_FORM=  AFFN,          ASDF,            ASDF
##VAR_DIM=   16384,         16384,           16384
##UNITS=     HZ,            ARBITRARY UNITS, ARBITRARY UNITS
##FACTOR=    0.220516191357247, 1,           1
##FIRST=     3129.37444579934, 0,            0
##LAST=      -483.342317206443, 0,           0
##MIN=       -483.342317206443, -846267,     0
##MAX=       3129.37444579934, 474556585,    0
$$ Real data points
##PAGE= N=1
##DATA TABLE= (X++(R..R)), XYDATA
$$ [...]
$$ plain form
13146 -200216 -451190 -336859 -105414 -182269 -72057 -109059 47679 138623 115251 21143
13136 21143 45270 -120463 -246827 98353 57787 -125819 -38266 162498 397037 246559
13126 246559 78732 23565 -133765 -27628 53733 338438 40791 -21849 -79763 118073
13116 118073 153493 -124895 -154064 -156111 128972 224869 287092 125088 -223437 -220319 -148781
13105 -148781 -215868 -39601 -252427 -200045 20046 -1188 -39471 58930 -50489 -76797 -71456
13094 -71456 -99474 -98688 -94029 -185109 -51651 96847 484496 339394 132735 94027 268704
13083 268704 230124 -27051 17754 284492 81098 -28603 106273 120924 -136290 -301971
13073 -301971 -55412 -107573 -238862 130782 337222 200131 -24959 -164071 62729 309881
$$ packed form
13146b00216k50974J14331K31445p6855J10212l7002J56738R0944k3372r4108
13136B1143K4127j65733j26364L45180m0566j83606Q7553K00764K34539j50478
13126B46559j67827n5167j57330J06137Q1361K84705k97647o2640n7914J97836
13116A18073L5420k78388k9169k047K85083R5897O2223j62004l48525L118P1538
13105a48781o7087J76267k12826N2382K20091k1234l8283R8401j09419k6308N341
13094g1456k8018P86M659r1080J33458J48498L87649j45102k06659l8708J74677
13083B68704l8580k57175M4805K66738k03394j09701J34876J4651k57214j65681
13073c01971K46559n2161j31289L69644K06440j37091k25090j39112K26800K47152
$$ plain form
13063 309881 341237 63440 108174 84501 73293 46467 92694 46426 47709 -24411 -99889
13052 -99889 45644 -19903 97600 80337 -238990 -129962 -10430 -11763 -3592 72746 109164
13041 109164 72391 -1727 -21930 99418 21298 -174720 -146429 -22606 -59161 1972 -2678
13030 -2678 -25544 -46408 4205 133634 155206 249160 247203 193484 -129839 -210840 -182263 -37299
13018 -37299 -4393 307236 117204 -48177 -36617 -162078 -94601 65723 39911 79242 277153
13007 277153 306432 377944 46048 -117157 -91347 62973 -174605 -132394 -229567 -208041 -16364
12996 -16364 -122098 111183 54328 207924 450134 281758 224511 31834 -17273 83938
12986 83938 127083 -190942 -125638 76459 16033 84196 243693 308478 243447 106598 167928
$$ packed form
13063C09881L1356k77797M4734k3673j1208k6826M6227m6268J283p2120p5478
13052i9889J45533o5547J17503j7263l19327J09028J19532j333Q171P6338L6418
13041A09164l6773p4118k0203J21348p8120j96018K8291J23823l6555O1133m650
13030b678k2866k0864N0613J29429K1572R3954j957n3719l23323q1001K8577J44964
13018c7299L2906L11629j90032j65381J1560j25461O7477J60324k5812L9331J97911
13007B77153K9279P1512l31896j63205K5810J54320k37578M2211r7173K1526J91677
12996a6364j05734K33281n6855J53596K42210j68376n7247j92677m9107J01211
12986H3938M3145l18025O5304K02097o0426O8163J59497O4785o5031j36849O1330
$$ plain form
12975 167928 40791 -29220 176274 148980 160832 125102 30734 -39993 117624 83971 -96055
12964 -96055 -11841 -92435 -166791 -13236 -23724 -57949 -97537 -131572 538 79670 76959
12953 76959 99605 -45647 77991 59742 49244 128844 14208 -125640 -209188 208609 144782
12942 144782 11167 100312 103473 90519 116557 272477 73904 66581 11265 121353 244437
12931 244437 438763 261240 -99326 130446 228542 149 98122 177593 159940 248609
12921 248609 285376 1953 -224743 59486 145183 152675 71937 -115409 29459 -252 126676
12910 126676 315781 360409 267563 282803 157351 31137 83930 -36052 126935 -33678
12900 -33678 48564 263794 65339 -91523 -225111 41905 209585 -65199 -30567 69350
$$ packed form
12975A67928j27137p0011K05494k7294J1852l5730r4368p0727J57617l3653j80026
12964i6055Q4214q0594p4356J53555j0488l4225l9588l4035J32110P9132k711
12953G6959K2646j45252J23638j8249j0498P9600j14636j39848q3548M17797o3827
12942A44782j33615Q9145L161j2954K6038J55920j98573p323n5316J10088J23084
12931B44437J94326j77523l60566K29772R8096k28393R7973P9471j7653Q8669
12921B48609L6767k83423k26696K84229Q5697P492q0738j87346J44868k9711J26928
12910A26676J89105M4628r2846J5240j25452j26214N2793j19982J62987j60613
12900c3678Q2242K15230j98455j56862j33588K67016J67680k74784L4632R9917
$$ plain form
12890 69350 -135593 -143424 23351 43001 70421 62615 180074 172574 310643 289781 238243
12879 238243 360655 516069 391134 105307 197724 293838 306633 116605 30013 161061
12869 161061 338974 126476 37267 36928 -38853 -3465 -161519 -117259 79756 168714 173227
12858 173227 -17766 -52758 83462 98706 389715 186028 -35589 22789 238847 315267
12848 315267 112361 -15548 -120976 65819 187658 466510 386302 127858 165890 224904
12838 224904 217917 142167 176604 114291 11807 228396 363240 486030 288578 76187
12828 76187 205219 237261 488041 589684 601543 431635 218110 132007 -76049 -361261
12818 -361261 440 325475 122268 163167 156291 -32181 96051 357241 284377 321841
$$ packed form
12890F9350k04943p831J66775J9650K7420p806J17459p500J38069k0862n1538
12879B38243J22412J55414j24935k85827R2417R6114J2795j90028q6592J31048
12869A61061J77913k12498q9209l39p5781L5388j58054M4260J97015Q8958M513
12858A73227j90993l4992J36220J5244K91009k03687k21617N8378K16058P6420
12848C15267k02906j27909j05428J86795J21839K78852q0208k58444L8032N9014
12838B24904o987p5750L4437o2313j02484K16589J34844J22790j97452k12391
12828G6187J29032L2042K50780J01643J1859j69908k13525q6103k08056k85212
12818c61261L61701L25035k03207M0899o876j88472J28232K61190p2864L7464
$$ plain form
12808 321841 362565 379549 248088 297218 289854 360445 278821 38006 4687 -78560 -358888
12797 -358888 -34358 427845 160960 97342 94088 174278 169983 310045 357926 427898 503207
12786 503207 491849 368333 444826 125571 -54839 183778 336671 167695 -7279 95000
12776 95000 100266 51075 150973 253305 309494 417128 473960 449146 397750 270997 286446
12765 286446 504557 510053 438685 184279 164608 136986 27911 -123306 62081 183379
12755 183379 202611 471721 81871 210144 297369 405078 571092 416389 435587 639936
12745 639936 576893 305435 406851 508956 551519 187394 257799 506374 318533 339866
12735 339866 308868 323399 251306 251390 233339 168263 206912 104879 277152 387201 377002
$$ packed form
12808C21841M0724J6984j31461M9130p364P0591q1624k40815l3319q3247k80328
12797c58888L24530M62203k66885o3618l254Q0190m295J40062M7881O9972P5309
12786E03207j1358j23516P6493l19255j80410K38617J52893j68976j74974J02279
12776I5000N266m9191R9898J02332N6189J07634N6832k4814n1396j26753J5449
12765B86446K18111N496p1368k54406j9671k7622j09075j51217J85387J21298
12755A83379J9232K69110l89850J28273Q7225J07709J66014j54703J9198K04349
12745F39936o3043k71458J01416J02105M2563l64125P0405K48575j87841K1333
12735C39866l0998J4531p2093Q4j8051o5076L8649j02033J72273J10049j0199
$$ plain form
12724 377002 480582 380332 408448 425754 314113 297136 449359 728881 591209 418263
12714 418263 579860 915876 621195 508469 528262 627419 684653 388335 172975 485438
12704 485438 915992 810023 878358 812512 573868 638454 496726 542536 653300 863275
12694 863275 866164 781963 841071 1075981 1162583 728910 514462 409286 391393 717472 871746
12683 871746 919157 617350 895176 929065 741115 876933 871362 727555 572876 594149
12673 594149 528454 760188 765384 707244 806848 839418 840030 915702 761442 769229 973355 910400
12661 910400 711241 730677 854303 909304 1159332 1097274 971914 850981 968873 842072
12651 842072 913707 817785 875551 1103618 1211581 1072164 922119 1030215 1022976 960593 881865
$$ packed form
12724C77002J03580j00250K8116J7306j11641j6977J52223K79522j37672j72946
12714D18263J61597L36016k94681j12726J9793R9157N7234k96318k15360L12463
12704D85438M30554j05969O8335o5846k38644O4586j41728M5810J10764K09975
12694H63275K889q4201N9108K34910Q6602m33673k14448j05176j7893L26079J54274
12683H71746M7411l01807K77826L3889j87950J35818n571j43807j54679K1273
12673E94149o5695K31734N196n8140R9604L2570O12P5672j54260P787K04126o2955
12661I10400j99159J9436J23626N5001K50028o2058j25360j20933J17892j26801
12651H42072P1635r5922N7766K28067J07963j39417j50045J08096p239o2383p8728
$$ plain form
12640 881865 1234735 1144177 1083578 1078371 1130056 1008801 1107117 1244910 1669951 1652328 1700023
12629 1700023 1640997 1777993 1704083 1851865 1967599 1624807 1648680 1703810 1777129 1791510
12619 1791510 1855463 1745637 1757208 1967002 1888207 1791348 1663208 1711014 1738062 1920857
12609 1920857 1977038 1982045 2187223 2243908 2408526 2197490 2053801 1827300 1776243 1972597
12599 1972597 2072824 2086190 2277695 2404267 2348259 2610765 2754675 2665355 2757136 2522566
12589 2522566 2780591 2917037 3028973 2842557 2947004 3061503 3259065 3605889 3556268 3255981
12579 3255981 3261025 3452856 3534083 3787264 3899270 4017115 4112853 4078436 3901486 4373250
12569 4373250 4695468 4752402 4778755 4737433 4684082 4743709 4642611 4780190 4883667 5223095
$$ packed form
12640H81865L52870r0558o0599n207N1685j21255R8316J37793M25041j7623M7695
12629A700023n9026J36996p3910J47782J15734l42792K3873N5130P3319J4381
12619A791510O3953j09826J1571K09794p8795r6859j28140M7806K7048J82795
12609A920857N6181N007K05178N6685J64618k11036j43689k26501n1057J96354
12599A972597J00227J3366J91505J26572n6008K62506J43910q9320R1781k34570
12589B522566K58025J36446J11936j86416J04447J14499J97562L46824m9621l00287
12579C255981N044J91831Q1227K53181J12006J17845R5738l4417j76950M71764
12569D373250L22218N6934K6353m1322n3351N9627j01098J37579J03477L39428
$$ plain form
12559 5223095 5305630 5653524 5782329 5827504 5798052 5875172 6124933 6362888 6352376 6470705
12549 6470705 6672005 6761346 7180289 7120272 6985206 7214814 7310154 7490182 7920629 7985406
12539 7985406 8142904 8267400 8560070 8833376 8986518 9004134 9193629 9392114 9572431 9689975
12529 9689975 9932947 10191128 10432573 10606604 10539263 10917254 11279971 11271718 11167334 11249012
12519 11249012 11315596 11639169 11852910 12319873 12645991 12616623 12728270 12953982 12879585 13008650
12509 13008650 13461011 13698141 13810143 13949940 14095588 14077416 14236913 14144711 14306580 14298186
12499 14298186 14479994 14678023 14690772 14812237 14891119 15016059 15225046 15215598 15476592 15532968
12489 15532968 15487812 15668015 15639653 15471401 15558701 15880610 15888606 15783901 15897759 15894243
$$ packed form
12559E223095Q2535L47894J28805M5175k9452P7120K49761K37955j0512J18329
12549F470705K01300Q9341M18943o0017j35066K29608R5340J80028M30447O4777
12539G985406J57498J24496K92670K73306J53142J7616J89495J98485J80317J17544
12529I689975K42972K58181K41445J74031o7341L77991L62717q253j04384Q1678
12519A1249012O6584L23573K13741M66963L26118k9368J11647K25712p4397J29065
12509A3008650M52361K37130J12002J39797J45648j8172J59497r2202J61869q394
12499A4298186J81808J98029J2749J21465P8882J24940K08987r448K60994N6376
12489A5532968m5156J80203k8362j68252Q7300L21909P996j04705J13858l516
$$ plain form
12479 15894243 15787485 15667827 15802245 15571075 15388949 15403091 15408515 15260034 15312319 15216358
12469 15216358 15179860 15285953 15108067 15133634 15038799 14920902 14531442 14318494 14354279 14428271
12459 14428271 14402651 14051394 14142164 14077042 13852763 13580726 13367289 13367864 13205375 12941921
12449 12941921 12736857 12463439 12174053 12246027 12157324 11928100 12016666 11927895 11627481 11326876
12439 11326876 11125251 11209721 10910470 10375838 10223694 10248998 10138932 9748134 9519524 9589384
12429 9589384 9417635 9071371 8990258 8895288 8664527 8539803 8413457 8320186 7843082 7643847
12419 7643847 7880243 7600700 7312703 7017169 6988781 6820527 6559757 6374438 6298952 6220060
12409 6220060 6021409 6025737 5917942 5763411 5570194 5360557 5293329 5448444 5449937 5139588
$$ packed form
12479A5894243j06758j19658J34418k31170j82126J4142N424j48481N2285r5961
12469A5216358l6498J06093j77886K5567r4835j17897l89460k12948L5785P3992
12459A4428271k5620l51257R0770o5122k24279k72037k13437N75j62489k63454
12449A2941921k05064k73418k89386P1974q8703k29224Q8566q8771l00414l00605
12439A1326876k01625Q4470k99251n34632j52144K5304j10066l90798k28610O9860
12429I589384j71749l46264q1113r4970k30761j24724j26346r3271m77104j99235
12419G643847K36396k79543k87997k95534k8388j68254k60770j85319p5486p8892
12409F220060j98651M328j07795j54531j93217k09637o7228J55115J493l10349
$$ plain form
12399 5139588 4986035 5199609 4795151 4603776 4349944 4212275 4077082 4133793 4211352 4253690
12389 4253690 4166125 3964093 3608433 3430087 3393025 3328611 3276817 3349934 3584677 3109272
12379 3109272 2944120 3046317 3063521 3110158 2958631 2953764 2695250 2849105 2758190 2548105
12369 2548105 2494313 2535929 2450366 2522015 2538855 2581261 2413576 2566695 2604312 2170990 2220301
12358 2220301 2308427 2223287 2054251 2192762 1869965 1649520 1667914 1902685 1976136 1959486
12348 1959486 1758718 1824099 1697775 1528388 1690590 1694048 1580537 1620465 1587401 1434121
12338 1434121 1750556 1671616 1622873 1584476 1331675 1441704 1663423 1442664 1520673 1277424
12328 1277424 1019174 1085764 997879 835986 674396 838026 913220 641744 751840 882428
$$ packed form
12399E139588j53553K13574m04458j91375k53832j37669j35193N6711P7559M2338
12389D253690q7565k02032l55660j78346l7062o4414n1794P3117K34743m75405
12379C109272j65152J02197J7204M6637j51527m867k58514J53855r0915k10085
12369B548105n3792M1616q5563P1649J6840M2406j67685J53119L7617m33322M9311
12358B220301Q8126q5140j69036J38511l22797k20445J8394K34771P3451j6650
12348A959486k00768O5381j26324j69387J62202L458j13511L9928l3064j53280
12338A434121L16435p8940m8743l8397k52801J10029K21719k20759P8009k43249
12328A277424k58250O6590q7885j61893j61590J63630P5194k71476J10096J30588
$$ plain form
12318 882428 969766 873418 842563 720165 671867 930501 1007802 975563 1268163 1298955 1044997
12307 1044997 1151252 894650 784247 680300 908875 945089 931399 972821 950388 693289
12297 693289 602871 635138 759547 695030 846139 1002805 1002373 863957 913275 755934 784833
12286 784833 773937 786451 742570 828379 941848 590775 527406 808605 883524 803274 769288
12275 769288 756086 650366 505007 191978 191405 187884 325770 262246 149560 230165 205080
12264 205080 223579 303776 405112 597535 338319 66396 399793 220861 190603 447662
12254 447662 549481 325259 431913 510741 262516 163608 192158 292198 419405 321959
12244 321959 453034 467856 172419 96506 44412 341937 174721 316304 587077 453746
$$ packed form
12318H82428Q7338r6348l0855j22398m8298K58634P7301l2239K92600L0792k53958
12307A044997J06255k56602j10403j03947K28575L6214j3690M1422k2433k57099
12297F93289r0418L2267J24409o4517J51109J56666m32j38416M9318j57341K8899
12286G84833j0896J2514m3881Q5809J13469l51073o3369K81199P4919q0250l3986
12275G69288j3202j05720j45359l13029n73l521J37886o3524j12686Q0605k5085
12264B05080J8499Q0197J01336J92423k59216k71923L33397j78932l0258K57059
12254D47662J01819k24222J06654P8828k48225r8908K8550J00040J27207r7446
12244C21959J31075J4822k95437p5913n2094K97525j67216J41583K70773j33331
$$ plain form
12234 453746 287636 88898 -237270 -135561 278484 189941 230402 -36689 5442 -128771
12224 -128771 -78100 112481 252432 -875 -194744 236828 559384 885291 900093 677192
12214 677192 642040 342392 156144 282501 311008 41847 75441 158626 215906 93884
12204 93884 -11581 -100608 77388 114342 -83766 -59622 -22523 71197 88687 50371 123708
12193 123708 122965 -61191 -142114 -276 88579 114770 130268 179093 -141280 -250884 -172750
12182 -172750 76938 19785 117352 60 -73791 432492 273508 114211 108711 143830 263870
12171 263870 214847 216451 126692 92011 54061 23951 112260 175437 61703 72561 -16717
12160 -16717 -102030 6896 -215973 -167855 74103 350328 -110356 -184094 21653 248428
$$ packed form
12234D53746j66110j98738l26168J01709M14045q8543M0461k67091M2131j34213
12224a28771N0671J90581J39951k53307j93869M31572L22556L25907J4802k22901
12214F77192l5152k99648j86248J26357K8507k69161L3594Q3185N7280j22022
12204I3884j05465q9027J77996L6954j98108K4144L7099R3720J7490l8316P3337
12193A23708p43j84156q0923J41838Q8855K6191J5498M8825l20373j09604P8134
12182a72750K49688n7153R7567j17292p3851N06283j58984j59297n500L5119J20040
12171B63870m9023J604q9759l4681l7950l0110Q8309O3177j13734J0858q9278
12160a6717q5313J08926k22869M8118K41958K76225m60684p3738K05747K26775
$$ plain form
12150 248428 249534 83379 -39222 115343 330137 192260 -100198 18404 -103161 -114898
12140 -114898 37383 -131426 47901 -61459 59739 103515 53866 161994 243471 288325
12130 288325 281634 175311 52179 62986 8769 171272 -49083 -72813 125461 31420 -71327
12119 -71327 167394 457638 136792 -90161 -73941 -233991 -137717 388984 344852 17270
12109 17270 123280 52760 59116 192595 -93774 -120769 -3572 14915 9742 139457 125664
12098 125664 79964 17764 -85546 -114741 53448 136639 -38469 119209 36457 -155783
12088 -155783 -301229 -112802 68709 158692 2535 71439 191953 -60840 83244 25352
12078 25352 -199974 -96997 3122 -310948 -187985 -67783 -121363 -227259 -140247 -70227
$$ packed form
12150B48428J106j66155j22601J54565K14794j37877k92458J18602j21565j1737
12140a14898J52281j68809J79327j09360J21198M3776m9649J08128Q1477M4854
12130B88325o691j06323j23132J0807n4217J62503k20355k3730J98274r4041j02747
12119g1327K38721K90244l20846k26953J6220j60050R6274N26701m4132l27582
12109A7270J06010p0520O356J33479k86369k6995J17197J8487n173J29715j3793
12098A25664m5700o2200j03310k9195J68189Q3191j75108J57678q2752j92240
12088a55783j45446J88427J81511Q9983j56157O8904J20514k52793J44084n7892
12078B5352k25326J02977J00119l14070J22963J20202n3580j05896Q7012P0020
$$ plain form
12068 -70227 -21899 151730 144724 -15328 -137663 25423 -41746 -256388 -99178 -74323 -395765
12057 -395765 -214932 -323926 -364320 -225473 89036 108126 -220334 -384378 -250506 -2651
12047 -2651 36107 -6621 151492 -29064 -30731 101625 8964 -39392 82380 -89612 -84812
12036 -84812 92382 -110641 -32517 -176861 -308623 -114471 -210182 -191285 -136176 -232956 -249255
12025 -249255 -392605 -168868 -131991 -151911 -232088 -510027 -318472 47592 270452 55731
12015 55731 -171453 -111612 35443 -51790 -17029 151057 100704 -16200 -206213 99623
12005 99623 -148766 -25557 -46729 -137633 -182200 -120901 -259806 -382609 -143885 -86216 -30290
11994 -30290 -2129 -135225 -37330 -175410 -240066 -87412 -195653 -238957 -56062 -16698 -118090
$$ packed form
12068g0227M8328J73629p006j60052j22335J63086o7169k14642J57210K4855l21442
12057c95765J80833j08994m0394J38847L14509J9090l28460j64044J33872K47855
12047b651L8758m2728J58113j80556j667J32356r2661m8356J21772j71992M800
12036h4812J77194k03023P8124j44344j31762J94152r5711J8897N5109r6780j6299
12025b49255j43350K23737L6877j9920q0177k77939J91555L66064K22860k14721
12015E5731k27184N9841J47055q7233L4761J68086n0353j16904j90013L05836
12005I9623k48389J23209k1172r0904m4567O1299j38905j22803K38724N7669N5926
11994c0290K8161j33096R7895j38080o4656J52654j08241m3304J82895L9364j01392
$$ plain form
11983 -118090 -215127 -195998 170585 98858 -191557 -192093 -109555 12659 -64168 -23215 17946
11972 17946 77448 -35724 -287760 99180 84308 108619 -129378 57456 40283 17727 116984
11961 116984 84918 37170 42621 95532 -25409 -107767 -225607 -370553 -372650 -115374 -58976
11950 -58976 101127 -96494 -490285 -432095 -166110 -53077 -163475 -113545 -161501 -101778
11940 -101778 -49393 -461050 -212771 -23827 -167065 -6675 146335 -47477 -288899 -165747
11930 -165747 -18561 -66159 -117736 -5311 -194983 -428390 -365024 -363685 -146073 -18690
11920 -18690 -174164 -134301 -313129 -145674 -194129 -316854 -69372 -34415 134488 89569
11910 89569 -264853 -242054 74020 -245153 -196670 -129731 -63609 -100069 -144695 -101222 -320547
$$ packed form
11983a18090r7037J9129L66583p1727k90415n36Q2538J22214p6827M0953M1161
11972A7946N9502j13172k52036L86940j4872K4311k37997J86834j7173k2556R9257
11961A16984l2066m7748N451N2911j20941q2358j17840j44946k097K57276N6398
11950e8976J60103j97621l93791N8190K65985J13033j10398M9930m7956N9723
11940a01778N2385m11657K48279J88944j43238J60390J53010j93812k41422J23152
11930a65747J47186m7598n1577J12425j89672k33407O3366J339K17612J27383
11920a8690j55474L9863j78828J67455m8455j22725K47482L4957J68903m4919
11910H9569l54422K2799L16074l19173M8483O6939O6122l6460m4626M3473k19325
$$ plain form
11899 -320547 -281078 -421799 -339017 -84974 -80891 75769 142720 -248355 -241914 -78964 -228698
11888 -228698 -380851 -326142 -483821 -203858 -111903 -259440 -275724 -219069 92143 -29101
11878 -29101 -242679 -299044 -308864 -244798 -188333 -218821 -283194 -34235 134035 -35354 -68352
11867 -68352 -123415 -177677 -136135 -67141 -92087 -366726 -247129 -194889 -178838 -262846 -292552
11856 -292552 -257877 -92674 -48474 32556 37817 -103597 56560 -84015 -151699 -85376 34825
11845 34825 -134683 -115191 -165763 -249475 -108636 -171503 -293415 -284296 -496753 -478706 -395795
11834 -395795 -198099 -267091 -254002 -222729 -161317 -331740 -232284 -69169 -210567 -358180
11824 -358180 -401017 -346235 -378246 -195968 -178850 -122860 -175858 -43959 -105660 -59005 -76001
$$ packed form
11899c20547L9469j40721Q2782K54043M083J56660O6951l91075O441J62950j49734
11888b28698j52153N4709j57679K79963R1955j47537j6284N6655L11212j21244
11878b9101k13578n6365r820O4066N6465l0488o4373K48959J68270j69389l2998
11867f8352n5063n4262M1542O8994k4946k74639J19597N2240J6051q4008k9706
11856b92552L4675J65203M4200Q1030N261j41414J60157j40575o7684O6323J20201
11845C4825j69508J9492n0572q3712J40839o2867j21912R119k12457J8047Q2911
11834c95795J97696o8992J3089L1273O1412j70423R9456J63115j41398j47613
11824c58180m2837N4782l2011J82278J7118N5990n2998J31899o1701M6655j6996
$$ plain form
11813 -76001 -154339 -139467 -336231 -277887 -77854 -248945 -373763 -139471 -134301 -130188 -196622
11802 -196622 -129885 -180067 -180815 -69381 -267268 -342606 -162011 -147456 -62615 -74172 41793
11791 41793 -42990 -7879 88509 -32390 -6447 87018 308665 194309 -8887 -25940 44225
11780 44225 209383 149632 -261227 -216143 -414500 -366724 -327751 -252863 -115341 36815 -119586
11769 -119586 -21669 -11174 -231037 -355726 -410728 -263453 -145938 -361421 -433271 -344214
11759 -344214 -253003 -32354 -281262 -160035 -238018 76748 72760 -152169 -82591 -211092
11749 -211092 -224702 -90321 61328 -265022 -342678 -220478 -203044 -288709 -392209 -346551
11739 -346551 -424031 -327956 -177692 -204905 -183328 -291644 -541029 -426653 -664106 -496249
$$ packed form
11813g6001p8338J4872j96764N8344K00033j71091j24818K34292N170M113o6434
11802a96622O6737n0182p48J11434j97887p5338J80595J4555Q4841j1557J15965
11791D1793q4783L5111R6388j20899K5943R3465K21647j14356k03196j7053P0165
11780D4225J65158n9751m10859M5084j98357M7776L8973P4888J37522J52156j56401
11769a19586R7917J0495k19863j24689n5002J47275J17515k15483p1850Q9057
11759c44214R1211K20649k48908J21227p7983L14766l988k24929O9578j28501
11749b11092j3610J34381J51649l26350p7656J22200J7434q5665j03500M5658
11739c46551p7480R6075J50264k7213K1577j08316k49385J14376k37453J67857
$$ plain form
11729 -496249 -364864 -209873 113124 253295 192144 -12283 -231385 -332237 -115103 -318796
11719 -318796 -219010 -351823 -342532 -440543 -362074 -498006 -293006 101504 166845 -40625 -446666
11708 -446666 -606960 -455201 -498637 -467657 -282096 -38055 43615 102511 -161817 -135185
11698 -135185 193423 -16329 64564 63636 -33407 30763 -34823 -101975 -83572 137826 222014
11687 222014 46200 262237 107308 -9527 -328100 -508292 -441732 -365507 -271462 -228714
11677 -228714 -276151 -81449 -59692 -93978 -176831 -349795 -4510 -141399 -279286 -309743
11667 -309743 -229716 85411 84052 40712 -56355 -2388 48944 -106633 -98198 -158574 24481
11656 24481 -173205 -362776 -215003 -105578 -296068 -423694 -350866 -567887 -399691 -270892
$$ packed form
11729d96249J31385J54991L22997J40171o1151k04427k19102j00852K17134k03693
11719c18796R9786j32813R291r8011P8469j35932K05000L94510O5341k07470m06041
11708d46666j60294J51759m3436L0980J85561K44041Q1670N8896k64328K6632
11698a35185L28608k09752Q0893r28r7043O4170o5586o7152J8403K21398Q4188
11687B22014j75814K16037j54929j16835l18573j80192O6560P6225R4045M2748
11677b28714m7437J94702K1757l4286q2853j72964L45285j36889j37887l0457
11667c09743Q0027L15127j359m3340r7067N3967N1332j55577Q435o0376J83055
11656B4481j97686j89571J47773J09425j90490j27626P2828k17021J68196J28799
$$ plain form
11646 -270892 -135140 -144860 -42757 -236209 -173171 -312551 -137522 -153106 -220029 -274820 -338126
11635 -338126 -499387 -362083 -342135 -513071 -272955 -246277 -322460 -99548 -176391 -436007
11625 -436007 -252402 11808 186475 149805 -4528 -50023 -232076 -257278 -177807 -141311
11615 -141311 -209922 -207451 -129721 -294540 -318386 -334760 -374844 -109681 -112052 -444735 -179176
11604 -179176 -266780 -269943 -203032 -165761 -353165 -402723 -317558 -457674 -249178 -80691 -46715
11593 -46715 -135392 -232865 171550 -166221 -428976 -402533 -486237 -186941 -109879 -335996 -283834
11582 -283834 -532338 -233847 -245947 -693145 -469554 -265232 -382708 -174807 -60400 -33541
11572 -33541 144592 31561 -329665 -401449 -245499 -285390 -349448 -154684 -320955 -391755
$$ packed form
11646b70892J35752r720J02103j93452O3038j39380J75029j5584o6923n4791o3306
11635c38126j61261J37304J9948j70936K40116K6678p6183K22912p6843k59616
11625d36007J83605K64210J74667l6670j54333m5495j82053k5202P9471L6496
11615a41311o8611K471P7730j64819k3846j6374m0084K65163k371l32683K65559
11604a79176q7604l163O6911L7271j87404m9558Q5165j40116K08496J68487L3976
11593d6715q8677r7473M04415l37771k62755K6443q3704K99296P7062k26117N2162
11582b83834k48504K98491j2100m47198K23591K04322j17476K07901J14407K6859
11572c3541J78133j13031l61226p1784J55950l9891o4058J94764j66271p0800
$$ plain form
11562 -391755 -433646 -210854 320976 976 -175490 -53315 -335843 -190745 179990 123731
11552 123731 -131631 -259429 -124061 102618 -73855 -333771 -296153 -237763 -15325 -48948
11542 -48948 -218968 -296691 -156492 -274660 -350705 -395313 -319120 -347507 -418243 -452253 -288965
11531 -288965 -167929 -21210 -59508 97793 -56401 -475176 -575065 -513429 -276274 -53626
11521 -53626 -151331 -68066 -192386 -214016 10390 122358 94124 -359227 -330369 -304065 -327895
11510 -327895 -384604 -380695 -248751 -104826 -39825 736 -19011 -56940 -363586 -628005 -528762
11499 -528762 -380778 -322177 -174856 -206110 -41216 -204849 -458541 -489483 -452711 -363496
11489 -363496 -190557 -196435 -229457 -259211 -220485 -172609 -202160 -209804 -179937 -200944 -289996 -70784
$$ packed form
11562c91755m1891K22792N31830l20000j76466J22175k82528J45098L70735n6259
11552A23731k55362j27798J35368K26679j76473k59916L7618N8390K22438l3623
11542d8948j70020p7723J40199j18168p6045m4608P6193k8387p0736l4010J63288
11531b88965J21036J46719l8298J57301j54194m18775r9889O1636K37155K22648
11521e3626r7705Q3265j24320k1630K24406J11968k8234m53351K8858K6304k3830
11510c27895n6709L909J31944J43925O5001M0561j9747l7929l06646k64419R9243
11499e28762J47984N8601J47321l1254J64894j63633k53692l0942L6772Q9215
11489c63496J72939n878l3022k9754L8726M7876k9551p644K9867k1007q9052K19212
$$ plain form
11477 -70784 -55720 16932 -96593 -370854 -211006 -196146 1975 15269 -166016 -393197
11467 -393197 -232234 -131035 -180027 -184467 -185699 -163133 -29010 143879 -190224 -104462 -147942
11456 -147942 -324188 -350195 -244962 -183814 18867 -110605 -101851 6468 -86641 -364952
11446 -364952 -435255 -248180 -396748 -491593 -479460 -463886 -207379 168177 122891 -173907
11436 -173907 -124569 -139707 -276181 -420906 -675294 -422253 -203022 -299241 -55178 -280451
11426 -280451 -386205 -462096 -440945 -294360 -293003 -236270 -155250 2439 -214559 -493932 -188053
11415 -188053 -220512 -293930 -285803 -184346 -180399 -164496 -96204 -213244 -291194 -127453 -26561
11404 -26561 -130808 -130492 -30324 168391 136350 100700 -29084 -330484 -440977 -569135 -536174
$$ packed form
11477g0784J5064P2652j13525k74261J59848J4860J98121J3294j81285k27181
11467c93197J60963J01199m8992m440j232K2566J34123J72889l34103Q5762m3480
11456a47942j76246k6007J05233O1148K02681j29472Q754J08319r3109k78311
11446c64952p0303J87075j48568r4845J2133J5574K56507L75556m5286k96798
11436a73907M9338j5138j36474j44725k54388K53041K19231r6219K44063k25273
11426b80451j05754p5891K1151J46585J357N6733Q1020J57689k16998k79373L05879
11415a88053l2459p3418Q127J01457L947J5903O8292j17040p7950J63741J00892
11404b6561j04247L16J00168J98715l2041l5650j29784l01400j10493j28158L2961
$$ plain form
11393 -536174 -352233 -366443 -299661 -42603 -192944 -356360 -542430 -466611 -420068 -353496
11383 -353496 -218333 -373860 -315046 -152745 -191074 -300676 -82569 -117033 -76578 29217
11373 29217 -129877 -239978 -135266 -15855 -203708 -246390 -183870 -203153 -30091 -29404 -272346
11362 -272346 -146974 -64524 -314468 -399752 -319141 -298127 -336462 -349639 -544740 -390605 -320456
11351 -320456 -173219 -191573 -57927 -38721 -218714 -232047 -156099 -110715 -195863 -311607 -272915
11340 -272915 -202886 -168151 -379925 -117697 4381 216136 257921 186113 38674 -96674
11330 -96674 -15862 -149412 -190389 -185619 -240928 -309654 -290461 -170225 -277757 -307677 -240201
11319 -240201 -45267 35149 -271451 -246259 -184282 -245644 -225044 -83873 151204 31931
$$ packed form
11393e36174J83941j4210O6782K57058j50341j63416j86070P5819M6543O6572
11383c53496J35163j55527N8814J62301l8329j09602K18107l4464M0455J05795
11373B9217j59094j10101J04712J19411j87853m2682O2520j9283J73062O87k42942
11362b72346J25372Q2450k49944q5284Q0611K1014l8335j3177j95101J54135P0149
11351c20456J47237j8354J33646J9206j79993j3333P5948M5384q5148j15744L8692
11340b72915P0029L4735k11774K62228J22078K11755M1785p1808j47439j35348
11330i6674Q0812j33550m0977M770n5309o8726J9193J20236j07532k9920O7476
11319b40201J94934Q0416l06600K5192O1977o1362K0600J41171K35077j19273
$$ plain form
11309 31931 -144365 -354238 -422305 -296281 -304241 -124773 -235759 -427963 -424148 -551051 -283342
11298 -283342 -95441 -30551 -91529 50107 -97409 -248617 -224782 -358627 -246413 -118915
11288 -118915 -197833 -295672 -412350 -568922 -27344 445748 217192 66567 -147423 -379567
11278 -379567 -295081 -197572 -315660 -208418 -226193 -173951 -213432 -192350 -156933 -96902 -12395
11267 -12395 -127108 -368084 -222333 -66197 -238246 -54358 -285734 -114441 -334158 -380604
11257 -380604 -191825 -329037 -425374 -224672 -294477 -98992 -205996 -261893 -93777 -83894
11247 -83894 -97729 -142704 -13408 -132954 -311152 -190460 -138706 -106318 -142584 -88194 58745
11236 58745 -66855 -224569 -187685 -255781 -262227 -398155 -198939 -293966 -291910 -215791 -157312
$$ packed form
11309C1931j76296k09873o8067J26024p960J79468j10986j92204L815j26903K67709
11298b83342J87901O4890o0978J41636j47516j51208K3835j33845J12214J27498
11288a18915p8918r7839j16678j56572N41578M73092k28556j50625k13990k32144
11278c79567Q4486R7509j18088J07242j7775N2242l9481K1082L5417O0031Q4507
11267a2395j14713k40976J45751J56136j72049J83888k31376J71293k19717m6446
11257c80604J88779j37212r6337K00702o9805J95485j07004n5897J68116R883
11247h3894j3835m4975J29296j19546j78198J20692N1754L2388l6266N4390J46939
11236E8745j25600j57714L6884o8096o446j35928J99216r5027K056P6119N8479
$$ plain form
11225 -157312 -391863 -363293 -248023 20717 -124717 -222170 -103922 -113926 -338319 -215112
11215 -215112 -181989 -75958 -143217 -434682 -404633 -220444 -227403 -231734 -296947 -142231 -44672
11204 -44672 80299 141840 -243769 1830 29874 -226233 -504043 -139485 -64745 -205812
11194 -205812 -349055 -170972 -214606 -65196 -114016 -134769 24580 160896 -181876 -222299
11184 -222299 -297323 -311157 -160220 -243736 -327349 -193483 -320580 -364126 -438319 -483704 -263874
11173 -263874 -322465 -141261 -271168 -496453 -419866 -356546 -271890 -392494 -295110 -257123 -313500
11162 -313500 -197443 -267212 -373385 -299092 -149219 -217457 -194952 -332338 -312978 -141812
11152 -141812 -131337 -159618 -40887 -4704 -41332 -142030 -270754 -153380 67120 22658
$$ packed form
11225a57312k34551K8570J15270K68740j45434r7453J18248j0004k24393J23207
11215b15112L3123J06031o7259k91465L0049J84189o959m331o5213J54716R7559
11204d4672J24971O1541l85609K45599K8044k56107k77810L64558P4740j41067
11194b05812j43243J78083m3634J49410m8820k0753J59349J36316l42772m0423
11184b22299p5024j3834J50937q3516q3613J33866j27097m3546p4193m5385K19830
11173b63874n8591J81204j29907k25285P6587O3320Q4656j20604R7384L7987n6377
11162c13500J16057o9769j06173P4293J49873o8238K2505j37386J9360J71166
11152a41812J0475k8281J18731L6183l6628j00698j28724J17374K20500m4462
$$ plain form
11142 22658 129571 -588 -187540 58027 -21417 126492 13636 -149090 -316324 -454030
11132 -454030 -174995 -116151 -147573 45850 103495 268226 30658 84506 -26047 -28863 -224019
11121 -224019 -371032 -251335 -134563 -69841 125309 -112981 -273278 -220120 -281796 -165900
11111 -165900 79306 256921 147802 -111256 -209712 -325598 -356038 -324394 -420443 -273148
11101 -273148 -213947 -119847 -117375 -261884 -395248 -156573 -133484 -130277 -128494 -431336 -454177
11090 -454177 -357909 -338236 -293619 -313460 -219608 -95434 -148293 -223536 -248957 -83209 -53712
11079 -53712 -138577 -375601 -568755 -254255 -276238 -188050 152 -101413 2556 89757
11069 89757 -110475 -325561 -302160 -136001 -197634 -197949 -213202 -125053 -243283 -36569 -133154
$$ packed form
11142B2658J06913j30159j86952K45567p9444J47909j12856j62726j67234j37706
11132d54030K79035N8844l1422J93423N7645J64731k37568N3848j10553k816j95156
11121b24019j47013J19697J16772O4722J95150k38290j60297N3158o1676J15896
11111a65900K45206J77615j09119k59058r8456j15886l0440L1644r6049J47295
11101b73148N9201R4100K472j44509j33364K38675K3089L207J783l02842k2841
11090d54177R6268J9673M4617j9841R3852J24174n2859p5243k5421J65748K9497
11079e3712q4865k37024j93154L14500k1983Q8188J88202j01565J03969Q7201
11069H9757k00232k15086K3401J66159o1633l15j5253Q8149j18230K06714r6585
$$ plain form
11058 -133154 -172699 232645 135546 -24843 -60391 -211175 86704 -124199 -103546 -180247
11048 -180247 -99999 -19646 -131739 -184020 106777 110829 -24945 80693 132501 63864 19420
11037 19420 -16924 -126399 -95324 46450 74531 -127690 -432553 -69456 -99756 -33599 -60343
11026 -60343 -267519 -159754 -335144 -400831 -393978 -157858 141040 -77847 -285969 211001
11016 211001 286950 231670 106743 -69252 -241228 -128575 -304019 -338365 -390562 -215536
11006 -215536 -58240 49931 40906 -7743 -309793 -276306 -323913 -228915 -140282 -154946 -20136
10995 -20136 59690 23166 46701 -75167 -242668 -197720 -321353 -100217 -255532 -224453 -180601
10984 -180601 -263827 -116320 5147 44808 -34810 100676 -136658 -289416 -35980 -134155
$$ packed form
11058a33154l9545M05344r7099j60389l5548j50784K97879k10903K0653p6701
11048a80247Q0248Q0353j12093n2281K90797M052j35774J05638N1808o8637m4444
11037A9420l6344j09475L1075J41774K8081k02221l04863L63097l0300O6157k6744
11026f0343k07176J07765j75390o5687O853K36120K98898k18887k08122M96970
11016B11001P5949n5280j24927j75995j71976J12653j75444l4346n2197J75026
11006b15536J57296J08171r025m8649l02050L3487m7607R4998Q8633j4664J34810
10995b0136P9826l6524K3535j21868j67501M4948j23633K21136j55315L1079M3852
10984a80601q3226J47507J21467L9661p9618J35486k37334j52758K53436r8175
$$ plain form
10974 -134155 -13026 -82187 -182523 -293129 -237392 -127437 -181733 -334758 -417696 -228277
10964 -228277 -127885 -304594 -162972 -45135 -28386 -90900 -308942 -438849 -333646 -177594
10954 -177594 -125890 -104372 -99305 -66954 -262134 -274012 -142542 41085 -5348 46034 207075
10943 207075 204207 139796 156640 -62798 -262514 -318407 -292318 -88867 -53423 -112696 -51404
10932 -51404 -20089 -188971 -211776 -345065 -51362 -14075 -438894 -414972 -352037 -328176 -357755
10921 -357755 -117567 -85375 41125 -292121 -339924 -373007 -313718 -248974 -223470 -368249 -160908
10910 -160908 -196444 -149027 -21011 -20789 -25372 -158673 -181161 -149128 -229068 -33888 209839
10899 209839 76190 -8587 49580 71547 -252118 -362814 -429089 -273446 -300001 -115398
$$ packed form
10974a34155J21129o9161j00336j10606N5737J09955n4296j53025q2938J89419
10964b28277J00392j76709J41622J17837J6749o2514k18042j29907J05203J56052
10954a77594N1704K1518N067L2351j95180j1878J31470J83627m6433N1382J61041
10943B07075k868o4411J6844k19438j99716n5893K6089K03451L5444n9273O1292
10932e1404L1315j68882k2805j33289K93703L7287m24819K3922O2935K3861k9579
10921c57755K40188L2192J26500l33246m7803l3083N9289O4744K5504j44779K07341
10910a60908l5536M7417J28016K22m583j33301k2488L2033p9940J95180K43727
10899B09839j33649q4777N8167K1967l23665j10696o6275J55643k6555J84603
$$ plain form
10889 -115398 -103219 -131659 -171263 -39706 10014 -47491 62018 -59620 -182041 -170768 -172157
10878 -172157 -142973 2836 185758 211621 250150 215054 344469 153270 -72420 -49974
10868 -49974 -146625 -108640 -134881 -538064 -424416 -263269 -231978 -303187 -147356 -226433 -397293
10857 -397293 -146142 -299593 -291071 -114309 207533 240182 -82981 -149016 -284525 -75436
10847 -75436 -135111 -52188 -41702 51108 164086 113485 -64001 -71733 172286 -49093 -170531
10836 -170531 -92350 34991 -36477 -128859 -135527 -203009 -120850 -150164 -162092 137872 145512
10825 145512 270284 279038 179416 195681 103290 84390 264239 -126077 -31864 24308 -116347
10814 -116347 2202 -25244 73420 128254 106882 167499 -108742 77102 149039 146514 -45605
$$ packed form
10889a15398J2179k8440l9604J31557M9720n7505J09509j21638j22421J1273j389
10878a72157K9184J45809J82922K5863L8529l5096J29415j91199k25690K2446
10868d9974r6651L7985k6241m03183J13648J61147L1291p1209J55831p9077j70860
10857c97293K51151j53451Q522J76762L21842L2649l23163o6035j35509K09089
10847g5436n9675Q2923J0486R2810J12978n0601j77486p732K44019k21379j21438
10836a70531P8181J27341p1468r2382o668o7482Q2159k9314j1928K99964P640
10825A45512J24772Q754r9622J6265r2391j8900J79849l90316R4213N6172j40655
10814a16347J18549k7446R8664N4834k1372O0617k76241J85844P1937k525j92119
$$ plain form
10803 -45605 5108 189813 224623 177817 -108586 50914 -68110 -109974 -193321 -201820 125323
10792 125323 226046 89545 -201046 -110995 96460 297 178142 87924 196277 8162
10782 8162 -52350 -16459 160753 360654 106623 -40862 62367 311924 325180 324653 80542
10771 80542 -131914 117649 -12023 -62290 385408 410765 112856 62437 231845 48317
10761 48317 -74645 176944 -69036 126671 227986 81356 122136 85688 121790 212020
10751 212020 86170 111855 70412 -124753 -144273 149302 176379 452375 284786 67105
10741 67105 314039 333363 389948 436244 395465 151193 -60671 148343 275548 275933 489995
10730 489995 445914 191733 8495 267463 244371 64262 301229 341285 379027 459938
$$ packed form
10803d5605N0713J84705L4810m6806k86403J59500j19024m1864q3347q499L27143
10792A25323J00723j36501k90591R0051K07455r6163J77845r0218J08353j88115
10782H162o0512L5891J77212J99901k54031j47485J03229K49557J3256n27k44111
10771H0542k12456K49563j29672n0267M47698K5357k97909n0419J69408j83528
10761D8317j22962K51589k45980J95707J01315j46630M0780l6448L6102R0230
10751B12020j25850K5685m1443j95165j9520K93575K7077K75996j67589k17681
10741F7105K46934J9324N6585M6296m0779k44272k11864K09014J27205L85K14062
10730D89995m4081k54181j83238K58968k3092j80109K36967M0056L7742Q0911
$$ plain form
10720 459938 333866 326418 344852 552615 503771 713559 973888 804752 411751 390351
10710 390351 417050 326360 432031 281856 263614 88784 88752 390702 208200 619775 409611
10699 409611 251879 494713 74040 201256 596293 387102 386697 195703 246964 256077 52007
10688 52007 85819 184694 138582 293679 287743 196401 202570 361066 581814 624807 397613
10677 397613 487490 388536 206987 205541 233255 -26517 85804 390046 132295 193619 183574
10666 183574 330219 292526 492054 589052 597102 403650 207319 197453 323178 557833 505395
10655 505395 432249 620754 674616 554568 480919 168569 184318 231079 50006 145506 488346
10644 488346 504246 599160 523823 491365 452746 285383 447809 304902 542850 453596 470076
$$ packed form
10720D59938j26072p448J8434K07763m8844K09788K60329j69136l93001k1400
10710C90351K6699r0690J05671j50175j8242j74830l2L01950j82502M11575k10164
10699D09611j57732K42834m20673J27216L95037k09191m05j90994N1261R113k04070
10688E2007L3812R8875m6112J55097n936r1342O169J58496K20748M2993k27194
10677C97613Q9877r8954j81549j446K7714k59772J12321L04242k57751O1324j0045
10666A83574J46645l7693J99528R6998Q050j93452j96331r866J25725K34655n2438
10655E05395p3146J88505N3862j20048p3649l12350J5749M6761j81073R5500L42840
10644D88346J5900R4914p5337l2458l8619j67363J62426j42907K37948q9254J6480
$$ plain form
10633 470076 702117 633038 398474 316494 623815 526345 546106 454269 629296 787891
10623 787891 577167 442885 588172 780855 665364 331010 246476 513161 548785 539323
10613 539323 488124 552379 445090 560251 737305 701214 685449 646648 730722 811855 881862
10602 881862 906518 777326 741963 828848 824330 793331 581156 158487 329418 250987 320235
10591 320235 280323 434610 532180 641553 536627 710862 1048648 905595 680258 574577
10581 574577 668368 711647 625524 727425 880136 875095 768987 431093 759721 973204
10571 973204 707259 907167 980219 788469 592261 910767 1097718 980961 715577 598831
10561 598831 913760 995298 841985 861626 980611 1074319 939040 1113650 1082555 1036805
$$ packed form
10633D70076K32041o9079k34564q1980L07321r7470J9761r1837J75027J58595
10623G87891k10724j34282J45287J92683j15491l34354q4534K66685L5624r462
10613E39323n1199O4255j07289J15161J77054l6091j5765l8801Q4074Q1133P0007
10602H81862K4656j29192l5363Q6885m518l0999k12175m22669J70931p8431O9248
10591C20235l9912J54287R7570J09373j04926J74235L37786j43053k25337j05681
10581E74577R3791M3279q6123J01901J52711n041j06108l37894L28628K13483
10571I73204k65945J99908P3052j91750j96208L18506J86951j16757k65384j16746
10561E98831L14929Q1538j53313J9641J18985R3708j35279J74610l1095m5750
$$ plain form
10551 1036805 819747 751704 1099281 1063540 1124237 1191741 989394 945246 1135529 1115930
10541 1115930 874562 765861 869001 853582 1026299 1068898 1347797 1286546 1239404 1283866
10531 1283866 1411460 1279145 1029198 874375 961200 965367 948921 1052339 1058130 1199856
10521 1199856 1375793 1212361 1117607 877528 1051116 1125275 1156239 1237404 1156913 1128690
10511 1128690 1002937 1348878 1484142 1485568 1463220 1293124 1605735 1826713 1529718 1416939
10501 1416939 1630950 1409034 1339480 1407460 1410564 1608791 1677509 1447916 1286581 1320209
10491 1320209 1665737 1743364 1656433 1425845 1594020 1713718 1604569 1483678 1576198 1561795
10481 1561795 1346845 1403109 1672838 1478503 1500890 1756057 1518362 1532404 1653440 1838986
$$ packed form
10551A036805k17058o8043L47577l5741O0697O7504k02347m4148J90283j9599
10541A115930k41368j08701J03140j5419J72717M2599K78899o1251m7142M4462
10531A283866J27594j32315k49947j54823Q6825M167j6446J03418N791J41726
10521A199856J75937j63432r4754k40079J73588P4159L0964Q1165q0491k8223
10511A128690j25753L45941J35264J426k2348j70096L12611K20978k96995j12779
10501A416939K14011k21916o9554O7980L104J98227O8718k29593j61335L3628
10491A320209L45528P7627q6931k30588J68175J19698j09149j20891R2520j4403
10481A561795k14950N6264K69729j94335K2387K55167k37695J4042J21036J85546
$$ plain form
10471 1838986 1873951 1729363 1731269 1705860 1602226 1627938 1847207 1925886 1878265 1870847 1875562
10460 1875562 2213972 2280104 2298417 2390340 2266781 2123524 1874396 1838209 1702338 1696447
10450 1696447 2047906 2114106 2210867 2246003 2115646 1925978 1998411 2130699 2096662 2110598
10440 2110598 2191914 2329344 2403024 2317594 2487345 2371428 2320363 2313817 2319187 2512095 2903179
10429 2903179 2701044 2894214 2661196 2745057 2812504 2803038 2763728 2747917 2593095 2789058
10419 2789058 2954231 2980539 3210591 3217721 3194345 2924112 3141734 3199365 3292503 3132629
10409 3132629 3194598 2988102 3093352 3295662 3402508 3513304 3620002 3717357 3313187 3450743
10399 3450743 3680482 3676043 3824970 3969436 3842376 3962232 3875717 3824977 3698664 3912803
$$ packed form
10471A838986L4965j44588J906k5409j03634K5712K19269P8679m7621p418M715
10460A875562L38410O6132J8313R1923j23559j43257k49128l6187j35871n891
10450A696447L51459O6200R6761L5136j30357j89668P2433J32288l4037J3936
10440B110598Q1316J37430P3680q5430J69751j15917n1065o546N370J92908L91084
10429B903179k02135J93170k33018Q3861O7447r466l9310j5811j54822J95963
10419B789058J65173K6308K30052P130k3376k70233K17622N7631R3138j59874
10409C132629O1969k06496J05250K02310J06846J10796J06698R7355m04170J37556
10399C450743K29739m439J48927J44466j27060J19856q6515n0740j26313K14139
$$ plain form
10389 3912803 4004900 4086161 4117817 3919006 3865355 4117833 4506887 4700549 4690743 4416563
10379 4416563 4234782 4314982 4517536 4573884 4768411 4499188 4626052 4812552 4993818 5056979
10369 5056979 4929819 5058584 5058576 5046301 4958527 5022485 5407246 5507654 5464517 5508625 5809577
10358 5809577 5772504 5981332 5914999 6071158 6198816 6109093 5932666 6186598 6225643 6120876
10348 6120876 6279727 6440069 6355729 6530321 6742022 6928375 7179718 7093021 7086427 7267743
10338 7267743 7447510 7649564 7923437 8139742 8279933 8420212 8645966 8516964 8454803 8658587
10328 8658587 8651958 8507793 8736679 8928823 9128869 9267765 9175548 9565108 9945143 9766347
10318 9766347 9683036 9951581 10271263 10609934 10829548 10943689 11034809 11229633 11576503 11842946
$$ packed form
10389C912803R2097Q1261L1656j98811n3651K52478L89054J93662r806k74180
10379D416563j81781Q0200K02554N6348J94527k69223J26864J86500J81266O3161
10369E056979j27160J28765qj2275q7774O3958L84761J00408m3137M4108L00952
10358E809577l7073K08828o6333J56159J27658q9723j76427K53932L9045j04767
10348F120876J58851J60342q4340J74592K11701J86353K51343q6697o594J81316
10338G267743J79767K02054K73873K16305J40191J40279K25754j29002o2161K03784
10328H658587o629j44165K28886J92144K00046J38896r2217L89560L80035j78796
10318I766347q3311K68545L19682L38671K19614J14141R1120J94824L46870K66443
$$ plain form
10308 11842946 11940321 11875044 12203027 12564681 12739686 12904471 13379949 13497231 13756430 13905870
10298 13905870 14310151 14484684 14895257 15478937 15679604 15973284 16365145 16897018 17242570
10289 17242570 17619736 18021724 18571970 19096108 19677598 20300816 21070107 21828798 22350713
10280 22350713 23074056 23504516 23928134 24612593 25387217 26090847 26861842 27749172 28849587
10271 28849587 29830826 30563028 31367718 32629572 33797098 35115893 36350061 37538831
10263 37538831 39071208 40462946 41934862 43654831 45399788 47344073 49395066 51444150
10255 51444150 53569279 55593732 57497318 59835780 62020752 64367823 66812317 69355913
10247 69355913 71694748 74256918 76943710 79441488 82391412 85074453 88034441 91270043
$$ packed form
10308A1842946R7375o5277L27983L61654J75005J64785M75478J17282K59199J49440
10298A3905870M04281J74533M10573N83680K00667K93680L91861N31873L45552
10289A7242570L77166M01988N50246N24138N81490O23218P69291P58691N21915
10280B2350713P23343M30460M23618O84459P74624P03630P70995Q87330J100415
10271B8849587R81239P32202Q04690J261854J167526J318795J234168J188770
10263C7538831J532377J391738J471916J719969J744957J944285K050993K049084
10255E1444150K125129K024453J903586K338462K184972K347071K444494K543596
10247F9355913K338835K562170K686792K497778K949924K683041K959988L235602
$$ plain form
10239 91270043 94520679 97835844 101105599 104338603 108013269 111761812 115583607 119586533
10231 119586533 123739325 128131314 132498904 136770867 141452092 145667043 150400766 155230598
10223 155230598 160228084 165172451 170133389 174984300 180176308 185217769 190079367 194865988
10215 194865988 199760206 204805602 209567570 214425869 219208581 223997213 228823219 233697278
10207 233697278 238618874 243290361 247947551 252778308 257717637 262338157 266868273 271371498
10199 271371498 276099780 280678252 285313275 290349997 295356080 300445284 305261797 310550009
10191 310550009 316057415 321613388 327330027 333037578 339055270 345196370 351123831 357505623
10183 357505623 364134083 370469488 377198798 384418330 391664724 398929542 406478190 413915002
$$ packed form
10239I1270043L250636L315165L269755L233004L674666L748543L821795M002926
10231A19586533M152792M391989M367590M271963M681225M214951M733723M829832
10223A55230598M997486M944367M960938M850911N192008N041461M861598M786621
10215A94865988M894218N045396M761968M858299M782712M788632M826006M874059
10207B33697278M921596M671487M657190M830757M939329M620520M530116M503225
10199B71371498M728282M578472M635023N036722N006083N089204M816513N288212
10191C10550009N507406N555973N716639N707551O017692O141100N927461O381792
10183C57505623O628460O335405O729310P219532P246394P264818P548648P436812
$$ plain form
10175 413915002 421498626 429427817 436942434 444176317 451477237 458232032 464356550 469083552
10167 469083552 472237860 473034001 470689596 464689537 454832405 441103970 423049137 400465592
10159 400465592 372518305 340709691 307150393 274886703 245255935 219342665 196541144
10152 196541144 176937764 159753593 144358294 130841683 119253704 109183847 100071260
10145 100071260 92036680 85223251 78985685 73587099 69094157 64952401 61100139 57400600
10137 57400600 54188351 51349867 48747181 46067818 44105310 42182176 40221891 38423902
10129 38423902 36567016 35157540 33933558 32598799 31682693 30577374 28974375 27887602
10121 27887602 26700849 25942553 25106961 24261200 23401186 22722184 21930031 21272298 20537777
$$ packed form
10175D13915002P583624P929191P514617P233883P300920O754795O124518M727002
10167D69083552L154308P96141k344405o000059r857132j3728435j8054833k2583545
10159D00465592k7947287l1808614l3559298l2263690k9630768k5913270k2801521
10152A96541144j9603380j7184171j5395299j3516611j1587979j0069857r112587
10145A00071260q034580o813429o237566n398586m492942m141756l852262l699539
10137E7400600l212249k838484k602686k679363j962508j923134j960285j797989
10129C8423902j856886j409476j223982j334759r16106j105319j602999j086773
10121B7887602j186753p58296q35592q45761q60014o79002p92153o57733p34521
$$ plain form
10112 20537777 19987044 19433176 18846838 18388565 17758855 17418681 17036789 16573222 16066843
10103 16066843 15654971 15047803 14774402 14493792 14103615 13903119 13424133 13194478 12778230
10094 12778230 12506115 12292786 11970392 11809980 11457360 11209851 10775236 10724826 10708202 10606842
10084 10606842 10100593 9803248 9622066 9489679 9522407 9366448 9177513 9061717 8920269
10075 8920269 8656384 8634286 8362759 8071136 8234714 8156699 8157949 7807560 7797917 7656288
10065 7656288 7482139 7160599 7126671 7185123 6977909 6609772 6354486 6424606 6246674 6323344
10055 6323344 6098233 5881875 5901391 5785148 5625117 5541566 5422360 5379738 5354193 5183317
10045 5183317 4876465 4944343 5076627 4952506 4836645 4927550 5054319 4830539 4600024 4605650
$$ packed form
10112B0537777n50733n53868n86338m58273o29710l40174l81892m63567n06379
10103A6066843m11872o07168k73401k80610l90177k00496m78986k29655m16248
10094A2778230k72115k13329l22394j60412l52620k47509m34615n0410j6624j01360
10084A0606842n06249k97345j81182j32387L2728j55959j88935j15796j41448
10075H920269k63885k2098k71527k91623J63578p8015J250l50389r643j41629
10065G656288j74149l21540l3928N8452k07214l68137k55286P0120j77932P6670
10055F323344k25111k16358J9516j16243j60031q3551j19206m2622k5545j70876
10045E183317l06852O7878J32284j24121j15861R0905J26769k23780k30515N626
$$ plain form
10035 4605650 4597202 4591418 4383697 4148009 4029812 3979212 3880603 3713446 3619006 3359486 3416868
10024 3416868 3522069 3302706 2915514 3115488 3102963 2894033 2810466 2855573 2769126 2682492
10014 2682492 2658269 2662994 2579184 2515540 2435180 2043862 2245283 2312091 2198698 2132066 2056654
10003 2056654 2058723 2081272 2131757 2339913 1915555 1805871 1873376 1859509 1762943 1908861 1773650
9992 1773650 1689158 1900940 2002486 1885374 1708777 1742773 1618097 1867076 1936434 2178895
9982 2178895 2101271 2167986 1881394 1835125 1880648 1771578 1755616 1602992 1794282 1884027 1664141
9971 1664141 1545247 1449903 1674524 1754913 1541233 1857209 1747918 1790710 1882002 1646007
9961 1646007 1728719 1527572 1514749 1792813 1551874 1565711 1478784 1451574 1455571 1396258 1560321
$$ packed form
10035D605650q448n784k07721k35688j18197n0600r8609j67157r4440k59520N7382
10024C416868J05201k19363l87192J99974j2525k08930q3567M5107q6447q6634
10014B682492k4223M725q3810o3644q0360l91318K01421O6808j13393o6632p5412
10003B056654K069K2549N0485K08156m24358j09684O7505j3867r6566J45918j35211
9992A773650q4492K11782J01546j17112j76597L3996j24676K48979O9358K42461
9982B178895p7624O6715k86592m6269M5523j09070j5962j52624J91290Q9745k19886
9971A664141j18894r5344K24621Q0389k13680L15976j09291M2792R1292k35995
9961A646007Q2712k01147j2823K78064k40939J3837q6927k7210L997n9313J64063
$$ plain form
9950 1560321 1639326 1529905 1431926 1470930 1410895 1434554 1290640 1268807 1557467 1578312 1163330
9939 1163330 1105335 1287933 1190111 1129534 1209421 1034847 1029713 1198503 940733 921932 796139
9928 796139 758019 650935 752347 914211 980930 868679 878665 933400 796261 676725 819123
9917 819123 1003735 1023525 731386 810884 980208 1115633 929477 711061 1009227 1044062
9907 1044062 1380124 1362584 1193115 959242 981654 1183150 939533 877383 981790 888523
9897 888523 855397 1009546 902733 960136 1177302 903480 763175 804214 617071 459779
9887 459779 609142 726186 782173 660574 327887 448621 668640 646149 677045 781823
9877 781823 964324 1044346 802989 556838 738017 707041 685247 832381 502422 487382
$$ packed form
9950A560321P9005j09421r7979L9004o0035K3659j43914k1833K88660K0845m14982
9939A163330n7995J82598r7822o0577P9887j74574n134J68790k57770j8801j25793
9928G96139l8120j07084J01412J61864O6719j12251R986N4735j37139j19536J42398
9917H19123J84612J9790k92139P9498J69324J35425j86156k18416K98166L4835
9907A044062L36062j7540j69469k33873K2412K01496k43617o2150J04407r3267
9897H88523l3126J54149j06813N7403K17166k73822j40305M1039j87143j57292
9887D59779J49363J17044N5987j21599l32687J20734K20019k2491L0896J04778
9877G81823J82501Q0022k41357k46151J81179l0976k1794J47134l29959j5040
$$ plain form
9867 487382 630939 561509 429380 391802 512738 817574 914596 917805 757202 517269 503196
9856 503196 681765 495900 642885 894796 582114 704453 813080 889232 701798 449523
9846 449523 481469 630514 706136 554143 486297 526501 645941 439880 171929 482370
9836 482370 605870 568476 527302 291811 298189 348138 336576 469300 566307 574603 570548 495749
9824 495749 513167 594724 445646 328155 286702 476382 637731 440876 195684 299820
9814 299820 232692 255965 334662 368771 304213 462453 270148 514267 455074 480691 503048
9803 503048 359302 500465 593548 525369 444523 517044 555071 755771 750216 650446 529781
9792 529781 393514 405103 446435 532250 587974 424335 301451 475404 355668 408715 645938
$$ packed form
9867D87382J43557o9430j32129l7578J20936L04836R7022L209j60603k39933j4073
9856E03196J78569j85865J46985K51911l12682J22339J08627P6152j87434k52275
9846D49523L1946J49045P5622j51993o7846M0204J19440k06061k67951L10441
9836D82370J23500l7394m1174k35491O378M9949j1562J32724R7007Q296m055p4799
9824D95749J7418Q1557j49078j17491m1453J89680J61349j96855k45192J04136
9814B99820o7128K3273P8697L4109o4558J58240j92305K44119n9193K5617K2357
9803E03048j43746J41163R3083o8179q0846P2521L8027K00700n555r9770j20665
9792E29781j36267J1589M1332Q5815N5724j63639j22884J73953j19736N3047K37223
$$ plain form
9781 645938 558066 617229 632262 756540 744189 761843 641693 406925 221492 227669 404017
9770 404017 378332 580126 846242 776229 749993 587659 653574 473231 397223 524851 613597
9759 613597 377822 184136 361163 491756 338372 333321 352576 261859 232470 431771 465920
9748 465920 546136 478629 359125 320084 414860 529210 479783 365391 230970 420617 462572
9737 462572 492691 443510 414219 559593 612326 605701 685646 642952 555547 548017 417084 311582
9725 311582 422152 345750 279380 141277 87059 94017 68787 -1827 36837 434962 433956
9714 433956 469883 533537 663362 763729 369894 315130 370696 366001 606502 602120 651707
9703 651707 777875 799819 780297 964399 815419 694215 798607 828908 517759 849624
$$ packed form
9781F45938q7872N9163J5033J24278j2351J7654j20150k34768j85433O177J76348
9770D04017k5685K01794K66116p0013k6236j62334O5915j80343p6008J27628Q8746
9759F13597k35775j93686J77027J30593j53384n051J9255r0717k9389J99301L4149
9748D65920Q0216o7507j19504l9041R4776J14350m9427j14392j34421J89647M1955
9737D62572L0119m9181k9291J45374N2733o625P9945m2694q7405p530j30933j05502
9725C11582J10570p6402o6370j38103n4218O958k5230p0614L8664L98125j006
9714D33956L5927O3654J29825J00367l93835n4764N5566m695K40501m382M9587
9703F51707J26168K1944j9522J84102j48980j21204J04392L0301l11149L31865
$$ plain form
9693 849624 1003892 841992 831245 649936 725903 858697 799904 685752 725970 731435 630359
9682 630359 746659 853973 924383 886915 802657 1055158 874368 773535 1108492 1309871
9672 1309871 1272378 1037233 964614 839201 719440 774215 787576 1064764 1179151 1130611
9662 1130611 1101893 1264617 1215323 1297473 1356109 1223287 1509599 1490172 1226291 1150629 1147050
9651 1147050 1521418 1389643 1332940 1506385 1582166 1591868 1656730 1533292 1466453 1443306 1289797
9640 1289797 1438857 1607590 1630626 1537437 1514195 1696850 1727616 1677430 1627577 1796599 1801352
9629 1801352 1771717 1930384 1894179 1837243 2157596 2004058 2114227 1907703 1992453 2143820
9619 2143820 2376664 2795741 2592757 2621731 2542884 2518333 2435425 2545936 2645247 2762364
$$ packed form
9693H49624J54268j61900j0747j81309P5967J32794n8793j14152M0218N465j01076
9682F30359J16300J07314P0410l7468q4258K52501j80790j00833L34957K01379
9672A309871l7493k35145p2619j25413j19761N4775J3361K77188J14387m8540
9662A130611k8718J62724m9294Q2150N8636j32822K86312j9427k63881p5662l579
9651A147050L74368j31775n6703J73445P5781R702O4862j23438o6839k3147j53509
9640A289797J49060J68733K3036r3189k3242J82655L0766n0186m9853J69022M753
9629A801352k9635J58667l6205n6936L20353j53538J10169k06524Q4750J51367
9619B143820K32844M19077k02984K8974p8847k4551q2908J10511R9311J17117
$$ plain form
9609 2762364 2812579 2777675 2656827 2775750 2860033 2853339 2728680 2908229 2827633 3048651 3288356
9598 3288356 3336935 3551211 3662836 3592981 3327287 3527679 3505328 3532815 3652012 3633766
9588 3633766 3810199 3923921 3972252 3975187 4060496 4019205 4098404 4279691 4386553 4165816 4128882
9577 4128882 4282890 4525814 4864195 4802640 4615829 4980206 5078141 4959920 5124811 5145501
9567 5145501 5290462 5447474 5499863 5393363 5595930 5433106 5689933 5890470 6018254 5893212
9557 5893212 5847344 5932129 6176868 6164535 6274601 6480207 6360060 6328285 6550041 6357682
9547 6357682 6284577 6217479 6464681 6892430 6762055 6754155 6884550 6951104 7008451 6982891 6903121
9536 6903121 7094214 6940744 6829999 6793723 6640931 6276099 6596513 6750310 6668429 6699909
$$ packed form
9609B762364N0215l4904j20848J18923Q4283o694j24659J79549q0596K21018K39705
9598C288356M8579K14276J11625o9855k65694K00392k2351K7487J19197j8246
9588C633766J76433J13722M8331K935Q5309m1291P9199J81287J06862k20737l6934
9577D128882J54008K42924L38381o1555j86811L64377R7935j18221J64891K0690
9567E145501J44961J57012N2389j06500K02567j62824K56827K00537J27784j25042
9557E893212m5868Q4785K44739j2333J10066K05606j20147l1775K21756j92359
9547F357682p3105o7098K47202M27749j30375p900J30395O6554N7347k5560p9770
9536F903121J91093j53470j10745l6276j52792l64832L20414J53797q1881L1480
$$ plain form
9526 6699909 6844299 6645325 6641186 6498604 6367470 6387240 6538163 6084042 6137787 6123579
9516 6123579 5987687 5980194 6060841 5894646 5871584 6079093 6245023 5876033 5746589 5704413
9506 5704413 5448244 5556869 5438432 5286854 5109574 4977089 5009926 5117328 5020847 4972088
9496 4972088 4787004 4511716 4446318 4413993 4247364 4457840 4583654 4394201 4317192 4360471
9486 4360471 4204624 4173473 4113575 4094295 3947302 3791928 3654309 3634152 3736391 3954932
9476 3954932 3599809 3226879 3275999 3125914 3291715 3263646 3280842 3360478 3106386 2931585
9466 2931585 2872381 2786292 2603099 2854648 2626883 2752011 2790795 2704473 2605631 2733583
9456 2733583 2698230 2465229 2588108 2550882 2561039 2547718 2335739 2119306 2202257 2229278 2182622
$$ packed form
9526F699909J44390j98974m139j42582j31134J9770J50923m54121N3745j4208
9516F123579j35892p493Q0647j66195k3062K07509J65930l68990j29444m2176
9506E704413k56169J08625j18437j51578j77280j32485L2837J07402r6481m8759
9496D972088j85084k75288o5398l2325j66629K10476J25814j89453p7009M3279
9486D360471j55847l1151n9898j9280j46993j55374j37619k0157J02239K18541
9476C954932l55123l72930M9120j50085J65801k8069J7196P9636k54092j74801
9466B931585n9204q6089j83193K51549k27765J25128L8784q6322r8842J27952
9456B733583l5353k33001J22879l7226J0157j3321k11979k16433Q2951K7021m6656
$$ plain form
9445 2182622 2088177 2117465 2053302 2063455 1861355 2003064 2182717 2022696 2074267 2040360 1963832
9434 1963832 1869026 1973459 1987789 1781250 1473104 1543842 1651075 1539645 1595188 1764090
9424 1764090 1383039 1397133 1501993 1494007 1727083 1493032 1281944 1491047 1247669 1446172
9414 1446172 1279502 1192903 1322904 1376959 1586222 1361388 1263830 1124942 1206206 1407830
9404 1407830 1307961 1407092 1444924 1542661 1584143 1324256 1344026 1266504 1144378 895644 1106460
9393 1106460 1162543 848892 986569 1278249 1036836 967387 1119809 1164500 1078220 1030761
9383 1030761 981949 895021 800663 905808 928425 786595 807740 1132585 1132151 917279 964167
9372 964167 820089 758455 712201 678414 740862 728923 820643 1046155 1128665 896674 971356
$$ packed form
9445B182622r4445K9288o4163J0153k02100J41709J79653j60021N1571l3907p6528
9434A963832r4806J04433J4330k06539l08146P0738J07233j11430N5543J68902
9424A764090l81051J4094J04860p986K33076k34051k11088K09103k43378J98503
9414A446172j66670q6599J30001N4055K09263k24834r7558j38888Q1264K01624
9404A407830r9869R9131L7832R7737M1482k59887J9770p7522j22126k48734K10816
9393A106460N6083l13651J37677K91680k41413o9449J52422M4691q6280m7459
9383A030761m8812q6928r4358J05145K2617j41830K1145L24845m34k14872M6888
9372I64167j44078o1634m6254l3787O2448j1939R1720K25512Q2510k31991P4682
$$ plain form
9361 971356 933203 854492 876102 876604 763866 901537 1098911 890986 719935 726797 711355
9350 711355 848127 994872 955481 1025813 973540 576582 583997 671520 628161 661265 902548
9339 902548 850852 545460 550985 507793 503776 413223 682994 865175 685873 627712 955987
9328 955987 714597 595770 761071 609509 503795 391122 288775 377503 473101 355523
9318 355523 468985 404398 412099 453628 607689 485321 600368 654413 773644 730682 474363
9307 474363 668822 559254 663839 765313 499375 375029 386400 418174 473705 330458
9297 330458 325016 470979 254356 339009 415217 376480 324555 421675 494817 736350 639320
9286 639320 458571 432937 372269 501264 582056 598743 489659 444998 524445 500471 376108
$$ packed form
9361I71356l8153p8711K1610N02j12738J37671J97374k07925j71051O862j5442
9350G11355J36772J46745l9391P0332n2273l96958P415Q7523m3359L3104K41283
9339I02548n1696l05392N525m3192m017r0553K69771J82181j79302n8161L28275
9328I55987k41390j18827J65301j51562j05714j12673j02347Q8728R5598j17578
9318C55523J13462o4587P701M1529J54061j22368J15047N4045J19231m2962k56319
9307D74363J94459j09568J04585J01474k65938j24346J1371L1774N5531j43247
9297C30458n442J45963k16623Q4653P6208l8737n1925R7120P3142K41533r7030
9286F39320j80749k5634o0668J28995Q0792J6687j09084m4661P9447k3974j24363
$$ plain form
9275 376108 401728 363902 681737 480814 368724 299854 476777 469055 586926 535710 548884
9264 548884 418504 353169 607434 497829 475065 399142 437244 760577 692552 451000 602093
9253 602093 656623 459569 435451 439997 374893 561741 527404 432366 243030 298961 375313
9242 375313 584057 401832 167933 582864 749841 569709 280404 532779 531519 424151
9232 424151 531697 622208 606551 526488 315005 437815 644421 451204 352958 387796 410641
9221 410641 305399 324526 462737 310971 195035 151705 286531 467776 417428 305382
9211 305382 211657 475040 719061 761024 647041 323515 225403 372178 410523 284801
9201 284801 191099 396280 325411 398787 588512 484276 539305 571889 601171 611276 557744
$$ packed form
9275C76108K5620l7826L17835k00923j12090o8870J76923p722J17871n1216J3174
9264E48884j30380o5335K54265j09605k2764p5923L8102L23333o8025k41552J51093
9253F02093N4530j97054k4118M546o5104J86848l4337r5038j89336N5931P6352
9242C75313K08744j82225k33899M14931J66977j80132k89305K52375j260j07368
9232D24151J07546R0511j5657q0063k11483J22810K06606j93217r8246L4838K2845
9221D10641j05242J9127J38211j51766j15936m3330J34826J81245n0348j12046
9211C05382r3725K63383K44021M1963j13983l23526r8112J46775L8345j25722
9201B84801r3702K05181p0869P3376J89725j04236N5029L2584K9282J0105n3532
$$ plain form
9190 557744 592003 429468 530156 680307 506876 368405 427510 239086 435057 517222
9180 517222 420777 482550 388274 340219 264849 398175 439290 467291 493155 462849 684490
9169 684490 780156 436443 381217 531216 287135 471824 643869 615354 669729 194195
9159 194195 71271 146834 178778 344644 320372 535527 578474 554271 519525 393463 546020
9148 546020 297195 83592 379961 509382 409919 487197 404158 460011 588502 249233
9138 249233 182515 160783 269671 359386 398015 500154 730061 609415 791721 658981
9128 658981 604069 564965 784265 889863 732351 619398 454163 389640 552796 749202
9118 749202 456621 418332 735926 569894 237737 202180 352028 450250 472206 521687 512450
$$ packed form
9190E57744L4259j62535J00688J50151j73431j38471N9105j88424J95971Q2165
9180E17222r6445O1773r4276m8055p5370J33326M1115K8001K5864l0306K21641
9169F84490R5666l43713n5226J49999k44081J84689J72045k8515N4375m75534
9159A94195j22924P5563L1944J65866k4272K15155M2947k4203l4746j26062J52557
9148E46020k48825k13603K96369J29421r9463P7278q3039N5853J28491l39269
9138B49233o6718k1732J08888Q9715L8629J02139K29907j20646J82306j32740
9128F58981n4912l9104K19300J05598j57512j12953j65235o4523J63156J96406
9118G49202k92581l8289L17594j66032l32157l5557J49848R8222K1956M9481r237
$$ plain form
9107 512450 451544 342068 368851 65047 336737 425921 435495 277390 423381 535499 405372
9096 405372 558133 695342 397752 601486 526354 351944 496946 433549 365629 447912
9086 447912 795327 653275 687127 659012 586583 427185 427013 760580 742357 827479 694917
9075 694917 657662 616495 681904 415499 701956 784396 799703 790339 848707 796662 957674
9064 957674 848178 632034 602344 477441 913669 822904 705335 667969 756964 629711
9054 629711 476913 467536 401243 300009 407235 485690 488168 574443 788976 815580 770518
9043 770518 916943 992602 1128778 983247 653652 902557 837856 705618 834105 946816
9033 946816 788981 700994 705136 651673 621668 524250 568082 520565 804589 1155204 1022123
$$ packed form
9107E12450o0906j09476K6783l03804K71690Q9184R574j58105J45991J12118j30127
9096D05372J52761J37209k97590K03734p5132j74410J45002o3397o7920Q2283
9086D47912L47415j42052L3852k8115p2429j59398j72L33567j8223Q5122j32562
9075F94917l7255m1167O5409k66405K86457Q2440J5307r364N8368n2045J61012
9064I57674j09496k16144k9690j24903M36228r0765j17569l7366Q8995j27253
9054F29711j52798r377o6293j01234J07226P8455K478Q6275K14533K6604m5062
9043G70518J46425P5659J36176j45531l29595K48905o4701j32238J28487J12711
9033I46816j57835q7987M142n3463l0005r7418M3832m7517K84024L50615j33081
$$ plain form
9022 1022123 1115861 927958 950461 1103885 1123560 917861 965107 980634 893850 920594 1111209
9011 1111209 1074949 1145944 1164220 993338 953251 795665 721130 846946 1051232 1052171 1071582
9000 1071582 1165093 1088969 1149447 1438379 1526465 1454588 1333214 1353688 1230067 1027526 1115203
8989 1115203 1202447 1329532 1386932 1502063 1451943 1241005 1352809 1386806 1436280 1680978
8979 1680978 1631609 1504499 1620126 1764088 1441892 1403677 1523741 1374658 1483449 1560389
8969 1560389 1643827 1735421 1696104 1784035 2010349 1939203 2111416 2283560 2228203 2351884 2418231
8958 2418231 2344379 2692913 2860137 3044635 3200679 3083466 3363877 3680440 3961215 3850449
8948 3850449 4148720 4485860 4564036 5025911 5264689 5525420 5755820 5869752 5927169 6394295
$$ packed form
9022A022123R3738j87903K2503J53424J9675k05699M7246J5527q6784K6744J90615
9011A111209l6260P0995J8276j70882m0087j57586p4535J25816K04286R39J9411
9000A071582R3511p6124O0478K88932Q8086p1877j21374K0474j23621k02541Q7677
8989A115203Q7244J27085N7400J15131n0120k10938J11804L3997M9474K44698
8979A680978m9369j27110J15627J43962l22196l8215J20064j49083J08791P6940
8969A560389Q3438R1594l9317Q7931K26314p1146J72213J72144n5357J23681O6347
8958B418231p3852L48534J67224J84498J56044j17213K80411L16563K80775j10766
8948C850449K98271L37140P8176M61875K38778K60731K30400J13932N7417M67126
$$ plain form
8938 6394295 6917382 7553723 8398154 8848019 9216178 9995056 10777033 11823208 13226731
8929 13226731 14994965 16978410 18924499 20906879 21584620 21503814 21688534 21264033 19961528
8920 19961528 17435024 15300082 13692281 12349101 11097358 10011890 8917384 8320721
8912 8320721 7736093 6939342 6052810 5521462 5126464 4903764 4676218 4127569 3833431 3464966
8902 3464966 3238869 3086653 3212343 2908836 2844739 2855662 2861469 2727626 2652190 2620744 2301966
8891 2301966 2272243 2177380 1949423 2187106 2417286 2293923 2090073 2064164 2212100 2168522
8881 2168522 2122020 1860895 1716585 1980247 2153103 2100210 2066416 1925942 1882442 1938261
8871 1938261 1968987 1850218 1816185 1786353 1893218 1726342 1741512 1643189 1579952 1705912 1681574
$$ packed form
8938F394295N23087O36341Q44431M49865L68159P78878P81977J046175J403523
8929A3226731J768234J983445J946089J982380O77741q0806J84720m24501j302505
8920A9961528k526504k134942j607801j343180j251743j085468j094506n96663
8912H320721n84628p96751q86532n31348l94998k22700k27546n48649k94138l68465
8902C464966k26097j52216J25690l03507o4097J0923N807j33843p5436l1446l18778
8891B301966k9723r4863k27957K37683K30180j23363k03850k5909J47936m3578
8881B168522m6502k61125j44310K63662J72856n2893l3794j40474m3500N5819
8871A938261L0726j18769l4033k9832J06865j66876J5170r8323o3237J25960k4338
$$ plain form
8860 1681574 1782471 1584375 1739777 1659195 1669323 1817304 1667459 1603430 1678101 1481216
8850 1481216 1503064 1339435 1362822 1509340 1715076 1822502 1901418 1798881 1854396 1738988
8840 1738988 1815485 2066286 1912263 1683641 1767198 1681194 1525793 1290143 1390087 1816319
8830 1816319 1865252 1786837 1691667 1790660 1820455 1683367 1642469 1632467 1662896 1438534 1610776
8819 1610776 1612541 1657820 1858494 1837717 1746635 1683290 1704026 1776421 1803381 1672504 1637139
8808 1637139 1656323 1773852 1718629 1768688 1598625 1580223 1847048 1840269 1651117 1787263 1912196
8797 1912196 1870574 1457504 1345028 1335945 1485092 2007977 2174826 1909688 2108992 2211950
8787 2211950 1840885 1478072 1618047 1704981 1561712 1832342 1772425 1938375 1963522 1654756
$$ packed form
8860A681574J00897j98096J55402q0582J0128J47981j49845o4029P4671j96885
8850A481216K1848j63629K3387J46518K05736J07426P8916j02537N5515j15408
8840A738988P6497K50801j54023k28622Q3557q6004j55401k35650R9944M26232
8830A816319M8933p8415r5170R8993K9795j37088m0898j0002L0429k24362J72242
8819A610776J765M5279K00674k0777r1082o3345K0736P2395K6960j30877l5365
8808A637139J9184J17529n5223N0059j70063j8402K66825o779j89152J36146J24933
8797A912196m1622m13070j12476r083J49147N22885J66849k65138J99304J02958
8787B211950l71065l62813J39975Q6934j43269K70630n9917J65950K5147l08766
$$ plain form
8777 1654756 1875953 1767289 1962675 1900489 1884209 2140418 2377870 2127762 2193951 2192375
8767 2192375 2032696 2163432 1882563 1842179 1931595 1989327 2073195 1970254 2057228 2192279
8757 2192279 2113430 1944155 1983419 2081031 1965933 2148736 2155123 2014400 2019107 2242806 2099833
8746 2099833 2106168 2318899 2310362 2051056 2182222 2207287 2116109 2205896 2261630 2265025 2118835
8735 2118835 2269015 2342555 2215038 2221719 2378366 2359014 2451311 2388072 2335885 2218848 2020961
8724 2020961 2102325 2435159 2458225 2413723 2310525 2228589 2403948 2249990 2176893 2472254
8714 2472254 2525080 2739920 2882474 2617828 2630081 2712856 2736300 2677958 2484350 2448097 2543705
8703 2543705 2569183 2805037 2696305 2682062 2636600 2560270 2778890 2668221 2411350 2436350
$$ packed form
8777A654756K21197j08664J95386o2186j6280K56209K37452k50108O6189j576
8767B192375j59679J30736k80869m0384Q9416N7732Q3868j02941Q6974J35051
8757B192279p8849j69275L9264R7612j15098J82803O387j40723M707K23699j42973
8746B099833O335K12731q537k59306J31166K5065r1178Q9787N5734L395j46190
8735B118835J50180P3540j27517O681J56647j9352R2297o3239n2187j17037j97887
8724B020961Q1364L32834K3066m4502j03198q1936J75359j53958p3097K95361
8714B472254N2826K14840J42554k64646J2253Q2775K3444n8342j93608l6253R5608
8703B543705K5478K35854j08732j4243m5462p6330K18620j10669k56871K5000
$$ plain form
8693 2436350 2606826 2613662 2705697 2789494 2566353 2451762 2483882 2797817 2606791 2671016 2745620
8682 2745620 2686381 2803347 2878270 2620496 2629578 2667228 2643633 2736668 2728801 3094306 3151889
8671 3151889 2927145 2846606 2868653 3036075 3147031 2824387 2841144 2922220 2982037 2962082 3243006
8660 3243006 3424501 3463608 3425246 3505972 3329300 3113914 3128572 3154073 3195678 3106898 3144158
8649 3144158 3046892 2999675 2819619 3008927 3347333 3346390 3336063 3344427 3532126 3477243 3339071
8638 3339071 3288488 3478790 3319013 3254806 3409066 3305239 3471307 3439967 3673295 3805266
8628 3805266 3614828 3486778 3401499 3257006 3490891 3615966 3598226 3668926 3520576 3753493
8618 3753493 3815086 3862938 3844481 3670536 3628596 3827401 3957443 3920661 3895171 3878718 3876383
$$ packed form
8693B436350J70476O836R2035Q3797k23141j14591L2120L13935j91026O4225P4604
8682B745620n9239J16966P4923k57774R082L7650k3595R3035p867L65505N7583
8671C151889k24744q0539K2047J67422J10956l22644J6757Q1076N9817j9955K80924
8660C243006J81495L9107l8362Q0726j76672k15386J4658K5501M1605q8780L7260
8649C144158r7266m7217j80056J89308L38406r43j0327Q364J87699n4883j38172
8638C339071n0583J90302j59777o4207J54260j03827J66068l1340K33328J31971
8628C805266j90438j28050q5279j44493K33885J25075j7740P0700j48350K32917
8618C753493O1593M7852j8457j73945m1940J98805J30042l6782k5490j6453k335
$$ plain form
8607 3876383 3985200 4029312 3659118 3590069 3740363 3992229 3872927 3755073 3801181 4188013
8597 4188013 4188414 4165529 4316352 4433149 4199376 4248449 4465736 4330430 4459920 4614157
8587 4614157 4652157 4406262 4604154 4723920 4430891 4215164 4329211 4522183 4698274 4469502
8577 4469502 4650667 4726704 4640312 4760043 4930196 4975295 4858735 4911689 4794156 4607816
8567 4607816 4713377 4891510 4827294 4755614 4988671 5266894 5445668 5172460 4880983 4989321
8557 4989321 4786926 4934538 5055008 5042358 5170015 5417090 5350760 5231533 5114551 5196982
8547 5196982 5313532 5431413 5409412 5523179 5439302 5474785 5523452 5485805 5722480 5593410
8537 5593410 5864784 5808784 5872682 5872965 5766294 5889810 5843785 5939958 5940348 6010995 6086339 5943982
$$ packed form
8607C876383J08817M4112l70194o9049J50294K51866j19302j17854M6108L86832
8597D188013M01k2885J50823J16797k33773M9073K17287j35306J29490J54237
8587D614157L8000k45895J97892J19766k93029k15727J14047J92972J76091k28772
8577D469502J81165P6037q6392J19731J70153M5099j16560N2954j17533j86340
8567D607816J05561J78133o4216p1680K33057K78223J78774k73208k91477J08338
8557D989321k02395J47612J20470j2650J27657K47075o6330j19227j16982Q2431
8547E196982J16550J17881k2001J13767q3877L5483M8667l7647K36675j29070
8537E593410K71374n6000O3898K83j06671J23516m6025R6173L90P0647P5344j42357
$$ plain form
8525 5943982 5980648 6353817 6361169 6279027 6262824 6254089 6446817 6317181 6242897 6035204 6349978
8514 6349978 6262154 6284886 6652139 6752933 6698476 6561529 6557186 6441152 6567473 6811211
8504 6811211 6938370 7183729 7206898 7453374 7195139 6989317 7115697 7217309 7333843 7392447
8494 7392447 7261999 7331170 7114401 6936004 7324609 7414308 7636822 7607601 7115696 7312334
8484 7312334 7423407 7392636 7611010 7561268 7794911 7768940 7923669 8023311 8202292 8410369
8474 8410369 8270967 8212612 8196555 8383198 8571352 8614944 8509549 8413599 8532776 8595669
8464 8595669 8736686 8754792 8742738 8769213 8973682 8651236 8838640 8559259 8788589 8912067
8454 8912067 9120450 9459051 9445324 9406826 9335747 9386055 9444719 9503251 9655419 9677831 9850018
$$ packed form
8525E943982L6666L73169P352q2142j6203q735J92728j29636p4284k07693L14774
8514F349978q7824K2732L67253J00794n4457j36947m343j16034J26321K43738
8504F811211J27159K45359K3169K46476k58235k05822J26380J01612J16534N8604
8494G392447j30448O9171k16769j78397L88605Q9699K22514k9221m91905J96638
8484G312334J11073l0771K18374m9742K33643k5971J54729R9642J78981K08077
8474H410369j39402n8355j6057J86643J88154M3592j05395r5950J19177O2893
8464H595669J41017J8106j2054K6475K04469l22446J87404k79381K29330J23478
8454H912067K08383L38601j3727l8498p1079N0308N8664N8532J52168K2412J72187
$$ plain form
8443 9850018 9895423 9869765 10096297 10081674 10152013 10261479 10570095 10484502 10408407 10274664 10184194
8432 10184194 10219332 10447105 10570669 10851042 10832582 10823122 10851905 11023831 11095018 11274649
8422 11274649 11133312 11166105 11546494 11539676 11397507 11561533 11577751 11622668 11605973 11852092
8412 11852092 11698994 11702067 12017886 12187372 12273107 12357829 12415144 12634087 12880294 12832404
8402 12832404 13010310 13114443 13258007 13187071 13076171 13054344 13086706 13164717 13281678 13318540
8392 13318540 13400024 13194737 13362229 13673222 13807288 13611969 13922110 14013770 14303972 14523106
8382 14523106 14516734 14378658 14471242 14368313 14518153 14724938 14779158 14970108 14989509 15183652
8372 15183652 15239014 15306438 15737217 15789148 15823427 15864225 15719073 15790725 15806666 15835983 16072787
$$ packed form
8443I850018M5405k5658K26532j4623P0339J09466L08616q5593p6095j33743r0470
8432A0184194L5138K27773J23564K80373j8460r460K8783J71926P1187J79631
8422A1274649j41337L2793L80389o818j42169J64026J6218M4917j6695K46119
8412A1852092j53098L073L15819J69486Q5735Q4722N7315K18943K46207m7890
8402A2832404J77906J04133J43564p0936j10900k1827L2362P8011J16961L6862
8392A3318540Q1484k05287J67492L10993J34066j95319L10141R1660K90202K19134
8382A4523106o372j38076R2584j02929J49840K06785N4220J90950J9401J94143
8372A5183652N5362O7424M30779N1931L4279M0798j45152P1652J5941K9317K36804
$$ plain form
8361 16072787 16401163 16283170 16557941 16689000 16517220 16725878 17033840 17119926 17350350 17191772
8351 17191772 17192302 17324771 17560773 17720421 17888817 17867753 18087211 18026430 18027006 18304581 18449849
8340 18449849 18454213 18661672 18701844 18636899 18732340 19045384 19170119 19219680 19521695 19737362
8330 19737362 19859647 19699627 19771703 19738483 20056291 20187819 20294449 20545314 20515175 20640391
8320 20640391 20933885 20980928 20863803 20830483 20773390 21124339 21353286 21586761 21534007 21487133
8310 21487133 21633260 21689296 22019293 22150396 22147253 22244824 22416689 22283194 22432004 22760219
8300 22760219 22882734 22918206 22971785 23007318 23099402 23174627 23314448 23422700 23609287 23679802
8290 23679802 23758063 23891540 24048788 24165832 24483919 24842728 24668153 24535792 24652280 24895387
$$ packed form
8361A6072787L28376j17993K74771J31059j71780K08658L07962Q6086K30424j58578
8351A7191772N30J32469K36002J59648J68396k1064K19458o0781N76K77575J45268
8340A8449849M364K07459M0172o4945R5441L13044J24735M9561L02015K15667
8330A9737362J22285j60020P2076l3220L17808J31528J06630K50865l0139J25216
8320B0640391K93494M7043j17125l3320n7093L50949K28947K33475n2754m6874
8310B1487133J46127N6036L29997J31103l143R7571J71865j33495J48810L28215
8300B2760219J22515L5472N3579L5533R2084P5225J39821J08252J86587P0515
8290B3679802P8261J33477J57248J17044L18087L58809j74575j32361J16488K43107
$$ plain form
8280 24895387 25045755 25256334 25257853 25401400 25702766 25588326 25629724 25790974 25971067 26162751
8270 26162751 26174931 26225068 26302284 26621741 26711228 26676009 26983364 26925372 26963531 27039172 27019615
8259 27019615 27142628 27173814 27211337 27446168 27663479 27777471 27842587 27737781 27834247 27867768
8249 27867768 27958754 28160873 28188060 28037584 28290377 28392196 28297703 28511607 28506171 28545125
8239 28545125 28564482 28438944 28418207 29043066 29067221 29079820 28863993 28874788 29073468 29085528
8229 29085528 29276813 29211195 29371113 29427897 29411592 29587159 29753076 29717623 29642267 29666120
8219 29666120 29783325 29654322 29969037 29933563 29806897 29948676 30071686 30220387 30089907 29838312
8209 29838312 29772683 29867011 29892289 30018523 29957318 29658376 29779666 29944791 29890282 29677797
$$ packed form
8280B4895387J50368K10579J519J43547L01366j14440M1398J61250J80093J91684
8270B6162751J2180N0137P7216L19457Q9487l5219L07355n7992L8159P5641j9557
8259B7019615J23013L1186L7523K34831K17311J13992O5116j04806R6466L3521
8249B7867768R0986K02119K7187j50476K52793J01819r4493K13904n436L8954
8239B8545125J9357j25538k0737O24859K4155J2599k15827J0795J98680J2060
8229B9085528J91285o5618J59918N6784j6305J75567J65917l5453p5356K3853
8219B9666120J17205j29003L14715l5474j26666J41779J23010J48701j30480k51595
8209B9838312o5629R4328K5278J26234o1205k98942J21290J65125n4509k12485
$$ plain form
8199 29677797 29813939 29910731 29900556 29682641 29789215 29967257 29661163 29555789 29879091 29988449
8189 29988449 29818188 29888172 30002695 29673003 29434767 29565580 29762703 29690030 29550189 29618340
8179 29618340 29573521 29624944 29854473 29984273 29622058 29484205 29481475 29525902 29599936 29586400 29466678
8168 29466678 29369103 29347776 29282178 29372262 29595860 29668360 29536308 29279771 29558549 29388171
8158 29388171 29117110 28988980 28851976 28650120 28505962 28316626 28365225 28561311 28371604 28226222
8148 28226222 28193138 28065090 28055310 28237607 28231865 27912886 27837507 27813780 27585870 27701539 27703551
8137 27703551 27679775 27501382 27605815 27331204 27334641 27348088 27038233 26991482 26990337 27199336 27044560
8126 27044560 26852439 26854123 26849430 26796013 26552111 26583010 26643097 26517137 26407710 26307436 26315863
$$ packed form
8199B9677797J36142R6792j0175k17915J06574J78042l06094j05374L23302J09358
8189B9988449j70261O9984J14523l29692k38236J30813J97123p2673j39841O8151
8179B9618340m4819N1423K29529J29800l62215j37853k730M4427P4034j3536j19722
8168B9466678r7575k1327o5598R0084K23598P2500j32052k56537K78778j70378
8158B9388171k71061j28130j37004k01856j44158j89336M8599J96086j89707j45382
8148B8226222l3084j28048r780J82297n742l18979p5379k3727k27910J15669K012
8137B7703551k3776j78393J04433k74611L437J3447l09855m6751j145K08999j54776
8126B7044560j92121J684m693n3417k43902L0899O0087j25960j09427j00274Q427
$$ plain form
8115 26315863 26032014 25917387 25800424 25842879 25988992 25802425 25664427 25766055 25753978 25551110
8105 25551110 25238142 25314997 25246579 25007878 24986774 25107440 25148777 24926097 24534675 24474561
8095 24474561 24667019 24510935 24105365 23834717 23903398 24005013 23998206 23920761 23910001 23769759
8085 23769759 23908319 24057066 23696318 23415585 23136677 23070367 23146317 23073894 22946691 22745083
8075 22745083 22822272 22662917 22334163 22321178 22215937 22153489 22356551 22096124 22058562 22002687
8065 22002687 21946483 21806652 21708853 21510840 21453556 21753909 21422468 21208031 21136103 21028618
8055 21028618 21059337 20994740 20817418 20719686 20535786 20460283 20344479 20351774 20367050 20112522 20084120
8044 20084120 20099355 20101363 20184789 20276677 20227326 20034883 19566377 19516997 19410666 19359313 19397500
$$ packed form
8115B6315863k83849j14627j16963M2455J46113j86567j37998J01628j2077k02868
8105B5551110l12968P6855o8418k38701k1104J20666M1337k22680l91422o0114
8095B4474561J92458j56084m05570k70648O8681J01615o807p7445j0760j40242
8085B3769759J38560J48747l60748k80733k78908o6310P5950p2423j27203k01608
8075B2745083P7189j59355l28754j2985j05241o2448K03062k60427l7562n5875
8065B2002687n6204j39831r7799j98013n7284L00353l31441k14437p1928j07485
8055B1028618L0719o4597j77322r7732j83900p5503j15804P295J5276k54528k8402
8044B0084120J5235K008Q3426R1888m9351j92443m68506m9380j06331n1353L8187
$$ plain form
8033 19397500 19067984 19034145 19043976 18933344 18685489 18780264 18625521 18522641 18481063 18350137
8023 18350137 18405719 18261516 18004997 17797151 17793188 17700413 17977003 17727546 17353010 17538162
8013 17538162 17712228 17541046 17439324 17290388 17108516 16949432 17025004 16797251 16663399 16696846
8003 16696846 16424359 15954632 16126064 15984738 15924387 16033031 15878744 15760438 15874607 15789160
7993 15789160 15589807 15792212 15630148 15427882 15249740 15145488 14992009 15149203 15162068 15004558
7983 15004558 14937111 15041584 14786089 14889910 14809030 14682856 14343057 14302660 14302516 13926004
7973 13926004 13885698 13933014 14058445 13842339 13605180 13753693 13611713 13571103 13393331 13390100
7963 13390100 13443307 13349157 13295155 12868878 12879179 13152515 13062437 12809636 12538922 12247582
$$ packed form
8033A9397500l29516l3839R831j10632k47855R4775j54743j02880m1578j30926
8023A8350137N5582j44203k56519k07846l963r2775K76590k49457l74536J85152
8013A7538162J74066j71182j01722j48936j81872j59084P5572k27753j33852L3447
8003A6696846k72487m69727J71432j41326o0351J08644j54287j18306J14169q5447
7993A5789160j99353K02405j62064k02266j78142j04252j53479J57194J2865j57510
7983A5004558o7447J04473k55495J03821q0880j26174l39799m0397j44l76512
7973A3926004m0306M7316J25431k16106k37159J48513j41980m0610j77772l231
7963A3390100N3207r4150n4002m26277J0301K73336r0078k52801k70714k91340
$$ plain form
7953 12247582 12357025 12474928 12432969 12320180 12162147 12008832 11893412 12084628 12260813 12341233
7943 12341233 12182787 11738879 11787445 11957420 11800237 11471666 11192598 11337894 11027179 11246112
7933 11246112 11274481 11101795 11050493 10996642 10765592 10788704 10929773 10662805 10532433 10382753
7923 10382753 10410616 10524866 10214511 10259674 10277935 10329013 10414876 10165144 9911216 9939888
7913 9939888 10056401 10061507 9841369 9577245 9692455 9620447 9532096 9625276 9457081 9315364
7903 9315364 9352948 9196545 9110704 8946408 9010267 8981675 8795490 8917422 9059778 9004035
7893 9004035 8891618 8577146 8346197 8532389 8566009 8375785 8137504 7937398 7882165 7887432
7883 7887432 7888605 7932277 7883322 7571617 7722673 7661779 7694273 7818950 8043033 7925196 7823988
$$ packed form
7953A2247582J09443J17903m1959j12789j58033j53315j15420J91216J76185Q0420
7943A2341233j58446m43908M8566J69975j57183l28571k79068J45296l10715K18933
7933A1246112K8369j72686n1302n3851k31050K3112J41069k66968j30372j49680
7923A0382753K7863J14250l10355M5163J8261N1078Q5863k49732k53928K8672
7913I939888J16513N106k20138k64124J15210p2008q8351R3180j68195j41717
7903I315364L7584j56403q5841j64296O3859k8592j86185J21932J42356n5743
7893I004035j12417l14472k30949J86192L3620j90224k38281k00106n5233N267
7883G887432J173M3672m8955l11705J51056o0894L2494J24677K24083j17837j01208
$$ plain form
7872 7823988 7837764 7669130 7365796 7426523 7410088 7364714 7310707 7190274 7079799 7085130 7150034
7861 7150034 7076399 6871051 7001703 7024632 7005303 7059559 6837458 6975143 7010873 6666259
7851 6666259 6528920 6568660 6998748 6684516 6510960 6441212 6500859 6506898 6472871 6206131 6027057
7840 6027057 6178329 6100126 6083760 6061261 6149635 6073466 5984215 5897370 6032433 6051337 5973816
7829 5973816 6108943 5856406 5848386 5812111 5656923 5835007 5861944 5789808 5602481 5522281 5515798
7818 5515798 5403663 5169232 5591010 5660951 5634038 5295404 5385487 5309556 5297851 5324847 5282923
7807 5282923 5070007 5177683 5167934 5271842 5194346 5016674 4681318 4586195 5038607 5017814
7797 5017814 4950458 5096115 4979483 4824525 4799865 4787332 4609499 4595540 4572937 4550086 4725114
$$ packed form
7872G823988J3776j68634l03334O0727j6435m5374n4007j20433j10475N331O4904
7861G150034p3635k05348J30652K2929j9329N4256k22101J37685L5730l44614
7851F666259j37339L9740M30088l14232j73556o9748N9647O039l4027k66740j79074
7840F027057J51272p8203j6366k2499Q8374p6169q9251q6845J35063J8904p7521
7829E973816J35127k52537q020l6275j55188J78084K6937p2136j87327q0200o483
7818E515798j12135k34431M21778O9941k6913l38634R0083p5931j1705K6996m1924
7807E282923k12916J07676r749J03908p7496j77672l35356r5123M52412k0793
7797E017814o7356J45657j16632j54958k4660j2533j77833j3959k2603k2851J75028
$$ plain form
7786 4725114 4500606 4310116 4478317 4600834 4503743 4698129 4575196 4660952 4783646 4814815
7776 4814815 4590640 4268007 4197054 4279771 4209746 4278493 4227639 4355465 4441082 4393003 4534509
7765 4534509 4532913 4361669 3957783 4040812 4172173 4016812 4084529 3957063 4119639 3824885
7755 3824885 3552204 3716724 4022003 3918133 3889102 4109897 3895788 3847102 3789763 3825400
7745 3825400 3771589 3654963 3294399 3230275 3415778 3430529 3501156 3634647 3536790 3646677
7735 3646677 3582718 3488411 3637040 3694081 3825975 3793655 3721211 3459058 3163647 3447664
7725 3447664 3458864 3430965 3326536 3429721 3350085 3182660 3103121 3130609 3084734 3147822 3182845
7714 3182845 3142139 2962636 2919165 3057729 3227038 3541463 3452152 3239410 3210793 3159977
$$ packed form
7786D725114k24508j90490J68201J22517r7091J94386j22933Q5756J22694L1169
7776D814815k24175l22633p0953Q2717p0025O8747n0854J27826Q5617m8079J41506
7765D534509j596j71244m03886Q3029J31361j55361O7717j27466J62576k94754
7755C824885k72681J64520L05279j03870k9031K20795k14109m8686n7339L5637
7745C825400n3811j16626l60564o4124J85503J4751P0627J33491r7857J09887
7735C646677o3959r4307J48629N7041J31894l2320p2444k62153k95411K84017
7725C447664J1200k7899j04429J03185p9636j67425p9539K7488m5875O3088L5023
7714C182845m0706j79503m3471J38564J69309L14425q9311k12742k8617n0816
$$ plain form
7704 3159977 3074523 3144983 2979207 2846450 2777304 3047597 2964104 2968957 3176173 3112340 2882759
7693 2882759 2830774 2768270 2625904 2718900 2914160 2715663 2839971 2723973 2618718 2645257
7683 2645257 2411892 2417549 2338865 2466821 2392979 2340949 2478656 2511372 2485924 2369351 2586664
7672 2586664 2693155 2746634 2724300 2658394 2387940 2395264 2425230 2400888 2539550 2558323 2449901
7661 2449901 2617173 2564170 2485619 2554092 2390163 2410963 2197140 2165933 2156386 2306285 2317373
7650 2317373 2425077 2307505 2210574 2422007 2230979 2081088 1900837 2134534 2331328 2188641
7640 2188641 2273722 2362200 2266124 2250518 2307420 2152660 1929952 1978116 2049731 1958785 2131646
7629 2131646 2048884 1798940 1657459 1913824 2074556 1990360 1791167 1722947 1977439 1769178
$$ packed form
7704C159977q5454P0460j65776j32757o9146K70293q3493M853K07216o3833k29581
7693B882759n1985o2504j42366R2996J95260j98497J24308j15998j05255K6539
7683B645257k33365N657p8684J27956p3842n2030J37707L2716k5448j16573K17313
7672B586664J06491N3479k2334o5906k70454P324K9966k4342J38662J8773j08422
7661B449901J67272n3003p8551O8473j63929K0800k13823l1207r547J49899J1088
7650B317373J07704j17572r6931K11433j91028j49891j80251K33697J96794j42687
7640B188641Q5081Q8478r6076j5606N6902j54760k22708M8164P1615r0946J72861
7629B131646q2762k49944j41481K56365J60732q4196j99193o8220K54492k08261
$$ plain form
7619 1769178 1955355 2166990 2129044 2146999 2221246 2248008 2147900 2212006 2048168 1879425
7609 1879425 1940882 1887468 1884269 1751281 1546981 1416463 1499845 1835675 2047025 2176240
7599 2176240 2062122 1960655 2051508 1763214 1658244 1587280 1659642 1636186 1426588 1796547
7589 1796547 1913277 1850889 1747058 1761052 1586007 1650839 1594999 1589688 1684057 1589058 1660879
7578 1660879 1644182 1543519 1439567 1507344 1600500 1683739 1598779 1531354 1782446 1535032 1369161
7567 1369161 1493134 1443962 1512363 1481343 1447610 1169450 1115684 1505862 1647423 1581210 1612781
7556 1612781 1445740 1436781 1406644 1475355 1381940 1287077 1256649 1273916 1343555 1420221 1671108
7545 1671108 1412013 1337623 1578201 1610980 1303231 1298226 1294905 1369793 1372514 1413817 1607975
$$ packed form
7619A769178J86177K11635l7946J7955P4247K6762j00108O4106j63838j68743
7609A879425O1457n3414l199j32988k04300j30518Q3382L35830K11350J29215
7599B176240j14118j01467R0853k88294j04970p0964P2362k3456k09598L69959
7589A796547J16730o2388j03831J3994j75045O4832n5840n311R4369r4999P1821
7578A660879j6697j00663j03952O7777R3156Q3239q4960o7425K51092k47414j65871
7567A369161J23973m9172O8401l1020l3733k78160n3766L90178J41561o6213L1571
7556A612781j67041q959l0137O8711r3415r4863l0428J7267O9639P6666K50887
7545A671108k59095p4390K40578L2779l07749n005l321P4888K721M1303J94158
$$ plain form
7534 1607975 1592681 1457984 1473056 1386629 1178481 1209888 1160263 1033171 1232568 1274149 1203175
7523 1203175 1244989 1265149 1329330 1315704 1202244 1249706 1172645 1118761 1134121 1175033 1022937
7512 1022937 944734 1099668 1188174 1253851 1156492 1072639 1222950 1362985 1402978 1318726 1408076
7501 1408076 1643173 1503876 1179532 1200323 1440619 1219213 1172125 1047123 1075940 1130958
7491 1130958 1023131 1162099 1336038 1008744 1128071 1370461 1249957 1415522 1487905 1186390
7481 1186390 902506 1147015 1154403 1035564 1340587 1177112 1076920 1065582 1056856 1183993
7471 1183993 1198106 1178686 1199043 1104441 1033702 1133002 913616 741106 1059997 1138242 1246836
7460 1246836 1088300 1157364 1014975 629957 525043 673887 971314 900578 764069 799804
$$ packed form
7534A607975j5294j34697J5072q6427k08148L1407m9625j27092J99397M1581p0974
7523A203175M1814K0160O4181j3626j13460M7462p7061n3884J5360M0912j52096
7512A022937p8203J54934Q8506O5677r7359q3853J50311J40035L9993q4252Q9350
7501A408076K35097j39297l24344K0791K40296k21406m7088j25002K8817N5018
7491A130958j07827J38968J73939l27294J19327K42390j20504J65565P2383l01515
7481A186390k83884K44509P388j18839L05023j63475j00192j1338q726J27137
7471A183993J4113j9420K0357r4602p0739R9300k19386j72510L18891P8245J08594
7460A246836j58536O9064j42389l85018j04914J48844K97427p0736j36509L5735
$$ plain form
7450 799804 635276 625381 688688 663126 923719 713217 782089 796946 921734 1074530 938103
7439 938103 847053 722220 693591 845735 918194 757581 823098 864844 867822 741070 518855
7428 518855 699273 869351 965423 738242 721745 657446 742501 629844 674062 803329 924161
7417 924161 653236 548319 678379 419539 686096 827737 738184 564635 666327 816934
7407 816934 719798 521819 704021 678934 432918 377868 450312 688671 918565 1014513 869806
7396 869806 709132 607615 597198 588102 482331 621906 812966 668213 555561 535290
7386 535290 557468 562182 428986 446482 717206 606700 515217 678569 581493 377113 181421
7375 181421 484134 837245 942425 901095 754261 733941 889209 959298 909232 539541
$$ packed form
7450G99804j64528r895O3307k5562K60593k10502O8872J4857J24788J52796j36427
7439I38103r1050j24833k8629J52144P2459j60613O5517M1746K978j26752k22215
7428E18855J80418J70078R6072k27181j6497o4299Q5055j12657M4218J29267J20832
7417I24161k70925j04917J30060k58840K66557J41641q9553j73549J01692J50607
7407H16934r7136j97979J82202k5087k46016n5050P2444K38359K29894R5948j44707
7396H69806j60674j01517j0417r096j05771J39575J91060j44753j12652k0271
7386E35290K2178M714j33196J7496K70724j10506r1483J63352r7076k04380j95692
7375A81421L02713L53111J05180m1330j46834k0320J55268P0089n0066l69691
$$ plain form
7365 539541 379306 395516 561181 579319 470796 468441 218579 311798 609886 669238 597856
7354 597856 769721 821434 837226 808475 485316 529576 546736 632302 756490 616769 194983
7343 194983 360220 596241 401493 571618 452462 436406 227410 402170 528016 371687
7333 371687 413598 511972 664986 608693 710526 681241 660664 575760 586398 553479 549776
7322 549776 553319 370779 491721 833579 696079 550824 800776 701690 593607 380039
7312 380039 292394 570290 612116 474156 671805 497607 288350 522384 643371 463902
7302 463902 551776 411135 413989 571074 285448 350281 358913 481733 265277 380777 584563
7291 584563 391423 505326 348931 490470 756110 496092 240696 264873 505060 483506
$$ packed form
7365E39541j60235J6210J65665J8138j08523k355k49862R3219K98088N9352p1382
7354E97856J71865N1713J5792k8751l23159M4260J7160Q5566J24188j39721m21786
7343A94983J65237K36021j94748J70125j19156j6056k08996J74760J25846j56329
7333C71687M1911R8374J53014n6293J01833k9285k0577q4904J0638l2919l703
7322E49776L543j82540J20942L41858j37500j45255K49952r9086j08083k13568
7312C80039q7645K77896M1826j37960J97649j74198k09257K34034J20987j79469
7302D63902Q7874j40641K854J57085k85626O4833Q632J22820k16456J15500K03786
7291E84563j93140J13903j56395J41539K65640k60018k55396K4177K40187k1554
$$ plain form
7281 483506 329350 332189 280523 332477 143584 158948 581971 614502 596170 544325 401413
7270 401413 504425 315323 547425 728451 492791 183492 267330 471285 599477 577759
7260 577759 541241 443357 384558 490276 305925 -47357 -177713 -89356 323412 322272 272617
7249 272617 298552 274116 386369 301721 483930 242661 263182 199193 56247 201183 475154
7238 475154 221056 288587 139161 361239 406889 244561 289572 385247 348350 -1588 77090
7227 77090 259329 478284 511716 275084 14843 85734 -46439 -36542 83448 183987 223619
7216 223619 341242 231291 62601 20979 159423 155550 16371 147957 403544 746564
7206 746564 448973 227435 395738 408701 194886 262920 150874 -144972 -54372 31508
$$ packed form
7281D83506j54156K839n1666N1954j88893J5364M23023L2531j8332n1845j42912
7270D01413J03012j89102K32102J81026k35660l09299Q3838K03955J28192k1718
7260E77759l6518r7884n8799J05718j84351l53282j30356Q8357M12768j140m9655
7249B72617K5935k4436J12253q4648J82209k41269K0521o3989j42946J44936K73971
7238D75154k54098O7531j49426K22078M5650j62328M5011R5675l6897l49938P8678
7227G7090J82239K18955L3432k36632k60241P0891j32173R897J19990J00539L9632
7216B23619J17623j09951j68690m1622J38444l873j39179J31586K55587L43020
7206G46564k97591k21538J68303J2963k13815O8034j12046k95846R0600Q5880
$$ plain form
7196 31508 380662 258110 165930 145084 65224 582944 465511 286273 121733 176130 317265
7185 317265 328002 301887 152546 197998 63978 248277 323694 325817 88174 26052 273782
7174 273782 132268 72371 189017 215620 168189 308642 262583 264722 477091 230714 72883
7163 72883 140637 181048 357979 544201 359592 335037 195477 389834 97099 3453 267393
$$ packed form
7196C1508L49154j22552r2180k0846p9860N17720j17433j79238j64540N4397J41135
7185C17265J0737k6115j49341M5452j34020J84299P5417K123k37643o2122K47730
7174B73782j41514n9897J16646K6603m7431J40453m6059K139K12369k46377j57831
7163G2883O7754M0411J76931J86222j84609k4555j39560J94357k92735r3646K63940
$$ [...]
##END NTUPLES=NMR SPECTRUM
##END=
