##TITLE=1H_EC-3355(II-2)xnk
 200.13MHz, CDCl3,
 8 sc
 
 7.8.2025
##JCAMPDX= 6.0         $$ Bruker NMR JCAMP-DX V2.0
##DATA TYPE= NMR SPECTRUM
##DATA CLASS= NTUPLES
##ORIGIN= UXNMR, Bruker Analytische Messtechnik GmbH
##OWNER= pz
$$ XWIN-NMR		Version 3.5
$$ Thu Aug  7 14:37:52 2025 Russian Standard Time (UT+4h)  she@DPX200
##.OBSERVE FREQUENCY= 200.1313
##.OBSERVE NUCLEUS= ^1H
##.ACQUISITION MODE= SIMULTANEOUS
##.ACQUISITION SCHEME= undefined
##.AVERAGES= 8
##.DIGITISER RES= 18
##SPECTROMETER/DATA SYSTEM= spect
##.PULSE SEQUENCE= zg30
##.SOLVENT NAME= CDCl3
##.SHIFT REFERENCE= (INTERNAL, CDCl3, 0, 15.6665)
##AUDIT TRAIL= $$ (NUMBER, WHEN, WHO, WHERE, WHAT)
$$ ##TITLE= Audit trail, XWIN-NMR		Version 3.5
$$ ##JCAMPDX= 5.01
$$ ##ORIGIN= Bruker BioSpin GmbH
$$ ##OWNER= she
$$ F:/spectra/data/she/nmr/H-C/1/pdata/1/auditp.txt
$$ ##AUDIT TRAIL=  $$ (NUMBER, WHEN, WHO, WHERE, WHAT)
(   1,<2025-08-07 14:36:19.28 +0400>,<she>,<DPX200>,
      <created by zg, POWCHK disabled, PULCHK disabled
       configuration hash MD5:
       00 E9 B6 7A A2 85 ED C7 34 08 36 98 17 FE 4E 26
       data hash MD5: 16K
       02 66 86 C8 47 5F EC 36 E3 0E B2 CE 32 A7 FD 63>)
(   2,<2025-08-07 14:36:21.81 +0400>,<she>,<DPX200>,
      <Start of raw data processing
       efp BC_mod = 2 LB = 0.25 FT_mod = 6 PKNL = 1 PHC0 = -1202.022 PHC1 = 13.1923 SI = 16K 
       data hash MD5: 16K
       FF 37 57 8B 10 BA E4 11 F0 8B DA EF D3 69 28 C6>)
(   3,<2025-08-07 14:36:39.98 +0400>,<she>,<DPX200>,
      <pk PHC0 = 0.4180124 PHC1 = 0 
       data hash MD5: 16K
       06 23 75 A2 25 92 9D 7F 54 2A 76 54 52 7E C8 A6>)
(   4,<2025-08-07 14:36:43.78 +0400>,<she>,<DPX200>,
      <abs ABSG = 5 
       data hash MD5: 16K
       24 99 68 2E E2 C0 4A BB 22 DD 0C 0C 2E E3 98 15>)
$$ ##END=
$$ 
$$ hash MD5
$$ 49 0A B8 E5 15 F7 C7 8C C3 2B 1B 22 B4 F9 C8 83
##$RELAX= 
##$RELAX= 
##$RELAX= 
##$RELAX= 
##$RELAX= 
##$RELAX= 
$$ Bruker specific parameters
$$ --------------------------
##$DU= <F:/spectra>
##$EXPNO= 1
##$NAME= <H-C>
##$PROCNO= 1
##$TYPE= <nmr>
##$USER= <she>
##$AMP= (0..31)
100 100 100 100 100 100 100 100 100 100 100 100 100 100 100 100 100 100 
100 100 100 100 100 100 100 100 100 100 100 100 100 100 
##$AQSEQ= 0
##$AQ_mod= 1
##$AUNM= <au_zg>
##$AUTOPOS= <>
##$BF1= 200.13
##$BF2= 200.13
##$BF3= 200.13
##$BF4= 200.13
##$BF5= 200.13
##$BF6= 200.13
##$BF7= 200.13
##$BF8= 200.13
##$BYTORDA= 1
##$CFDGTYP= 0
##$CFRGTYP= 5
##$CHEMSTR= <none>
##$CNST= (0..31)
1 1 145 1 1 1 1 1 1 1 1 1 1 1 1 1 1 1 1 1 1 1 1 1 1 1 1 1 1 1 1 1 
##$CPDPRG= <>
##$CPDPRG1= <>
##$CPDPRG2= <>
##$CPDPRG3= <>
##$CPDPRG4= <mlev>
##$CPDPRG5= <mlev>
##$CPDPRG6= <mlev>
##$CPDPRG7= <mlev>
##$CPDPRG8= <mlev>
##$CPDPRGB= <>
##$CPDPRGT= <>
##$D= (0..31)
0 0.7 0 0 0 0 0 0 0 0 0 0.03 0 0 0 0 0 0 0 0 0 0 0 0 0 0 0 0 0 0 0 0 
##$DATE= 1754562978
##$DBL= (0..7)
120 120 120 120 120 120 120 120 
##$DBP= (0..7)
150 150 150 150 150 150 150 150 
##$DBP07= 0
##$DBPNAM0= <>
##$DBPNAM1= <>
##$DBPNAM2= <>
##$DBPNAM3= <>
##$DBPNAM4= <>
$$ [...]
##$SUBNAM3= <"">
##$SUBNAM4= <"">
##$SUBNAM5= <"">
##$SUBNAM6= <"">
##$SUBNAM7= <"">
##$SUBNAM8= <"">
##$SUBNAM9= <"">
##$SW= 18.0517328524113
##$SWIBOX= (0..15)
0 0 2 0 0 0 0 0 0 0 0 0 0 0 0 0 
##$SW_h= 3612.71676300578
##$TD= 16384
##$TD0= 1
##$TE= 0
##$TE2= 300
##$TE3= 300
##$TEG= 300
##$TL= (0..7)
0 120 120 120 120 120 120 120 
##$TP= (0..7)
150 150 150 150 150 150 150 150 
##$TP07= 0
##$TPNAME0= <>
##$TPNAME1= <>
##$TPNAME2= <>
##$TPNAME3= <>
##$TPNAME4= <>
##$TPNAME5= <>
##$TPNAME6= <>
##$TPNAME7= <>
##$TPOAL= (0..7)
0.5 0.5 0.5 0.5 0.5 0.5 0.5 0.5 
##$TPOFFS= (0..7)
0 0 0 0 0 0 0 0 
##$TUNHIN= 0
##$TUNHOUT= 0
##$TUNXOUT= 0
##$USERA1= <user>
##$USERA2= <user>
##$USERA3= <user>
##$USERA4= <user>
##$USERA5= <user>
##$V9= 5
##$VALIST= <valist>
##$VCLIST= <CCCCCCCCCCCCCCC>
##$VD= 0
##$VDLIST= <DDDDDDDDDDDDDDD>
##$VPLIST= <PPPPPPPPPPPPPPP>
##$VTLIST= <TTTTTTTTTTTTTTT>
##$WBST= 1024
##$WBSW= 4
##$XGAIN= (0..3)
0 0 0 0 
##$XL= 0
##$YL= 0
##$YMAX_a= 296597
##$YMIN_a= -388379
##$ZGOPTNS= <>
##$ZL1= 120
##$ZL2= 120
##$ZL3= 120
##$ZL4= 120
##$ABSF1= 15.51441
##$ABSF2= -2.537439
##$ABSG= 5
##$ABSL= 3
##$ALPHA= 0
##$AQORDER= 0
##$ASSFAC= 0
##$ASSFACI= 0
##$ASSFACX= 0
##$ASSWID= 0
##$AUNMP= <proc_1d>
##$AZFE= 0.1
##$AZFW= 0.1
##$BCFW= 0
##$BC_mod= 2
##$BYTORDP= 0
##$COROFFS= 0
##$CY= -3
##$DATMOD= 1
##$DC= 0
##$DFILT= <>
##$DTYPP= 0
##$F1P= 0
##$F2P= 0
##$FCOR= 1
##$FTSIZE= 16384
##$FT_mod= 6
##$GAMMA= 0
##$GB= 0
##$INTBC= 1
##$INTSCL= 3.241238e-09
##$ISEN= 128
##$LB= 0.25
##$LEV0= 0
##$LPBIN= 0
##$MAXI= 10000
##$MC2= 0
##$MEAN= 0
##$ME_mod= 0
##$MI= 1.114404
##$NCOEF= 0
##$NC_proc= -7
##$NLEV= 6
##$NOISF1= 3.799351
##$NOISF2= 2.8
##$NSP= 0
##$NTH_PI= 0
##$NZP= 0
##$OFFSET= 15.66646
##$PC= 1
##$PHC0= -1201.604
##$PHC1= 13.1923
##$PH_mod= 1
##$PKNL= yes
##$PPARMOD= 0
##$PSCAL= 0
##$PSIGN= 0
##$REVERSE= no
##$SF= 200.129971029933
##$SI= 16384
##$SIGF1= 3
##$SIGF2= 2
##$SINO= 0.751879
##$SIOLD= 32768
##$SREGLST= <19F.Aceton>
##$SSB= 0
##$STSI= 16384
##$STSR= 0
##$SW_p= 3612.71676300578
##$SYMM= 0
##$S_DEV= 0
##$TDeff= 16384
##$TDoff= 0
##$TI= <>
##$TILT= no
##$TM1= 0
##$TM2= 0
##$TOPLEV= 0
##$USERP1= <user>
##$USERP2= <user>
##$USERP3= <user>
##$USERP4= <user>
##$USERP5= <user>
##$WDW= 1
##$XDIM= 16384
##$YMAX_p= 325624887
##$YMIN_p= -1706757
$$ End of Bruker specific parameters
$$ ---------------------------------
##NTUPLES= NMR SPECTRUM
##VAR_NAME=  FREQUENCY,     SPECTRUM/REAL,   SPECTRUM/IMAG
##SYMBOL=    X,             R,               I
##VAR_TYPE=  INDEPENDENT,   DEPENDENT,       DEPENDENT
##VAR_FORM=  AFFN,          ASDF,            ASDF
##VAR_DIM=   16384,         16384,           16384
##UNITS=     HZ,            ARBITRARY UNITS, ARBITRARY UNITS
##FACTOR=    0.220516191357247, 1,           1
##FIRST=     3135.32819339273, 0,            0
##LAST=      -477.388569613048, 0,           0
##MIN=       -477.388569613048, -1706757,    0
##MAX=       3135.32819339273, 325624887,    0
$$ Real data points
##PAGE= N=1
##DATA TABLE= (X++(R..R)), XYDATA
$$ [...]
5809C59484n7486q8848r6264j78485M65075L4498J01545j8650o6151k25332j16164
5798A13222J71537k80783k2926J68623L80938l27642j95149L2163R7473M3317
5788A80773L18781j40410k90788K1681K12784Q7925r1245l04856l5246L60798
5778C20197j59138K133J82548j45751q0657J62987J27305q2953r5016p4478j95466
5767c8289L96349J77628j20846m6353r3877J61300k58989j66679J65146J44792
5757C20182j57669k24135m8898L92451m5088j46657N2871Q9795J80445k71591
5747A41706N8432Q0517J06844k81343K83325L22014l02526l28127J32944k06764
5737G022Q605L04721j77043J32565j78762N1179J14909p1964k29202L10566l56085
$$ plain form
5809 359484 301998 213150 116886 -61599 403476 437974 539519 520869 454718 229386 113222
5798 113222 284759 3976 -18950 149673 530611 202969 7820 39983 137456 180773
5788 180773 499554 359144 68356 90037 302821 390746 299501 -5355 -40601 320197
5778 320197 161059 163192 345740 199989 119332 282319 409624 326671 231655 157177 -38289
5767 -38289 358060 535688 414842 368489 274612 435912 176923 10244 175390 320182
5757 320182 162513 -61622 -110520 281931 236843 90186 143057 232852 413297 141706
5747 141706 200138 280655 387499 106156 389481 711495 408969 80842 213786 7022
5737 7022 15627 320348 143305 275870 97108 148287 263196 191232 -37970 272596 -83489
5726h3489K42338J20082k29415K44983J50934J08397J2926k94457J4153j52086
5716A34366k69066N28863l02221J14642J23070j78276J39466M5841l13442j33021
5706a09778L31004J85594J55970j45557k3020r26j35345p4648k89720J90874L79864
5695D64312o1651L7376j55484j30746J00666L13979m6057k33644K74045j08983
5685D53813M2459K79431p0008J79637j01364K7999j69118k38517n6432R7336N5505
5674E00741j53791L57089n1131J35305j91764L4319L7827J88760J5905K5082k01814
5663F96528p1982r4163l33929M5482J24005m1003r5100K34187q1852m2905J29822
5652D69090j49071r5974J77063J16643Q2728P5753L7138j97482J75405k90455
$$ plain form
5726 -83489 158849 278931 49516 294499 445433 553830 566756 272299 286452 134366
5716 134366 -134700 394163 91942 206584 329654 151378 290844 336685 23243 -109778
5706 -109778 221226 406820 562790 417233 394213 393287 257942 183294 -106426 84448 464312
5695 464312 402661 440037 284553 153807 254473 568452 522395 288751 562796 453813
5685 453813 496272 775703 705695 885332 783968 811967 642849 404332 347900 445236 500741
5674 500741 346950 704039 652908 788213 596449 630768 668595 857355 873260 898342 696528
5663 696528 624546 530383 196454 241936 365941 324938 229838 464025 382173 339268 469090
5652 469090 320019 224045 401108 517751 600479 676232 713370 515888 691293 400838
5642D00838j74736r6435J88398m6460J09062J58267K17093N1198j81686K5895
5632F51434j40360L7723j20924k7363Q8353r6796K0256P1566P3284L47193R5305
5621I99671k09970N111J51469l29332j24327k3444J19104J96128j21842j26136
5611E36432j23775j47911J32125o7319p9875M1649J18053K02651J95490L7903
5601H45423j47372J39774k20668R8957J8269j51630L7670q5755L6385o5660N8367
5590E63760N05089j05760l30777K50412j97953l77820K05173n7965j73134K22229
5580E03254o6376K24730j07032K8314L64807K1418k01740r3762k4093J80120J21717
5569I51357j3722O4536j502l06245j8473j18496J84082r3409m22210J95072k80031
$$ plain form
5642 400838 226102 129667 318065 271605 380667 538934 756027 807225 625539 651434
5632 651434 511074 548797 427873 400510 488863 392067 412323 483889 557173 904366 999671
5621 999671 789701 794812 946281 616949 492622 469178 588282 784410 662568 536432
5611 536432 412657 264746 396871 329552 249677 291326 409379 612030 807520 845423
5601 845423 698051 837825 617157 716114 734383 582753 620423 534668 571053 505393 563760
5590 563760 1068849 963089 632312 882724 684771 306951 512124 454159 281025 503254
5580 503254 436878 661608 554576 582890 947697 969115 767375 673613 649520 829640 951357
5569 951357 937635 1002171 1000669 694424 675951 557455 741537 648128 225918 420990 140959
5558A40959O7661K38349L52025J69530k28220j43426J37753L0165J74915J4152
5548I53863k91726n1726K9248L3526J02533k2230m8839L95116k9764n3762R4174
5537A110413J9889k84233r8329M8312Q907J8680J40463J36475m683j04313M913
5526I96494K228j58848m5071r0292O2137j33083L8818K11754J18123J13278j79104
5515I36434j06526L82508K1414p3505J25744J1349K78119m43471j14301M07616
5505A425381l4956m34699k0275M12095J02864J04587J06279J29420j32875J11166
5495A768987L3012J42818j14309k044p1747P7575J30469J21296K4494m7540k60448
5484A802563J13380L34594O6445K4437K07907n1669j969n51K23694J84371l38550
$$ plain form
5558 140959 208620 446969 798994 968524 740304 596878 734631 764796 939711 953863
5548 953863 662137 610411 639659 673185 775718 753488 704649 1099765 1070001 1016239 1110413
5537 1110413 1130302 846069 747740 796052 804959 823639 964102 1100577 1095894 991581 996494
5526 996494 998722 839874 794803 704511 766648 633565 672383 884137 1002260 1115538 936434
5515 936434 829908 1212416 1233830 1160325 1286069 1297418 1575537 1132066 1017765 1425381
5505 1425381 1390425 955726 935451 1347546 1450410 1554997 1661276 1790696 1657821 1768987
5495 1768987 1801999 1944817 1830508 1828464 1756717 1834292 1964761 2086057 2110551 2063011 1802563
5484 1802563 1915943 2250537 2316982 2341419 2549326 2497657 2495688 2495137 2718831 2903202 2564652
5473B564652J53529j15840L29505j6210N1304j08559k700L49119J27591M6136
5463C378527M74715j20955l56135O5933N29867L55516r211j16353l6037M50857
5453D616724K14678k2968l0484J30588J18478L33347k31415L23453L87450J9893
5443E859744K73679K12218j01621J10797k8879K19989K53025K28501J47769K76109
5433G451331O94032J56340j45049j9628K72440O65258N95982Q0466J72719K26426
5423A0150317M85446N16591L53674K55958K43121N45915Q05847M3297m7427O38120
5413A3990859J41814L61368K45935L77005M14912O14192P29999P3646M22320Q25598
5403A8197648M71629L76249J64752O24317P45689J77290K34561L84520N49710
$$ plain form
5473 2564652 2718181 2602341 2931846 2915636 2966940 2858381 2855681 3204800 3332391 3378527
5463 3378527 3853242 3732287 3376152 3442085 3971952 4327468 4318257 4201904 4165867 4616724
5453 4616724 4831402 4808434 4777950 4908538 5027016 5360363 5128948 5452401 5839851 5859744
5443 5859744 6133423 6345641 6244020 6354817 6325938 6545927 6798952 7027453 7175222 7451331
5433 7451331 8145363 8301703 8156654 8137026 8409466 9074724 9670706 9751172 9923891 10150317
5423 10150317 10635763 11152354 11506028 11761986 12005107 12551022 13356869 13400166 13352739 13990859
5413 13990859 14132673 14494041 14739976 15116981 15531893 16146085 16876084 16949730 17372050 18197648
5403 18197648 18669277 19045526 19210278 19834595 20580284 20757574 20992135 21376655 21926365
5394B1926365P46984L23093M61325Q23226O63226N21448L62687L08040M56240
5385B6592634Q00670L27550N48255P03871M69814M00821N65529J67259P16799
5376C1293202Q40891L51427K53991Q23011L29805N06039P14663K25438M31968
5367C5770435N01418O98034P13182O81371O63438K40886N30374P98791M70905
5358D1068834L17146L99369O0911M41017J39646N43106L26246L12401L31139L0365
5348D3970180M20631k6871K24797M60323L92128J43706L11810L89763j09304J69946
5338D6347109K47639R8743K34854K86489K14588m591N6913J89861R177L975q5913
5327D7598844K87584K26406j70022n4499k82847k24798k96808M3379k19956M1762
$$ plain form
5394 21926365 22673349 22996442 23457767 24280993 24944219 25465667 25828354 26136394 26592634
5385 26592634 27393304 27720854 28269109 28972980 29442794 29843615 30409144 30576403 31293202
5376 31293202 32134093 32485520 32739511 33562522 33892327 34398366 35113029 35338467 35770435
5367 35770435 36271853 36969887 37683069 38364440 39027878 39268764 39799138 40597929 41068834
5358 41068834 41385980 41785349 41846260 42287277 42426923 42970029 43296275 43608676 43939815 43970180
5348 43970180 44390811 44363940 44588737 45049060 45441188 45584894 45896704 46286467 46177163 46347109
5338 46347109 46594748 46693491 46928345 47214834 47429422 47424831 47481744 47671605 47680782 47684757 47598844
5327 47598844 47886428 48112834 47942812 47888313 47605466 47380668 47083860 47127239 46907283 46949045
5317D6949045m25184L7801k39078l60807k08133k78237R035J87368l57879k83594
5307D5030337j87689q3212q26348r58572l68424n85545m79588m74658m42713j26717
5297D0496871p59127n04170j91277o22939n72476o16815l38826l18495m98898
5288C6073848p55660j30121l24764n21553l21172p13699l51907p00876p87319
5279C1466777k98160m23935p30564n83091o74994n03546k26203q11500p32418
5270B6482366n69801p12765o29755n50400l11718n86152o64718k48963m76150
5261B1731944m94693r37669n66878m50610n25363k42274p22475m63248n61626
5252A6767108n34346k95279m29704l80636m39460m43496p94088l84403j69924
$$ plain form
5317 46949045 46523861 46561662 46322584 45961777 45753644 45475407 45484442 45671810 45313931 45030337
5307 45030337 44842648 44759436 43933088 42974516 42606092 42020547 41540959 41066301 40623588 40496871
5297 40496871 39737744 39233574 39042297 38419358 37846882 37230067 36891241 36572746 36073848
5288 36073848 35318188 35188067 34863303 34341750 34020578 33306879 32954972 32254096 31466777
5279 31466777 31168617 30744682 30014118 29431027 28756033 28252487 28026284 27214784 26482366
5270 26482366 25912565 25199800 24570045 24019645 23707927 23121775 22457057 22208094 21731944
5261 21731944 21237251 20299582 19732704 19282094 18756731 18514457 17791982 17328734 16767108
5252 16767108 16232762 15937483 15507779 15127143 14687683 14244187 13450099 13065696 12895772
5243A2895772l15480o63060k52686j86186l57841k01108k1244o16511k16816l3932
5233A0030908m58691k86367l81803l02885k50471n38312l39280o1207m40652j45681
5223F825559j92033k45179K19185k87461l70284k74383j17652k44885n7240L43950
5213E599577j85756o11747J3432n12333l72173N1270j57258M26536k95419l47169
5203C608960k06204j53667K30904p7864j56569k54555J16631l0567k00431k0984
5193B855654J66688K6309j540l17701n05654O3940k12137l9673J41934M17566
5183B595386j6594n41753j68636L74177j40054L72853J1914j65505m7088J24860
5173B399560P9754j12042k9883k16474k13721k34209N8816J83162J82570n19k27814
$$ plain form
5243 12895772 12580292 11917232 11664546 11478360 11120519 10919411 10898167 10281656 10064840 10030908
5233 10030908 9572217 9285850 8904047 8601162 8350691 7812379 7473099 7411892 6971240 6825559
5223 6825559 6633526 6388347 6607532 6320071 5949787 5675404 5557752 5312867 5255627 5599577
5213 5599577 5413821 4802074 4815506 4303173 3931000 3982270 3825012 4251548 3956129 3608960
5203 3608960 3402756 3249089 3479993 3402129 3245560 2991005 3107636 3077069 2876638 2855654
5193 2855654 3022342 3048651 3047111 2729410 2223756 2287696 2075559 2035886 2177820 2595386
5183 2595386 2578792 2037039 1868403 2242580 2102526 2475379 2487293 2321788 2274700 2399560
5173 2399560 2479314 2367272 2337389 2120915 1907194 1672985 1731801 1914963 2097533 2097014 1869200
5162A869200k26282J67812M76987R5430k62366m30308j54667J66477j20054P5472
5152A657701L28159j77513K8004N6311j82793k24923K76493M8397j38028J52531
5142A824339O8642J06141r2337Q0288k77055k95055j50078J32767J24030j51573
5132A370109j82493R7009j07511L70736K56689o0792r9959L12311j6418j52295
5122A787386K92669j27025m4854K27918j04711J17345k22158q6709o8947K96545
5112B067459J50990m47957K45183J91113j7322K0633j17784N2849J82134q0029
5102B247269l50211j67239K57942L80206j04399J13983J23163q9029R4718j76952
5092B329451L19248r6878J61140j8168l37452M0735M80329K67794k71520K31913
$$ plain form
5162 1869200 1642918 1810730 2287717 2383147 2120781 1690473 1535806 1702283 1582229 1657701
5152 1657701 1985860 1808347 1836351 1892662 1709869 1484946 1761439 1809836 1671808 1824339
5142 1824339 1892981 1999122 1906785 1987073 1710018 1414963 1264885 1397652 1521682 1370109
5132 1370109 1187616 1284625 1177114 1547850 1804539 1743747 1643788 1956099 1939681 1787386
5122 1787386 2080055 1953030 1908176 2136094 2031383 2148728 1926570 1839861 1770914 2067459
5112 2067459 2218449 1770492 2015675 2206788 2189466 2210099 2092315 2145164 2327298 2247269
5102 2247269 1897058 1729819 1987761 2367967 2263568 2377551 2500714 2411685 2506403 2329451
5092 2329451 2648699 2551821 2712961 2694793 2357341 2398076 2878405 3146199 2874679 3106592
5082C106592L11764K8123l25728j29499O16338J54154J61560O8814q9422J34547
5072D037243L21340k67070K44872K3385M4050J46040K9115j14587K05776M15143
5062E085307L07463L67931j45246O1756J86964Q7487L92017L25253Q9683P0006
5052F828621M62883K21784L40288L82358J00182K86136N85939J39715K07174M30098
5042I985178M31596L70730L60360N25143M41152O07376J19481M86661M44590L92306
5032A4164573K31561P71833L92288K76337K49762M68245O62725L28070R9326O12231
5022A8256951O87717L47559K14806P82162M89263L99773K41889M04534O13948
5013B2438602L88478N53473L50840R21905M88401O10941J020650N02660Q20853
$$ plain form
5082 3106592 3418356 3446479 3120751 2991252 3607590 3761744 3923304 3992118 3902696 4037243
5072 4037243 4358583 4091513 4336385 4359770 4403820 4549860 4578975 4464388 4670164 5085307
5062 5085307 5392770 5760701 5615455 5677211 5864175 5951662 6343679 6668932 6758615 6828621
5052 6828621 7291504 7513288 7853576 8235934 8336116 8622252 9208191 9347906 9555080 9985178
5042 9985178 10416774 10787504 11147864 11673007 12114159 12721535 12841016 13327677 13772267 14164573
5032 14164573 14396134 15167967 15560255 15836592 16086354 16554599 17217324 17545394 17644720 18256951
5022 18256951 18944668 19292227 19507033 20289195 20778458 21178231 21420120 21824654 22438602
5013 22438602 22827080 23380553 23731393 24653298 25141699 25752640 26773290 27275950 28096803
5004B8096803Q90377J081295O10108O61365O40721P02994N57336Q94567R36275
4995C5071841m1990Q06228O66132K28586K60506L36531N10522L85382J78034K9916
4985C8431688N3983N47415L80603M37907N74381M11408M17464O23948L97076J66644
4975D2442517L93012M53987P19489N42272N70709N71007K66530O40597L70129
4966D6970249L50305M87531J48001J86314M70859L02040k21156P8125J97908J01180
4956D9071356j09862P1164K19780J22994k22050j27734J55881j88771J71644M1274
4946D9205676k22014k85496k62760L2324m62752j24285j07620k81615l66206m17344
4936D6707908n85823n28449J4597l74769n7555m22282n87317m54440k20700j71569
$$ plain form
5004 28096803 28987180 30068475 30678583 31339948 31980669 32683663 33240999 34135566 35071841
4995 35071841 35029851 35836079 36502211 36730797 36991303 37327834 37838356 38223738 38401772 38431688
4985 38431688 38485671 39033086 39413689 39851596 40425977 40837385 41254849 41878797 42275873 42442517
4975 42442517 42835529 43289516 44009005 44551277 45121986 45692993 45959523 46600120 46970249
4966 46970249 47320554 47808085 47956086 48142400 48613259 48915299 48694143 48772268 48970176 49071356
4956 49071356 48961494 49032658 49252438 49375432 49153382 49025648 49181529 48992758 49164402 49205676
4946 49205676 48983662 48698166 48435406 48467730 48004978 47880693 47773073 47491458 47125252 46707908
4936 46707908 46122085 45593636 45608233 45233464 45175909 44753627 44166310 43711870 43491170 43319601
4926D3319601n47841l26285k5318l67585n09443q43340k07048J94914n92484m76495
4916C9618676m64145m47332m74766m02924o75939o05378o51501j089908n50911
4907C4255872l28951m41370j034945n36277o44150p98399p79906o41571l82492
4898B8667811o99026o24367j84669l19039p86934q93323m06390k92091k53406
4889B4208566k75917m37013p8984o26349o86396l19607o25117k72619l37761k74477
4879B0274326l81340m84424k87887o87607m56060q13897n34484o12320q71298
4870A5145009n01439m15126l11024m92628l54732l07247m51319l80692l45070
4861A1585732m26626m5174j49470m72524m23777l63465O4383K36828n35769o27286
$$ plain form
4926 43319601 42771760 42445475 42420157 42052572 41543129 40699789 40492741 40687655 40095171 39618676
4916 39618676 39154531 38707199 38232433 37829509 37153570 36548192 35896691 34806783 34255872
4907 34255872 33926921 33485551 32450606 31914329 31270179 30471780 29691874 29050303 28667811
4898 28667811 27968785 27344418 27159749 26840710 26053776 25160453 24754063 24461972 24208566
4889 24208566 23932649 23495636 23416652 22790303 22103907 21784300 21159183 20886564 20548803 20274326
4879 20274326 19892986 19408562 19120675 18433068 17977008 17163111 16628627 16016307 15145009
4870 15145009 14643570 14228444 13917420 13424792 13070060 12762813 12311494 11930802 11585732
4861 11585732 11159106 11113932 10964462 10491938 10068161 9704696 9769079 10005907 9470138 8842852
4851H842852k65343k86687k56908p8654j11699l02938l86468m93552n2935o4251
4841F543417k81589r2007J23301k61352k71994k57129j88290o558p46o04242J5829
4830D718640P3121j96975k1448k84526k2142o9620j49260k75227m0258l7834j52236
4819C542235J75944J14674l52516o14928K84136n6139j5124L7875j09817N3037
4809C059377J12967J36373n2062k93683j82871K79137L6741l65357p3870J76253
4799B833005o2061j55134J56092k59927k30237M03048k9602j06162n8734j97406
4789B292882J40790l82914P2602J65839k35619r2742J70954P0340j15750J3684
4779B100066l65262N7995K60793P9590j71463r3518J10125j5770J12068k96134
$$ plain form
4851 8842852 8577509 8290822 8033914 7955260 7843561 7540623 7154155 6660603 6607668 6543417
4841 6543417 6261828 6169821 6293122 6031770 5759776 5502647 5314357 5307799 5307053 4702811 4718640
4830 4718640 4791761 4594786 4573338 4288812 4266670 4197050 4047790 3772563 3732305 3694471 3542235
4819 3542235 3718179 3832853 3480337 2865409 3149545 3093406 3078282 3116157 3006340 3059377
4809 3059377 3172344 3308717 3256655 2962972 2780101 3059238 3095979 2730622 2656752 2833005
4799 2833005 2770944 2615810 2771902 2511975 2281738 2684786 2655184 2549022 2490288 2292882
4789 2292882 2433672 2050758 2123360 2289199 2053580 1960838 2131792 2202132 2086382 2100066
4779 2100066 1734804 1792799 2053592 2133182 1961719 1868201 1978326 1962556 2074624 1778490
4769A778490j65108M17222J53534k62311q9234J21517j51770N7574N7973L9920
4759A957807M412q9375j30808K11641k66052K70882L68788l35887p3010J79291
4749B097689J35833J15347P2313N9236m96749l8035K02376R3163J69617K6757
4739B437547L05328K8531m19563p6308l58801k54634m2188K12653K18637k92885
4729A758317j63371J42140P6375l43925k14660Q7875j65478L2794K86796K17773
4719A714636j13510J01254j3023j83896m8627J26536k53344L09338J26171j8123
4709A747412j72770j3285O2203Q3701Q2556l8468J06717j97107r6318L6348j37723
4698A463266K13082K78949l1044J67694o4676j61795l51850J32701p5464l28019
$$ plain form
4769 1778490 1613382 2030604 2184138 1921827 1832593 1954110 1802340 1859914 1917887 1957807
4759 1957807 1962219 1872844 1742036 1953677 1687625 1958507 2327295 1991408 1918398 2097689
4749 2097689 2233522 2348869 2421182 2480418 1983669 1945634 2148010 2241173 2410790 2437547
4739 2437547 2742875 2771406 2351843 2275535 1916734 1662100 1619912 1832565 2051202 1758317
4729 1758317 1594946 1737086 1813461 1469536 1254876 1342751 1177273 1210067 1496863 1714636
4719 1714636 1601126 1702380 1689357 1505461 1456834 1583370 1330026 1639364 1765535 1747412
4709 1747412 1574642 1561357 1623560 1707261 1789817 1751349 1858066 1660959 1564641 1600989 1463266
4698 1463266 1676348 1955297 1924253 2091947 2027271 1865476 1513626 1646327 1570863 1242844
4688A242844j38932L59434L3318Q9199j19010j02821l00073J18261R4033L6419
4678A312672j06197m8917j68239J8456o1922j09892R0953r9698J87204L15417
4668A329837q9630J31958l47240R4469K86340k48313j79779J24616M610j34459
4658I72409J00377q5964j68537J2412K57635p4067k5538J54643Q0309j88920k18021
4647H16738J37459n9427o8160K45408j14069N1601L75078n3315Q0029j83873j42004
4636A085465L68072R0357j32184R4343j03305k57018r1681L53905R6662l49610
4626A155006J30173p0109L6965L35805J10529J04061p845k42969l0839L16347
4616A837124O9030j45465L94131N6993J70081l18654J84828j30759j16740n5080
$$ plain form
4688 1242844 1103912 1463346 1496664 1585863 1466853 1364032 1063959 1182220 1276253 1312672
4678 1312672 1206475 1157558 989319 1007775 945853 835961 926914 827216 1014420 1329837
4668 1329837 1240207 1372165 1024925 1119394 1405734 1157421 977642 1102258 1106868 972409
4658 972409 1072786 986822 818285 830697 1088332 1014265 988727 1143370 1223679 1034759 816738
4647 816738 954197 894770 826610 1072018 957949 1009550 1384628 1331313 1411342 1227469 1085465
4636 1085465 1453537 1543894 1411710 1506053 1402748 1145730 1054049 1407954 1504616 1155006
4626 1155006 1285179 1215070 1252035 1587840 1698369 1802430 1794585 1551616 1520777 1837124
4616 1837124 1906154 1760689 2154820 2211813 2381894 2063240 2248068 2117309 2000569 1945489
4606A945489J56801L17586R0170O6278j05742L75479j53848k97738N64935J42606
4596C102016j00429o0435J62797J07821N9587K77122L01101L20487J00686j9360
4586D251393K2053L47598j88812J24609K50464J80439k8620L64631M79567k85726
4576E517596j43334j49259j17299P5761J92168J95386M65967J19959M05058J92743
4566F754746p927n3417K33689O65380k08443M50589L10867R1891P7614K95454
4556H610443K20008p6799k6296p8636L63814n8283K69249J93299N4512o7451N6225
4545I460085k74921r0314L01123p7041m99694l5831L18889l21157n09586N406
4535H276959k55530k18099r892k90183K74675l00697o9334k42697J01375j87156
$$ plain form
4606 1945489 2102290 2419876 2510046 2576324 2470582 2846061 2692213 2394475 2959410 3102016
4596 3102016 3001587 2941152 3103949 3211770 3271357 3548479 3849580 4170067 4270753 4251393
4586 4251393 4273446 4621044 4432232 4556841 4807305 4987744 4959124 5323755 5803322 5517596
4576 5517596 5374262 5225003 5107704 5183465 5375633 5571019 6036986 6156945 6562003 6754746
4566 6754746 6746819 6693402 6927091 7592471 7384028 7834617 8145484 8237375 8314989 8610443
4556 8610443 8830451 8753652 8727356 8648720 9012534 8954251 9223500 9416799 9471311 9403860 9460085
4545 9460085 9185164 9094850 9395973 9318932 8819238 8783407 9102296 8781139 8271553 8276959
4535 8276959 8021429 7803330 7793438 7503255 7777930 7477233 7407899 7165202 7266577 7079421
4525G079421j06276O30q178J90061j10350o2177M7292j68666l25295K9582p5244
4514F490800n4067j05706M6195J09902k9733k7652n15586n05228K3518j73466
4504E258977k47341j01942j32011k93436Q4147J95425j86570k94458k34068k87512
4494C761211J2311j59997k65614p0378l65043k54988l22959K43500l5963L23002
4484B865082M52454m86919l47900L5607k28960P4333q762M8258j18038j68330
4474B116825K44873m6989m9070J1358k34153J07756l40764j14944N9808M63531
4464B218231K57261l86997j48557l35919K75714n1312R3914J12519k3203j42645
4454A869006m7402L53401l0964r003J13910k10232m3199k3873j44238j92001m7023
$$ plain form
4525 7079421 6973145 6973775 6965597 7155658 7045308 6983131 7030423 6861757 6536462 6566044 6490800
4514 6490800 6436733 6331027 6377222 6487124 6457391 6429739 5914153 5408925 5432443 5258977
4504 5258977 5011636 4909694 4777683 4484247 4568394 4763819 4577249 4282791 4048723 3761211
4494 3761211 3773522 3613525 3347911 3277533 2912490 2657502 2334543 2578043 2542080 2865082
4484 2865082 3317536 2830617 2482717 2518324 2289364 2363697 2354935 2403193 2285155 2116825
4474 2116825 2361698 2314709 2265639 2276997 2042844 2150600 1809836 1694892 1754700 2218231
4464 2218231 2475492 2088495 1939938 1604019 1879733 1828421 1922335 2034854 2011651 1869006
4454 1869006 1821604 2175005 2144041 2135038 2248948 2038716 1995517 1971644 1827406 1635405 1588382
4443A588382L65470J19039j38540K23756r491k47133m36102J24710M97419j04014
4433A983496l10021N6846j14087J45902l08114K08023j5565N3887k93607L42161
4423A748921K19962j93356J5829j56215L10531k25526K29692K46255l73654L9595
4413A862034L12943j59013k19681J1577R9778k5599K37838l55344j13918P3514
4403A724129J41436K01160j74906O4382K18874J45679J22862r0729j59346m84142
4393A709399N2486k7947k09149L31204J83969J26043j30364K24588J93104p2826
4383B380507J21513j09003J5764k3934P5689n2861k51843J65651J21129j33177
4373B309435K2522j10405L86932L2892Q4185r2659O3886K11729k067p0264j5027
$$ plain form
4443 1588382 1953852 2072891 1934351 2158107 2148616 1901483 1465381 1590091 2087510 1983496
4433 1983496 1673475 1730321 1616234 1762136 1454022 1662045 1646480 1700367 1406760 1748921
4423 1748921 1968883 1775527 1791356 1635141 1945672 1720146 1949838 2196093 1822439 1862034
4413 1862034 2174977 2015964 1796283 1807860 1907638 1882039 2119877 1764533 1650615 1724129
4403 1724129 1865565 2066725 1891819 1956201 2175075 2320754 2443616 2352887 2193541 1709399
4393 1709399 1761885 1733938 1524789 1855993 2039962 2166005 2035641 2260229 2453333 2380507
4383 2380507 2502020 2393017 2408781 2384847 2460536 2407675 2155832 2321483 2442612 2309435
4373 2309435 2331957 2221552 2608484 2641376 2725561 2632902 2696788 2908517 2906450 2836186 2821159
4362B821159j96009J14513L57258K1836p2232j83347O10411k29879L7641J78297
4352C459648k2041p1793N26271M5418j72745J31388p9037K31318K51550J60827
4342D460804P7528M985j56130K34562K12556R8913K32819J67006L876N7832R0293
4331E485044K16208K93216J31337Q4326L63802K78044l7533J94247L14816M74629
4321G798136L39242J0875K59120k8447J54244J92807O20268N44874M79135K79578
4311A0649832K05559K74495J18254L56922J73426J04635Q73583J104505R0089
4302A3951300L20881M67644K59661J77767K04761O53695O83279N49715N96987
4293A7865690R45496O55010P69177O82906M97786N71666N88683M16559M33945
$$ plain form
4362 2821159 2625150 2739663 3096921 3118757 3046525 2863178 3473589 3243710 3281351 3459648
4352 3459648 3437607 3365814 3892085 3937503 3764758 3896146 3817109 4048427 4299977 4460804
4342 4460804 4538332 4543317 4387187 4621749 4834305 4933218 5166037 5333043 5336919 5394751 5485044
4331 5485044 5701252 5994468 6125805 6210131 6573933 6851977 6814444 7008691 7323507 7798136
4321 7798136 8137378 8148253 8407373 8378926 8533170 8725977 9346245 9891119 10370254 10649832
4311 10649832 10855391 11129886 11248140 11605062 11778488 11883123 12756706 13861211 13951300
4302 13951300 14272181 14739825 14999486 15177253 15382014 16035709 16718988 17268703 17865690
4293 17865690 18811186 19466196 20235373 20918279 21416065 21987731 22576414 22992973 23426918
4284B3426918P20440J219177Q29391M12396Q46406O28781R96732O87951P43118
4275C0511310Q03086R04934N98296N02305O85769P00566Q03754O27919M59640
4266C6597579N96420Q85329P07135M80102N51807P04123P25831K58312O87060
4257D2193698P68078L92381J91339J64872N14347J89361P8546L14859n9687K09122
4247D4956916P89864J72911J95461l35485k23795J77153K37744j9860M0739k093
4237D5989555j47422l65159k85364j32819k87480K30069k65564k50261j73311
4228D4312244l50027k02498k3815o9064N8657R0378k3850K21178L8184m1383j07129
4217D3902875l75086j58992J57873k09001P9425r9744o8116L34408N8872K9920
$$ plain form
4284 23426918 24147358 25366535 26195926 26608322 27454728 28083509 29080241 29768192 30511310
4275 30511310 31314396 32219330 32817626 33319931 34005700 34706266 35510020 36137939 36597579
4266 36597579 37193999 38079328 38786463 39266565 39818372 40522495 41248326 41506638 42193698
4257 42193698 42961776 43354157 43545496 43710368 44224715 44414076 44492622 44807481 44747794 44956916
4247 44956916 45746780 45919691 46115152 45779667 45555872 45733025 45970769 45950909 45991648 45989555
4237 45989555 45842133 45476974 45191610 45058791 44771311 45001380 44735816 44485555 44312244
4228 44312244 43962217 43759719 43735904 43666840 43725497 43815875 43792025 44013203 44051387 44010004 43902875
4217 43902875 43527789 43368797 43526670 43317669 43397094 43297350 43229234 43563642 43622514 43652434
4207D3652434K23027m6265l884n0142j92952N3390j3087q3897K97528N53294j06905
4196D4282541R2172N6054N426L14728N47196K03699N43928K23549N36586M78312
4186D7284191j97652K07695K18622M15866K83418L72679Q44378j53296k2509N11935
4176D9765327L27495L54870L47276J05883J48800K80230l1239J48650R8250M51057
4166E1996599L73306L06926L87537L01129J96634J62598k7926k57478m6625N47107
4156E3939807L42619q8975k97109j28952P7875o1890l5563j19435m25861j19835
4146E3082681j66778j94147L148n58992J6293l39386l29408o3356J9964n6778
4136E1413241m97469j3199m10902k85998k89505k89380J58496j22886m95316j87270
$$ plain form
4207 43652434 43875461 43829196 43825312 43775170 43582218 43635608 43622521 43538624 43836152 44389446 44282541
4196 44282541 44374713 44430767 44436193 44750921 45298117 45501816 46045744 46269293 46805879 47284191
4186 47284191 47086539 47294234 47512856 47928722 48212140 48584819 49429197 49275901 49253392 49765327
4176 49765327 50092822 50447692 50794968 50900851 51049651 51329881 51298642 51447292 51545542 51996599
4166 51996599 52369905 52676831 53064368 53365497 53562131 53724729 53696803 53439325 53392700 53939807
4156 53939807 54282426 54193451 53896342 53767390 53845265 53783375 53747812 53628377 53202516 53082681
4146 53082681 52915903 52721756 52724904 52165912 52182205 51842819 51513411 51450055 51470019 51413241
4136 51413241 50915772 50902573 50491671 50205673 49916168 49626788 49785284 49662398 49167082 48979812
4126D8979812J35559m00341p03487n12919m93424n56439n65446l26604k79892
4117D5276819n96456q01979o92105o56080k60451k66051q76920n09830q16755
4108C9800192p13997n10237q49983l43444n24560n69971j31649p10042q34516
4099C4611793k85266o55705p9620n87465n74746n29324k32330l98974j80260k00006
4089C0888097n62725l34908o30585l7678j84452l28852l98325l37060J11739l70765
4079B7814486o01317k98418o09053n32275j93990j99706k34764n37385n96401
4070B4011177n14013n71398p6876k91534k16033l23083l36254j24299m83678m08439
4060B0665570j43612l33659n14038k07576l54222K6215n7684O8662J759j77071
$$ plain form
4126 48979812 49115371 48715030 48011543 47498624 47005200 46448761 45883315 45556711 45276819
4117 45276819 44680363 43878384 43186279 42530199 42269748 42003697 41126777 40616947 39800192
4108 39800192 39086195 38575958 37725975 37382531 36857971 36288000 36156351 35446309 34611793
4099 34611793 34326527 33670822 33591202 33003737 32428991 31899667 31667337 31268363 31088103 30888097
4089 30888097 30325372 29990464 29359879 29322201 29137749 28808897 28410572 28073512 28185251 27814486
4079 27814486 27213169 26914751 26305698 25773423 25579433 25379727 25144963 24607578 24011177
4070 24011177 23497164 22925766 22848890 22557356 22341323 22018240 21681986 21557687 21074009 20665570
4060 20665570 20521958 20188299 19674261 19466685 19112463 19138678 19080994 19149656 19151415 18974344
4050A8974344p3309k70111l98512j4113J24465k0539r7209J25272q0344l20993
4040A7948951K14800J66597J39200K18143J34624k08537P686o5483J06718R2393
4030A8755092N03447L45966q6748j83631k2948L41859L20264j0454N67755M00864
4020B0931466L96491R6641J41718L91341N17954p3346Q5507N92913J85253L65080
4010B3631018P15501K00177J66200L5752K16891M55903L80493M24582N36073L82719
4000B7145309N9993O28097K58719K18632O08254K97931M32835J92266K56776P26815
3990C0825627N87365K36051M52319P91947M47945P74507O55068P92596M72581
3981C6036006K62306J044993Q78272N71321N42413O97376Q14279N93612R08507
$$ plain form
4050 18974344 18901035 18630924 18232412 18218299 18342764 18322225 18225016 18350288 18269944 17948951
4040 17948951 18163751 18330348 18469548 18687691 18822315 18613778 18621464 18555981 18662699 18755092
4030 18755092 19258539 19604505 19517757 19334126 19311178 19653037 19973301 19962847 20530602 20931466
4020 20931466 21327957 21424598 21566316 21957657 22475611 22402265 22487772 23080685 23265938 23631018
4010 23631018 24346519 24546696 24712896 24748648 24965539 25421442 25801935 26226517 26762590 27145309
4000 27145309 27205302 27833399 28092118 28310750 28919004 29216935 29649770 29842036 30098812 30825627
3990 30825627 31412992 31649043 32101362 32893309 33341254 34115761 34770829 35563425 36036006
3981 36036006 36298312 37343305 38221577 38792898 39335311 40032687 40846966 41440578 42349085
3972D2349085M34276N69374O79166Q39045J009080P28392N07298K99062N46704
3963D7961482O73697L93819M54556R9203N03330O99044N23357J94200O58790K54641
3953E2416119K52447Q90264O45914P84807O02584O06646P67503R20714R49296
3944E8836294N72265Q07850Q06714J064163J004939O92960O90005O83315M61759
3935F5620264M06718O56221O48837N97065N70440L32609M03860K82993K74489
3926F9793496M26566N49292J65859O4377R7910M75260P32330L98911P60580M97044
3916G3961625L34745O3823k5766L82583P22430K85301L83722K84628O39429L69533
3906G7402053L84765N90797M34881K92611O30869O86786P71371P22067J053182
$$ plain form
3972 42349085 42783361 43352735 44031901 44870946 45880026 46608418 47115716 47414778 47961482
3963 47961482 48635179 49028998 49483554 49582757 50086087 50785131 51308488 51502688 52161478 52416119
3953 52416119 52668566 53558830 54204744 54989551 55592135 56198781 56966284 57886998 58836294
3944 58836294 59408559 60216409 61023123 62087286 63092225 63785185 64475190 65158505 65620264
3935 65620264 66026982 66683203 67332040 67929105 68499545 68832154 69236014 69519007 69793496
3926 69793496 70220062 70769354 70935213 70999590 71097500 71572760 72305090 72704001 73464581 73961625
3916 73961625 74296370 74360193 74334427 74717010 75439440 75724741 76108463 76393091 77032520 77402053
3906 77402053 77786818 78377615 78812496 79105107 79735976 80422762 81194133 81916200 82969382
3897H2969382J073895R42206J147257J064384J408073J810201J586713J477377
3889I3479488K128739J838000J609563J630673J727876J785848J044007O83250
3881A05927444R94686N73855Q89051O85179K235m3782O7054K43859r6128n98651
3871A08644802l44166m89994n85483n36897n29318r33368j137777j137973j413532
3862A01536294j379735j314650j141606j894704j667456j384744j468404j433489
3854H9851506j254215j269016q65861q09002j040168j162168p77787o84831q98297
3845H1090161j111116r06443j206276p74733j209269j221869j311173j610476
3837G1738806r29271j428622j176250j669067j855438j261472j240407j559183
$$ plain form
3897 82969382 84043277 84985483 86132740 87197124 88605197 90415398 92002111 93479488
3889 93479488 95608227 97446227 99055790 100686463 102414339 104200187 105244194 105927444
3881 105927444 106922130 107495985 108385036 109070215 109072450 109028668 109095722 109339581 109243453 108644802
3871 108644802 108300636 107810642 107225159 106688262 106158944 105225576 104087799 102949826 101536294
3862 101536294 100156559 98841909 97700303 95805599 94138143 92753399 91284995 89851506
3854 89851506 88597291 87328275 86462414 85653412 84613244 83451076 82673289 81988458 81090161
3845 81090161 79979045 79072602 77866326 77091593 75882324 74660455 73349282 71738806
3837 71738806 70809535 69380913 68204663 66535596 64680158 63418686 62178279 60619096
3829F0619096j798438j588497j581334j804813j329845j807069j449857j489496
3821D7769747j635424j789430j217486j279926j033150j362192j089903j309837
3813C7052399j119310r54640o53218p96874j012346o66242p67446m61468o07800
3804C0013055p81956n43943o11678n96370l69689o83650m06912n75374m45168
3795B4998315m97671n494o07496n27917l53180j85100l94184n78982r7732m83942
3785B1266617j93778l26216m82949n0537l48629j62613j63644k62187M2730q3922
3775A9234872l41418k8961j63655K72779j6634K34311J4862j56842k51755K63960
3765A9061519M06564J90516j99947j12161P04042O5429o7556K74074K6133M95304
$$ plain form
3829 60619096 58820658 57232161 55650827 53846014 52516169 50709100 49259243 47769747
3821 47769747 46134323 44344893 43127407 41847481 40814331 39452139 38362236 37052399
3813 37052399 35933089 34978449 34325231 33528357 32516011 31849769 31082323 30620855 30013055
3804 30013055 29231099 28687156 28075478 27479108 27109419 26425769 26018857 25443483 24998315
3795 24998315 24500644 24495150 23887654 23359737 23006557 22821457 22427273 21848291 21750559 21266617
3785 21266617 21072839 20746623 20263674 20213137 19864508 19701895 19538251 19276064 19318794 19234872
3775 19234872 18893454 18864493 18700838 18973617 18956983 19191294 19206156 19049314 18797559 19061519
3765 19061519 19468083 19658599 19458652 19346491 20050533 20115962 20048406 20322480 20348613 20843917
3755B0843917N09763L15803K03066M67070O84303K67579P7671P70653Q17141N93921
3745B5550887J201891N32269R30792R97422P18633Q15217J214123J484726J279216
3736C4725176J274967R61063Q70623J267418P82706R38839J304478R41389O70146
3727D3736805J055256Q80421J217115Q63347M59278Q70788P96177R76801R70116
3718E1826104R37764J205761J090925J102070J076996J504366J265657R60865
3710F0970508J287818J628157J424555J190498J381553J899099J266378J348316
3702G2396882J821979J744668J642029J873336K163549K125618K429694K852100
3694H9049855K777162K918216L209971L575808M552111M152153M281290N030192
$$ plain form
3755 20843917 21353680 21669483 21872549 22339619 23023922 23291501 23369172 24139825 24956966 25550887
3745 25550887 26752778 27285047 28215839 29213261 29931894 30747111 31961234 33445960 34725176
3736 34725176 36000143 36961206 37831829 39099247 39881953 40820792 42125270 43066659 43736805
3727 43736805 44792061 45672482 46889597 47752944 48212222 49083010 49879187 50855988 51826104
3718 51826104 52763868 53969629 55060554 56162624 57239620 58743986 60009643 60970508
3710 60970508 62258326 63886483 65311038 66501536 67883089 69782188 71048566 72396882
3702 72396882 74218861 75963529 77605558 79478894 81642443 83768061 86197755 89049855
3694 89049855 91827017 94745233 97955204 101531012 106083123 110235276 114516566 119546758
3686A19546758M694877N179082M982658M790408M839500M793453M717606M443768
3678A57988110L566092L121653L420455K285994J813044J092513L16703j60170
3670A73444394m61997j074731j147103j351566j818657k415610k615149k590273
3662A59969308k635284l143104l032926k556198k279587k760238k604598k047987
3654A38909386j878849k081419j583245j223311j232803j205645j335196j075834
3646A27293084j152865q52869l75626r51685j194834j175738j673262j447170
3638A18469035j459957j660042j946682k248254k340231k373153k430318k148139
3630A01862259k534254k690866k779193k490367k481705k723004k623838k219083
$$ plain form
3686 119546758 124241635 129420717 134403375 139193783 144033283 148826736 153544342 157988110
3678 157988110 161554202 164675855 168096310 170382304 172195348 173287861 173604564 173444394
3670 173444394 172982397 171907666 170760563 169408997 167590340 165174730 162559581 159969308
3662 159969308 157334024 154190920 151157994 148601796 146322209 143561971 140957373 138909386
3654 138909386 137030537 134949118 133365873 132142562 130909759 129704114 128368918 127293084
3646 127293084 126140219 125287350 124911724 123960039 122765205 121589467 119916205 118469035
3638 118469035 117009078 115349036 113402354 111154100 108813869 106440716 104010398 101862259
3630 101862259 99328005 96637139 93857946 91367579 88885874 86162870 83539032 81319949
3622H1319949k204632k556680k541618k141348k058336j886525k226578k369438
3614F3334794j909888j693109j455051j619254j745008j611635j728895j579994
3606D9991960j367679j059350j534267j660687j041059j281062j226865j447785
3598C9373206j236450j082619j292013r83250j088921q18815n58480j026368m35226
3589C0851064p45560j033275p25127n78290o91152o34191m82161j80614m84891
3580B5295803o90972o40631n74345k56122n88364p10978m41194j15446j94446
3571B1083305o63831l41733n36447n19452l63924n68112r1825l13634l30028r9304
3561A7255015m53506k15848l72759j90755r3487l32135l40825L5491l26776n6111
$$ plain form
3622 81319949 79115317 76558637 74017019 71875671 69817335 67930810 65704232 63334794
3614 63334794 61424906 59731797 58276746 56657492 54912484 53300849 51571954 49991960
3606 49991960 48624281 47564931 46030664 44369977 43328918 42047856 40820991 39373206
3598 39373206 38136756 37054137 35762124 34778874 33689953 32871138 32312658 31286290 30851064
3589 30851064 30105504 29072229 28347102 27768812 27077660 26443469 25961308 25780694 25295803
3580 25295803 24604831 23964200 23389855 23133733 22545369 21834391 21393197 21277751 21083305
3571 21083305 20419474 20077741 19541294 19021842 18657918 18089806 17997981 17684347 17354319 17255015
3561 17255015 16801509 16585661 16212902 16022147 15928660 15596525 15255700 15291191 14964415 14908304
3551A4908304k71132k86828J28056l58818j02996m00889j62244O3103K49973O9646
3541A3836175m6973l86848j20088J38641j26318K26271N2640O7716n2933q3026
3531A3505257j80368k4624K77955P8217L02648O6716L64880J07324M7462K71630
3521A4817097J34195R0060K20861J86467K05139J45999O02716K36341M04297L69817
3511A7412989m2479O70559N16822Q90441O30130L49062N51299M76151Q23954M73846
3501B2752774Q91253O62496O84422Q89000Q10456Q95274R97919N00162P06097
3492B9789853J064408J074756O89373R34578O51830Q01673J476073R38228J134758
3483C8555530J186556J068972J050249J318533R63919J289827J293194J088511
$$ plain form
3551 14908304 14637172 14350344 14478400 14119582 14016586 13615697 13453453 13516556 13766529 13836175
3541 13836175 13789202 13402354 13282266 13420907 13294589 13520860 13573500 13641216 13588283 13505257
3531 13505257 13324889 13300265 13578220 13656437 13959085 14025801 14390681 14498005 14545467 14817097
3521 14817097 14951292 15041352 15262213 15448680 15653819 15799818 16402534 16638875 17043172 17412989
3511 17412989 17370510 18041069 18557891 19448332 20078462 20427524 20978823 21454974 22278928 22752774
3501 22752774 23644027 24306523 24990945 25879945 26690401 27585675 28583594 29083756 29789853
3492 29789853 30854261 31929017 32618390 33552968 34204798 35006471 36482544 37420772 38555530
3483 38555530 39742086 40811058 41861307 43179840 44143759 45433586 46726780 47815291
3475D7815291J352672J219884J072204J581421J288425J234159J146862J552468
3467E8263386J646716J466091J606891J444803J629919J411195J985796K053568
3459G1508365K108473K171630K210921K295674K822797L462231L161446L460098
3451I3201635L102664M003785M494157M477109M498264M772751M372857M689717
3443A27612939M792159M433082M351297L829033M079731L610470L633841L106866
3435A59449418K512833K237557K077742J709623J240489Q11137O22077L97806
3427A71058682J5080k38904j041498j401653j313485j702432j808367k236430
3419A61330993k369961k197294k511607k557414k660529k519372k529234k274075
$$ plain form
3475 47815291 49167963 50387847 51460051 53041472 54329897 55564056 56710918 58263386
3467 58263386 59910102 61376193 62983084 64427887 66057806 67469001 69454797 71508365
3459 71508365 73616838 75788468 77999389 80295063 83117860 86580091 89741537 93201635
3451 93201635 96304299 100308084 104802241 109279350 113777614 118550365 122923222 127612939
3443 127612939 132405098 136838180 141189477 145018510 149098241 152708711 156342552 159449418
3435 159449418 161962251 164199808 166277550 167987173 169227662 170038799 170660876 171058682
3427 171058682 171073762 170834858 169793360 168391707 167078222 165375790 163567423 161330993
3419 161330993 158961032 156763738 154252131 151694717 149034188 146514816 143985582 141711507
3411A41711507j843041j942436j885757j507193j276255j434903r75746n28039
3403A30318137j063213r99693j224381j408852j249751r46901j285123j592119
3395A20548104j789506j516551j825520k042858k116129k177299k018789j946041
3387A05115411j944936j727137k400773k848403k606957k349680k884929k895269
3379H5457327k194409k290372k463092k353925k177084k192765k009780j863640
3371F7912260k012959j968545j629804j811020j462445j598019j337500j447607
3363E4644361j158662j336163j225750j168029j147443j081275j023394l96388
3355D6107257p41562o26682n65238q64717j71241o59066l79391m84261m38675
$$ plain form
3411 141711507 139868466 137926030 136040273 134533080 133256825 131821922 130846176 130318137
3403 130318137 129254924 128255231 127030850 125621998 124372247 123425346 122140223 120548104
3395 120548104 118758598 117242047 115416527 113373669 111257540 109080241 107061452 105115411
3387 105115411 103170475 101443338 99042565 96194162 93587205 91237525 88352596 85457327
3379 85457327 83262918 80972546 78509454 76155529 73978445 71785680 69775900 67912260
3371 67912260 65899301 63930756 62300952 60489932 59027487 57429468 56091968 54644361
3363 54644361 53485699 52149536 50923786 49755757 48608314 47527039 46503645 46107257
3355 46107257 45365695 44739013 44173775 43309058 43137817 42478751 42099360 41615099 41176424
3346D1176424J55848n84929j2700J00628m11549j18456Q2900k93284K40038L02671
3336D0637591l6777j06196l27562K43132p0416J13900j08062J3712N3000R5453
3326D0507775J17520J45589K58187J19129p896K50308M81286L07091K50892N51365
3316D2981246M58086M94730N30912M89577Q19250O75806K35723L29836L78156
3307D7393322O58979O85910J61825P80868O05590O52392P95553R04984J178150
3298E3817573J269939J352090J580015J720049K064432K228328K841600K748939
3290F9622965L032553L277419L299966L388868L687925L645526L434534L336593
3282I6726349K774071K467869K041426J573846R44679K62664R666r98272j941080
$$ plain form
3346 41176424 41332272 40747343 40734643 40835271 40423722 40305266 40388166 40094882 40334920 40637591
3336 40637591 40600814 40494618 40167056 40410188 40339772 40453672 40345610 40359322 40412322 40507775
3326 40507775 40625295 40770884 41029071 41148200 41140304 41390612 41871898 42178989 42429881 42981246
3316 42981246 43439332 43934062 44464974 44954551 45773801 46449607 46685330 47015166 47393322
3307 47393322 48052301 48738211 48900036 49680904 50286494 50938886 51734439 52639423 53817573
3298 53817573 55087512 56439602 58019617 59739666 61804098 64032426 66874026 69622965
3290 69622965 72655518 75932937 79232903 82621771 86309696 89955222 93389756 96726349
3282 96726349 99500420 101968289 104009715 105583561 106528240 106790904 106800570 105802298 103861218
3273A03861218j828740k027830k594335k806362l082247k974444k632321k800067
3265H3114872k698232k384774k050634k106544j338374r02167p73800p15099l72126
3256F9773122k04201J44039O9340L8843L07398J15615M61835N38416N93038N93130
3246G2430575K53712n8609J14811k66145j038177o43713q87803j231991j428401
3237F7244259j677060j550483k058806k290438k167421k159124k299041j965254
3229E1076632k249241k060163k405292j817392j709294j840440j319114j410689
3221C6265007j330001j099390q54023p45581q60445p31475p74824j018958o54851
3212B8195459n08677o43744n64351o0290r6705p38495q91538l25453n17281l67410
$$ plain form
3273 103861218 102032478 100004648 97410313 94603951 91521704 88547260 85914939 83114872
3265 83114872 80416640 78031866 75981232 73874688 72536314 71634147 70860347 70145248 69773122
3256 69773122 69568921 69712960 69782300 69821143 70128541 70244156 70705991 71244407 71837445 72430575
3246 72430575 72684287 72625678 72740489 72474344 71436167 70792454 69904651 68672660 67244259
3237 67244259 65567199 64016716 61957910 59667472 57500051 55340927 53041886 51076632
3229 51076632 48827391 46767228 44361936 42544544 40835250 38994810 37675696 36265007
3221 36265007 34935006 33835616 32981593 32236012 31375567 30644092 29869268 28850310 28195459
3212 28195459 27686782 27043038 26478687 26418397 26321692 25583197 24691659 24366206 23848925 23481515
3202B3481515l58349o01023o26912l68463k88031n94333l31741p04744o15618
3193A8992301m92655o31631j80764n72058n69436n20255m90293l18632m69547
3184A4747030j33789k70519p42094o6979j25151n36095k86872k74383l86130l77515
3174A1547503P5861l17906k38261j50423j49119p8406k13851j87858m12390J61154
3164A0036304l54278k85557L04088j10979r8102j18654p846j30602k4706l1042
3154I178626k94932k3800J48657j30058r413n14035j47688R1451J40790n9476
3144H380122J43304J68895r5095J79727k45414K21064j92268K32979m18948l18901
3134H055465M88070M0233j44427o5839K2581J42035k83147j75330J27055M20135
$$ plain form
3202 23481515 23123166 22522143 21895231 21526768 21238737 20644404 20312663 19607919 18992301
3193 18992301 18499646 17868015 17687251 17115193 16545757 16025502 15535209 15216577 14747030
3184 14747030 14613241 14342722 13600628 13533649 13408498 12872403 12585531 12311148 11925018 11547503
3174 11547503 11623364 11305458 11067197 10916774 10767655 10689249 10475398 10287540 9875150 10036304
3164 10036304 9682026 9396469 9700557 9589578 9491476 9372822 9364976 9234374 9209668 9178626
3154 9178626 8883694 8859894 9008551 8878493 8869080 8355045 8207357 8298808 8439598 8380122
3144 8380122 8523426 8692321 8597226 8776953 8531539 8752603 8560335 8793314 8374366 8055465
3134 8055465 8543535 8583768 8439341 8373502 8396083 8538118 8254971 8079641 8206696 8626831
3124H626831K39724J51409K9998m9962K17841j37414m4180M41323o4933L8913
3114I449550N71286r2285J27353Q1857J09785L35824P1091R0394K31709J19208
3104A1095772K60345M22178J64045M81888J18301L8326N06234N75789L46888L04511
3094A4314277O63682K20714K25964M56209O09082O33955P45153L75119O72075
3085A8916230P45816O22184N92921P87611P23731R37646J033470J106641J297982
3076B6764232J234469J425923J490084J308054J495219J788761J455006J933853
3068C8895601J616288J878449J959636J930781J462649J557961J509062J141147
3060E1951574J180546J451508J523473J899153K100376J797441K575099K607500
$$ plain form
3124 8626831 8866555 9017964 9047962 8998000 9215841 9078427 9034247 9475570 9410637 9449550
3114 9449550 10020836 9928551 10055904 10137761 10247546 10583370 10654461 10744855 10976564 11095772
3104 11095772 11356117 11778295 11942340 12424228 12542529 12580855 13087089 13662878 14009766 14314277
3094 14314277 14977959 15198673 15424637 15880846 16489928 17123883 17869036 18244155 18916230
3085 18916230 19662046 20284230 20877151 21664762 22388493 23326139 24359609 25466250 26764232
3076 26764232 27998701 29424624 30914708 32222762 33717981 35506742 36961748 38895601
3068 38895601 40511889 42390338 44349974 46280755 47743404 49301365 50810427 51951574
3060 51951574 53132120 54583628 56107101 58006254 60106630 61904071 64479170 67086670
3052F7086670K357171K870073L193235K989026L393582L541136L933833L240820
3044I2605546K560100J657126J455071J151816O75592Q97625J735837J561376
3036A04300089J939272K444403K858953L686150L984180M614844N335390N886738
3028A35050019O463122O985174P770270R470664J0688474J2109080J4119136J5298272
3020B17954211J5911310J7156232J7500544J7256781J5887937J2959085P800991
3013C22427091L197796p9381j528508j765243k223030m210086r921734j5075311
3005B90821594j6895921j5656268j3403795j0984839q772163p361313o604529
2998B11142766n802087n503441m921832l951476l437711k054990n82476L05094
$$ plain form
3052 67086670 69443841 72313914 75507149 78496175 81889757 85430893 89364726 92605546
3044 92605546 95165646 96822772 98277843 99429659 100105251 101002876 102738713 104300089
3036 104300089 106239361 108683764 111542717 115228867 119213047 123827891 129163281 135050019
3028 135050019 141513141 148498315 156268585 165739249 176427723 188536803 202655939 217954211
3020 217954211 233865521 251021753 268522297 285779078 301667015 314626100 322427091
3013 322427091 325624887 325545506 324016998 322251755 320028725 315818639 305896905 290821594
3005 290821594 273925673 258269405 244865610 233880771 225108608 217747295 211142766
2998 211142766 205340679 199837238 194915406 190963930 187526219 185471229 184888753 185193847
2990A85193847O02965J563172J610258K247655J850977J597545J757526J644550
2982A98068495J821384J808413K251064K733777K621185J918632R0595j582072
2974B09731473k489342l333103l996730n140188o009371p241062p464524q232882
2966A65824271p685696p119443o485159n663577n965605n674742n211163o183347
2958A15835539n980055n501149m837216m558321l997714l540700l509460k922899
2950H0988025k820267k396714k448508k489077j962683j546670j236780j459606
2942F4627720j632961j131505r23200p57745q07511q25852j252576n84313j361324
2933E5350733q88502q47044q21058j053235j338240j457267j574553j691080j950394
$$ plain form
2990 185193847 185796812 187359984 188970242 191217897 193068874 194666419 196423945 198068495
2982 198068495 199889879 201698292 203949356 206683133 209304318 211222950 211313545 209731473
2974 209731473 207242131 203909028 199912298 194772110 188762739 181521677 174057153 165824271
2966 165824271 158138575 151019132 144533973 138870396 132904791 127230049 122018886 115835539
2958 115835539 109855484 104354335 99517119 94958798 90961084 87420384 83910924 80988025
2950 80988025 78167758 75771044 73322536 70833459 68870776 67324106 66087326 64627720
2942 64627720 62994759 61863254 60940054 60182309 59374798 58548946 57296370 56712057 55350733
2933 55350733 54462231 53615187 52794129 51740894 50402654 48945387 47370834 45679754 43729360
2924D3729360j564882k048344j677317k087470j762046j498743j742111j419605
2916B9928842r39040j328499j486839r31228o77632o85123r28598j076746r75427
2907B0899710p22211p13048n17534m11039o79376m93558n11979m57873m03704
2898A5989388l16638l12175o89576o19397j17271m12709l44344k33627n05004
2889A2438647n05600k99461o94187j23481k90963k14749j60094l96525j06615
2880I646972n73719k91065k28867M781n00419k32237K23704j98497j27019l49551
2870G374083k69994p74k63473l19338l20083R9835l79951J23353o2136j22925
2860E858597j86045j80740k7079J1683n6655l14982j48394J46232m70917q8310
$$ plain form
2924 43729360 42164478 40116134 38438817 36351347 34589301 33090558 31348447 29928842
2916 29928842 28989802 27661303 26174464 25243236 24565604 23880481 22951883 21875137 20899710
2907 20899710 20177499 19464451 18946917 18535878 17856502 17362944 16850965 16393092 15989388
2898 15989388 15672750 15360575 14670999 14051602 13934331 13521622 13177278 12943651 12438647
2889 12438647 11933047 11633586 10939399 10815918 10524955 10310206 10150112 9753587 9646972
2880 9646972 9073253 8782188 8553321 8558102 8057683 7825446 8049150 7850653 7723634 7374083
2870 7374083 7104089 7103315 6839842 6520504 6200421 6300256 5920305 6043658 5981522 5858597
2860 5858597 5672552 5491812 5464733 5476416 5419761 5104779 4956385 5102617 4631700 4543390
2850D543390J79299l08866l69718L2908Q5013L1489n47774k70338J18044J30517
2840C623964J21018N2274M7714m02312k58723q5104L32491n9337J25720p2673
2830C425032j04803j46833l4220k28625p0467j5721J11457J29975o7265j24547
2820B873983Q2227l6120j84303k61365J65084L43295k29569j95770K0437J10259
2810B688158j52136l04565J65184J36553J35565r2219j33544k21892m56478j38635
2800A625991M82222P0746L340J64913j94309k01287l5759N0691M18797l08311
2790B077034l42962R5345K8729K76282J34950l0088j02824J69878J71937k16923
2780B261358q9963j60926K31800r3135M6507m10675p2971K63135J67403K9481
$$ plain form
2850 4543390 4722689 4413823 4044105 4077013 4162026 4193515 3645741 3375403 3493447 3623964
2840 3623964 3744982 3797256 3844970 3442658 3183935 3098831 3431322 3371985 3497705 3425032
2830 3425032 3320229 3173396 3139176 2910551 2840084 2824363 2935820 3065795 2998530 2873983
2820 2873983 2956210 2920090 2735787 2474422 2639506 2982801 2753232 2557462 2577899 2688158
2810 2688158 2536022 2231457 2396641 2533194 2668759 2576540 2442996 2221104 1764626 1625991
2800 1625991 2108213 2178959 2182299 2347212 2152903 1951616 1915857 1966548 2385345 2077034
2790 2077034 1734072 1829417 1858146 2134428 2269378 2239290 2136466 2306344 2478281 2261358
2780 2261358 2171395 2010469 2242269 2149134 2195641 1784966 1711995 1975130 2142533 2172014
2770B172014R4980j83587n02297R0092m5731J69931K74437l24520k50916K0984
2760A515387O4700L31976k84l95677j93307N70221j99276J19089J14608j83475
2750A743962K2582K25418N819j30985j19373J40853k24268o9272k7586n7890J12767
2739A622027J94902K32226j29230K4871j52749J80128L14399n2629K67763N8706
2729B560414K81778J93911k54193n07094M6849j92572K46843J55321j24376r1646
2719B315235k03549j30591o1182q8805q4982j3097O4266j59742j53084l3354J14530
2708A565645O4722N0436J93136l53408j72721K56738J84791j73458o5494K05458
2698A755845K24886j41990j36348j10712P1191K04312l60436J31856j6228p5362
$$ plain form
2770 2172014 2266994 2083407 1581110 1671202 1625471 1795402 2069839 1745319 1494403 1515387
2760 1515387 1580087 1912063 1911779 1516102 1322795 1893016 1693740 1812829 1927437 1743962
2750 1743962 1766544 1991962 1997781 1866796 1747423 1888276 1664008 1594736 1567150 1509260 1622027
2739 1622027 1816929 2049155 1919925 1944796 1792047 1972175 2286574 2233945 2501708 2560414
2729 2560414 2842192 3036103 2781910 2274816 2321665 2129093 2375936 2531257 2406881 2315235
2719 2315235 2111686 1981095 1919913 1831108 1746126 1733029 1797295 1637553 1484469 1451115 1565645
2708 1565645 1630367 1680803 1873939 1520531 1347810 1604548 1789339 1615881 1550387 1755845
2698 1755845 1980731 1838741 1702393 1591681 1662872 1867184 1506748 1638604 1622376 1547014
2688A547014j50430o9340j39015j0120J29361r476J19020l04152j09701K22310
2678A225471K35329m42119k14522j20689K27394J36407j75938q9513K27896R0613
2668A100329n03221k55085O24540M9467j88447K4581K61986k08798k86789k35984
2658C82579K65952J27966j39380J69905k11485M23188p1080j23678M3184j29904
2648G37247o7865n9422l38184J09220R3597j43341L39269k2551j28648m1187r1692
2637C86443O92K69183k78579j73223J92304K13981p0068J101J58342l31794m867
2626C63515Q3465M28086m09016m70677M99726J38847k88649n6335L7010m32196
2616a06224M67415J43070n83846J7177N49151n2207m9950k5811j15845o1191K45219
$$ plain form
2688 1547014 1396584 1327244 1188229 1178109 1307470 1297994 1417014 1112862 1003161 1225471
2678 1225471 1460800 1018681 804159 683470 910864 1047271 871333 781820 1009716 1100329
2668 1100329 597108 342023 966563 1016030 827583 852164 1114150 905352 618563 382579
2658 382579 648531 776497 637117 807022 595537 1018725 947645 823967 867151 737247
2648 737247 669382 609960 271776 380996 474593 331252 670521 647970 519322 478135 386443
2637 386443 387135 656318 377739 204516 396820 610801 540733 541834 700176 368382 363515
2626 363515 446980 875066 466050 -4627 495099 633946 345297 288962 325972 -106224
2616 -106224 361191 504261 -79585 -62408 486743 434536 384586 358775 242930 181739 426958
2605D26958J24362q20l2771r8745N3925M1330j84661j93001K52626J28126j05862
2594D11467p9166q7325n3664o6214J21588M9708R6442N337k83000o0687K53879
2583C08365r4727k10434K95301k04795q0408O6077L5203J0243l1556j15242j79235
2572b01208K96058L7710n276j76232P2202O3023j41390J02852O7720k2872P2994
2561A65581P1914j7208o5407K2987L17065k25030O0817J55404J70330J0319l6104
2550F30668j91788k01244k57003K3539K03426j01599k67481N9312L1023r8991
2540a70138O2879P485j3989k880k32748J03607R0612O867K63518K88534j24978
2529B78769k05929K45693j88103K4966j51779p4352K31056k7946j06516j20412
$$ plain form
2605 426958 551320 550500 517729 418984 472909 514239 329578 136577 389203 517329 411467
2594 411467 332301 244976 191312 125098 246686 296394 392836 398173 115173 54486 308365
2583 308365 213638 3204 298505 93710 13302 79379 114582 124825 93269 -21973 -201208
2572 -201208 94850 132560 127284 -48948 23254 86277 -55113 47739 115459 92587 165581
2561 165581 237495 220287 154880 177867 494932 269902 330719 486123 656453 666772 630668
2550 630668 438880 237636 -19367 4172 207598 105999 -161482 -102170 -71147 -170138
2540 -170138 -107259 -99774 -113763 -116643 -349391 -245784 -155172 -148305 115213 403747 278769
2529 278769 72840 318533 130430 155396 3617 -70735 160321 132375 25859 -94553
2519i4553l07557J23259K26795K33493K94106j19464p2768j79910K93933n25239
2509a27905q9026J7919J38558K3896O0230K7376M6858K47455k43980M3897M5380
2498A90658q7524l23950K26828K11329M3869l4997l7873k62015k67360K43247
2488i7788q7316j62712O00257l6805j30486J23563j63234j54051k27319K89060
2478d6831J40182j71937J35431K8884N9845m2466j70476J0639K14440N542Q1069
2467B44322j46593L3436j98209K81610J90633j97078j09725k10911K57588j8917
2457A26156k49324J98023L50275J59886J5407l13354L49614k89166q5048Q7316
2447C49785k05398l1163L8476M5665o9090j673J44022K07595J76695l51126l5089
$$ plain form
2519 -94553 -402110 -278851 -52056 181437 475543 356079 283311 103401 397334 -127905
2509 -127905 -216931 -199012 -60454 -36558 23672 51048 97906 345361 101381 145278 190658
2498 190658 103134 -220816 6012 217341 261210 226213 188340 -73675 -341035 -97788
2488 -97788 -185104 -347816 252441 215636 85150 208713 45479 -108572 -335891 -46831
2478 -46831 93351 -78586 56845 85729 145574 103108 -67368 -56729 157711 163253 244322
2467 244322 97729 131165 -67044 214566 405199 208121 98396 -112515 145073 126156
2457 126156 -123168 74855 425130 585016 600423 287069 636683 347517 262469 349785
2447 349785 144387 113224 151700 197365 128275 126602 270624 478219 654914 303788 268699
2436B68699O2106k64023k6487L28532K1040j95830K20292n38289P2033K89242
2426B37315R3312k02753p4704J91342K21393n85894J59579L67059l88355K02625
2416B20919L00040j5451j97073j52153P536R103O6795R8947L61305j54108l19304
2405B26556J09938l12962K30802o2205j87409n7372P0523J45924j2465N4360j55865
2394D9825j95826j02771L25577j10726r1840N2447k20966J98528J82352L46334
2384D32934k12067l11448j71350Q7577J54679l3852J74830R1455K9170m5660j69798
2373B6470R4468Q7584p872L40598p2626k07471k7325J70698K0862K0575N4898
2362E00859l04382M113M4211l90728K74578k2260l61307J90854P6088K45937j38209
$$ plain form
2436 268699 330805 66782 40295 368827 389867 194037 414329 -123960 -51927 237315
2426 237315 330627 127874 53170 244512 465905 -119989 39590 406649 18294 220919
2416 220919 520959 505508 308435 156282 163818 172921 239716 338663 699968 545860 226556
2405 226556 336494 23532 254334 192129 4720 -52652 17871 163795 151330 205690 49825
2394 49825 -146001 -248772 76805 -33921 -125761 -73314 -294280 -95752 86600 432934
2384 432934 220867 -90581 -261931 -174354 -19675 -53527 121303 212758 241928 196268 26470
2373 26470 120938 208522 200650 541248 468622 261151 233826 404524 425386 445961 500859
2362 500859 196477 200590 244801 -145927 128651 106391 -254916 -64062 12026 257963 119754
2351A19754L06475R2373j71834J73438k44528j61781j92439P7571j9798J50864
2341A30095l4134N8252P2757L81578j99186o1212J8190l7136Q8329j51852K90270
2330E55951J68445j47806l79145j57895K56307j21683M2268l5815j31259j64540
2320a15172J59045J52808o4728j87850M17831K12847l49109M2061j2909Q9175
2310C43999k09976P3753O0984P5981r9412J012K5152M1213J47496J31433j88269
2299D03366K5345j01125O7104k7376K14939k53278l7686P5069j1824m0681j24461
2288A89392K53454R5252o6310K45833l20508j37109K1982L23156N7819k99001
2278C63960P6767Q6374j44072o0299J62639J41396K04304K45546j25420K23757
$$ plain form
2351 119754 426229 518602 346768 520206 275678 113897 -78542 -971 -20769 130095
2341 130095 95961 154213 226970 608548 409362 348150 366340 329204 417533 265681 555951
2330 555951 724396 576590 197445 39550 295857 174174 216442 180627 49368 -115172
2320 -115172 43873 196681 131953 -55897 361934 574781 225672 267733 254824 343999
2310 343999 134023 207776 268760 344741 245329 246341 271493 312706 460202 591635 403366
2299 403366 428711 327586 394690 367314 582253 328975 291289 366358 354534 313853 189392
2288 189392 442846 538098 471788 717621 397113 260004 281986 605142 662961 363960
2278 363960 440727 527101 383029 322730 485369 626765 831069 1076615 951195 1174952
2268A174952K335j98548M9124n4157j53816M6404m6813k02488K1566L99179J44709
2257A182447k56459J53085J74778K16116O6986j82774P361L7351k42462n2740
2247A103689K97284L11669q1351m7865m330r4269J4812K22438M72358l7617k4603
2236B132215L39252J04376n7136M81564L66701p3863q430M74961N07012k93190
2226C973462M14942K3522L55036K18684j54687P3214N32058M97999j17763k69326
2216E547141K81273L63970K20630m3273K83972L67220M12214M93723L84512N12632
2206H824014P06464M08551J4508P5526k28820r7917k6084k13399N68539K30005
2196A0261387K520n164M32570N16894K10919N82209O17144L97601O97081M19533
$$ plain form
2268 1174952 1177287 978739 1027863 973706 819890 866294 819481 616993 638559 1037738 1182447
2257 1182447 925988 1079073 1253851 1469967 1536953 1354179 1361540 1398891 1156429 1103689
2247 1103689 1400973 1712642 1631291 1583426 1579096 1484827 1499639 1722077 2194435 2156818 2132215
2236 2132215 2471467 2575843 2518707 3000271 3366972 3293109 3284679 3759640 4266652 3973462
2226 3973462 4388404 4411926 4766962 4985646 4830959 4904173 5436231 5934230 5816467 5547141
2216 5547141 5828414 6192384 6413014 6369741 6653713 7020933 7433147 7926870 8311382 8824014
2206 8824014 9530478 9939029 9953537 10029063 9800243 9702326 9676242 9462843 10031382 10261387
2196 10261387 10263907 10258743 10691313 11208207 11419126 12001335 12618479 13016080 13713161 14132694
2186A4132694R55376P93531R20313J649639J946168K066740K143243K175810J885122
2177B8668636K712684L047670J620021K18362m72056j193566r98547L03913P92100
2168C4699217O67040k191739m259173k751211j908586j353770j107127p49357
2160B1045294p65996m73122p95105m65959o65633q01125l46989J81123o1494k64845
2150A6586149j7705K85132K11766N32847L94119j20929J95702K58412J73574K15575
2140A8714642J02022j76118L40084P62409M91397p86608q72834n80879l55846
2131A7638269r17312j751558j590874j335249r69134n11448r60554m18060k76004
2122H908076o19227l28499l53702o63203l91087l36303k73318l23513m36857o5854
$$ plain form
2186 14132694 15088070 15881601 16801914 18451553 20397721 22464461 24607704 26783514 28668636
2177 28668636 31381320 34428990 36049011 36267373 35795317 34601751 33603204 33907117 34699217
2168 34699217 35366257 33174518 28915345 26164134 24255548 22901778 21794651 21045294
2160 21045294 20279298 19806176 19011071 18545112 17879479 17078354 16731365 16912488 16850994 16586149
2150 16586149 16568444 16853576 17065342 17598189 17992308 17871379 18067081 18325493 18499067 18714642
2140 18714642 18816664 18640546 18980630 19743039 20234436 19447828 18574994 17994115 17638269
2131 17638269 16720957 14969399 13378525 12043276 11074142 10562694 9602140 9184080 8908076
2122 8908076 8288849 7960350 7606648 6943445 6552358 6216055 5942737 5619224 5182367 5116513
2112E116513k63605j1156m95754j37064l80221k14998O9506j20683J474k75119
2102C288893j84723Q501l58279p8802n5304k24955j64668K90027j65610j77221
2092B177859l52164K17489n2087k28427J69126n9715l56351K10794j14955J12009
2082A723578n8548m05983l06978Q4496L84818o4261j01259k81214J72019j21667
2072A025001k32149J97948j90628L263K26945N7317k03290k4780k23942j81555
2062D54130K2666j48033L53335j72521k02606K13639p9765L84844R039o4863N9516
2051H29381m1719L03465l32407j18013Q8335k12397k35325M4827j47727J10942
2041B89362j66332j06900j67645R9689R8314N8341J77462P6113j41129L2951L1483
$$ plain form
2112 5116513 4852908 4841752 4345998 4208934 3828713 3613715 3683221 3562538 3564012 3288893
2102 3288893 3104170 3112671 2754392 2675590 2620286 2395331 2230663 2520690 2355080 2177859
2092 2177859 1825695 2043184 1991097 1762670 1931796 1872081 1515730 1726524 1611569 1723578
2082 1723578 1665030 1259047 952069 1036565 1421383 1357122 1255863 974649 1146668 1025001
2072 1025001 792852 990800 800172 803435 1030380 1087697 884407 859627 635685 454130
2062 454130 476796 328763 682098 509577 306971 520610 440845 825689 834728 769865 829381
2051 829381 787662 1091127 758720 640707 729042 516645 281320 326147 178420 289362
2041 289362 123030 16130 -151515 -51826 46488 104829 282291 358404 217275 250226 281709
2030B81709K68493j87975j83289o1330Q2952l6271M5350k66026K16945J22026
2020B82584j48514k89973J46690L04218k98399K80340m2855p4612K23117k30534
2010A52062J9034J75389j45149n1740j23523L9384K04456n2040k18093K32338
2000B32118j32839k07730J2073K29181o5247O7438M97648j27918n16068J06375
1990I5031j91369n8004N8325o905J92310k16964r246k873N7338j17213M1369M51474
1978B93273n7819l23788K7988j44982K24166j06911p513J38303j30360j19966
1968b07609L92041k36098J47824L08188q7136l4708k45297K14764j12767J81487
1958C20689j43352k04658R588J12841K32496L53377k53631p1268n3699J88813
$$ plain form
2030 281709 550202 362227 178938 117608 200560 164289 209639 -56387 160558 282584
2020 282584 134070 -155903 -9213 295005 -3394 276946 234091 159479 382596 152062
2010 152062 171096 346485 201336 149596 26073 65457 269913 217873 -220 232118
2000 232118 99279 -108451 -96378 132803 67556 134994 632642 504724 -11344 95031
1990 95031 -96338 -154342 -96017 -102922 89388 -127576 -136822 -139695 -82357 -199570 -158201 293273
1978 293273 235454 -88334 -60346 -205328 18838 -88073 -95586 42717 -87643 -207609
1968 -207609 184432 -51666 96158 404346 317210 282502 37205 251969 139202 320689
1958 320689 177337 -27321 -17733 95108 327604 680981 427350 356082 302383 491196
1948D91196R5739j61947K92409o34470j34638M12100K62162l67677l76305k784
1938a24215l05591J47078M20100K63050k31286n6063R3202R2656r6021k1541k49911
1927f8542j11098J94213R194j49979j3238J03398J88228j65468j74576L2797j35229
1916b90300J61353N2306K7782j06266J61745l4674j07203O5781K2096j41336o301
1905a95017O0658K61123K14373l01893j11233r2596L72288K24876k89752j03433
1895C9394N9433K73542j82697r3316Q9404m0961J20826l88087j18356K08841J24194
1884I2217j07737k01034j83119L22954M657J5420l08143p070L32044K20357m10
1873A80136k0224N382L6034n8750k07236J41677J74935j31928l73888p9349J48623
$$ plain form
1948 491196 586935 424988 717397 82927 -51711 360389 622551 254874 -121431 -124215
1938 -124215 -429806 -282728 137372 400422 169136 113073 206275 298931 202910 181369 -68542
1927 -68542 -179640 14573 23767 -126212 -139450 -36052 152176 -13292 -187868 -155071 -290300
1916 -290300 -128947 -76641 -48859 -155125 6620 -28054 -135257 -69476 -47380 -188716 -195017
1905 -195017 -134359 126764 341137 39244 -71989 -164585 207703 432579 142827 39394
1895 39394 98827 372369 189672 96356 185760 144799 265625 -122462 -240818 -31977 92217
1884 92217 -15520 -216554 -399673 -76719 -72062 -56642 -364785 -371855 -39811 180546 180136
1873 180136 159912 165294 201328 142578 -64658 77019 251954 120026 -253862 -333211 -184588
1862a84588k57217J48201L54260n0357N3652L53184j86057m45605O5869O3600
1852h5058j93266n3359N47116j78433k71311q4762m8016P3240J27646J37433K46298
1841B17528m47548n2002J26302j61050K77985j911P3486l15387r131K14769k2675
1830i9634M5848J09782M24128j03880j75884P5601o7409m14976K1262K07999j0523
1819A2314P4045j23705k5200j48487O39883k8678l14411k03734j9208j13945J23797
1808a27329L22553K1927l21497p0391J66026j63941J58792Q221j8532N078j44694
1797a63787J94731K15460j79583j69300K22059K1586o88792M20560j35912M18524
1787A55546j8063N2703k44679j29175L00454p1893k5432k48707J67271K86960
$$ plain form
1862 -184588 -441805 -293604 60656 10299 63951 417135 231078 -214527 -148658 -85058
1852 -85058 -278324 -331683 215433 37000 -234311 -319073 -367089 -293849 -166203 -28770 217528
1841 217528 -230020 -282022 -155720 -316770 -38785 -40696 32790 -282597 -291728 -76959 -99634
1830 -99634 -53786 55996 480124 376244 200360 275961 208552 -206424 -185162 22837 12314
1819 12314 86359 -37346 -62546 -211033 428850 400172 85761 -117973 -137181 -251126 -127329
1808 -127329 195224 217151 -104346 -174737 -8711 -172652 -13860 -5639 -24171 -19093 -163787
1797 -163787 30944 246404 66821 -102479 119580 141166 -547626 -127066 -262978 155546
1787 155546 137483 190186 -54493 -183668 116786 44893 19461 -229246 -61975 224985
1777B24985n4247l84002L10321q2801k58833J40933j26318j30936m886J16543
1767b49241J2385J19199O9961O0294j20116N2931K24108M6169o5941l01630k40979
1756c92860J78102K17765j82572k1230Q8219j89248P0584K22954K60563k01290
1746E0987J264j99899j3520R8564k29318q7089L21312M0294K46391J00395k55262
1735G4119Q6045k76495K2652J23613k33760K3719J21817J4037m0288R2994Q4306
1724I2759k03973R5854p5166J25351L62564M2780o203l35721M9969k54087o1521
1713a67394J52276L0581N8289q6266l7021m12682K21149m7122j16600M9689L80576
1702B5475j16446p324R1600j21140M4360M1202p4478j28436p2165L78405o6432
$$ plain form
1777 224985 170738 -213264 97057 14256 -244577 -103644 -229962 -360898 -365784 -249241
1767 -249241 -236856 -117657 -47696 12598 -107518 -54587 169521 215690 149749 -151881 -392860
1756 -392860 -214758 3007 -179565 -200795 -112576 -301824 -231240 -8286 252277 50987
1746 50987 52251 -147648 -161168 -62604 -291922 -379011 -57699 -17405 228986 329381 74119
1735 74119 160164 -116331 -93679 29934 -203826 -180107 -58290 -44253 -84541 8453 92759
1724 92759 -111214 -15360 -90526 34825 397389 440169 433966 98245 148214 -105873 -167394
1713 -167394 -15118 15463 73752 -12514 -49535 -462217 -241068 -288190 -404790 -355101 25475
1702 25475 -90971 -98295 -6695 -127835 -83475 -42273 -116751 -245187 -317352 61053 -5379
1691e379K8700K0795j26672N7508k65554k70280J56056J29307L32354j36046j19788
1680a98999J26082N8880l7371L82107r0512l38090j04174K60402p4707o5177n7145
1669a38704O5193N0047o774J28292L6852m40217j04579K14768L3881j77160J27880
1658b10521J00986k1708K49999k06243n610q9450r116K13539K7352M1319n05571
1647d15024l8827N05553k14389k260K75314M1916q8143l85588L04207L07795N779
1636B96333k52968l99369L95983J27748j64237k69981N1014q7394j08997J47716
1626b64152l3750p1981M36992J34746K3197l26403m3737K81597J72980k33067
1616G6422p39j68712j97197k2099M94570j47068j50442q6277j04834N766K50043
$$ plain form
1691 -5379 23321 44116 -82556 -25048 -290602 -560882 -404826 -275519 56835 -79211 -198999
1680 -198999 -72917 -14037 -51408 330699 240187 -97903 -202077 58325 -16382 -81559 -138704
1669 -138704 -73511 -23464 -30238 98054 134906 -305311 -409890 -195122 -161241 -338401 -210521
1658 -210521 -109535 -131243 118756 -87487 -93097 -182547 -191663 21876 49228 90547 -415024
1647 -415024 -453851 51702 -162687 -164947 110367 152283 64140 -321448 -17241 290554 296333
1636 296333 43365 -356004 39979 167727 3490 -266491 -215477 -302871 -411868 -264152
1626 -264152 -297902 -369883 67109 201855 225052 -101351 -145088 136509 309489 76422
1616 76422 75683 -93029 -290226 -312325 182245 35177 -115265 -201542 -306376 -300610 -50567
1605e0567j12155q9584K45169K42670m47839K51158L24160k81828q8310J1563
1595D437L3470j11467J62588j87983P3559l2355J13655n209K1537p1102j21602
1584a20472M23432k35696l02178o5305O6526O3992j27139M24516j26677j00520
1574i9521p9632q2034J43422k10368L30965j23220K01842K2745k85809J84460
1564B850k8207k07702j30196J97971j67714j49758N21035L7469k06845N0960k37729
1553c17866J22655J33217q910Q8322J09296k4855J6822J02620J20105j26005J59548
1542C74949l87762l57561L60365l35116K69114K03127j52367k00402J00749k21180
1532c46084R2802M39574m2216m07592k54628N60903Q3540k87876k91658L28636
$$ plain form
1605 -50567 -162722 -252306 -7137 235533 -212306 38852 363012 81184 -7126 4437
1595 4437 37907 -73560 89028 -98955 -25396 -57751 55904 50695 72232 1130 -120472
1584 -120472 302960 67264 -234914 -300219 -233693 -169701 -296840 127676 999 -99521
1574 -99521 -179153 -261187 -117765 -328133 2832 -120388 81454 104199 -181610 2850
1564 2850 -25357 -233059 -363255 -165284 -332998 -482756 38279 75748 -131097 -80137 -317866
1553 -317866 -195211 -61994 -70904 17418 126714 101859 118681 221301 341406 215401 374949
1542 374949 -12813 -370374 -10009 -345125 -76011 127116 -25251 -225653 -124904 -346084
1532 -346084 -253282 186292 144076 -263516 -518144 42759 126299 -161577 -453235 -124599
1522a24599J00633K48251l39081J78398j08670l57071K93007m1882K99585K3618
1512A72189k13772P3685k0259l039o3274N2829K7629J38061K81405k59041m89927
1501c03514o7415j17373Q9553J25210L8248p1372K65435J10264J27304j42593
1491E3747q4927J90810j40940j01471j75688P0535J7359o6903L03573m20541j36398
1480d90844Q3362j39036J58898K69678J9728n64669K11137K24953K36761J81118
1470A91086m2788l00485J85545L38748o8600r8843M513p1655p9571J2110q4846
1459a4786O451k39585N8385j36893K10501l02370j71389K55492R0934j88231o4083
1448d95574L41977J71688j53037l97014J51196K22319j27454l849L6492k46289
$$ plain form
1522 -124599 -23966 224285 -114796 63602 -45068 -402139 -109132 -151014 148571 172189
1512 172189 -41583 32102 11843 8804 -54470 -1641 25988 164049 445454 186413 -303514
1501 -303514 -370929 -488302 -398749 -273539 -235291 -306663 -41228 69036 196340 53747
1491 53747 -31180 159630 18690 -82781 -258469 -187934 -170575 -237478 66095 -354446 -490844
1480 -490844 -407482 -546518 -387620 -117942 -98214 -662883 -451746 -226793 9968 191086
1470 191086 148298 -152187 33358 372106 303506 204663 209176 137521 57950 70060 -14786
1459 -14786 -8335 -247920 -189535 -326428 -115927 -418297 -589686 -334194 -243260 -431491 -495574
1448 -495574 -153597 18091 -134946 -531960 -380764 -158445 -285899 -289748 -253256 -499545
1438d99545K86730R1394l5241J88423j20796j10066K07417L15495l73651p9514
1428a29354L71591j27755J10167p3411J36348n0475n9875k84750q7203m4804J97408
1417d2113M5249j89462K4390M2165R0915j42788L24153p4651j24027Q1885J36771
1406A72487J19776j82781J68158k83410K8488J68023j94606p9925Q7090k10954
1396b07654r0780J4134M1906P6606N6441O8425K06435q9273k48776r8586L83829
1385A12707p9845K5877k43638o6558L6356m6361K61960k41964j52413J00526L47852
1374E4499j98798m715j01245K29963m6947R7263K56007J83273l80613k76453N2446
1363a35320K12367l8586j95306K73786j14270K34137j02749j29597K30154k09088
$$ plain form
1438 -499545 -212815 -121421 -156662 31761 -89035 -199101 8316 323811 -49840 -129354
1428 -129354 242237 114482 224649 151238 287586 237111 177236 -107514 -194717 -239521 -42113
1417 -42113 3136 -186326 -161936 -119771 -28856 -171644 152509 77858 -46169 35716 172487
1406 172487 292263 109482 277640 -5770 22718 190741 -3865 -83790 3300 -207654
1396 -207654 -298434 -284300 -242394 -165788 -109347 -40922 165513 76240 -172536 -271122 112707
1385 112707 32862 58739 -184899 -251457 -215101 -261462 498 -241466 -393879 -293353 54499
1374 54499 -144299 -149014 -250259 -20296 -67243 30020 286027 469300 88687 -187766 -135320
1363 -135320 77047 38461 -156845 116941 2671 236808 134059 4462 234616 25528
1353B5528J04311m24478j4453J24719J77214J15266n6375k54109j24904K2080
1343c05201J73824R9126k2579N102K55930K69743j39912q0962l3454j32008o8659
1332B0950L13352N5951k65045j37092r9476k52849L85324l2725K78958J06845
1322C74193O4785o4553j93463j07899q5721k12855L81264j77379j78843N95j57012
1311c56888P5614J48382K32145J05032J09473j62706n02305Q3665J95621j37389
1301b09356M6132P665K97734j97247j55450N301k9004q2974M01788n3260j86414
1290a55085L54677j61269O4402o4591j75729J39827L15867O0255J0471k77351
1280A11474j96754j08038k03011K65090K05522m5290j46066m40116J64379M75865
$$ plain form
1353 25528 129839 -294639 -309092 -184373 -7159 108107 51732 -202377 -327281 -305201
1343 -305201 -131377 -32251 -54830 -49728 206202 475945 336033 255071 221617 89609 20950
1332 20950 334302 390253 125208 -11884 -111360 -364209 21115 -11610 267348 374193
1322 374193 438978 374425 180962 73063 -12658 -225513 155751 -21628 -200471 -199876 -356888
1311 -356888 -281274 -132892 99253 204285 313758 151052 -351253 -267588 -71967 -209356
1301 -209356 -163224 -155559 142175 -55072 -210522 -205221 -234225 -317199 84589 31329 -155085
1290 -155085 199592 38323 102725 38134 -137595 2232 318099 378354 388825 111474
1280 111474 -85280 -193318 -396329 -131239 74283 28993 -117073 -557189 -392810 83055
1270H3055J76049l0858k19894L62744j53323k63040P4159r9083j4777J45392m50601
1259c90177K06349L82112Q6592R8685l49364J63060j85345k75241L26947r4492
1249c0874J43811J79285M6665j72817m7685m49263k04854K93471R6801m6568K40264
1238D8236j21172J36152K5495p0894p7513J7276j97470K27116J94497P9401k7330
1227B33794l19630l6033q850J58854j18310L7290L32565j7328p5518j38200K50591
1216B99225Q2594j24997k57845K32889M9422l72374k48529j9857J11580k9055
1206b76947j07851Q7457j1731N5944M11291j68178O0739j73505K99723p6700k70788
1195a70546J14772K47567j81183M767j16498K50476l8972j71550J38097j09075
$$ plain form
1270 83055 259104 228246 8352 371096 217773 -45267 28892 -70191 -84968 60424 -390177
1259 -390177 -183828 198284 284876 383561 34197 197257 11912 -263329 63618 -30874
1249 -30874 112937 292222 338887 166070 118385 -330878 -535732 -242261 -145460 -192028 48236
1238 48236 -72936 63216 88711 17817 -59696 -42420 -239890 -12774 181723 261124 233794
1227 233794 -85836 -121869 -130719 28135 -90175 -52885 279680 262352 186834 48634 299225
1216 299225 381819 256822 -1023 231866 281288 -91086 -339615 -359472 -247892 -276947
1206 -276947 -384798 -297341 -309072 -253128 158163 -10015 50724 -122781 176942 100242 -170546
1195 -170546 -55774 191793 10610 15377 -101121 149355 110383 -61167 76930 -32145
1185c2145k19526M52224p8808k35743K59919P0840m86431l6120M04279K9390q4061
1174D3818J06369p1178N393R8761J8874J9426m4151q9833L34231O5786k68427
1163B19069l49300k02386j12129J61077p5359K23883l7345l3410K84722j1228
1153F7594Q2824K7376O5230R948r5293J5278j58949k38291L9894j60081K43557
1142a00913L63243k09036l48783j13578L76742J19743j77193N57286J51211k63291
1132C55431k76100m0446K27726l64613l22666K30796J38323J50237j06141K5405
1122A7952l08570l21759J48032M53371l5057l3636J36241j53181Q0495K89487
1112B73375j69531k7215J61835l2362k25903j35473J68090K47133k25113k3650
$$ plain form
1185 -32145 -251671 200553 121745 -113998 145921 216761 -269670 -305790 98489 127879 43818
1174 43818 150187 79009 84402 183163 202037 221463 177312 87479 421710 487496 219069
1163 219069 -130231 -332617 -444746 -283669 -359028 -135145 -172490 -205900 78822 67594
1153 67594 150418 177794 243024 252972 157679 172957 14008 -224283 -184389 -344470 -100913
1142 -100913 262330 53294 -295489 -409067 -32325 87418 -89775 467511 618722 355431
1132 355431 79331 38885 266611 -98002 -420668 -189872 -51549 98688 -7453 17952
1122 17952 -290618 -612377 -464345 -10974 -46031 -79667 56574 -96607 -16112 273375
1112 273375 103844 76629 238464 206102 -19801 -155274 12816 259949 34836 11186
1102A1186k03659J7816K71458j36370l1174O8984k41079k77056L38648K63591
1092H2345L8283K64477j58053j19017L8578j32537r9421J15401q6589o3163K05877
1081H6181k37312O8307P8263j80685K95822N7943K3250j71609k99100J65521J55817
1070D2398J86981L4126k97108k7845J9379k20799j50510L7020J06870M4695r003
1059b33796K70350r5154j8954m0999J09127Q7601j86421j5174K1268j6190J58670
1048D0328K59271k5427j11989p1159K26585n6931l05712o9189n8849L17425l1186
1037A13167o0862K17502l38029r3532K30392r5005j92806R5309Q6760J15692j6084
1026F2504Q5462k88958j59300J6858J14518l9207M60333L43659l57788k07387
$$ plain form
1102 11186 -192473 -174657 96801 -39569 -70743 -1759 -242838 -519894 -181246 82345
1092 82345 120628 385105 227052 108035 146613 14076 -85345 30056 -56533 -119696 86181
1081 86181 -151131 -82824 -4561 -185246 110576 168519 191769 20160 -278940 -113419 42398
1070 42398 229379 263505 -33603 -61448 -42069 -262868 -413378 -376358 -269488 -224793 -233796
1059 -233796 36554 -58600 -77554 -118553 -9426 78175 -108246 -123420 -102152 -118342 40328
1048 40328 299599 274172 162183 91024 317609 260678 -45034 -114223 -173072 144353 113167
1037 113167 52305 269807 -68222 -161754 68638 -26367 -219173 -123864 -37104 78588 62504
1026 62504 147966 -140992 -300292 -283434 -168916 -208123 252210 595869 238081 30694
1016C0694J24231o3611o7380P8609j8795k62090J90281j17682J1367J74486M0566
1005A20676p9721k94020J1342p4909K02654L53895q8486k66515p0939K44847J28364
994A87188Q3913q5584J0126K516l88569J00820R7955p7673L3594K66327m97051
983b66438j24566L66779L28657N3816j3601l28526j96763L67526j48482L5816
973G4218R6220k38556k57018J04375L08961J6343o0682k66656k49468J96784k23449
962d98928j45116J43371J96457M5108j1806L36882J37528Q0756j01699Q9646m5782
951B26417j44453N4431j21759k72589j30729Q5986j51349K82988J60985K59398
941B49326k77081p7846Q1265k06291j25632K02937J20224k95038j11318L12460
$$ plain form
1016 30694 154925 91314 23934 102543 83748 -178342 11939 -105743 -94376 80110 120676
1005 120676 40955 -253065 -241723 -316632 -113978 239917 151431 -115084 -186023 58824 187188
994 187188 271101 185517 195643 198159 -190410 -89590 8365 -69308 -35714 230613 -266438
983 -266438 -391004 -24225 304432 358248 344647 16121 -180642 186884 38402 74218
973 74218 170438 -68118 -325136 -220761 88200 104543 43861 -222795 -472263 -275479 -498928
962 -498928 -644044 -500673 -304216 -259108 -270914 65968 203496 284252 182553 272199 226417
951 226417 81964 136395 14636 -257953 -388682 -302696 -454045 -171057 -10072 249326
941 249326 -27755 -105601 -24336 -230627 -356259 -153322 -33098 -328136 -439454 -126994
931a26994K7174n8457r2073j33563N15274j0029K21781j53942L0688O7009p5135
920B11733P0624K17652j48785p8575J15898j77714m8320N673k9708j34408j20715
909a16645q0609K33956j9431k21797L548m347j17928L39758j84384O893L05707
898A44721k60419J79046L0792k80543p4162J65539r5328l99309j2670L26360L30771
887E4798k30994J84522O8958k6037J27096j86244o2740o8561M82071n9647k39875
876D3347q2992K04171l2110K9787K57786j44256l96145K62863N1724k13931K91215
865B71459j51915m9036k53834l0430J35655k9203K77381k8237L1318L6623j64758
854D5023K3146l23933L43971k856j53044j70658L81428K30620m59356J5470J26217
$$ plain form
931 -126994 -99820 -158277 -250350 -383913 131361 121332 343113 189171 219859 286868 211733
920 211733 282357 500009 351224 272649 388547 210833 162513 168186 138478 4070 -116645
909 -116645 -197254 36702 17271 -204526 -200978 -205325 -323253 16505 -167879 -160986 144721
898 144721 -115698 63348 94140 -186403 -260565 -95026 -190354 -589663 -602333 -275973 54798
887 54798 -176196 8326 77284 51247 178343 -7901 -70641 -139202 342869 283222 43347
876 43347 -39645 164526 132416 162203 419989 275733 -120412 142451 194175 -19756 271459
865 271459 119544 70508 -183326 -213756 -78101 -107304 170077 141840 173158 209781 45023
854 45023 68169 -255764 88207 85351 -67693 -238351 143077 373697 -85659 -70189 56028
843E6028L25525M1533m2522m7401L12612r8348k80226k88204k56064P5638J18332
832h3097j82971n0019k42353J45451K54288K19575J2386q2586j83163k58687J54712
821b96464Q3186m2932N5117j56427K87688J66874j77720j60288K34097J42156
811A35287J07528l831m22675m57567J73522K73787J63840L15958l00069p1101
801h5321j3175K74845m9759J31747j15310k38185k48102j25255J43856L62131
791C7472l8603O8379N0509J61624k6990l41124J00621j43519j43144J39722k55641
780c90694L30016L03719Q648j96073j48799k29651K86313K19064o746j44251j25317
769i3771P8084P8852J50671m79956Q1836M35968r4346l30835j51494L30390Q5439
$$ plain form
843 56028 381553 423086 380564 333163 645775 547427 267201 -21003 -277067 -201429 -83097
832 -83097 -266068 -316087 -558440 -412989 -158701 60874 73260 -9326 -192489 -451176 -296464
821 -296464 -213278 -256210 -201093 -357520 -69832 97042 -80678 -240966 -6869 135287
811 135287 242815 238984 -183691 -641258 -467736 -193949 -30109 285849 -14220 -85321
801 -85321 -98496 176349 126590 258337 143027 -95158 -343260 -468515 -324659 37472
791 37472 -1131 67248 117757 279381 252391 -88733 11888 -131631 -274775 -135053 -390694
780 -390694 -60678 243041 251689 55616 -93183 -322834 -36521 182543 175797 31546 -93771
769 -93771 -15687 63165 213836 -266120 -184284 251684 157338 -173497 -324991 5399 90838
758I0838k84029Q728J51330r7939P3018P5143J11369k92015j73653L32964J21076
747A16830J06171k02205k53438P7109L03270O8218O1061p5715j51735M701O1340
736A15607l34120J60089j53868K62110r9887J4987J10515J01729O3580R910J95192
725D45844k29365k35520k92701K38857K11256J74222J19827k2127l6895l57971
715A5427p5652j76825R1480Q0789j56565m3283J06356k7711N4148N9204K36825
704A64193J9126m7142j57833K4718j21871J25535P4439P6311k7719k37115O9742
693c7616P6169K04529L4149P750k02890j9463J90143L9573k70609K07368l83903
682a54800p8005J05627K20600J0311o6017R9024P457o4262J5277j03187j84503
$$ plain form
758 90838 -193191 -184463 -33133 -131072 -58054 17089 128458 -163557 -337210 -4246 116830
747 116830 223001 20796 -232642 -155533 147737 215955 277016 201301 49566 54267 115607
736 115607 -218513 -58424 -212292 49818 -50069 -35082 75433 177162 240742 250652 445844
725 445844 216479 -19041 -311742 -72885 138371 312593 432420 410293 373398 15427
715 15427 -60225 -237050 -145570 -64781 -221346 -264629 -158273 -185984 -131836 -72632 164193
704 164193 183319 136177 -21656 3062 -118809 6726 81165 157476 129757 -107358 -37616
693 -37616 38553 243082 277231 284981 82091 62628 252771 292344 21735 229103 -154800
682 -154800 -232805 -127178 93422 103733 37716 136740 144197 79935 95212 -7975 -192478
671a92478R5575K26811r786r0440j0357Q7191k46192k5149K07543r1463k82230
660c30975j03516L86538L94362k89165m41897M5152J179J70834K08942R6338m5746
649I2046j72888k47036j83260L43153J51514J40135L06452J75804Q6271j17363
639E74828k86500l01034k41751L08068M4844p8121j09759K95685k17412j87324
629a98476J19514J614j45949j77577J77886K81952K43242k68642M9949l53411
619b69898K06432J9665j11934P5955m1282k16607J32212K79903k50475L71371
609A95342Q2342k29576J94251O8463K70688k16552k57852j68469L57921K6964
599C23522j69712O6903K1732k56307J87704m40840j66536K33852J00703J13614
$$ plain form
671 -192478 -96903 129908 120122 29682 19325 106516 -139676 -164825 42718 -48745 -330975
660 -330975 -434491 -47953 346409 57244 -384653 -339501 -338322 -167488 41454 137792 92046
649 92046 -80842 -327878 -511138 -167985 -16471 123664 430116 605920 692191 574828
639 574828 288328 -12706 -254457 53611 98455 20334 -89425 206260 -11152 -198476
629 -198476 -78962 -77348 -223297 -400874 -222988 58964 302206 33564 83513 -269898
619 -269898 -63466 -43801 -155735 -79780 -121062 -337669 -205457 74446 -176029 195342
609 195342 277684 48108 242359 310822 581510 364958 107106 -61363 296558 323522
599 323522 153810 220713 242445 -13862 173842 -266998 -433534 -199682 -98979 14635
589A4635K62612j68415o866k0004l32722K331L16099L86102j31779N6264k89262
578H8995M9111j27982K58571j27125k825k26516p5024j61962L22221K98346m03386
567a07576L50911j70827l02849L42742R5664j48787O4920j35998K36961J39092
557C64253m17589j6810p6283O5557L12455J8882k19458K33498l6702k9881K16625
546D14547j67380j93931k1976K13830k1356l33557J5262J65758k95664J35397
536h9070O8800J25483l4623L6567l7227J10927j45544l05348r6948K99484L79061
525C11562l29644j07404J09027J2047O3972K18964n80003j53500L34697K04223
515H3941k53498n8356k4015L8263P2716J05520j45098J87869L3107k10796L30386
$$ plain form
589 14635 277247 108832 101966 81962 -250760 -248429 67670 453772 321993 378257 88995
578 88995 138106 10124 268695 141570 138745 -87771 -162795 -324757 -2536 295810 -107576
567 -107576 243335 72508 -230341 112401 208065 59278 124198 -11800 225161 364253
557 364253 -53336 -70146 -146429 -80872 231583 250465 31007 264505 227803 197922 414547
546 414547 247167 53236 31260 245090 223734 -109823 -94561 71197 -224467 -89070
536 -89070 -20270 105213 70590 107157 69930 180857 35313 -270035 -366983 -67499 311562
525 311562 -18082 -125486 -16459 -4412 59560 278524 -301479 -454979 -120282 83941
515 83941 -169557 -227913 -251928 -213665 -140949 -35429 -180527 7342 40449 -170347 160039
504A60039j20321r4770k38378M06329o6134l90876J52091Q0873L06326P0629k56855
493H953k03334J17702k2823M73130J65290l14619k5405j5356Q834N7430k49054
482G48O7666o0546j79540L31333R6360l80829k71514L02504K00438K61106j04700
471B63026j39333M3634j9548j97330j89753J44708N05737j89652n29163K87907
461a9767J84137j53623J74040o073p1769j95042J83528J88205l1659j30940l56745
450b35708l282k5459P1437K51043l8192K3370P5183p0509l2005r9321Q8197r7051
438i2297k12306J15144N22371m9805k74097R5427j8510j50497r5530K95347k15407
427h0160k36674J79826M6275m1217N3755p4600K50945n6199j80338J06092O9667
$$ plain form
504 160039 39718 -55052 -293430 112899 46765 -344111 -192020 -111147 195179 265808 8953
493 8953 -194381 -76679 -99502 373628 538918 224299 198894 183538 192372 249802 748
482 748 68414 7868 -171672 159661 256021 -124808 -396322 -93818 106620 367726 263026
471 263026 123693 167327 147779 -49551 -239304 -94596 411141 221489 -307674 -19767
461 -19767 164370 10747 184787 178714 106945 -88097 95431 283636 251977 121037 -235708
450 -235708 -238990 -264449 -193012 58031 19839 43209 118392 47883 15878 -83443 4754 -92297
438 -92297 -304603 -189459 332912 283107 9010 104437 85927 -64570 -160100 135247 -80160
427 -80160 -316834 -137008 -90733 -131950 -78195 -152795 98150 41951 -138387 -32295 37372
416C7372j9310j75123M3551j8829K48486P3933j8951J01j73028j57479M19081
405B59804L3209j64842j93078j42277K52757o4666j65059m25799L47537k04282
395d66696J9302M27786q3758J23045j25235k08372J41884M78963k18476m99233
385d10790L23821o811K0720L22267K00009k03463j09239o8025K2201m1835q9886
374d1031M6028k45937P1015J44066j06027L1330J44690m4891Q8348n9983L564
363C1172r091n1414N24330K9771m07110j9775m533p6075j72296K56641j94441
352i2821J43224j66087k44183J2338J88533m3477j9352J74940Q6730l49800r6578
341d06533K26520K12259J84367j80480k84173j18302L40620n4048J60981k03926
$$ plain form
416 37372 18062 -157061 -113510 -132339 116147 190080 171129 171230 -1798 -159277 259804
405 259804 293013 128171 -64907 -207184 45573 -19093 -184152 -609951 -262414 -466696
395 -466696 -447394 -19608 -103366 19679 -105556 -313928 -172044 306919 88443 -410790
385 -410790 -86969 -93780 -73060 249207 449216 245753 136514 68489 90690 48855 -41031
374 -41031 4997 -240940 -169925 -25859 -131886 -100556 44134 -757 87591 27608 31172
363 31172 22081 -29333 494997 524768 117658 97883 93350 17275 -155021 101620 -92821
352 -92821 50403 -115684 -359867 -347529 -158996 -202473 -221825 -46885 39845 -309955 -406533
341 -406533 -180013 32246 216613 36133 -248040 -366342 -25722 -79770 81211 -122715
331a22715m7889O4986j59496m045m4942N9736l726Q3971j81606Q800K87680K53631
319A94385o0615L72094J6103l64183O8286m3079j44815J87977k17141j93248l229
308a87465J22366l9820l8258M2079M2295J59361n1699L9626j63673J02756O9562
297I7130n9081l0442L68899J20063m25907o4501R7166Q2469n5125o3318M2236
286A09589k1879O5254j45545M929n6004l7925j20565J42148j52090J97937n2632
275f6783J28514R3655J01856j43079m1030j28237k37463J22780M9744j56337O5941
264b10439J47000K11319J48471k82500N4941M6891q9534k17k0954M5811O875l16619
252b58955J34670L36813q1764m61262j8102R3850K49308K773R1825K40517k68245
$$ plain form
331 -122715 -170604 -105618 -265114 -269159 -314101 -254365 -258091 -174120 -355726 -346926 -59246 194385
319 194385 133770 505864 521967 157784 226070 182991 38176 226153 9012 -184236 -187465
308 -187465 -65099 -104919 -143177 -101098 -58803 100558 48859 88485 -75188 27568 97130
297 97130 38049 7607 376506 496569 70662 6161 103327 185796 130671 67353 109589
286 109589 87710 152964 7419 12348 -43656 -81581 -202146 -59998 -212088 -14151 -66783
275 -66783 61731 155386 257242 114163 73133 -55104 -292567 -169787 -120043 -276380 -210439
264 -210439 -63439 147880 296351 13851 68792 115683 26149 25932 4978 50789 57664 -258955
252 -258955 -124285 212528 130764 -330498 -348600 -254750 -5442 -2669 89156 329673 61428
241F1428l21323J95678l76248k72289J60645K62905J40595k91376L71397J82343
231A13755l39261K7995L69520l44285r8539K22257p2072K06564j1589n2446k55349
220b33450Q2923K22956J38134k62004K20297l1390m55679J73232L602r0331q437
209b40147J47308Q0109j36812L45861N0265k34709J25190m8727m1497m17382K5205
198c45336K76678r6626N0501K54180P9868j17884o1870K3881p209K28046J35007
187D19236k60299M256k93358j60794J48381L40372J05830k00689k07116j24795
177b28976K75306l6417j05187J72100N0953O536p0624j10526j46423j30751K03553
166a20456J75843Q3546l57970j22420J753K89400J70260j04920k45969J66871
$$ plain form
241 61428 -259895 -64217 -440465 -712754 -552109 -289204 -148609 -439985 -68588 113755
231 113755 -225506 -197511 172009 -172276 -270815 -48558 -120630 85934 74345 21899 -233450
220 -233450 -150527 72429 210563 -51441 168856 137466 -318213 -144981 -141379 -231710 -240147
209 -240147 -92839 -12730 -149542 196319 246584 11875 137065 88338 46841 -370541 -345336
198 -345336 -68658 -165284 -114783 139397 219265 101381 39511 63392 56183 284229 419236
187 419236 158937 163193 -130165 -290959 -142578 197794 303624 102935 -104181 -228976
177 -228976 46330 9913 -95274 76826 127779 134315 63691 -46835 -193258 -324009 -120456
166 -120456 55387 138933 -219037 -341457 -339704 -50304 119956 15036 -230933 -64062
156f4062L16831n8955j49589M2360L7806p6182n6080j32105j11549M4994K64054
145E7523r3665J06730l0462O1292q3308l4619J75742J26691n9134k52493J13459
134H7756r9782J50505K1933q6639o0276k46773J18916r8515j26582n8446K06737
123a91166L0983N5410l2197K2861K26462J96878l6059j98956L6393k492q1340
112B6777Q0365J5496l09979k3415J71218K1137K76091q7998l34926Q0306K6190
101e8738J25373Q4824k67143j27291L18754o1454K01928j6547p2375m9355j9273
90E8703P3550r5073R119j93874j30404k05641K00512j0733o4368K68094J43953
79E3838q3889P8689j09226j93041M5613J09899K3261P7341R0019j15939k9486
$$ plain form
156 -64062 252769 193814 44225 86585 124391 48209 -7871 -139976 -251525 -206531 57523
145 57523 -36142 70588 40126 101418 18110 -16509 159233 285924 226790 -25703 87756
134 87756 -12026 138479 160412 73773 13497 -233276 -114360 -212875 -339457 -397903 -191166
123 -191166 -160183 -104773 -136970 -114109 112353 309231 273172 74216 110609 108117 26777
112 26777 107142 122638 -187341 -210756 -39538 -18401 257690 169692 -165234 -84928 -58738
101 -58738 66635 151459 -115684 -242975 75779 14325 216253 199706 127331 77976 58703
90 58703 132253 37180 46299 -147575 -277979 -483620 -283108 -293841 -358209 -90115 53838
79 53838 -30051 48638 -60588 -253629 -208016 -98117 -74856 2485 92504 -23435 -52921
68e2921R3204j62756J35180k4644Q8896K33104K221j02847j41044Q0863m5101
57A04155M0446j81782j14825m5565K90807j64312k10875J64695J79824J0785k08464
46a35111J91480j3216k02839N5178P7591M769J1596j4848K6958j27150m1467J28576
34c8483L2576j41728K21471o8106k48816J13751L683K39126j48923O3252R128
23C6931J4353J84672j9716p6504o020m2082O8318K79329k55522l18779L6445r8640
11a97215J22233k65916K26795K61946k13870k2475J95263L4758k50976m0288J68734
0A8989
$$ plain form
68 -52921 40283 -122473 12707 -11937 76959 310063 312284 209437 68393 149256 104155
57 104155 144601 -37181 -152006 -197571 93236 -71076 -281951 -117256 62568 73353 -135111
46 -135111 56369 43153 -159686 -104508 -26917 -22148 -10552 -25400 1558 -125592 -167059 -38483
34 -38483 -5907 -147635 73836 5730 -243086 -129335 -125652 113474 -35449 27803 36931
23 36931 51284 235956 216240 139736 133716 91634 159952 439281 183759 -135020 -98575 -197215
11 -197215 -74982 -340898 -114103 147843 -66027 -88502 106761 141519 -109457 -149745 18989
0 18989
$$ Imaginary data points
##PAGE= N=2
##DATA TABLE= (X++(I..I)), XYDATA
16383b896314K60903j53765j67420K31761K27111n2905O2728j31104j14921l2609
16373b766535K76712M2808M6285j33041J14001M3237k18126K65037J72521O5177
$$ plain form
16383 -2896314 -2635411 -2789176 -2956596 -2724835 -2497724 -2550629 -2487901 -2619005 -2733926 -2766535
16373 -2766535 -2489823 -2447015 -2400730 -2533771 -2419770 -2376533 -2594659 -2329622 -2157101 -2091924
$$ [...]
##END NTUPLES=NMR SPECTRUM
##END=
