##TITLE=1H_EC-3355(II-2)x1Y
 200.13MHz, DMSO,
 8 sc
 
 8.8.2025
##JCAMPDX= 6.0         $$ Bruker NMR JCAMP-DX V2.0
##DATA TYPE= NMR SPECTRUM
##DATA CLASS= NTUPLES
##ORIGIN= UXNMR, Bruker Analytische Messtechnik GmbH
##OWNER= pz
$$ XWIN-NMR		Version 3.5
$$ Fri Aug  8 13:51:32 2025 Russian Standard Time (UT+4h)  she@DPX200
##.OBSERVE FREQUENCY= 200.1313
##.OBSERVE NUCLEUS= ^1H
##.ACQUISITION MODE= SIMULTANEOUS
##.ACQUISITION SCHEME= undefined
##.AVERAGES= 8
##.DIGITISER RES= 18
##SPECTROMETER/DATA SYSTEM= spect
##.PULSE SEQUENCE= zg30
##.SOLVENT NAME= DMSO
##.SHIFT REFERENCE= (INTERNAL, DMSO, 0, 15.6367)
##AUDIT TRAIL= $$ (NUMBER, WHEN, WHO, WHERE, WHAT)
$$ ##TITLE= Audit trail, XWIN-NMR		Version 3.5
$$ ##JCAMPDX= 5.01
$$ ##ORIGIN= Bruker BioSpin GmbH
$$ ##OWNER= she
$$ F:/spectra/data/she/nmr/H-C/1/pdata/1/auditp.txt
$$ ##AUDIT TRAIL=  $$ (NUMBER, WHEN, WHO, WHERE, WHAT)
(   1,<2025-08-08 13:50:06.56 +0400>,<she>,<DPX200>,
      <created by zg, POWCHK disabled, PULCHK disabled
       configuration hash MD5:
       00 E9 B6 7A A2 85 ED C7 34 08 36 98 17 FE 4E 26
       data hash MD5: 16K
       6F EA D8 8C E6 FE 1E E1 25 3E 1C 33 C5 0B 5E 23>)
(   2,<2025-08-08 13:50:21.95 +0400>,<she>,<DPX200>,
      <Start of raw data processing
       efp BC_mod = 2 LB = 0.25 FT_mod = 6 PKNL = 1 PHC0 = -1557.734 PHC1 = 9.192299 SI = 16K 
       data hash MD5: 16K
       98 C4 C7 75 25 D7 07 40 EC 82 D3 16 57 D8 3A 25>)
(   3,<2025-08-08 13:50:44.28 +0400>,<she>,<DPX200>,
      <pk PHC0 = -1.3744 PHC1 = 1.6 
       data hash MD5: 16K
       AA CE D5 5A 12 E3 81 12 2A 49 29 90 B2 9B 14 50>)
(   4,<2025-08-08 13:50:48.56 +0400>,<she>,<DPX200>,
      <abs ABSG = 5 
       data hash MD5: 16K
       F7 C7 8C 5E B3 19 01 DF 39 50 2F 1B 31 47 96 B6>)
$$ ##END=
$$ 
$$ hash MD5
$$ 4E E6 E0 57 CC 9E A0 31 12 16 E8 26 30 8A DD E4
##$RELAX= 
##$RELAX= 
##$RELAX= 
##$RELAX= 
##$RELAX= 
##$RELAX= 
$$ Bruker specific parameters
$$ --------------------------
##$DU= <F:/spectra>
##$EXPNO= 1
##$NAME= <H-C>
##$PROCNO= 1
##$TYPE= <nmr>
##$USER= <she>
##$AMP= (0..31)
100 100 100 100 100 100 100 100 100 100 100 100 100 100 100 100 100 100 
100 100 100 100 100 100 100 100 100 100 100 100 100 100 
##$AQSEQ= 0
##$AQ_mod= 1
##$AUNM= <au_zg>
##$AUTOPOS= <>
##$BF1= 200.13
##$BF2= 200.13
##$BF3= 200.13
##$BF4= 200.13
##$BF5= 200.13
##$BF6= 200.13
##$BF7= 200.13
##$BF8= 200.13
##$BYTORDA= 1
##$CFDGTYP= 0
##$CFRGTYP= 5
##$CHEMSTR= <none>
##$CNST= (0..31)
1 1 145 1 1 1 1 1 1 1 1 1 1 1 1 1 1 1 1 1 1 1 1 1 1 1 1 1 1 1 1 1 
##$CPDPRG= <>
##$CPDPRG1= <>
##$CPDPRG2= <>
##$CPDPRG3= <>
##$CPDPRG4= <mlev>
##$CPDPRG5= <mlev>
##$CPDPRG6= <mlev>
##$CPDPRG7= <mlev>
##$CPDPRG8= <mlev>
##$CPDPRGB= <>
##$CPDPRGT= <>
##$D= (0..31)
0 0.7 0 0 0 0 0 0 0 0 0 0.03 0 0 0 0 0 0 0 0 0 0 0 0 0 0 0 0 0 0 0 0 
##$DATE= 1754646605
##$DBL= (0..7)
120 120 120 120 120 120 120 120 
##$DBP= (0..7)
150 150 150 150 150 150 150 150 
##$DBP07= 0
##$DBPNAM0= <>
##$DBPNAM1= <>
##$DBPNAM2= <>
##$DBPNAM3= <>
##$DBPNAM4= <>
$$ [...]
##$SUBNAM3= <"">
##$SUBNAM4= <"">
##$SUBNAM5= <"">
##$SUBNAM6= <"">
##$SUBNAM7= <"">
##$SUBNAM8= <"">
##$SUBNAM9= <"">
##$SW= 18.0517328524113
##$SWIBOX= (0..15)
0 0 2 0 0 0 0 0 0 0 0 0 0 0 0 0 
##$SW_h= 3612.71676300578
##$TD= 16384
##$TD0= 1
##$TE= 0
##$TE2= 300
##$TE3= 300
##$TEG= 300
##$TL= (0..7)
0 120 120 120 120 120 120 120 
##$TP= (0..7)
150 150 150 150 150 150 150 150 
##$TP07= 0
##$TPNAME0= <>
##$TPNAME1= <>
##$TPNAME2= <>
##$TPNAME3= <>
##$TPNAME4= <>
##$TPNAME5= <>
##$TPNAME6= <>
##$TPNAME7= <>
##$TPOAL= (0..7)
0.5 0.5 0.5 0.5 0.5 0.5 0.5 0.5 
##$TPOFFS= (0..7)
0 0 0 0 0 0 0 0 
##$TUNHIN= 0
##$TUNHOUT= 0
##$TUNXOUT= 0
##$USERA1= <user>
##$USERA2= <user>
##$USERA3= <user>
##$USERA4= <user>
##$USERA5= <user>
##$V9= 5
##$VALIST= <valist>
##$VCLIST= <CCCCCCCCCCCCCCC>
##$VD= 0
##$VDLIST= <DDDDDDDDDDDDDDD>
##$VPLIST= <PPPPPPPPPPPPPPP>
##$VTLIST= <TTTTTTTTTTTTTTT>
##$WBST= 1024
##$WBSW= 4
##$XGAIN= (0..3)
0 0 0 0 
##$XL= 0
##$YL= 0
##$YMAX_a= 177168
##$YMIN_a= -398179
##$ZGOPTNS= <>
##$ZL1= 120
##$ZL2= 120
##$ZL3= 120
##$ZL4= 120
##$ABSF1= 15.63671
##$ABSF2= -2.415141
##$ABSG= 5
##$ABSL= 3
##$ALPHA= 0
##$AQORDER= 0
##$ASSFAC= 0
##$ASSFACI= 0
##$ASSFACX= 0
##$ASSWID= 0
##$AUNMP= <proc_1d>
##$AZFE= 0.1
##$AZFW= 0.1
##$BCFW= 0
##$BC_mod= 2
##$BYTORDP= 0
##$COROFFS= 0
##$CY= -3
##$DATMOD= 1
##$DC= 0
##$DFILT= <>
##$DTYPP= 0
##$F1P= 0
##$F2P= 0
##$FCOR= 1
##$FTSIZE= 16384
##$FT_mod= 6
##$GAMMA= 0
##$GB= 0
##$INTBC= 1
##$INTSCL= 3.241238e-09
##$ISEN= 128
##$LB= 0.25
##$LEV0= 0
##$LPBIN= 0
##$MAXI= 10000
##$MC2= 0
##$MEAN= 0
##$ME_mod= 0
##$MI= 1.114404
##$NCOEF= 0
##$NC_proc= -7
##$NLEV= 6
##$NOISF1= 3.799351
##$NOISF2= 2.8
##$NSP= 0
##$NTH_PI= 0
##$NZP= 0
##$OFFSET= 15.63671
##$PC= 1
##$PHC0= -1559.108
##$PHC1= 10.7923
##$PH_mod= 1
##$PKNL= yes
##$PPARMOD= 0
##$PSCAL= 0
##$PSIGN= 0
##$REVERSE= no
##$SF= 200.1299769831
##$SI= 16384
##$SIGF1= 3
##$SIGF2= 2
##$SINO= 0.751879
##$SIOLD= 32768
##$SREGLST= <19F.Aceton>
##$SSB= 0
##$STSI= 16384
##$STSR= 0
##$SW_p= 3612.71676300578
##$SYMM= 0
##$S_DEV= 0
##$TDeff= 16384
##$TDoff= 0
##$TI= <>
##$TILT= no
##$TM1= 0
##$TM2= 0
##$TOPLEV= 0
##$USERP1= <user>
##$USERP2= <user>
##$USERP3= <user>
##$USERP4= <user>
##$USERP5= <user>
##$WDW= 1
##$XDIM= 16384
##$YMAX_p= 352238361
##$YMIN_p= -634409
$$ End of Bruker specific parameters
$$ ---------------------------------
##NTUPLES= NMR SPECTRUM
##VAR_NAME=  FREQUENCY,     SPECTRUM/REAL,   SPECTRUM/IMAG
##SYMBOL=    X,             R,               I
##VAR_TYPE=  INDEPENDENT,   DEPENDENT,       DEPENDENT
##VAR_FORM=  AFFN,          ASDF,            ASDF
##VAR_DIM=   16384,         16384,           16384
##UNITS=     HZ,            ARBITRARY UNITS, ARBITRARY UNITS
##FACTOR=    0.220516191357247, 1,           1
##FIRST=     3129.37444579934, 0,            0
##LAST=      -483.342317206443, 0,           0
##MIN=       -483.342317206443, -634409,     0
##MAX=       3129.37444579934, 352238361,    0
$$ Real data points
##PAGE= N=1
##DATA TABLE= (X++(R..R)), XYDATA
$$ [...]
5943G57061k54660k54999J8932M0941L39941j16656K706J6835J3757j52448k27225
5932A84185L775q0043k987J29849Q5802J28504j22288J49610j33909j38174k6107
5921A78217J23507J01361k01476n9701r467j43648j88870K90735Q7583m8532k2037
5910A07672n089j43039O1824j98020L4194P6457J47443k1354M96J63626j82197
5899D2013p6992J935J26858K79082o1593j33604j49019R1579j11834L9593J78550
5888B26568j08772P1501L3278l5284j09566K8312q5837L7571J20761K06869k09156
5877A76245j42299K16572j14191M836k8617J75829l52578j6806J25263m1499j7224
5866a4469L2386m9469n958K2025j45525J49353l0380J07925o5082J69013Q3933
$$ plain form
5943 757061 502401 247402 266334 307275 647216 530560 533266 550101 563858 411410 184185
5932 184185 187960 107917 104930 234779 320581 449085 326797 476407 342498 204324 178217
5921 178217 301724 403085 201609 141908 132441 -11207 -200077 90658 178241 129709 107672
5910 107672 102583 -40456 21368 -176652 -142458 -66001 81442 60088 60584 224210 42013
5899 42013 -34979 -33044 93814 372896 311303 177699 28680 120259 8425 48018 226568
5888 226568 117796 189297 222575 187291 77725 106037 20200 57771 178532 385401 176245
5877 176245 33946 250518 136327 141163 112546 288375 -64203 -81009 44254 2755 -14469
5866 -14469 17917 -31552 -37510 -15485 -161010 -11657 -42037 65888 806 169819 253752
5855B53752k5434R2602k17273J4798k6781r5647m8938J34161N9604L18533N4450
5844E13827j9221l1888l44256J54543j37347p4300P3047j63014l0833k024R3585
5833C2119k66273J62583j12309L21059O8175j23085M8550R1384P997l1564j71646
5822B6990j41265K1392O6224L11069L3839k47050O0353J98080J49626j67399j72971
5811A38888L75617l92664K8861J22064K338j22029k50651L1716N2752J43815J12224
5800B42931n7716k695j46727n6192J7087K70314k21172O3523J01872j02428n9955
5789D8842K21K42854j3820N3497O8323r2019j32324k63659J55225m452o786P6198
5777A32100P5762k15325P6098J71604k58801o8774J37737K57816J28148j33558
$$ plain form
5855 253752 228318 320920 103647 118445 91664 -3983 -52921 81240 140844 459377 513827
5844 513827 494606 462718 118462 273005 135658 61358 134405 -28609 -59442 -61466 32119
5833 32119 -234154 -71571 -183880 137179 205354 82269 130819 222203 230200 198636 26990
5822 26990 -114275 -92883 -26659 284410 318249 71199 131552 329632 479258 311859 138888
5811 138888 514505 121841 150702 272766 275104 153075 -97576 -65860 -13108 130707 242931
5800 242931 185215 182520 35793 -20399 -3312 267002 45830 109353 211225 108797 48842
5789 48842 49063 291917 278097 331594 399917 307898 175574 -88085 67140 62688 55902 132100
5777 132100 207862 -7463 68635 240239 -18562 -87336 50401 308217 436365 302807
5767C02807m09609O0932P7491n7410J14788L75852l17012j48501K24863p1546
5757A52655n1833k66635L09451L2759J85128l7627j40506j84550N6819R7253m358
5746A48556J95490l9788j29040K42280j44099j47488O953P4986j04396q436J36650
5735B31668q4130J35380k23946J12224m1815J81428R3429j71380o6569K15039
5725C81328L8670K2715j24952j39508J97519R9234K00291j23483j37908J06450
5715E20356j23422j93660m8156p7027J28129r7146J74111J54288j20516r9335
5705B17622P7662O4041K53n1153r5486n075q2096J86030r3791K23286K15303r6842
5693E59754J9372k74446j27647J53989o1727K56837k08167l4716J58376L997P6979
$$ plain form
5767 302807 -106802 -45870 31621 -25789 88999 464851 147839 -662 224201 152655
5757 152655 100822 -165813 143638 176397 361525 323898 183392 -1158 55661 152914 148556
5746 148556 344046 304258 175218 417498 273399 125911 132864 207850 103454 95018 231668
5735 231668 147538 282918 58972 171196 129381 310809 404238 232858 166289 381328
5725 381328 419998 442713 317761 178253 375772 475006 675297 551814 413906 520356
5715 520356 396934 203274 155118 78091 206220 109074 283185 437473 316957 217622
5705 217622 295284 359325 359578 308425 212939 207864 125768 311798 218007 441293 656596 559754
5693 559754 579126 304680 177033 331022 269295 526132 317965 283249 441625 445622 522601
5682E22601j01389j05803J40013J33637p6214k4829q118j64278J09555j48544
5672B76631P6626j52876k57412K72936L3821p8540K60580J95197k3662r5074k6031
5661D82196m5558k88079j20123n2138L09886J05051K78204o1119k52920O5083
5651D20483J05882j99126q875L09927j8993J8621j10784J66632J94790P1463k05220
5640G44800k28619L9179J95504J8679J59676j04717k56020K6030K78256l6573
5630H36195j09680L25065j81020q2934J7010j19080N1142J60981P3453R911m1738
5619I39305k08343K32195K430J51203n5844j44510J35178r6108n0151r6869J24567
5608I33053K88071k26305l4952O2226k20662n9385J76006J86856L229K0770q9441
$$ plain form
5682 522601 421212 315409 455422 589059 512845 488016 479898 315620 425175 276631
5672 276631 353257 200381 -57031 215905 249726 171186 431766 626963 603301 508227 482196
5661 482196 436638 148559 28436 -23702 286184 391235 669439 608320 355400 420483
5651 420483 526365 327239 318364 628291 609298 627919 517135 683767 878557 950020 744800
5640 744800 516181 555360 750864 769543 929219 824502 568482 594512 872768 836195
5630 836195 726515 1051580 870560 787626 804636 685556 736698 897679 971132 981043 939305
5619 939305 730962 963157 965587 1116790 1060946 916436 1051614 955506 905355 808486 933053
5608 933053 1221124 994819 959867 1022093 801431 742046 918052 1104908 1108137 1128907 1039466
5597A039466n2710q4602p0632O007n6132J887k21634n6929L51376K6066L939l95661
5585D90441J99266M8208K36555j87536j58746J29369m2060Q5594N2795l8091p7398
5574G38397M0730Q7553p5398j03103o289J58246k95419j09470J58894J20228k0631
5563F93738L5559Q4466J94456R7171m77111L6373J06546P7976k96207j33121m8357
5552C71489L87032l0509k28126J99541M21485j87681k47741J13730Q1334J8992
5542H99546j16488P1490M5645q9674k58856J22160Q5085P5050N929m8531J63405
5531I54761l6160k05483K27206J66618j6069j15844l86341l759J66675L4854K48951
5520A035409J24234q1314k81273k79628J66447J24040J38310l01998L01343L00043
$$ plain form
5597 1039466 986756 902154 831522 837529 781397 783284 561650 504721 856097 882163 886102 490441
5585 490441 689707 737915 974470 786934 628188 757557 715497 801091 853886 815795 738397
5574 738397 779127 866680 791282 688179 681890 840136 544717 435247 594141 714369 693738
5563 693738 729297 813763 1008219 1105390 628279 664652 771198 849174 552967 419846 371489
5552 371489 758521 728012 499886 699427 1120912 933231 685490 799220 880554 899546
5542 899546 783058 854548 900193 810519 551663 673823 758908 833958 839887 791356 954761
5531 954761 918601 713118 940324 1106942 1090873 975029 588688 584929 751604 786458 1035409
5520 1035409 1159643 1078329 797056 517428 683875 807915 946225 644227 945570 1245613
5510A245613K0966k7780j37854r5357r6704j09678o5454J25163J51256Q4389j66022
5499I28538j79557j53124J29143L05304m1960j40253J25959k01574J53639K7160
5489I53275l46151J65063M24540M0157k38379n8649K06270R6332o5103j53786
5479A023569K4090K22752k39420k57914O7885R9898J02701k76400L7399j83206
5469F21354J3731J32544J60363j06233J5037J73687l3610k80669L0901K96625
5459A023730J24701j32659o4474O5158k43413j02786K13631K20263K1393j13953
5449A011591j7886j2549q0565K5166l7827j36539j45934M2530K09193j248j80511
5438F75421K40860R3962j95462J94976J96081J9170j12941j97583j62614q6829
$$ plain form
5510 1245613 1266579 1238799 1100945 1005588 908884 799206 733752 858915 1010171 1094560 928538
5499 928538 748981 595857 725000 1030304 988344 848091 974050 772476 926115 953275
5489 953275 607124 772187 1196727 1236884 998505 939856 1146126 1242458 1177355 1023569
5479 1023569 1047659 1270411 1030991 773077 840962 940860 1043561 767161 804560 621354
5469 621354 635085 767629 927992 821759 836796 1010483 976873 696204 727105 1023730
5459 1023730 1148431 1015772 951298 1016456 773043 670257 883888 1104151 1125544 1011591
5449 1011591 993705 981156 900591 925757 887930 751391 605457 647987 857180 855932 675421
5438 675421 916281 1010243 814781 1009757 1205838 1225008 1112067 914484 751870 665041
5428F65041J04334J56787J17553m3294J45970J43333j31240l71847l36344k071
5418D48222J96530J36716R9055N0203j51648j04899K03839Q6269J52174M9475
5408A165936Q162j47191J50667j38121l41K97221J94340l04384r9461k54387m4594
5397H27847Q6473n4490J54093k6473j62609J11725R9671J25741N6012J01808q8103
5386A231695M7943K18455r9938r9991R2012m1954l61315J2377K83908K89415L7129
5375A609736R1081J02214j15633j21856l0057R3503M577J83766O6013L2019M2716
5364A958079o0472q6847L5894n9472l2029K54711L9183j1075J64669k96499n5435
5353A850707J89567r4114K1023J63959J35625k7686q0985N8912J97757n5986p8262
$$ plain form
5428 665041 769375 926162 1043715 1000421 1146391 1289724 1158484 786637 450293 448222
5418 448222 644752 781468 880523 930726 779078 674179 878018 964287 1116461 1165936
5408 1165936 1174098 1026907 1177574 1039453 1039112 1336333 1530673 1226289 1126828 872441 827847
5397 827847 914320 859830 1013923 987450 824841 936566 1036237 1161978 1217990 1319798 1231695
5386 1231695 1279638 1498093 1398155 1298164 1390176 1348222 986907 999284 1283192 1572607 1609736
5375 1609736 1700817 1803031 1687398 1565542 1535485 1628988 1633565 1817331 1883344 1915363 1958079
5364 1958079 1897607 1810760 1846654 1787182 1755153 2009864 2049047 2037972 2202641 1906142 1850707
5353 1850707 2040274 1946160 1967183 2131142 2266767 2239081 2158096 2217008 2414765 2358779 2280517
5342B280517j5730J71673k14439O5152J37669L0450j39585J50551j3234J35J68254
5331B621413j29983j37263K72412O046j09052m519K21909o1412j13322J44970
5321B711199j63320n8377L33688R5383r0991K0170N4763N5941M0049J34248n5983
5310C076770j01747J49109n9926K4131K42933L39187q483j00950J2730L14069
5300C887823L1631j07154L01184N1066J01774j82694j74544K96195J62549l6399
5290D331431L9781p9006J13039K67286L88701J81832N7406J92749J85777J3709
5280E692705M21805L52620K63056M57588L15547M27773L98114L7625J23388N48780
5270I039001O04791N35496M22782O35286M88970M59579P86435R81812P67435O31487
$$ plain form
5342 2280517 2264787 2436460 2222021 2287173 2424842 2455292 2315707 2466258 2453024 2453159 2621413
5331 2621413 2491430 2354167 2626579 2632625 2523573 2519054 2740963 2679551 2566229 2711199
5321 2711199 2547879 2489502 2823190 2918573 2827582 2847752 2902515 2958456 2998505 3132753 3076770
5310 3076770 2975023 3124132 3064206 3088337 3331270 3670457 3661974 3561024 3573754 3887823
5300 3887823 3919454 3812300 4113484 4164550 4266324 4083630 3909086 4205281 4367830 4331431
5290 4331431 4371212 4292206 4405245 4672531 5061232 5243064 5300470 5493219 5678996 5692705
5280 5692705 6114510 6467130 6730186 7187774 7503321 7931094 8329208 8366833 8490221 9039001
5270 9039001 9643792 10179288 10602070 11237356 11726326 12185905 12972340 13954152 14721587 15353074
5260A5353074J157185R83202J024900J056712R00468J353252J140007J533168
5252B4501968J207953R86903J153786J315299J304608J037075J075370J226406
5244C3809368P87081P19931R84747O63822J123295J234747J021421J031933J130874
5235D2507219J099298J433033J694639J566423J511141J631106K017139K116927
5227E5576925K247505K256402K632797K390070K620262K571559K790017K749865
5219G5835402K028328J795172J384195J070643R95476M67855L3160j43156j029464
5210H2437611p90909j110028q79893p03952p80352m62929o93450o23553k42840
5201G6149705m69176K1463q2134K61133J25856J9740P23590P11544J089632J106444
$$ plain form
5260 15353074 16510259 17493461 18518361 19575073 20475541 21828793 22968800 24501968
5252 24501968 25709921 26696824 27850610 29165909 30470517 31507592 32582962 33809368
5244 33809368 34596449 35316380 36301127 36964949 38088244 39322991 40344412 41376345 42507219
5235 42507219 43606517 45039550 46734189 48300612 49811753 51442859 53459998 55576925
5227 55576925 57824430 60080832 62713629 65103699 67723961 70295520 73085537 75835402
5219 75835402 77863730 79658902 81043097 82113740 83109216 83577071 83610231 83467075 82437611
5210 82437611 81646702 80536674 79656781 78952829 78172477 77709548 77016098 76392545 76149705
5201 76149705 75680529 75701992 75619858 75880991 76006847 76026587 76750177 77461721 78551353 79657797
5191G9657797R43607P57929Q51614M61424M70459j31967o58787j088925j578496
5182G9684655j685084k440474k208052k609288k611344k761295k303187k462487
5174F0603444k315724k031281k234504j836714j621707j824351j506584j246961
5166D5985618j178501j111264j441401j083578n23299j281237p83068q88947j161255
5157C6533068o10558p45500q09364j319606j279211j118593j393121j499695j398933
5148B6358487j237552j053728j331227j564306j584841j087650o87433j047874
5140A6763876p59538o02445n96614o20122n73633m53966q11912p23387o90003
5131A0932256m16602o03993n66697j12594k09351k64264m15327k43511l22543
$$ plain form
5191 79657797 80601404 81359333 82210947 82672371 83142830 83010863 82352076 81263151 79684655
5182 79684655 77999571 75559097 73351045 70741757 68130413 65369118 63065931 60603444
5174 60603444 58287720 56256439 54021935 52185221 50563514 48739163 47232579 45985618
5166 45985618 44807117 43695853 42254452 41170874 40647575 39366338 38583270 37694323 36533068
5157 36533068 35922510 35177010 34367646 33048040 31768829 30650236 29257115 27757420 26358487
5148 26358487 25120935 24067207 22735980 21171674 19586833 18499183 17811750 16763876
5140 16763876 16004338 15401893 14805279 14185157 13611524 13157558 12345646 11622259 10932256
5131 10932256 10515654 9911661 9344964 9232370 9023019 8758755 8343428 8099917 7777374
5122G777374m59791j63405m7553k2002l23257J46462k51363m27084n55207j75409
5112E498765L7133k57580j31716N8490P400k49325j15076k90436k23686l10068
5102D023901N6649L5609o3422l12524l44646J94936M65375j76839j95820J07145
5092C790364l04935j25562L8403j64471k00718J08874j31967l15441j78355L36323
5082B852515j60576j78795j46534O1089k79531K37757J74461j7350k50832j66573
5072B125631q5357o4617L9477K00600P2911n6517J38171p3501l63364n7898k7067
5061A848469j2319q9675L3975K613l47936k5782J45315J83740l74840J14638j36089
5050A342109l41991M38876K10652j10168k68107N5716p0714j47995J45430N6111
$$ plain form
5122 7777374 7317583 7154178 7106625 7084623 6761366 6907828 6656465 6229381 5674174 5498765
5112 5498765 5535898 5278318 5146602 5205092 5212492 4963167 4848091 4557655 4333969 4023901
5102 4023901 4080550 4116159 4052737 3740213 3395567 3590503 4055878 3879039 3683219 3790364
5092 3790364 3485429 3359867 3398270 3233799 3033081 3141955 3009988 2694547 2516192 2852515
5082 2852515 2691939 2513144 2366610 2427699 2148168 2385925 2560386 2543036 2292204 2125631
5072 2125631 2040274 1975657 2015134 2215734 2288645 2232128 2370299 2296798 1933434 1875536 1848469
5061 1848469 1836150 1746475 1780450 1783063 1435127 1409345 1554660 1738400 1363560 1478198 1342109
5050 1342109 1000118 1438994 1649646 1539478 1271371 1327087 1256373 1108378 1253808 1309919
5040A309919m7047j8721J0219q8546L0162o3844j99394M2313N4884j86371K77085
5029A120659l7934L467K74694N7825m4825k06013r0986j32590O7588J14520k55535
5018H70870n3657O437J64810P9264l34150N13122n7633j46681j93731J20485L08666
5007A277802j17362j17406j79059K92346l5280j6363p4681N5043O7490O7425j81897
4996A038058J9284j40630J03261n0314R4737m2751J26741J3111J6466J24190J46921
4985A449074m23720R8292q9960P7782L0514j7973K10713k5820J20758l45288l06332
4974G78040M8337J65718j84509J57525J05173J4668p8312m3579j16700J35659
4964I82020L97832n1464k58228k74528L5332J02547L30272j80466j55799J74566
$$ plain form
5040 1309919 1262872 1244151 1254370 1165824 1195986 1132142 932748 975061 1029945 843574 1120659
5029 1120659 1082725 1086192 1360886 1418711 1373886 1167873 1076887 944297 1011885 1126405 870870
5018 870870 817213 823650 988460 1067724 733574 1246696 1189063 1042382 848651 969136 1277802
5007 1277802 1160440 1043034 863975 1156321 1121041 1104678 1029997 1085040 1152530 1219955 1038058
4996 1038058 1057342 916712 1019973 969659 1064396 1021645 1148386 1161497 1177963 1302153 1449074
4985 1449074 1025354 1123646 1033686 1111468 1141982 1124009 1334722 1308902 1429660 1084372 778040
4974 778040 826377 992095 807586 965111 1070284 1084952 1006640 963061 846361 982020
4964 982020 1379852 1328388 1070160 795632 830964 933511 1263783 1083317 927518 1102084
4954A102084k4706J12707o6732K06341J40814j70234m8672J34139O6671q9159
4944A363253j97334L14082J76104j30016k03446K75001M4650L7349p5445o8708
4934A535490L49500r0307K54024K33584Q8163p3914L9631J23821J51119M79168
4924C090279K43902L27409Q16813M9189j45116j43382q9576J49237j73559j1841
4914D113355J8018m03941m03341k15834N6189j82378j40779k13278j38809L7712
4904B526914j21107r0372j01833n5021q1436j04670J12192J35687m9018j36539
4894B034797r4586J54959j06084r1479q2810K0127N1106K0227K9961J23774l9294
4883B020698m6626k83515J56437K66764l22116j18799l5604p412M9380P0311J9994
$$ plain form
4954 1102084 1077378 1190085 1123353 1329694 1470508 1300274 1251602 1385741 1452412 1363253
4944 1363253 1165919 1480001 1656105 1526089 1322643 1597644 1642294 1679643 1604198 1535490
4934 1535490 1884990 1794683 2048707 2282291 2370454 2296540 2336171 2459992 2611111 3090279
4924 3090279 3334181 3661590 4478403 4527592 4382476 4239094 4149518 4298755 4125196 4113355
4914 4113355 4131373 3727432 3324091 3108257 3164446 2982068 2841289 2628011 2489202 2526914
4904 2526914 2405807 2315435 2213602 2158581 2077145 1972475 2084667 2220354 2171336 2034797
4894 2034797 1940211 2095170 1989086 1897607 1814797 1834924 1886030 1906257 1936218 2059992 2020698
4883 2020698 1974072 1690557 1846994 2113758 1791642 1672843 1637239 1629827 1679207 1749518 1769512
4872A769512k35589J24969o3009r9365j71167J76178j86962M0083j3391P5020
4862A416279P2743n469q3853J26006p9603k71323K06915M5633k94094k12280N291
4851I26245K95039J56536J05356L8015k60841j22226L0015J88560k26580k4133
4841A105986k8633k18807K70894J25562p9221j18604J13898j50062K09389k62034
4831I68368j37785J65429K91234p6322j45535K40360K4647k33523j35930J76660
4821A137603k31774R9722j3553O4467j64724j92077L1927K41117L694j29285j54122
4810F92995O5753k79689J33666M14733J98061p6015l14259J71339N5308j63976
4800H97916K44818o2349j08407j70604K47843J62593L08461J79946k56540l5304
$$ plain form
4872 1769512 1533923 1658892 1595883 1496518 1325351 1501529 1314567 1354650 1341259 1416279
4862 1416279 1489022 1483553 1399700 1525706 1446103 1174780 1381695 1427328 1133234 920954 926245
4851 926245 1221284 1377820 1483176 1521191 1260350 1138124 1168139 1356699 1130119 1105986
4841 1105986 1077353 858546 1129440 1255002 1175781 1057177 1171075 1021013 1230402 968368
4831 968368 830583 996012 1287246 1210924 1065389 1305749 1330396 1096873 960943 1137603
4821 1137603 905829 1005551 991998 1056465 891741 699664 731591 972708 976402 847117 692995
4810 692995 758748 479059 612725 1027458 1225519 1149504 835245 1006584 1061892 897916
4800 897916 1142734 1080385 971978 801374 1049217 1211810 1520271 1700217 1443677 1408373
4790A408373J96322K60679p8360L77283j4574K9247J07075K44049J64422L4943
4780B729459O08725K52006J23041J52602J33770j0097P9212k71540q2117k31388
4770C483673l02206k96842n82858l95088K30484j18365j34722j70737P9315j04186
4760A688468j78576p4868O2905j61158r7289J83322r3194j59170m0126P8277j51861
4749A056730N6414j68192O6532M84881J18946k60203j03151j88504M8370K68612
4739A380435m30139k35543J79490L196j01064O3078k7998J6544N234J52123J4066
4728A019422j20575L1146j21988J35035k38235M7828K57100o4954O4883J26354
4718A136016m2283J08644l4256l55128J76189j9643k9737Q9905J56484J22591
$$ plain form
4790 1408373 1604695 1865374 1787014 2164297 2149723 2178970 2286045 2530094 2694516 2729459
4780 2729459 3338184 3590190 3713231 3865833 3999603 3989506 4068718 3797178 3715061 3483673
4770 3483673 3181467 2884625 2301767 1906679 2137163 2018798 1884076 1713339 1792654 1688468
4760 1688468 1509892 1435024 1497929 1336771 1239482 1422804 1329610 1170440 1130314 1208591 1056730
4749 1056730 1113144 944952 1011484 1496365 1615311 1355108 1251957 1063453 1111823 1380435
4739 1380435 950296 714753 894243 897439 796375 859453 831455 847999 853233 1005356 1019422
4728 1019422 898847 929993 808005 943040 704805 752633 1009733 944779 1009662 1136016
4718 1136016 1093733 1202377 1168121 812993 989182 969539 939802 1029707 1186191 1308782
4708A308782j28637r013L4265P344P8122j47944l2264l6331k63250k904j21737
4697F86433K22505l1544L5837J45831J28870L5376j9035k9089J63841L6681J05041
4686A480747j29503N8086K48499J48590j58255j27209j14576k39985J08831o58
4676A274567j18724K65151K9679J63875l0574p3013R6659K267k7128M3893Q7423
4665A714075M2666j0080J14907L17614Q553j45514K31421J66744L2974o5283L27704
4654B735781M4529j49296K16588K67960K66177P4607N2239L05325M14541L37491
4644D565942M22503R3337K89907K76497L47503O66092K94245L93165O67597N83109
4634H599897P55350P01022J090556J160242J049512J036341J648470K063071K553367
$$ plain form
4708 1308782 1180145 1171132 1205397 1212741 1290863 1142919 1110655 1074324 811074 808170 686433
4697 686433 908938 877394 913231 1059062 1187932 1223308 1204273 1175184 1339025 1375706 1480747
4686 1480747 1351244 1409330 1657829 1806419 1648164 1520955 1406379 1166394 1275225 1274567
4676 1274567 1155843 1420994 1450673 1614548 1583974 1510961 1607620 1609887 1582759 1626652 1714075
4665 1714075 1756741 1746661 1861568 2179182 2187735 2042221 2273642 2440386 2473360 2408077 2735781
4654 2735781 2780310 2631014 2847602 3115562 3381739 3456346 3508585 3813910 4228451 4565942
4644 4565942 4988445 5081782 5371689 5648186 5995689 6661781 6956026 7349191 8016788 8599897
4634 8599897 9355247 10056269 11146825 12307067 13356579 14392920 16041390 18104461 20657828
4625B0657828K546617K761222K979012J498901M54842J042352J760580N10326
4617C4211680r78146j521687j132215p10392j6652K19194N46099J161378J643120
4608C3422379K191479K478022K288891K139149K533076K941227K857793L198546
4600E4050562L356107L276157L610839L358906K881978K429886K398606K795598
4592G8158639K439739J981109J920436J576498R67668l4864k55263j57370m82481
4583H6114111j070348j807084k218432k285920k967887l148305k909121k715324
4575F6991690l135448l559592l771681l453060l818381l496025l166595k814981
4567C9775927l070934l015505l152060k708091k445244k310265j970657j777314
$$ plain form
4625 20657828 23204445 25965667 28944679 30443580 30898422 31940774 33701354 34211680
4617 34211680 33233534 31711847 30579632 29869240 29852588 30071782 30617881 31779259 33422379
4608 33422379 35613858 38091880 40380771 42519920 45052996 47994223 50852016 54050562
4600 54050562 57406669 60682826 64293665 67652571 70534549 72964435 75363041 78158639
4592 78158639 80598378 82579487 84499923 86076421 87044089 87009225 86753962 86596592 86114111
4583 86114111 85043763 83236679 81018247 78732327 75764440 72616135 69707014 66991690
4575 66991690 63856242 60296650 56524969 53071909 49253528 45757503 42590908 39775927
4567 39775927 36704993 33689488 30537428 27829337 25384093 23073828 21103171 19325857
4559A9325857j692633j451456j073656j088462r19695q40857p87583p13507m04825
4550A0353183m74910l69576m10985o29471j74792j35537l92677o9621j37857k02303
4540G355454j8047J7144j16577N4163n3927K7209J26343l90908r23608n62855
4530E514391l10336k09525j42354j67889l34442O1066L405j03677k19834j81905
4520C908900m51728m29850o9885J7691j85889j2133J17655K9824j90148o3930
4510B670507j57838n8084J17521l96753k35844k6019O6026J60392m9544k7337
4500B063027j642j32720k48111J05903p4051j70869K79592n7654j65522j9849
4490A578104k43141R2804J30549L288n3060j66576o9527K3418J96992m4719j82245
$$ plain form
4559 19325857 17633224 16181768 15108112 14019650 13099955 12259098 11471515 10758008 10353183
4550 10353183 9878273 9508697 9097712 8468241 8293449 8157912 7765235 7695614 7557757 7355454
4540 7355454 7337407 7354551 7237974 7292137 7238210 7265419 7391762 7000854 6077246 5514391
4530 5514391 5204055 4994530 4852176 4684287 4349845 4410911 4414316 4310639 4090805 3908900
4520 3908900 3457172 3027322 2957437 2975128 2789239 2777106 2894761 2924585 2734437 2670507
4510 2670507 2512669 2454585 2572106 2175353 1939509 1913490 1979516 2139908 2090364 2063027
4500 2063027 2061385 1928665 1680554 1786457 1712406 1541537 1821129 1763475 1597953 1578104
4490 1578104 1334963 1427767 1558316 1561604 1508544 1341968 1272441 1295859 1492851 1448132 1265887
4479A265887J11875K18087o084j8532J40134J9694o3239j48346l82261K07226
4469A344441l9465j12867K47261N061m4460j88115K352N6542r6214j33157K07553
4458A248932K57509l04971J88069j77519j66468R5886J61608q9246j12808r0348
4448A010644J91523J2274j70890L63228k39396j20401L97221o0378k44778k56618
4438H82429n0845P9038J31713n6436n3437n3539j8649j6910o0532J35657L7684
4427I56173K51812n9611j98489l6429k63206M598K50194J32655J58411k73057
4417I23051K2785l704L5856j11200M6591J54364J2553j21786j34825O3174M5161
4406I32020P1468J52005k62323n9804R0295p5810r853M3366K83259k5094l0842
$$ plain form
4479 1265887 1377762 1595849 1589765 1571233 1711367 1731061 1667822 1519476 1137215 1344441
4469 1344441 1304976 1192109 1439370 1444431 1399971 1211856 1214208 1270750 1174536 1041379 1248932
4458 1248932 1506441 1201470 1389539 1212020 1045552 1141438 1303046 1213800 1100992 1010644
4448 1010644 1202167 1214441 1043551 1406779 1167383 1046982 1444203 1383825 1139047 882429
4438 882429 831584 910622 1042335 985899 932462 878923 860274 843364 782832 918489 956173
4427 956173 1207985 1148374 949885 913456 650250 654848 905042 1037697 1196108 923051
4417 923051 945836 942132 977988 866788 913379 1067743 1080296 958510 823685 886859 932020
4406 932020 1003488 1155493 893170 833366 923661 847851 837998 881364 1164623 1139529 1108687
4395A108687J23091l2754k0781p9898r7593r0681j00858N5026k2427J36835j77494
4384H01153Q2932J72062O3689R226p1042R8218j29589R7631N5874k40656M6381
4373I85879J89470O6168j51457j76435l2894J07885J95692M8123o6713Q0693q5924
4362A160487N6404L1265j19489J56229m1961J82013L08094J55141n05R4715K584
4351A984977k2952j11927R2063m4226q3180l7213K26845J1296O0045J95944O5515
4340B337187J93205J3408J82028P8674j18495J80074L18767J71220L52047j7552
4330C690563R8335N63830K489L26954K83214K75598M04059J94591L71378L72056
4320F583067M80014N29139O21753N05158N00390M16052M79222N40979P48313P13839
$$ plain form
4395 1108687 1231778 1199024 1178243 1098345 1000752 910071 809213 864239 841812 978647 801153
4384 801153 884085 1056147 1119836 1129062 1058020 1156238 1026649 1124280 1180154 939498 985879
4373 985879 1175349 1241517 1090060 913625 880731 988616 1184308 1232431 1165718 1246411 1160487
4362 1160487 1216891 1248156 1128667 1284896 1242935 1424948 1733042 1888183 1887678 1982393 1984977
4351 1984977 1962025 1850098 1942161 1897935 1814755 1777542 2004387 2015683 2075728 2271672 2337187
4340 2337187 2530392 2543800 2725828 2804502 2686007 2866081 3184848 3356068 3708115 3690563
4330 3690563 3788898 4352728 4355217 4682171 4965385 5240983 5645042 5839633 6211011 6583067
4320 6583067 7063081 7592220 8213973 8719131 9219521 9635573 10114795 10655774 11404087 12117926
4310A2117926P15997O05152N53506P48470O47668O17923O19091Q27673Q49652
4301A8303058O45158P72095Q80293R19025Q60773Q22910R91752P95983N63496
4292B5554543Q42791P06290M40079L74055O15230N62456P32197M40349O19444
4283C0887434N95016L90364L14880J27612J28922n3003j68066q2068k32026j62991
4273C1746074l36604j87060n69816k63341k07089l58966l15422q37095l82758
4264B8287923o04344o65553p34645o83908p39287o67497n60669r77035o40776
4255B2014209n77176p49230n24807o15287m42532l81634n92657p08699o72232
4246A6749955o28763n50130n57042o43118m99128l99547m50058p65596n68545
$$ plain form
4310 12117926 12833923 13439075 13992581 14741051 15388719 16006642 16625733 17453406 18303058
4301 18303058 18948216 19720311 20600604 21519629 22380402 23203312 24195064 24991047 25554543
4292 25554543 26397334 27103624 27543703 27917758 28532988 29095444 29827641 30267990 30887434
4283 30887434 31482450 31872814 32187694 32315306 32444228 32391225 32223159 32141091 31909065 31746074
4273 31746074 31409470 31222410 30652594 30389253 30182164 29823198 29507776 28670681 28287923
4264 28287923 27683579 27018026 26283381 25599473 24860186 24192689 23632020 22654985 22014209
4255 22014209 21437033 20687803 20162996 19547709 19105177 18723543 18130886 17422187 16749955
4246 16749955 16121192 15571062 15014020 14370902 13871774 13472227 13022169 12256573 11688028
4237A1688028m17505j27396j78493j57792m27340o42401n25404k74349j00381
4228H836967m31631j71892k96725l49049k65482j65365n9049m02092k69099l17039
4218F109544l9329k44519k93559j38929m94393j9234m0107j82713k82524r4566
4208D279671j46511l0100J51920k36436r9761o4777n51622p2612R1201J05451
4198C426424K08026O4510l24625P6657j71081j82968N87m758J06625O3933k01117
4187C062213M5483Q5121l1953j4011n4926O1845j56105j88286j3031R8131J47182
4176C041663K24209J26689l14542l61229N3609p8665q1500R6890j50120j11611
4166B445393j62615J81837M3199R2143l9619J06922P2692k43605M8853J27776
$$ plain form
4237 11688028 11270523 11143127 10964634 10806842 10379502 9737101 9211697 8937348 8836967
4228 8836967 8405336 8233444 7936719 7587670 7322188 7156823 7097774 6695682 6426583 6109544
4218 6109544 6070215 5825696 5532137 5393208 4898815 4879581 4839474 4656761 4374237 4279671
4208 4279671 4133160 4103060 4254980 4018544 3918783 3854006 3302384 3229772 3320973 3426424
4198 3426424 3634450 3698960 3374335 3450992 3279911 3096943 3097530 3092772 3199397 3263330 3062213
4187 3062213 3107696 3192817 3160864 3146853 3091927 3153772 2997667 2809381 2796350 2894481 3041663
4176 3041663 3265872 3392561 3078019 2716790 2770399 2691734 2610234 2707124 2557004 2445393
4166 2445393 2282778 2464615 2507814 2599957 2560338 2667260 2739952 2496347 2545200 2672976
4156B672976l34309R6487J26625j09581j61518J8186M3565k71890Q4191j47556
4146B017176J27733K46034K03741k00421k82097J25401J49859M5724j37638N5997
4136B351509J04898n5833J9624r8751K75080J20891l02090k8615J77704k32447
4126B331970M5391j97678j25694L6212K30897k6513o32M7846j17171r3256J04413
4115B235785J88589P85p5267k75571J65625J77028j05260J79400L3766j06072
4105B418808k56391J59520J53763J0659J0781m8899K05243j7737N383K31193p130
4094B865193J70086J46431k22242q7286q3076r8802M33303l2190J79570Q2420
4084C353407K5273K06808j93585m2720J14070L53095K2741R8208R5001O6495K17140
$$ plain form
4156 2672976 2338667 2435154 2561779 2452198 2290680 2308866 2352431 2080541 2164732 2017176
4146 2017176 2144909 2390943 2594684 2394263 2112166 2237567 2387426 2433150 2295512 2351509
4136 2351509 2456407 2400574 2420198 2321447 2596527 2717418 2415328 2386713 2564417 2331970
4126 2331970 2377361 2179683 2053989 2090201 2321098 2294585 2293953 2341799 2224628 2131372 2235785
4115 2235785 2424374 2425159 2349892 2074321 2239946 2416974 2311714 2491114 2524880 2418808
4105 2418808 2162417 2321937 2475700 2486359 2497140 2448241 2653484 2635747 2641130 2872323 2865193
4094 2865193 3035279 3181710 2959468 2872182 2789106 2690304 3123607 3091417 3270987 3353407
4084 3353407 3378680 3585488 3391903 3349183 3463253 3816348 3839089 3937297 4032298 4098793 4315933
4073D315933R6050j83832R8820K59842L6653J55764L16931p5773Q6356K30332
4063E337076M14754L90835J12286J58638L78417M68792J84194K88036J21156J8616
4053G872800M16291M49981L06993J83374M12297L24450L87685K48669L51508N64292
4043A1518340Q18931P03468O19015Q52471O50609Q50644R29222R98920J200101
4034A9141721J146897J208371J322396J661596K151129K213488K654498J865436
4026C3365532M77853N68448J378757J541842J744050J872402J210393O66238P24202
4017D3549717J196378J381623J625798K010153J901655K179162K204340J911562
4009E7960388K092937J817113J167392J505540J211751J194331R54428O37647
$$ plain form
4073 4315933 4411983 4228151 4326971 4586813 4623466 4779230 5096161 5020388 5106744 5337076
4063 5337076 5751830 6142665 6254951 6413589 6792006 7260798 7444992 7733028 7854184 7872800
4053 7872800 8289091 8739072 9046065 9229439 9641736 9966186 10353871 10602540 10954048 11518340
4043 11518340 12337271 13040739 13659754 14512225 15162834 16013478 16942700 17941620 19141721
4034 19141721 20288618 21496989 22819385 24480981 26632110 28845598 31500096 33365532
4026 33365532 33843385 34411833 35790590 37332432 39076482 40948884 42159277 42825515 43549717
4017 43549717 44746095 46127718 47753516 49763669 51665324 53844486 56048826 57960388
4009 57960388 60053325 61870438 63037830 64543370 65755121 66949452 67903880 68541527
4001F8541527J256236J231768J293138J508681J701524J786578J803203J802902
3993H0925557K072650J796639J984334J980613J678244J990764J876193K445878
3985I6750872L068298K883987L072266L320598L237797K470230K000870J031994
3977A17836912K30140j1476j056968k436745l058341l919641l845434l552253
3969A00186194l408920l128598k923935k729644k467597k230858k086350j953011
3961G9257281j693053j838872k070682j873114k080600j785093j543794j815330
3953F4556743j354744j225883j247682j001346j112225j285090j075787j160727
3945E5093259j483867j998246k046540j956594k193462k024949k386253j784886
$$ plain form
4001 68541527 69797763 71029531 72322669 73831350 75532874 77319452 79122655 80925557
3993 80925557 82998207 84794846 86779180 88759793 90438037 92428801 94304994 96750872
3985 96750872 99819170 102703157 105775423 109096021 112333818 114804048 116804918 117836912
3977 117836912 118067052 118055576 116998608 114561863 111503522 107583881 103738447 100186194
3969 100186194 96777274 93648676 90724741 87995097 85527500 83296642 81210292 79257281
3961 79257281 77564228 75725356 73654674 71781560 69700960 67915867 66372073 64556743
3953 64556743 63201999 61976116 60728434 59727088 58614863 57329773 56253986 55093259
3945 55093259 53609392 51611146 49564606 47608012 45414550 43389601 41003348 39218462
3937C9218462j835597k120932k107718j680103j589067j213055j022138p06132
3929B6943720q40873p17751n14160l76338q7034j48009j34396m3707J64150J17993
3919B4363595K41081J53473L34530N90187L63817N52708P85539J045967J181062
3910B9611959Q59506P66379J308973J582341J697118K002842K021531K450702
3902D2301351K698990L004290L105098L155471L220230K917442L058474L070410
3894F6531756L077144K790260K272727J986233J661809J242633Q74168Q33425
3886H1270155K98187J23744l63288q9846k89532n70598n75893j195469j096258
3877G7511202j374417j669903j807992k241967k212221k703715k915912l199425
$$ plain form
3937 39218462 37382865 35261933 33154215 31474112 29885045 28671990 27649852 26943720
3929 26943720 26102847 25385096 24870936 24494598 24407564 24259555 24125159 24081452 24245602 24363595
3919 24363595 24604676 24758149 25092679 25682866 26046683 26599391 27384930 28430897 29611959
3910 29611959 30471465 31237844 32546817 34129158 35826276 37829118 39850649 42301351
3902 42301351 45000341 48004631 51109729 54265200 57485430 60402872 63461346 66531756
3894 66531756 69608900 72399160 74671887 76658120 78319929 79562562 80436730 81270155
3886 81270155 81568342 81692086 81328798 81238952 80949420 80378822 79802929 78607460 77511202
3877 77511202 76136785 74466882 72658890 70416923 68204702 65500987 62585075 59385650
3869E9385650l018283l176436l474127l059584l042787l154081k964819k203908
3861C5291625k372347j753262j775408k018565j240861j633825j417772j219572
3853B1860013r09800p86346p58179n96919n68927p24283q65202o96263n56024
3844A5398070l76128k84780m09698m67509l85195k2390l20976j68708m07619l34920
3834A2220147K2969l87178j37258j60233j91695l05822j01189j92987L2320j86874
3824A0612200o5312k0845j07212l25663Q6600K82390k90753j10771L99190r5240
3814A0364584o6356J02433j7702J39840J88796K97875L9747K38963K39795J69962
3804A1697937J50264J30080M75128P06433N29380M59026J76812M93340O04998
$$ plain form
3869 59385650 56367367 53190931 49716804 46657220 43614433 40460352 37495533 35291625
3861 35291625 32919278 31166016 29390608 27372043 26131182 24497357 23079585 21860013
3853 21860013 20950213 20163867 19405688 18808769 18239842 17515559 16650357 15954094 15398070
3844 15398070 15021942 14737162 14327464 13859955 13474760 13452370 13131394 12962686 12555067 12220147
3834 12220147 12243116 11855938 11718680 11558447 11366752 11060930 10959741 10766754 10799074 10612200
3824 10612200 10546888 10526043 10418831 10093168 10179768 10462158 10171405 10060634 10459824 10364584
3814 10364584 10298228 10400661 10382959 10522799 10711595 11009470 11049217 11288180 11527975 11697937
3804 11697937 11848201 11978281 12453409 13159842 13689222 14148248 14325060 14818400 15423398
3795A5423398J23096O01610O41609K06891M39357K77496K54619O29626M51819
3786A9049521Q2651J42598L99194J47804J35645K51968K40221K97067L69784J26168
3776B1242621P21625K53621Q8008K62621M02260Q6020K91998L38995L54681J83912
3766B4226362m0717K69886k8769l8717j13638j42476l60672n95921m17421j93642
3756B2564275l88151m80348l82403n81908m47146p0634K0504j2164j69606k6726
3746B0025693O0101K10866K03428O16000O07024O89135P43639Q51733R96113J134080
3736B6137812J363973J502382J375232J577344K048247J978747K420109K791338
3728D1195184K820094L062867L262044L799209L927870M318290M812179N156025
$$ plain form
3795 15423398 15546494 16148104 16789713 16996604 17435961 17713457 17968076 18597702 19049521
3786 19049521 19132172 19274770 19673964 19821768 19957413 20209381 20449602 20746669 21116453 21242621
3776 21242621 21964246 22217867 22305875 22568496 22970756 23056776 23348774 23687769 24042450 24226362
3766 24226362 24185645 24455531 24426762 24388045 24274407 24131931 23771259 23175338 22757917 22564275
3756 22564275 22176124 21695776 21313373 20731465 20284319 20213685 20234189 20222025 20052419 20025693
3746 20025693 20085794 20296660 20500088 21116088 21723112 22412247 23155886 24007619 25003732 26137812
3736 26137812 27501785 29004167 30379399 31956743 34004990 35983737 38403846 41195184
3728 41195184 44015278 47078145 50340189 54139398 58067268 62385558 67197737 72353762
3720G2353762N526787O189910N784943O168806N839607O083395N653724N023757
3712A18624691M790361L975064L880329L067073K741251J730799R65761K34917
3704A40010246N9310n53884j174900j616553j949490k189797k499338k749502
3696A27336092l046676l471736l653749l973535m511808m422637m811793m907010
3688I4537148m973855n185301m664682m973969m685984m268801m274886l694437
3680E7815233l685747l514488l363343k692389k205982j921830k173967j892940
3672C6364547j675350j390142j534538j033765r65976q74020q54102q92046p77828
3663B6366780r08248n98098k73348l30824m39028l91888l46344j68923r7781L2707
$$ plain form
3720 72353762 77880549 84070459 89855402 96024208 101863815 107947210 113600934 118624691
3712 118624691 123415052 127390116 131270445 134337518 137078769 138809568 139775329 140010246
3704 140010246 140069556 139515672 138340772 136724219 134774729 132584932 130085594 127336092
3696 127336092 124289416 120817680 117163931 113190396 108678588 104255951 99444158 94537148
3688 94537148 89563293 84377992 79713310 74739341 70053357 65784556 61509670 57815233
3680 57815233 54129486 50614998 47251655 44559266 42353284 40431454 38257487 36364547
3672 36364547 34689197 33299055 31764517 30730752 29764776 28890756 28036654 27144608 26366780
3663 26366780 25458532 24860434 24587086 24256262 23817234 23425346 23079002 22910079 22812298 22845005
3653B2845005L0267Q7095J58242k34747J18011l09874J12549M19317M1444L21096
3643B3588405j65661m7535k62658N4613l37856l50106m09579m92809o26254m85035
3633B0465525l72099m12084j56980m05956m39702k19432k24263j61768q260J63274
3623A8228255J14100J66539L58212M54578L82024N44306N26602N89069O49460
3614B2013145M92249L44540M85392O95737K76828L3960K70919J20441J60826k2876
3604B4871161j32452k21473k42999o1394Q6464m06411k42199l85000m70185k43852
3594B2551660k52295k36397m55471p02165n73206p01506p51497n97489n14520
3585A7767114p52380o62723o34975n24549n21837n20956m67336j23366k67869
$$ plain form
3653 22845005 22875272 22962367 23120609 22885862 23003873 22693999 22806548 23225865 23267309 23588405
3643 23588405 23422744 23375209 23112551 23167164 22829308 22479202 22069623 21576814 20950560 20465525
3633 20465525 20093426 19681342 19524362 19118406 18678704 18459272 18235009 18073241 18064981 18228255
3623 18228255 18342355 18508894 18867106 19321684 19703708 20248014 20774616 21363685 22013145
3614 22013145 22505394 22849934 23335326 24031063 24307891 24341851 24612770 24733211 24894037 24871161
3604 24871161 24738709 24517236 24274237 24212843 24299307 23892896 23650697 23265697 22795512 22551660
3594 22551660 22299365 22062968 21607497 20905332 20332126 19630620 18879123 18281634 17767114
3585 17767114 17014734 16352011 15717036 15192487 14670650 14149694 13682358 13558992 13291123
3576A3291123m39198j29729k83806j28359j6239m11558J53484j16430J14827L15777
3566A2349892K90057L36060M78588L48600J83782M35158O38747O34183L02966
3557A5998033L60620K06089N70897L89086M08933L38097K70819K80958N34294
3548A9357826j8997J38986K84175L19221K70763m7742J27851J94299k71049r1006
3538B0264327k08905J12862j93620J44361k17237o13953k22311J48703J22154
3529A9336381K9293J1763J46541J56589K82669O43060O51778N29422P89197R53182
3519B3529875J026562J171690J112325J708887J691388J809919J879719K268408
3511C6198773K420735K648156L091792L144420L025419L582303L663158L872564
$$ plain form
3576 13291123 12851925 12722196 12438390 12310031 12293792 11882234 12035718 11919288 12034115 12349892
3566 12349892 12639949 12976009 13454597 13803197 13986979 14422137 15060884 15695067 15998033
3557 15998033 16358653 16564742 17135639 17524725 17933658 18271755 18542574 18823532 19357826
3548 19357826 19338829 19477815 19761990 20081211 20351974 20304232 20432083 20626382 20355333 20264327
3538 20264327 20055422 20168284 19974664 20119025 19901788 19287835 19065524 19214227 19336381
3529 19336381 19365674 19377437 19523978 19680567 19963236 20606296 21258074 21787496 22576693 23529875
3519 23529875 24556437 25728127 26840452 28549339 30240727 32050646 33930365 36198773
3511 36198773 38619508 41267664 44359456 47503876 50529295 54111598 57774756 61647320
3503F1647320L959354M005613M087070L701393L588040L455251L596605L073674
3495I1114320K905063L048860K619221K848574L110583K616909K370097K531197
3487A13164824K424353K376679K240318K176149J949835J202147Q90690P63875
3479A27188870L99989k42536l24695p31593j221240j565438j349053j515692j591477
3470A19047135j697877j712090j847593k086665k015188k479558k661371k851448
3462A01695345l210364l455052l453814l658463l764079l727117l949020l746010
3454G2731426l737649l642685l504138l389885l181106k985209k841491k794292
3446D6654971k694623k274580k303233k031128j884132j802385j730468j445693
$$ plain form
3503 61647320 65606674 69612287 73699357 77400750 80988790 84444041 88040646 91114320
3495 91114320 94019383 97068243 99687464 102536038 105646621 108263530 110633627 113164824
3487 113164824 115589177 117965856 120206174 122382323 124332158 125534305 126424995 127188870
3479 127188870 127588859 127346323 127021628 126290035 125068795 123503357 122154304 120638612 119047135
3470 119047135 117349258 115637168 113789575 111702910 109687722 107208164 104546793 101695345
3462 101695345 98484981 95029929 91576115 87917652 84153573 80426456 76477436 72731426
3454 72731426 68993777 65351092 61846954 58457069 55275963 52290754 49449263 46654971
3446 46654971 43960348 41685768 39382535 37351407 35467275 33664890 31934422 30488729
3438C0488729j116429q95398q34859r32004o62182m67913m12518l85465k72638
3429B4509323j49377O3966j701l1322n6453M3673L01934J94500k5859O8844j06036
3418B4811492o2555j27796k65076k7553m4919L18068K08967l00053j28436J72745
3408B4554884j6413m13847k80870m84454q7960m59649m53516q69524o10925o12219
3398B0265507r68503q65637o07813l72785m76747p17942m68041k55575j41120
3389A5391344l85117k74353k95558J1003J62842Q2957K47151K19083J06803J93507
3379A5459662K77115M78336J24936j0216J00112L55359K50310k14704J79233J14431
3369A7114574K7701J03076J67482Q3853K16135M09247P30215O45319M40948Q42867
$$ plain form
3438 30488729 29372300 28476902 27642043 26710039 26047857 25579944 25167426 24781961 24509323
3429 24509323 24359946 24423912 24422211 24390889 24334436 24378109 24680043 24874543 24848684 24917528 24811492
3418 24811492 24748937 24621141 24356065 24328512 24283593 24601661 24810628 24510575 24382139 24554884
3408 24554884 24538471 24124624 23843754 23359300 23271340 22811691 22358175 21488651 20877726 20265507
3398 20265507 19297004 18431367 17823554 17450769 16974022 16256080 15788039 15532464 15391344
3389 15391344 15006227 14731874 14436316 14447319 14610161 14693118 14940269 15159352 15266155 15459662
3379 15459662 15736777 16215113 16340049 16329833 16429945 16785304 17035614 16820910 17000143 17114574
3369 17114574 17142275 17245351 17412833 17496686 17712821 18122068 18852283 19497602 19938550 20781417
3359B0781417R14627Q74557R17100J170700J098796J428986J524808J377590J538366
3350C1626947K123795K071337K176878K735318K759866L389409L096430L691138
3342E3671118M232303M609694M924828M770810N003865M974133N079466M974615
3334I2240832M268182L637052K652286J975815J349254k5719j008497k023394
3326A03065811k595184l632363m113226m274418m917605m917380m875609n035519
3318F8704507n098085m177277l933116l789281l609083k944699k834852k717853
3310C9600261k563518j896124j675381j815337j707982j399968j324586j200661
3302B6016704j010210r23473p88597p59687o61655o34552l29346p07808p52292
$$ plain form
3359 20781417 21696044 22570601 23487701 24658401 25757197 27186183 28710991 30088581 31626947
3350 31626947 33750742 35822079 37998957 40734275 43494141 46883550 49979980 53671118
3342 53671118 57903421 62513115 67437943 72208753 77212618 82186751 87266217 92240832
3334 92240832 96509014 100146066 102798352 104774167 106123421 106097702 105089205 103065811
3326 103065811 100470627 96838264 92725038 88450620 83533015 78615635 73740026 68704507
3318 68704507 63606422 59429145 55496029 51706748 48097665 45152966 42318114 39600261
3310 39600261 37036743 35140619 33465238 31649901 29941919 28541951 27217365 26016704
3302 26016704 25006494 24083021 23294424 22534737 21873082 21238530 20909184 20201376 19449084
3293A9449084n57559l30239l75081n38695n43270q30584m34685m19286m25017
3284A4994668m57721l03317o38800l005j83405m73460l05423l66246m23849j65933
3274A1673509j03003j98892k51834m01655n29261l22792q399n7792k45423j4986
3264I539472J9617j99825j50064q5888j78714j17718j36463j96713j30622n5219
3254H307863p2612l5182R2714j51862P4138j76263r1057j02488M4681k6918j43103
3243G719911j38054K3366j56954n6386R9881r3715j85497k52903m04511K29104
3233F784242R6947O1875m88894k03032R5646m00576j96323k92083k30530k67756
3223D959516J03730o3648p2669R7325o5780k9479k17331j25124j42092m03209
$$ plain form
3293 19449084 18891525 18561286 18186205 17647510 17104240 16273656 15838971 15419685 14994668
3284 14994668 14536947 14233630 13594830 13591825 13408420 12934960 12629537 12263291 11839442 11673509
3274 11673509 11570506 11371614 11119780 10718125 10188864 9866072 9857673 9799881 9554458 9539472
3264 9539472 9559089 9359264 9209200 9123312 8944598 8826880 8690417 8493704 8363082 8307863
3254 8307863 8235251 8200069 8292783 8140921 8215059 8038796 7947739 7845251 7889932 7863014 7719911
3243 7719911 7581857 7605223 7448269 7391883 7491764 7398049 7212552 6959649 6555138 6784242
3233 6784242 6881189 6943064 6454170 6251138 6346784 5946208 5749885 5457802 5227272 4959516
3223 4959516 5063246 4999598 4926929 5024254 4958474 4928995 4711664 4586540 4444448 4041239
3213D041239J07538L8057J08005J59174K03304j99251m6109J31838k85051M4489
3203D303233J00094J11144M2675j11889Q5432M417J56222P7210k22352J15004
3193D661190j51114K25882r5373l13801R9706K02382q0781J24120j20256p4905
3183D477050L97826J03139r9451J61730j76400N977J5108m45965J26321K36321
3173D801656j74626J23635j48862q9382j1635M32939K583j84397K50404j19044
3163D883271P1625K08783n5597J9085K82323J64418R5001N068j24801k11800k2743
3152E314633M2076J00763L24437o6427J24411K37246P6032M32520K33134o6563
3142F752262J3206L37777M40998L62399K22352k8550K94453M26357K43730M70207
$$ plain form
3213 4041239 4148777 4186834 4294839 4454013 4657317 4458066 4411957 4543795 4258744 4303233
3203 4303233 4403327 4514471 4557146 4445257 4530689 4535106 4691328 4768538 4546186 4661190
3193 4661190 4510076 4735958 4640585 4326784 4426490 4628872 4548091 4672211 4551955 4477050
3183 4477050 4874876 4978015 4878564 5040294 4863894 4869871 4884979 4439014 4565335 4801656
3173 4801656 4627030 4750665 4601803 4512421 4500786 4933725 4936308 4751911 5002315 4883271
3163 4883271 4954896 5163679 5108082 5127167 5409490 5573908 5668909 5673977 5549176 5337376 5314633
3152 5314633 5356709 5457472 5781909 5715482 5839893 6077139 6153171 6585691 6818825 6752262
3142 6752262 6765468 7103245 7544243 7906642 8128994 8100444 8394897 8821254 9064984 9535191
3132I535191K55302M10445L16205M80634N11186L21967M00197P04133M96088L42255
3122A3773603O84992Q63267P94708Q57421Q81551P98404J015199J246465J193880
3113B2109490J516259J422661J955622K110137K184913K104591K615973K848162
3105C8867808L342411L344100L117933L580218L443602L709601L699843L967070
3097F7072586M716621N347098N798686O804425P598831Q566707R497526J0895493
3089A26297973J1990753J2869413J4924739J6043462J7286699J9949869K2063757
3082B41426665K3562564K4032794K2836749J8377015J1798930O431160K738493
3075C51204370J033991q73979m518593r976598j5720756k0309765k2554643k2224019
$$ plain form
3132 9535191 9790493 10200938 10517143 10997777 11508963 11830930 12231127 12935260 13431348 13773603
3122 13773603 14458595 15321862 16116570 16973991 17855542 18653946 19669145 20915610 22109490
3113 22109490 23625749 25048410 27004032 29114169 31299082 33403673 36019646 38867808
3105 38867808 42210219 45554319 48672252 52252470 55696072 59405673 63105516 67072586
3097 67072586 71789207 77136305 82934991 89739416 97338247 105904954 115402480 126297973
3089 126297973 138288726 151158139 166082878 182126340 199413039 219362908 241426665
3082 241426665 264989229 289022023 311858772 330235787 342034717 348465877 351204370
3075 351204370 352238361 351364382 346845789 336869191 321148435 300838670 278284027 256060008
3067B56060008k1117593j9571979j7819657j5432792j2832194j0113318q397150
3060A50775325p116261o038021n317842n397997n171023m925756n043633m835313
3052A06929479m828508n075307n495777n725309n634083n677083n364356m856664
3044F4272392m769097m144127l875183l411815k976162k541413k278747k164112
3036C8111736k332797k118591j868337j600288j497433j217827j068023j075345
3028B5333095j240823j150926q84117j180522q96400o78350r35498l09299n04389
3019A7552771p53652p00098n91125m44492n40263m05445l25687l94831o22186
3010A2774992l11906j46031j57594m59224m60326l28668j80916l36641m67281
$$ plain form
3067 256060008 234942415 215370436 197550779 182117987 169285793 159172475 150775325
3060 150775325 143659064 137621043 132303201 126905204 121734181 116808425 111764792 106929479
3052 106929479 102100971 97025664 91529887 85804578 80170495 74493412 69129056 64272392
3044 64272392 59503295 55359168 51483985 48072170 45096008 42554595 40275848 38111736
3036 38111736 35778939 33660348 31792011 30191723 28694290 27476463 26408440 25333095
3028 25333095 24092272 22941346 22057229 20876707 19980307 19301957 18366459 18057160 17552771
3019 17552771 16799119 16099021 15507896 15063404 14523141 14117696 13792009 13397178 12774992
3010 12774992 12463086 12317055 12159461 11700237 11239911 10911243 10730327 10393686 9926405
3001I926405k67004m92788l40958l75059l05204J17568j1435l36170m38382j97421
2991G279552j86643l26551j11500o8170j79683p4064j14793k68429j61226N1799
2981E840292j25531j66972l42266k35549k14218j6274J56594j75591p0238P6090
2971D726337j32230l57153j69091R2093j56329j30649j95592j96719n8407P4294
2961C496554k3551M5094J65265j22811l76985m4422j63296K06775j27845m13668
2951B641110J25283j05204j12141J20538L5896n1774m6602q169j17000J30284
2941B612221j42583j66396N5094k5019k9017J9850M2960k71417J72258r6664k99225
2930A872062L685j68652L0507N1022o7329J23347M8125j19110k82L02732k8899
$$ plain form
3001 9926405 9659401 9166613 8825655 8450596 8145392 8262960 8251525 7915355 7476973 7279552
2991 7279552 7092909 6766358 6654858 6586688 6407005 6332941 6218148 5949719 5788493 5840292
2981 5840292 5714761 5547789 5205523 4969974 4755756 4739482 4896076 4720485 4650247 4726337
2971 4726337 4594107 4236954 4067863 4159956 4003627 3872978 3677386 3480667 3422260 3496554
2961 3496554 3473003 3518097 3683362 3560551 3183566 3139144 2975848 3182623 3054778 2641110
2951 2641110 2766393 2661189 2549048 2669586 2705482 2653708 2607106 2598937 2481937 2612221
2941 2612221 2469638 2303242 2358336 2333317 2304300 2324150 2367110 2095693 2267951 2171287 1872062
2930 1872062 1875747 1707095 1737602 1788624 1721295 1844642 1892767 1773657 1773375 2076107 2047208
2919B047208j82826k28050N215J05204k63025O3301L5714l661j87950o8380M6826
2908A369576q0119P7525J11094k28782J24890J33445k39340J56166j18179l10342
2898I95934K60851j62722j79631J10943O7848R6134O3125j18645k84446J01050
2888I50441K8858L5671j96929l16459M40278J24294J13033O5976n2697J46709
2878A339175j47348l427r1124N0257j07302N5480j03842r4138k2464J12857P7454
2867A065578p2155Q7643n209r1798k16497J14510n0882K575K61458p9536n5505
2856I60182q1156J22710m2075n2401P6289Q507k7606o2587l6767J90517k05298
2845H50315R1926j26494N9041o1395o7625J93860j87386Q4784j81895o2636O2913
$$ plain form
2919 2047208 1864382 1636332 1641547 1746751 1483726 1547027 1582741 1579080 1391130 1322750 1369576
2908 1369576 1289457 1366982 1478076 1249294 1374184 1507629 1268289 1424455 1306276 995934
2898 995934 1256785 1094063 914432 1025375 1093223 1189357 1252482 1133837 849391 950441
2888 950441 979299 1014970 818041 501582 941860 1066154 1179187 1245163 1192466 1339175
2878 1339175 1191827 1188400 1097276 1147533 1040231 1095711 991869 897731 875267 988124 1065578
2867 1065578 993423 1081066 1075857 984059 767562 882072 831190 833765 1095223 1015687 960182
2856 960182 879026 1001736 959661 907260 983549 992056 964450 901863 865096 1055613 850315
2845 850315 942241 815747 874788 813393 745768 939628 752242 837026 655131 592495 655408
2834F55408N3167M8491n7730O5841J14721p3954k18861K59115o0906l20982L04273
2823G68583R655M3412K22593j91389j13926J65097r6009K348R3444Q7296j17560
2812H73544J54948J2799J13920K66199n89j46984k18961J22719M7069J13636L96809
2801A735109K2946k12347k5257l523L36376J8634L62498Q5239m1915J22721j21798
2790B278683k54387K79490j19146r5093j07167j30916n4307P4141k10944p1258
2780A589096o5956j66330J9589o7861j71128j63301O1444M6856P5403k18840K43395
2769A182367j25406p3550O6479J4313j4105j46438L5091j20004j52800P0022m0057
2758F95912O1589j36806p3204o4606K2448k1611K57011N0370j90696n8122J27967
$$ plain form
2834 655408 708575 757066 699336 765177 879898 805944 587083 846198 785292 464310 768583
2823 768583 778238 821650 1044243 852854 738928 904025 808016 810364 903808 991104 873544
2812 873544 1028492 1041291 1155211 1421410 1420821 1273837 1054876 1177595 1224664 1338300 1735109
2801 1735109 1758055 1545708 1520451 1516928 1853304 1871938 2234436 2319675 2277760 2400481 2278683
2790 2278683 2024296 2303786 2184640 2089547 1982380 1851464 1797157 1871298 1660354 1589096
2780 1589096 1523140 1356810 1376399 1308538 1137410 974109 1035553 1082409 1157812 938972 1182367
2769 1182367 1056961 983411 1049890 1064203 1050098 903660 938751 818747 665947 735969 695912
2758 695912 757501 620695 547491 482885 505333 483722 740733 791103 600407 542285 670252
2747F70252J64131l67746n1386L47243j70390n0518k15619k08664P1826O1798
2737B50927L32239j05727k83794K2725o9655J52670M7620M5024l4667j37104j33653
2726H6605J69387J32100j13924j64654R1340j57290J83316N11M7598J10134j24765
2715B60358J00414M6556j585q9541j32319J57461q1360O1822k45452K1092J63833
2704B61279k14529J0883K21050K18501J91743l27586l33334p605J97838q6812
2694A31428r2086K76123M0721Q6055K1121J69605m7037L2188K50931k18290j34616
2683E16143O5955j48156j87722M3549L3889m3886l3336N0485J43224j14510K11819
2672E37454k83324j66735O1120J19051Q3279K10539M0932k80925J20065q0261
$$ plain form
2747 670252 834383 466637 415251 762494 592104 541586 325967 117303 189129 250927
2737 250927 583166 477439 193645 216370 146715 299385 347005 392029 357362 220258 86605
2726 86605 255992 388092 274168 109514 200854 43564 226880 227391 274989 385123 260358
2715 260358 360772 407328 405743 316202 183883 341344 259984 321806 76354 97446 261279
2704 261279 46750 57633 278683 497184 688927 361341 28007 20402 218240 131428
2694 131428 39342 315465 356186 442241 463362 632967 585930 618118 869049 650759 516143
2683 516143 582098 433942 246220 289769 323658 279772 246436 296921 440145 325635 537454
2672 537454 254130 87395 148515 267566 350845 561384 602316 321391 441456 361195
2662C61195j10718j95787j00777K17052k6927K1939J47992K30699j33982j78577
2652B32109n3386P8434J86141L2565k69281J92318M5112N8244j81569M5361L0003
2641C96051o0771O5591j00341r3437R0173k931O5599p6790L6902k96581N8036
2630H1501J99380q4888J17674J56516j33822j05974q8929J70953j01700j53236
2620E7475J50489J11342j61492M5946J1909k17831n0320Q9790K18075j62660Q8986
2609A81709K47567l8318l6807j4329n7288k04534j50879M2654J06626r141J2341
2598G9601K38970o2833l2582R0518M7107J70337j91239j09841j19015J85289K65462
2587E61774m47764L2704J41329K9026q8055k0777J27632J41208j53888Q8690P6279
$$ plain form
2662 361195 250477 54690 -46087 170965 144038 165977 313969 544668 410686 232109
2652 232109 178723 257157 443298 475863 206582 398900 444012 502256 320687 366048 396051
2641 396051 335280 400871 300530 207093 297266 294335 359934 283144 320046 23465 81501
2630 81501 280881 195993 313667 470183 336361 230387 141458 312411 210711 57475
2620 57475 207964 319306 157814 203760 215669 -2162 -52482 37308 255383 92723 181709
2609 181709 429276 390958 354151 339822 282534 78000 -72879 -30225 76401 67260 79601
2598 79601 318571 255738 223156 313674 360781 531118 339879 230038 111023 296312 561774
2587 561774 114010 146714 288043 317069 229014 208237 335869 477077 323189 411879 488158
2576D88158p1223j57222j80501l4650R2311J82188p0100L1739j7368l33250Q7174
2565A7256J00645j41469P1447J20728k20563N2245j04890q1141Q1210J74288J01980
2554A71736Q6777n1794p2367m8525r2156O130L4384O7198J90176j97507j70586
2543g6534K69278k08008k9685K67938j99680Q8330j2951J83740j83246J09665
2533B08847j06452j01439j24485l6839J40822J07939K44291j20190j14384o9471
2523B8639j18900j13468R8125j135N6971p3363K7640J49367l4490K50338o93o2713
2511B06318j13285j8079j2946k0545K49214j60986j41782P5149Q2107k31436l2436
2500a18707J41162O5434p1259j13643j16230l5593L68512L2881j91256j56451
$$ plain form
2576 488158 416935 259713 79212 44562 136873 319061 248961 280700 263332 -69918 17256
2565 17256 117901 -23568 47879 168607 -51956 289 -104601 -185742 -104532 69756 171736
2554 171736 258513 206719 134352 85827 -6329 -199 34185 101383 291559 94052 -76534
2543 -76534 192744 -15264 -44949 222989 23309 111639 98688 282428 99182 208847
2533 208847 102395 956 -123529 -160368 -19546 88393 332684 212494 98110 28639
2523 28639 -90261 -203729 -105604 -106739 -49768 -123131 -95491 53876 19386 269724 269031 206318
2511 206318 93033 74954 62008 41463 290677 129691 -12091 63058 145165 -86271 -118707
2500 -118707 22455 87889 16630 -97013 -213243 -248836 119676 152557 -38699 -195150
2490a95150p6502L32174J7689J0340K87496j68580k36626L39503m0250m6255j30058
2479I3781k25734j09034J55299j4878J5352J10772J64976n2909J8827R3536M19356
2468F69344j38846m87399R643P8043J48638k95716J19510j14333J19286j54353
2458d6183J24019K89517k89693j3991j25847J32035J00984j96137J84963K52060
2448D11727j54453R9722n2660l53895J00929N1097n1137J59813k72986Q2482K8078
2437D8717O201L4295Q2229q6544j75651J56298Q0736J21372j50104k77311J41774
2426a7988j48360j41570L24887J05159N7340J38249m06430q8852Q8151P6881K05453
2415A92920p9406j06573l2429K03111J54011k06093p3720J36J1263J59658k4414
$$ plain form
2490 -195150 -271652 60522 78211 88551 376047 207467 -29159 310344 270094 223839 93781
2479 93781 -131953 -240987 -85688 -100566 -85214 25558 190534 137625 156452 249988 669344
2468 669344 530498 43099 52742 130785 279423 -16293 103217 -11116 108170 -46183
2458 -46183 77836 367353 77660 63669 -62178 69857 170841 -25296 159667 411727
2448 411727 257274 356996 304336 -49559 51370 102467 51330 211143 -61843 20639 48717
2437 48717 54918 89213 171442 84898 -90753 65545 146281 267653 117549 -159762 -17988
2426 -17988 -166348 -307918 16969 122128 179468 317717 -88713 -177565 -89414 -12533 192920
2415 192920 113514 6941 -25488 177623 331634 125541 51821 51957 63220 222878 198464
2404A98464J4134j76048o7221P2191k84310K06737K09579j68642Q6394R0145k76899
2393i5476J70944P294P5462r7034j2770l4160j93192K99947J195k04388M4199
2382c7979o3212J66665J92061m680k06737j22020j18718p0389J04497M20905q0645
2371A79748k41463Q3865J3825j12781j85333J09936K41411K58673k77989o277
2361F3615r4243J48922j37795K09986K4405k40040J46514J11674K27074j32338
2351C27774m12080J40196l58454J18214J29966L5609l3348L0364j3853j07421
2341a43033K03654J1103J17353J04860j93596L324k004P1878N4975r77k02287
2330B5250r0149K72212J30459j63135j04133J4800J51793J83914m6399N5472P8671
$$ plain form
2404 198464 212598 36550 -30671 41520 -242790 -36053 173526 4884 91278 181423 -95476
2393 -95476 75468 82762 158224 61190 48420 14260 -178932 121015 122210 -82178 -37979
2382 -37979 -101191 65474 257535 252855 46118 -75902 -194620 -265009 -160512 260393 179748
2371 179748 -61715 22150 35975 -76806 -262139 -152203 89208 347881 69892 63615
2361 63615 -30628 118294 -19501 190485 214890 -25150 121364 233038 460112 327774
2351 327774 -84306 55890 -302564 -184350 -54384 -18775 -52123 -21759 -35612 -143033
2341 -143033 60621 71724 189077 293937 100341 103665 101661 173539 228514 227537 25250
2330 25250 -64899 207313 337772 174637 70504 85304 237097 421011 374612 430084 508755
2319E08755j45185l21763K4127L03663j77884k83931j49743N9498K77406R7803
2309A92746L188J850K4782m0179J32940r0633J61108k8122k0461j25186j28165
2298H3868N4365j99120P559J33912L39566J74704L6065k21431k7982J89187j50370
2287D20323O9362K3027j9513L32500J91727k35491j00942O2322J52072J32663
2277A028050O7134k5039k21498m7971j72669P4686K10994Q9877j03296L183k4740
2266H78711K5917k25920j50670k33146k75033J90355k5036P169n7192J44211J45392
2255D24758K62378n08212l0302J07235j86003j28199J25129J13751Q2662j32562
2245A30635j79509N4183M65025k46584j61988K3432J46143J72350j77322p4690
$$ plain form
2319 508755 363570 41807 65934 369597 191713 -92218 -241961 -182463 94943 192746
2309 192746 195934 197784 222566 182387 315327 224694 385802 357680 337219 212033 83868
2298 83868 138233 -60887 -53328 80584 420150 594854 630919 409488 381506 570693 420323
2287 420323 489685 512712 493199 825699 1017426 781935 680993 743315 895387 1028050
2277 1028050 1095184 1070145 848647 800676 628007 702693 913687 1003564 900268 903451 878711
2266 878711 904628 678708 528038 294892 19859 210214 185178 192347 135155 279366 424758
2255 424758 687136 178924 148622 255857 69854 -58345 66784 180535 263197 130635
2245 130635 -48874 5309 470334 223750 61762 85194 231337 403687 226365 151675
2235A51675J64458Q3383j73069q9083J8836q9495m4119l2859j1390K58332p0607
2224A66062j9872j35312r7951l543K04620k21835n0664R6415K85231R0585k6918
2213B86818k00950j88116m808J14661K81546k38758P4612M8442l34987j99838
2203c61378Q0758J69684M385r3023m9089L83042k80482k16312J67013P0197k36496
2192c61701j83146L62250K07814j0749j96057Q8101L30339J0447k06782Q5683
2182A26199J71366K20267k35473k30271J59693M7449m02036k00035J00507Q547
2172b33787K02100P5139j43503N6661J12389l3674J2027N9565J36945j68338n9860
2161A5664J76763j8321k96817Q5731J53931J26693j12072j31673J9055l4526M1878
$$ plain form
2235 151675 316133 399516 226447 137364 156200 66705 22586 -10273 -21663 236669 166062
2224 166062 146190 10878 -87073 -90616 114004 -107831 -158495 -62080 223151 313736 286818
2213 286818 85868 -102248 -107056 7605 289151 50393 125005 173447 -161540 -361378
2203 -361378 -280620 -110936 -106551 -199574 -248663 134379 -146103 -362415 -195402 -125205 -361701
2192 -361701 -544847 -182597 25217 14468 -181589 -93488 236851 247298 40516 126199
2182 126199 297565 517832 282359 52088 211781 259230 -142806 -342841 -242334 -233787
2172 -233787 -31687 43452 -100051 -43390 68999 35325 47352 106917 243862 75524 15664
2161 15664 192427 174106 -122711 -36980 116951 243644 131572 -101 18954 -15572 26306
2150B6306N5207p5299r9738l4715n3026N3828q5732R3035L38281J24870r9982
2139B43035j78671k30898J97450R5387j17958O0800O9693J046l17848j8966j58444
2128c55374N9930J22038P0369J60348r1056k19744p5161J25075N9183J50582K4426
2117C0616j81129K38571J51161j22638L4499j29154J7285j05421K2949J71055
2107A27794L51682o9386k95718O2015J37445j85982N1963P065k755J33122j9700
2096B97545M0205K6687j2427j42640l24357O0620J58868n9081J11199N214J1221
2085A73054n1570j39406n8887J48640m1493k9449R1451k1421j58533j53145K99228
2074E8469k50056J60726K82477k42265J66054l9254P9222q1984j78772M5549m607
$$ plain form
2150 26306 81513 6214 -93524 -128239 -181265 -127437 -213169 -120134 218147 343017 243035
2139 243035 64364 -166534 30916 126303 8345 69145 138838 139884 -177964 -196930 -355374
2128 -355374 -295444 -173406 -103037 57311 -33745 -253489 -328650 -203575 -144392 6190 30616
2117 30616 -150513 88058 239219 116581 151080 21926 39211 -66210 -43261 127794
2107 127794 479476 410090 114372 176387 313832 127850 179813 186878 184123 317245 297545
2096 297545 337750 364437 352010 209370 -114987 -54367 104501 45420 156619 161833 173054
2085 173054 121484 -17922 -76809 71831 30338 889 92340 70919 -87614 -240759 58469
2074 58469 -191587 -30861 251616 9351 175405 136151 215373 133389 -45383 166 -4441
2063d441n3754R6766o662l0397j64365K72247L13948m31920l92371Q3077J56939
2052a60933j6033R756r275J13559J38178l7939L3917o8371j07569j03490N7367
2041a50833L826j26314J84171p2541Q8545R1710j21562K41696j84310j429P7482
2030C0441j04484l4798p8138K7529J67995J75204k473k33523J814J71218p2580
2019D8205j84920k21674L31550O7957Q0970j44345j20784J41376q0198K20130
2009A38267m4821j64322l14347J94381R8661K81420J51928l60809k04485K34532
1999A0405k9737j74330K85633J09817j57943l39941J33723J21236K10060o2590
1989A06333O6677j32764Q6981P4265R0369l14605j03470L05684J04173m5328j63438
$$ plain form
2063 -4441 -58195 38571 31909 1512 -162853 109394 423342 -8578 -400949 -317872 -160933
2052 -160933 -176966 -167210 -176485 -62926 75252 37313 71230 2859 -104710 -208200 -150833
2041 -150833 -147007 -273321 -89150 -161691 -73146 18564 -102998 138698 -45612 -47041 30441
2030 30441 -74043 -108841 -186979 -159450 8545 183749 181276 -52247 -50433 120785 48205
2019 48205 -136715 -358389 -26839 41118 122088 -22257 -143041 -1665 -81863 138267
2009 138267 93446 -70876 -385223 -190842 -92181 189239 341167 -19642 -224127 10405
1999 10405 -19332 -193662 91971 201788 43845 -296096 -162373 -41137 168923 106333
1989 106333 173010 40246 127227 201492 291861 -22744 -126214 179470 283643 238315 74877
1978G4877j69302J03197k330Q299l9288m4004p1471J58871P0147j47112J87195
1967A29079P0251q0828L3489N5844l05277Q3229J12401r3140P3474j31735p1006
1956a24219P0764j67926J19304M2047J27278K8849j9486J0234j8827O2829j22817
1945H030N628O0975k62178N8469m3022J3695m1234J82953o847N1180L2606n8506
1933A749m01231P7065K21977L07606j00408j03357P6019j86810K01336m5385j14729
1922f6168Q8413M704J49408k04616R5794L8272j54763N3689j85296P7527N2681
1911e0355M8696j15000j7214K58635Q5299k35126o5588n9447n1744L2749K05004
1900C5909j13212J74305k1387J7667Q4725M0426k54353k3282R9082K63507j97284
$$ plain form
1978 74877 -94425 8772 6442 14741 -24547 -68551 -140022 18849 88996 -58116 129079
1967 129079 199330 118502 151991 207835 -97442 -14213 98188 5048 78522 -53213 -124219
1956 -124219 -53455 -221381 -102077 -60030 67248 96097 76611 86845 68018 130847 8030
1945 8030 13658 74633 -187545 -129076 -172098 -158403 -199637 -16684 -23531 27649 60255 1749
1933 1749 -399482 -322417 -100440 207166 106758 3401 79420 -107390 93946 48561 -66168
1922 -66168 22245 26949 176357 -28259 67535 105807 -48956 4733 -180563 -103036 -50355
1911 -50355 -1659 -116659 -133873 124762 210061 -25065 -90653 -150100 -201844 -169095 35909
1900 35909 -77303 97002 75615 93282 178007 218433 -35920 -59202 39880 303387 106103
1889A06103m504N8101j73419m7844J29045J15275r6607p031R840k10112J96586
1878G5433K09806j26214j62667L4589O8830K1062r1478j2926J55724k61410K4154
1867f5097J59049J33948Q5322J3623j60171j9637m3521P5943J75151k28407j79606
1856e3403J18784j91582j33212J7537K98642k8147J01484L1190k50311n0052j71938
1845c11008rJ13478P9J35240M41351J45250l10401k92103R0611J37694o751j06514
1833C6917j58646k79010K01029K50180q4431p7279o4114K44565J00113l39630
1823a70306p0971J38591J00601J39093j60671J36770M404j66822J1208L0734j21717
1812a29086R3975n5964M0180q4242K12240K13397j01879l2673j35625k3236j62459
$$ plain form
1889 106103 101599 159700 -13719 -61563 67482 182757 86150 79119 88959 -121153 75433
1878 75433 285239 159025 -3642 30947 99777 120839 29361 16435 172159 -89251 -65097
1867 -65097 93952 227900 313222 326845 166674 147037 103516 179459 354610 126203 -53403
1856 -53403 65381 -126201 -259413 -241876 56766 28619 130103 161293 -89018 -139070 -311008
1845 -311008 -311017 -197539 -197460 -62220 379131 524381 213980 -78123 12488 150182 143431 36917
1833 36917 -121729 -400739 -199710 50470 -33961 -111240 -175354 69211 169324 -170306
1823 -170306 -241277 -102686 -2085 137008 -23663 113107 117511 -49311 -38103 -7369 -129086
1812 -129086 -35111 -91075 -50895 -135137 77103 290500 188621 155948 20323 -2913 -165372
1801a65372K2604J91036n8210j896m7563q0047J594R0766L5456j73654r5922Q43
1789b80365O1331K14009J36962r5200k61854k41344L72219J37001l93525J59742
1779a91024L20153L7896J46625m1304j83678q9548j24540J08097J79578m234J2039
1768A70060J948J85p724l2259r1158J64187m7423m81195K47333L3465k09920J95269
1756e7232L3709m8039J17610j89967l9082J80501Q1074j03849k12113j49850J72915
1745b14323L15484p4629j32721K18811J64896j50707j63175o2705Q8610O1343
1735E0884L3658n6007k45330J69861K90842k58674J23668k18099p0113J38058
1725d1252J73563j21110j50954o527L7680J05271j98073q1703o7330Q0218J80471
$$ plain form
1801 -165372 -142768 48268 -9942 -11838 -59401 -139448 -137854 -47088 -11632 -185286 -281208 -280365
1789 -280365 -219034 -5025 131937 36737 -225117 -466461 -94242 42759 -350766 -191024
1779 -191024 129129 167025 313650 272346 88668 -880 -125420 -17323 162255 158021 170060
1768 170060 172008 172193 164469 132210 41052 205239 157816 -323379 -76046 -42581 -252501 -57232
1756 -57232 -23523 -71562 46048 -143919 -183001 -2500 78574 -25275 -237388 -387238 -214323
1745 -214323 101161 26532 -106189 112622 277518 126811 -36364 -99069 -10459 50884
1735 50884 84542 28535 -216795 -46934 243908 -14766 108902 -109197 -179310 -41252
1725 -41252 132311 11201 -139753 -146280 -108600 -3329 -201402 -283105 -350435 -270217 -89746
1714h9746P678J94731J35901o3619l8704J00746l80439k3600L9633L5501J3812
1703f8106K1848J12860r7256k65999L7510L14922L7098j09618P9495j96016J2748
1692a20514l2995o9193J05669j07338K27662K30342j75111j19459M21584j00415
1682B60232r3918m9473J35054k95585j68631J29530K9959k7947Q8442Q6639k93031
1671a98729j4652J1693Q9197r9892K4213m593r0311j0832L9421P2035p1653J56834
1659i7269J78427l462J57034k30664k4760k79247n0590K06952J09229L4526O8514
1648F8690J12913k16964m1667j34757R7355P2982M06975k40497j44503O853J6585
1637C965K78088m22806j08897J98742n5762p4962K00995O9213r5813j08103N3952
$$ plain form
1714 -89746 -82068 112663 248564 184945 146241 246987 -133452 -157052 -117419 -81918 -68106
1703 -68106 -46258 66602 -30654 -296653 -259143 55779 92877 -16741 62754 -133262 -120514
1692 -120514 -153509 -222702 -117033 -224371 3291 233633 58522 -60937 360647 260232
1682 260232 166314 116841 251895 -43690 -212321 -82791 -52832 -80779 7663 94302 -198729
1671 -198729 -213381 -201688 -112491 -212383 -188170 -192763 -283074 -293906 -254485 -182450 -254103 -97269
1659 -97269 81158 77696 234730 4066 -20694 -299941 -350531 -143579 -34350 176 68690
1648 68690 181603 -35361 -77028 -211785 -114430 -41448 365527 125030 -19473 -12620 3965
1637 3965 282053 -140753 -249650 -50908 -106670 -181632 19363 88576 -7237 -115340 -61388
1626f1388K00913N571j26502l2432O3998R2258K00439k03619j10092l09528M4871
1615b35511k12191K13411K40028J71205J16585l08215p7966k46783j17721L86229
1605g0929P505k04080j5963P9100J99079J54779P3860j00593j16536j4925M7389
1594C8686k4563J8161l7478p9285M6522p6414K36651j74157J73643N9401q5704
1583I5463m9783L6748j4433P1219k18093j89637K10995q7436J49147q6753M1757
1572d0806P0760k5499j83991J10055k4358K74524N4255l7182r8697m4642n0067
1561D352j56013M8939L39501K65633k82617k0230J96234j96828j83p6027J55569
1550B78330j8816r7624l93708j80355J62159K27584J29234j42031j76088J05610
$$ plain form
1626 -61388 139525 145096 18594 -13838 50160 142418 342857 139238 29146 -280382 -235511
1615 -235511 -447702 -234291 5737 176942 293527 -14688 -92654 -339437 -457158 -70929
1605 -70929 -63424 -267504 -283467 -204367 -5288 149491 223351 122758 6222 -8703 38686
1594 38686 14123 32284 -5194 -84479 -37957 -114371 122280 -51877 121766 181167 95463
1583 95463 45680 82428 67995 139214 -78879 -268516 -57521 -144957 4190 -82563 -40806
1572 -40806 29954 4455 -179536 -69481 -93839 180685 234940 197758 99061 54419 4352
1561 4352 -151661 -102722 236779 502412 219795 199565 395799 198971 198788 122761 278330
1550 278330 259514 161890 -231818 -412173 -250014 -22430 106804 -35227 -211315 -105705
1540a05705J83581l51797n6341M96800N1323J2036k33306j36749N9006j65253
1530b46405j52698J44210k2081K14467Q1256j52650J66563n5979m047o5736K66351
1519A73251L9747j98150j17369p3100J28588O4168n0776j0188j99665N1846O4469
1508a27179j2350j93274P567K76736n804j15090j04474l5327J5773K41714M08284
1497C56576q2346j09399J73997j86576n5472p3007R8407J34627k19242m8886q5131
1486i6452N8164j2317L6950l03135j16547K43508J35155K58643m5044j65252J11402
1475A05075J05705j74105j04279Q7994J21069j08733J3877k6061l42923J5143
1465c07238K00876N0070j09870j15831J02773o2239K99699o7225l23148K56164
$$ plain form
1540 -105705 77876 -273921 -330262 166538 217861 229897 -3409 -140158 -81152 -246405
1530 -246405 -399103 -254893 -276974 -62507 18749 -133901 32662 -23317 -27364 -93100 173251
1519 173251 212998 14848 -102521 -175621 -47033 17135 -33641 -43829 -243494 -191648 -127179
1508 -127179 -139529 -332803 -325236 -48500 -54304 -169394 -273868 -309195 -293422 -51708 356576
1497 356576 274230 164831 338828 152252 96780 23773 122180 256807 37565 -11321 -96452
1486 -96452 -38288 -50605 -13655 -316790 -433337 -189829 -54674 203969 158925 -6327 105075
1475 105075 210780 36675 -67604 20390 141459 32726 46603 20542 -322381 -307238
1465 -307238 -106362 -56292 -166162 -281993 -179220 -241459 58240 -8985 -332133 -75969
1455g5969J96957M8293n3402Q721l9186k0602m6876j20937J96004K186j66716
1444g1527n9952P9008J61511j43576K5845L23272J20039n43801j02937L04347
1434I2229n5790o1324l0188K85726j36457n7410j89202K0302R8427j19036J8711
1423a34012J72645P1845j54995Q2484K7667J55849j09665K2307J55489p2689j04597
1412A12328J53995l86266k14314J54235J38488n8396J52687j52291M3816j28135
1402a83853n1260L40334J83643k25547k23348j74572J67243L23309r5066j24210
1392f3327K2605q1015J29016N2647j19716J37282j43030J09359k3376j04306r718
1381i3579J76255O9835J1090j56776o212R0646j48063j27190J44812l819p6277
$$ plain form
1455 -75969 120988 169281 115879 124600 85414 64812 17936 -103001 93003 95189 -71527
1444 -71527 -131479 -52471 109040 -34536 -8691 314581 434620 -109181 -212118 92229
1434 92229 36439 -24885 -55073 230653 94196 36786 -152416 -132114 -33687 -152723 -134012
1423 -134012 38633 110478 -44517 37967 65634 221483 111818 134125 289614 216925 112328
1412 112328 266323 -119943 -334257 -180022 -41534 -99930 52757 -99534 -55718 -183853
1402 -183853 -235113 105221 288864 63317 -160031 -334603 -167360 155949 60883 -63327
1392 -63327 -40722 -121737 7279 59926 -59790 77492 -65538 43821 20445 -83861 -93579
1381 -93579 82676 152511 163601 6825 613 91259 -56804 -183994 -39182 -43001 -119278
1370a19278R3844q4217l2893j0310J54370j79151J95150R4348k68565K4802J7435
1359a14465J39769L118k04728q8067L16132j66089J33637K70213j19804J10830
1349B80546j275l02390k1783K20152r8723j49470L7531q3389J63059K0907R1598
1338A56763j38263J11683m7996j14474k5837k23161k29778J63914L32315M4233
1328B9399j12744M692n8871J22385J29486q7388L5359j28932L3470j35898k09255
1317c78297r2153J48507J94690L45722q2815j41646K56263j49458j51741K47231
1307A96303l7398j81677q9419K24194K54810j61233j97550q8428K4255J43077
1297H6934m1813j95552O3592J69414k2029j8161L07360p7504l4655J34494m20237
$$ plain form
1370 -119278 -25434 -109651 -142544 -152854 1516 -177635 17515 111863 -156702 -131900 -114465
1359 -114465 25304 28422 -176306 -264373 51759 -114330 19307 289520 169716 280546
1349 280546 279271 -23119 -44902 175250 76527 -72943 -35412 -118801 44258 65165 156763
1338 156763 18500 130183 82187 -32287 -58124 -281285 -511063 -347149 -14834 29399
1328 29399 -83345 -78653 -137524 -15139 114347 26959 62318 -66614 -33144 -169042 -378297
1317 -378297 -470450 -321943 -127253 218469 135654 -5992 250271 100813 -50928 196303
1307 196303 158905 -22772 -112191 112003 366813 205580 8030 -80398 -56143 86934
1297 86934 45121 -150431 -86839 82575 60546 42385 349745 272241 237586 372080 -48157
1286d8157n7446J14706m0660M7823r0042q1491J09295Q6999j00613J84449p2139
1275E2724j54322N7498k1671K98122K0209q7621k22279q7725M6247m7764o4347
1264b10929k90977J26352K24652K83549j24497L8577L1261J19201K9753l2666
1254A94276J07447j07110k56408j37160n4641k4407R1859k33724m708K14408K3814
1243a86354m2502K02654j1854P5921m2370J10571n7374k0510j13680M7252q5013
1232a23259j36648O5888L7925q5967R6057J16947M3991L5763J30432j07687R1535
1221A64977K04338j10103J2147j66868j17291M0412j59422j21869K36997r9411
1211a16093K82031j87066R852p3597j3072L13451j69735q5131j44458K0728o6656
$$ plain form
1286 -48157 -105603 9103 -31557 16266 -73776 -155267 -45972 41027 -59586 124863 52724
1275 52724 -101598 -44100 -65771 232351 252560 164939 -57340 -145065 -98818 -146582 -210929
1264 -210929 -501906 -375554 -150902 132647 8150 46727 77988 197189 226942 194276
1254 194276 301723 194613 -61795 -198955 -253596 -278003 -186144 -419868 -424576 -210168 -186354
1243 -186354 -228856 -26202 -38056 37865 -4505 106066 48692 28182 -85498 -38246 -123259
1232 -123259 -259907 -194019 -156094 -242061 -146004 -29057 14934 50697 181129 73442 164977
1221 164977 369315 259212 271359 104491 -12800 27612 -131810 -253679 -16682 -116093
1211 -116093 165938 -21128 -11276 -84873 -97945 215506 45771 -39360 -183818 -163090 -229746
1200b29746K71479o6061j08150j65696J50153K49194p7987k5548k135j78894K48822
1189F5431j61603j69641L70055n5673J33254l2806l1706K1358P9347j50959L9132
1178A06189P1690J1082K08M385l89297N128M8027l6864l8138K4002K1381K32977
1166F0770P6889K07552J35160k12347j60983j92910j88852N7267K10781p8763
1156h5436M4605R5962q1648K8976J76090j82528k98094M2013J92539J98566J01544
1145B32589k78086l7275O302j90825J35135K13617n0279l1771J42865K54132l12418
1134H3986j57848k4346r6700k7152R3694J24213n3798o3142K06274o2046L7993
1123F1128j16344j32835K25804J96311J868k59821n531l0297k0076P6360j05615
$$ plain form
1200 -229746 41733 -24328 -132478 -298174 -148021 101173 23186 -2362 -4497 -183391 65431
1189 65431 -96172 -265813 104242 48569 181823 149017 117311 138669 218016 67057 106189
1178 106189 177879 188961 189169 193554 -195743 -190615 -142588 -179452 -217590 -193588 -172207 60770
1166 60770 137659 345211 480371 268024 107041 -85869 -274721 -217454 -6673 -85436
1156 -85436 -40831 55131 -26517 2459 178549 -3979 -302073 -260060 -67521 131045 232589
1145 232589 -45497 -82772 -76470 -267295 -132160 81457 31178 -593 142272 396404 83986
1134 83986 -73862 -98208 -194908 -222060 -128366 -4153 -57951 -121093 85181 23135 61128
1123 61128 -55216 -188051 37753 234064 235932 -23889 -29420 -59717 -79793 -3433 -109048
1112a09048Q303K97041j82172j52072K8478n8101L37088o2616p2190J7456m2834
1101I333N6523o0836Q4021J18446M157m1879k25136o9464J12526r1473P1460P6706
1089D4384J99208R4305l85152j0674J44452m6764j14539l2721P1404m6068r5594
1078a77759J73955R123n9307K34603Q0398k50917l05236J3397J37412J44078q938
1067i191J43766P5432r1722j46965l6661j04457J34287K85485k49591j64213K38845
1056G5015k36413n2806K42198j779j65864J49618r4435N3688P2866p8910J85011
1045A48189J13213L6815l08806p3381k10724R1044P402j6464Q6532N8083K7978
1034d0119j45101P1533P3183O4974p0962l0088M2565J29902N9770n0526J6161
$$ plain form
1112 -109048 -100745 196296 14124 -137948 -109470 -167571 169517 106901 34711 52167 9333
1101 9333 65856 5020 89041 207487 211644 169765 -55371 -124835 -12309 -103782 -32322 44384
1089 44384 243592 337897 -47255 -57929 86523 39759 -74780 -107501 -36097 -82165 -177759
1078 -177759 -3804 5319 -53988 180615 261013 10096 -295140 -281743 -144331 -253 -9191
1067 -9191 134575 210007 118285 -28680 -65341 -169798 -35511 249974 383 -163830 75015
1056 75015 -161398 -214204 27994 26215 -139649 9969 -84466 -30778 42088 -36822 148189
1045 148189 261402 298217 -10589 -83970 -294694 -203650 -196248 -212712 -126180 -68097 -40119
1034 -40119 -185220 -113687 -40504 24470 -46492 -76580 -34015 95887 155657 105131 121292
1023A21292M5603J47197O6044k61517J29364r5183Q5343n5027k55218j3202J49523
1012F4219K65671J00852k02829k08852N3014J27464m4455p5518j5927k4574K64068
1001C03133J29647P3186j54117k65929M8755Q3423k12365P4498M0230K6983J517
990A48961R7563j16113l25898K2033M57676J03572j16614k60489j3851O4403J1143
979G2386q015m9245k16159l1605M24639j65012j31734m6611N1249j15884K4267
968a91724K89844J3864K19163j74425l18395o1427j82300Q9589K50691Q1691P3904
957I0475q9399l53760O4643K2592J97709J40810K22859r5288j08938l4573n212
946E1918K7120J700j9913J4984N6240j70504l970n4946j07416J16436K51882J2102
$$ plain form
1023 121292 166895 314092 380136 118619 247983 152800 238143 183116 -72102 -85304 64219
1012 64219 329890 430742 227913 19061 72075 199539 155084 79566 63639 39065 303133
1001 303133 432780 505966 351849 85920 134675 218098 5733 80231 120461 147444 148961
990 148961 246524 130411 -195487 -173454 284222 387794 271180 10691 -3160 61243 72386
979 72386 64371 15126 -201033 -232638 192001 26989 -104745 -151356 -100107 -215991 -191724
968 -191724 98120 111984 331147 156722 -161673 -223100 -405400 -315811 -65120 16571 90475
957 90475 1076 -352684 -288041 -265449 -67740 73070 295929 200641 91703 57130 51918
946 51918 79038 80738 60825 75809 132049 -38455 -42425 -97371 -204787 -88351 163531 175633
934A75633J84701k36942j89608r2973J52603J31669n9438m8843J11787J7533j16854
923B9268J33223L86828p9625l26838o2674m7406J20490k5237k071j21012l42860
912c37914n1536O6453J82387K63546k6028j56487J74107J9231J73409j13868l97690
901b04390J44666n4584j83727L24783J72096j11482m0108m9394k75261K08588
891f8813P1422j50778J60592j23236k8334J42298n5030j5573J84848j27563O3216
880E3049j2393J18368o5988q2972j71339m4676J24556K3723j57123K4479J89376
869i40J81735l3603j53304P2476l3669l84141j91388J70189K22606j41283J76301
858a15021L49127k44422k07233O0372K27402j20114K34696p4515p5943P7594K3929
$$ plain form
934 175633 360334 123392 -66216 -159189 -6586 125083 65645 16802 128589 146122 29268
923 29268 162491 549319 469694 142856 80182 32776 153266 128029 125958 4946 -337914
912 -337914 -389450 -322997 -140610 122936 96908 -59579 114528 133759 307168 193300 -204390
901 -204390 -59724 -114308 -298035 26748 198844 87362 47254 -2140 -277401 -68813
891 -68813 2609 -148169 12423 -110813 -139147 3151 -51879 -67452 117396 -10167 53049
880 53049 40656 159024 93036 10064 -161275 -205951 -81395 -57672 -214795 -190316 -940
869 -940 180795 147192 -6112 66364 32695 -351446 -542834 -372645 -150039 -291322 -115021
858 -115021 234106 -10316 -217549 -157177 70225 -49889 184807 110292 34349 111943 135872
847A35872q0940l4595j33682J45214M5764k23863O1322j16107K54360J434j52365
836i7586k78071J43538M74283j37139l1083m3595l2235J23345k05666J65423M4353
825A25567J21682n9129j11023r6229p1220J57017J40503j83897K56729N1807J14119
814D45926M2294j14577j17830l12977K34928j16433r2089l19114L03915O9219
804B3262L7742J88657j49444j40404j32449j06668J04867K97224J60891j23243
794A60435k33084j844N8950m2274j65301J11867J24311K7481L072j42263L2401
783f6249K57731p9689j77453o9290L0806M5895O5934k8794j54876J60624O9006
772E3645j20286K2685k03402O7290O7199k09260J53974J73258l2847J06670k10187
$$ plain form
847 135872 54932 20337 -113345 31869 77633 -146230 -84908 -201015 53345 54779 -97586
836 -97586 -375657 -232119 242164 105025 73942 30347 -1888 121457 -84209 81214 125567
825 125567 247249 188120 77097 -19132 -90352 66665 207168 23271 280000 331807 445926
814 445926 488220 373643 255813 -57164 177764 61331 -30758 -349872 -45957 23262
804 23262 61004 249661 100217 -40187 -172636 -279304 -174437 122787 283678 160435
794 160435 -72649 -74493 -15543 -57817 -223118 -111251 13060 40541 43613 -98650 -66249
783 -66249 191482 111793 -65660 -134950 -104144 -58249 7685 -21109 -175985 -15361 53645
772 53645 -66641 -43956 -247358 -180068 -112869 -322129 -168155 5103 -27744 78926 -131261
761a31261L9905J21915J57702n1532k25275J80911J11788j84816k12428k39029
751d32120K06036L56866k04355j85082J53708j3575J26689L50400l89895l00381
741c31709n3520K59558P3553r7005j63131L11687K48667m7964O665R941j85227
730C1515j46952j39703j7471K85861J99784k2025j16405J14979q0021j12688P4217
719G1091J92910O3320j58441J12188j00311M0501j88003p1017o9045J44933J0004
708D8130J48242N7065l49690q5335k6957R8604r7966J71759L7043j05417K1961
697h2561p887Q1267P1909j23855k6429j77641l7807M8569o7381j9247J36697j7711
685b22077J36712l5575k42703J10447m9393J1645L37731L9553l2157j55841l21979
$$ plain form
761 -131261 -91356 30559 188261 136729 -88546 92365 204153 19337 -193091 -432120
751 -432120 -226084 130782 -73573 -258655 -104947 -118522 8167 358567 -31328 -331709
741 -331709 -385229 -125671 -52118 -149123 -312254 -567 248100 200136 206801 216742 31515
730 31515 -115437 -255140 -272611 13250 213034 191009 74604 189583 109562 -3126 71091
719 71091 264001 327321 168880 281068 180757 221258 33255 -37762 -106807 38126 48130
708 48130 196372 253437 -96253 -181588 -208545 -109941 -207907 -36148 895 -104522 -82561
697 -82561 -90448 -9181 62728 -61127 -87556 -265197 -303004 -254435 -321816 -341063 -204366 -222077
685 -222077 -85365 -120940 -363643 -253196 -302589 -290944 46787 86340 54183 -101658 -423637
674d23637K21750L0672j49811M1863O1566K65686j73972N0126K4991Q6070J0990
663D6294l56199M1167K29343J70683j30805k67769K05522L8008j78643J5458K6531
652a60410J77124J028o845p7311J53568J02025R742k13495j3375K69441J93199
641D34691j1470l24586q5988j05625J43374Q456j61620j77097J84518K94707k58187
630e8827j94637m473J08320K8812n6404J35272j92571O6630P5050j85982K824
619b75986J86457K56578l2243Q3158l6867j44559R4758k57214j72352J35051J06248
608e6971J76799k26728J96474J24945k57593J19279k26069J43186P2368J02129
598A67819m1091k03022m2066N5719q8631p939j11568K52572K49540q9737p4403
$$ plain form
674 -423637 -201887 -171215 -321026 -279163 -217597 48089 -125883 -75757 -50766 35304 46294
663 46294 -309905 -268738 -39395 131288 483 -267286 -61764 -23756 -202399 -186941 -160410
652 -160410 16714 17742 10897 -66414 87154 189179 198921 -14574 -27949 241492 434691
641 434691 423221 98635 12647 -92978 50396 58852 -102768 -279865 -95347 199360 -58827
630 -58827 -253464 -257937 -149617 -120805 -177209 -41937 -234508 -167878 -92828 -278810 -275986
619 -275986 -89529 167049 134806 217964 181097 36538 131296 -125918 -298270 -163219 -56971
608 -56971 119828 -106900 89574 214519 -43074 76205 -149864 -6678 65690 167819
598 167819 126728 -76294 -118360 -62641 -151272 -159211 -270779 -18207 231333 141596 67193
587F7193j29524K29626J39866k46648r7257r9902q1145J91314O0122l24810o9405
576c60570O0850R0970j01820M5900L58704j64918j20436M2815M4144J12536J23826
565A32001j79614R9708J55716O3703k63337Q8102j61956k22239j18712J67953
555b38675O8742l8256J15945J66990k84859L0379K51957J4746J14155k72788p9835
544a51499K42457m6052j30640K7620M42139m7539n06035K2936K45183m004k02738
533a08172j48305M1114K18756J29085r4233j4073m8538m2708K3523P7055R157
522D2661j32809O3698j49942L57745K34199q4050l4193j82112q5204K9637j60182
511a00552k10208J4671J69500M7813J4431j22038J08086J66358k25816R6984o8021
$$ plain form
587 67193 -62331 167295 307161 60513 -36744 -136646 -217791 -26477 33645 -291165 -360570
576 -360570 -299720 -208750 -310570 -264670 94034 -70884 -191320 -148505 -104361 8175 132001
565 132001 -47613 52095 207811 271514 8177 96279 -65677 -287916 -406628 -238675
555 -238675 -169933 -208189 -92244 74746 -210113 -179734 72223 86969 201124 -71664 -151499
544 -151499 90958 44906 -85734 -58114 384025 336486 -169549 -146613 98570 94566 -108172
533 -108172 -256477 -215363 3393 132478 38245 24172 -24366 -67074 -43551 33504 42661
522 42661 -90148 -26450 -176392 181353 415552 331502 297309 115197 29993 59630 -100552
511 -100552 -310760 -296089 -126589 -78776 -64345 -186383 -78297 88061 -137755 -40771 -108792
500a08792m4906J53109j14880r5926K26847J3802j69217j75375p7939K68589J56514
489C1826j42072K29305J50740o7152j62532l88957K39829K27476m0600Q5651K51387
478D14901J46772j92199k81990l28116L4166L07566R1618n1207j88750Q1337j76200
467a42102N3789K08491N2716j17619k78406K85525j01640k6343R327j36062l6293
456b28617j47734J72143J81253l921q3093J79895J51110Q9132l8141q8419j34008
445D9600J85079r6053r9427j12904j40466q5699J91202j03026K8640K12622j01964
434g2396l6800j44058J4599J56860O1254N355J59210r5237R181K8231j28784J12485
422F9900o7291j45459m212j2832N8033K22153M7747Q8688j37643k65601J44919
$$ plain form
500 -108792 -153698 -589 -115469 -211395 15452 29254 -139963 -315338 -393277 -124688 31826
489 31826 -110246 119059 269799 202647 40115 -348842 -109013 118463 77863 163514 414901
478 414901 561673 369474 87484 -240632 -206466 101100 192718 141511 -47239 34098 -142102
467 -142102 -88313 120178 172894 55275 -223131 62394 -39246 -65589 -56262 -192324 -228617
456 -228617 -376351 -204208 -22955 -26876 -109969 69926 221036 310168 272027 183608 49600
445 49600 234679 138626 39199 -73705 -214171 -299870 -108668 -211694 -183054 29568 -72396
434 -72396 -109196 -253254 -238655 -81795 -20541 -15186 144024 48787 57968 86199 -42585 69900
422 69900 2609 -142850 -147062 -159894 -101861 120292 168039 256727 119084 -146517 -1598
411a598m7686N7068J36498j48765m6850p6639O9917J76731k10475N1344K7256
400a3199K97080j26889o4315j2312J47620o6282q6079j24397r4370N4762m3739
389a32120N9249j07227K62982j19426M9787J52532o2100j33743K19556J72493
379C61983K9034J38629l79067K2943j49480j01952R4914q4041p3058k9459N0672
368a18882p5998J54740m1742j43032J81416K55414p8960P4442q6688l70279K58056
357H487m0161M4365R4325j17055J46001n6063q8959O005j08708Q2628M4975O7716
345H3556l2631J9379j17851j83141K28244J41884K8124r5524m3412Q9581J03435
334B21644j00382K7732j43905M4453n2104P6556O5926k59362J20281R808J0959
$$ plain form
411 -1598 -49284 7784 144282 -4483 -51333 -127972 -58055 118676 -91799 -40455 -13199
400 -13199 283881 156992 92677 80365 227985 161703 75624 -48773 -143143 -88381 -132120
389 -132120 -72871 -180098 82884 -36542 13245 165777 103677 -30066 189490 361983
379 361983 391017 529646 150579 173522 24042 -77910 17004 -67037 -140095 -169554 -118882
368 -118882 -194880 -40140 -81882 -224914 -43498 211916 132956 207398 120710 -249569 8487
357 8487 -31674 12691 107016 -10039 135962 79899 -9060 -3055 -111763 -29135 15840 83556
345 83556 50925 70304 -47547 -230688 -2444 139440 167564 72040 28628 118209 221644
334 221644 121262 148994 5089 49542 -2562 73994 139920 -119442 839 10647 21606
323B1606j46847J61746K8550k31591K48587o8708j54137J24568P1992J03267O1951
312B20984r754j64576P1475J64994J7041K3744r914O2011k57006m2726R5370k22106
300e0463J207R720K02852Q5940k3008k34050j45377p398J24750K42928N9977k5682
288B41396l74002M24327o3475k39871Q0115l9232o4854k73243M9986K38596J18564
277I8307k9690j34373P293j27765J19383p5072k3013J28228k80334K4950K94089
266B003K84267q9418k32432j30624n4599K83309q3661j51482j86876Q9984K12504
255e7025R3161k8615r2647l0365L2343J29600J31916j20828l5296J14061K4081
244A60386J2637r4162j893k98955J30514O4322K20085J40849m28087n6249K59646
$$ plain form
323 21606 -125241 36505 65055 -166536 82051 13343 -140794 -16226 55766 159033 220984
312 220984 211230 46654 118129 283123 300164 323908 313994 376005 118999 76273 171643 -50463
300 -50463 -49256 -39536 163316 249256 226248 -7802 -153179 -160577 -35827 207101 267078 241396
288 241396 -132606 291721 228246 -11625 68490 29258 -35596 -308839 -258853 -20257 98307
277 98307 68617 -65756 -58463 -186228 -66845 -141917 -164930 -36702 -317036 -292086 2003
266 2003 286270 196852 -35580 -166204 -220803 62506 -21155 -172637 -359513 -269529 -57025
255 -57025 36136 7521 -85126 -115491 -83148 46452 178368 57540 22244 136305 160386
244 160386 173023 78861 76968 -221987 -91473 -27151 192934 333783 -94304 -150553 109093
233A09093J23800l4823j17834k44973J63509m8233p9050J07858J2921J55536j70687
222b2883j65913J4164K95053n864K39020k29149r0549R0247j11721O9517q8373
211f451J19480J21773L4712k06013J27198r9875j70753k2276K3028Q0433O8234
200F9490L25964j32781p6122o6819k21689k9393P0511j4882j1960k0379O5482
189d2578q7997J50616n9377M6077j2445J77225J69181o2476l54653N5127l0252
178e1552P8090L04522K2865k04957j23219J80595j45373j6470P9261j9318o7114
167C7330K04877k43947l6045M6170J03575J28212j75712J0085j40820R534R4127
156C7386R1335P9900m20878L26433J55063j41062j39483o1256j5408J03128P1875
$$ plain form
233 109093 232893 198070 80236 -164737 -1228 -49461 -128511 -20653 -7732 147804 -22883
222 -22883 -188796 -174632 120421 114557 353577 124428 33879 124126 12405 81922 -6451
211 -6451 113029 234802 269514 63501 190699 90824 -79929 -102205 -79177 1256 69490
200 69490 395454 262673 186551 119732 -101957 -131350 -60839 -75721 -87681 -108060 -42578
189 -42578 -130575 20041 -39336 6741 -5704 171521 340702 278226 -76427 -21300 -51552
178 -51552 26538 331060 353925 148968 25749 206344 60971 44501 123762 104444 37330
167 37330 242207 -1740 -37785 8385 111960 240172 64460 74545 -66275 -56741 37386
156 37386 128721 208621 -212257 114176 269239 128177 -11306 -72562 -87970 15158 87033
145H7033j68715n8951K21129K862J766j61934j1272J57365n9777J5930m439J22099
133A43096J07035l09588j62374K40152j21305j3684M00804n0212j39164j90894
123i6134J66472j45191l8665K02685o0876o3800P5912P6724J9899K27164k75573
112H8617j45981R747j51959m9008J01170J66105o1622m855N2365N9484j00782
101c6719l7434k5150J92127n5559j32718R8867M1850p51j14699J13970j39421
90i5637J7814k2444J91751Q5738J52740j0880j15568N9362r6213j17321k7160
79B2182o542J37777j15390k2383J93861l6461q0925K7842k55584J260N0304J95789
67A11730n3099j04660K08740j98871m8235Q4452K0099J42785j31501r8808O6213
$$ plain form
145 87033 -81682 -140633 80496 83358 85124 -76810 -88082 69283 9506 25436 20997 143096
133 143096 250131 -59457 -221831 18321 -102984 -116668 284136 233924 94760 -96134
123 -96134 70338 -74853 -113518 89167 28291 -35509 40403 117127 137026 364190 88617
112 88617 -57364 -47617 -199576 -248584 -147414 18691 -42931 -47786 4579 64063 -36719
101 -36719 -74153 -99303 92824 37265 -95453 3414 45264 44513 -70186 43784 -95637
90 -95637 -77823 -100267 91484 177222 329962 319082 203514 262876 166663 49342 22182
79 22182 15640 153417 38027 15644 209505 173044 92119 119961 -135623 -134363 -84059 111730
67 111730 58631 -46029 162711 -36160 -84395 57 20156 162941 31440 -67368 -1155
56a155J8480O5368K1323O4665j02782R7175J4960m8786p2528l1032l2306K416
44d202J28034j19250j1437o2535O1529j12278m0214J74540J5129O5478k89970
33a95176J42436L8861P043J78308j00281o2318j38550J4453J49679k8009Q5436
22I1882j02413M8273N1111j01605o2368Q8713Q7429L2520M9381K1022m2861j97310
10c6226J93420J1282j61583K6682Q8244r9948J04720j33362j37796J51991
0G424
$$ plain form
56 -1155 17325 82693 104016 168681 65899 163074 178034 129248 56720 25688 -6618 -4202
44 -4202 123832 4582 -6855 -69390 -7861 -120139 -160353 14187 29316 94794 -195176
33 -195176 -52740 -13879 -6836 171472 71191 8873 -129677 -115224 34455 6446 91882
22 91882 -10531 37742 88853 -12752 -75120 13593 101022 133542 182923 203945 161084 -36226
10 -36226 157194 168476 6893 33575 121819 21871 126591 -6771 -144567 7424
0 7424
$$ Imaginary data points
##PAGE= N=2
##DATA TABLE= (X++(I..I)), XYDATA
16383a485631j02943L8168K92943J0910J7540R5712p27M1425O3593R402n1043
16372a070651Q3683k5677m221J89678L2928K3039K9558K9967J38328J08492O0391
16361d04485o0556M4615k9100K89716J1763q4218O2690P1532p7684M148K85627
16350A14048j09358p6883J41952O5875J49159M1774N4063m1299K7904L6628n563
16339C98300R5336L298j0090L48180L1553j71770J90791P6366j55052n2766N9693
16328H13839q9790J22677J15205J01250N3669o0260L3165r6014J28834P792K5654
16317A156021J09241L6498o2289J81647J38741r4710N7888J5843n2973M1439N3533
$$ plain form
16383 -1485631 -1588574 -1550406 -1257463 -1246553 -1229013 -1133301 -1134028 -1092603 -1029010 -1019608 -1070651
16372 -1070651 -986968 -1012645 -1016866 -827188 -794260 -771221 -741663 -711696 -573368 -464876 -404485
16361 -404485 -465041 -420426 -449526 -159810 -148047 -232265 -169575 -98043 -175727 -171579 114048
16350 114048 4690 -72193 69759 135634 284793 326567 380630 339331 367235 403863 398300
16339 398300 493636 496934 486844 835024 866577 694807 885598 961964 806912 754146 813839
16328 813839 724049 846726 961931 1063181 1116850 1056590 1089755 993741 1122575 1130367 1156021
16317 1156021 1265262 1301760 1239471 1421118 1559859 1465149 1523037 1538880 1485907 1527346 1580879
$$ [...]
##END NTUPLES=NMR SPECTRUM
##END=
