##TITLE=1H_EC-3355(II-2)x1
 200.13MHz, DMSO,
 8 sc
 
 7.8.2025
##JCAMPDX= 6.0         $$ Bruker NMR JCAMP-DX V2.0
##DATA TYPE= NMR SPECTRUM
##DATA CLASS= NTUPLES
##ORIGIN= UXNMR, Bruker Analytische Messtechnik GmbH
##OWNER= pz
$$ XWIN-NMR		Version 3.5
$$ Thu Aug  7 14:30:58 2025 Russian Standard Time (UT+4h)  she@DPX200
##.OBSERVE FREQUENCY= 200.1313
##.OBSERVE NUCLEUS= ^1H
##.ACQUISITION MODE= SIMULTANEOUS
##.ACQUISITION SCHEME= undefined
##.AVERAGES= 8
##.DIGITISER RES= 18
##SPECTROMETER/DATA SYSTEM= spect
##.PULSE SEQUENCE= zg30
##.SOLVENT NAME= DMSO
##.SHIFT REFERENCE= (INTERNAL, DMSO, 0, 15.5144)
##AUDIT TRAIL= $$ (NUMBER, WHEN, WHO, WHERE, WHAT)
$$ ##TITLE= Audit trail, XWIN-NMR		Version 3.5
$$ ##JCAMPDX= 5.01
$$ ##ORIGIN= Bruker BioSpin GmbH
$$ ##OWNER= she
$$ F:/spectra/data/she/nmr/H-C/1/pdata/1/auditp.txt
$$ ##AUDIT TRAIL=  $$ (NUMBER, WHEN, WHO, WHERE, WHAT)
(   1,<2025-08-07 14:29:38.70 +0400>,<she>,<DPX200>,
      <created by zg, POWCHK disabled, PULCHK disabled
       configuration hash MD5:
       00 E9 B6 7A A2 85 ED C7 34 08 36 98 17 FE 4E 26
       data hash MD5: 16K
       57 13 15 75 9A 8D CB CC 4A 6E 38 F7 C4 8D B3 A4>)
(   2,<2025-08-07 14:29:41.04 +0400>,<she>,<DPX200>,
      <Start of raw data processing
       efp BC_mod = 2 LB = 0.25 FT_mod = 6 PKNL = 1 PHC0 = -1201.71 PHC1 = 13.1923 SI = 16K 
       data hash MD5: 16K
       37 00 DA F7 37 94 09 77 4D C6 5D 58 FC C4 8F 94>)
(   3,<2025-08-07 14:29:56.45 +0400>,<she>,<DPX200>,
      <pk PHC0 = -0.3124385 PHC1 = 0 
       data hash MD5: 16K
       72 C5 28 F2 B4 45 7F 03 4D EB 08 E4 1E C4 00 0F>)
(   4,<2025-08-07 14:30:00.57 +0400>,<she>,<DPX200>,
      <abs ABSG = 5 
       data hash MD5: 16K
       C6 1B D6 06 9C D9 2C 1B 3B 43 A6 96 74 DF 91 16>)
(   5,<2025-08-07 14:30:16.87 +0400>,<she>,<DPX200>,
      <abs ABSG = 5 
       data hash MD5: 16K
       EC 3D 8D 09 E4 06 14 83 90 11 67 E0 07 C3 01 92>)
$$ ##END=
$$ 
$$ hash MD5
$$ 58 2D 0C C4 20 36 55 1E 0E A6 A1 74 0C 18 C6 C9
##$RELAX= 
##$RELAX= 
##$RELAX= 
##$RELAX= 
##$RELAX= 
##$RELAX= 
$$ Bruker specific parameters
$$ --------------------------
##$DU= <F:/spectra>
##$EXPNO= 1
##$NAME= <H-C>
##$PROCNO= 1
##$TYPE= <nmr>
##$USER= <she>
##$AMP= (0..31)
100 100 100 100 100 100 100 100 100 100 100 100 100 100 100 100 100 100 
100 100 100 100 100 100 100 100 100 100 100 100 100 100 
##$AQSEQ= 0
##$AQ_mod= 1
##$AUNM= <au_zg>
##$AUTOPOS= <>
##$BF1= 200.13
##$BF2= 200.13
##$BF3= 200.13
##$BF4= 200.13
##$BF5= 200.13
##$BF6= 200.13
##$BF7= 200.13
##$BF8= 200.13
##$BYTORDA= 1
##$CFDGTYP= 0
##$CFRGTYP= 5
##$CHEMSTR= <none>
##$CNST= (0..31)
1 1 145 1 1 1 1 1 1 1 1 1 1 1 1 1 1 1 1 1 1 1 1 1 1 1 1 1 1 1 1 1 
##$CPDPRG= <>
##$CPDPRG1= <>
##$CPDPRG2= <>
##$CPDPRG3= <>
##$CPDPRG4= <mlev>
##$CPDPRG5= <mlev>
##$CPDPRG6= <mlev>
##$CPDPRG7= <mlev>
##$CPDPRG8= <mlev>
##$CPDPRGB= <>
##$CPDPRGT= <>
##$D= (0..31)
0 0.7 0 0 0 0 0 0 0 0 0 0.03 0 0 0 0 0 0 0 0 0 0 0 0 0 0 0 0 0 0 0 0 
##$DATE= 1754562578
##$DBL= (0..7)
$$ [...]
##$SUBNAM3= <"">
##$SUBNAM4= <"">
##$SUBNAM5= <"">
##$SUBNAM6= <"">
##$SUBNAM7= <"">
##$SUBNAM8= <"">
##$SUBNAM9= <"">
##$SW= 18.0517328524113
##$SWIBOX= (0..15)
0 0 2 0 0 0 0 0 0 0 0 0 0 0 0 0 
##$SW_h= 3612.71676300578
##$TD= 16384
##$TD0= 1
##$TE= 0
##$TE2= 300
##$TE3= 300
##$TEG= 300
##$TL= (0..7)
0 120 120 120 120 120 120 120 
##$TP= (0..7)
150 150 150 150 150 150 150 150 
##$TP07= 0
##$TPNAME0= <>
##$TPNAME1= <>
##$TPNAME2= <>
##$TPNAME3= <>
##$TPNAME4= <>
##$TPNAME5= <>
##$TPNAME6= <>
##$TPNAME7= <>
##$TPOAL= (0..7)
0.5 0.5 0.5 0.5 0.5 0.5 0.5 0.5 
##$TPOFFS= (0..7)
0 0 0 0 0 0 0 0 
##$TUNHIN= 0
##$TUNHOUT= 0
##$TUNXOUT= 0
##$USERA1= <user>
##$USERA2= <user>
##$USERA3= <user>
##$USERA4= <user>
##$USERA5= <user>
##$V9= 5
##$VALIST= <valist>
##$VCLIST= <CCCCCCCCCCCCCCC>
##$VD= 0
##$VDLIST= <DDDDDDDDDDDDDDD>
##$VPLIST= <PPPPPPPPPPPPPPP>
##$VTLIST= <TTTTTTTTTTTTTTT>
##$WBST= 1024
##$WBSW= 4
##$XGAIN= (0..3)
0 0 0 0 
##$XL= 0
##$YL= 0
##$YMAX_a= 342086
##$YMIN_a= -417449
##$ZGOPTNS= <>
##$ZL1= 120
##$ZL2= 120
##$ZL3= 120
##$ZL4= 120
##$ABSF1= 15.51441
##$ABSF2= -2.537439
##$ABSG= 5
##$ABSL= 3
##$ALPHA= 0
##$AQORDER= 0
##$ASSFAC= 0
##$ASSFACI= 0
##$ASSFACX= 0
##$ASSWID= 0
##$AUNMP= <proc_1d>
##$AZFE= 0.1
##$AZFW= 0.1
##$BCFW= 0
##$BC_mod= 2
##$BYTORDP= 0
##$COROFFS= 0
##$CY= -3
##$DATMOD= 1
##$DC= 0
##$DFILT= <>
##$DTYPP= 0
##$F1P= 0
##$F2P= 0
##$FCOR= 1
##$FTSIZE= 16384
##$FT_mod= 6
##$GAMMA= 0
##$GB= 0
##$INTBC= 1
##$INTSCL= 3.241238e-09
##$ISEN= 128
##$LB= 0.25
##$LEV0= 0
##$LPBIN= 0
##$MAXI= 10000
##$MC2= 0
##$MEAN= 0
##$ME_mod= 0
##$MI= 1.114404
##$NCOEF= 0
##$NC_proc= -7
##$NLEV= 6
##$NOISF1= 3.799351
##$NOISF2= 2.8
##$NSP= 0
##$NTH_PI= 0
##$NZP= 0
##$OFFSET= 15.51441
##$PC= 1
##$PHC0= -1202.022
##$PHC1= 13.1923
##$PH_mod= 1
##$PKNL= yes
##$PPARMOD= 0
##$PSCAL= 0
##$PSIGN= 0
##$REVERSE= no
##$SF= 200.130001459381
##$SI= 16384
##$SIGF1= 3
##$SIGF2= 2
##$SINO= 0.751879
##$SIOLD= 32768
##$SREGLST= <19F.Aceton>
##$SSB= 0
##$STSI= 16384
##$STSR= 0
##$SW_p= 3612.71676300578
##$SYMM= 0
##$S_DEV= 0
##$TDeff= 16384
##$TDoff= 0
##$TI= <>
##$TILT= no
##$TM1= 0
##$TM2= 0
##$TOPLEV= 0
##$USERP1= <user>
##$USERP2= <user>
##$USERP3= <user>
##$USERP4= <user>
##$USERP5= <user>
##$WDW= 1
##$XDIM= 16384
##$YMAX_p= 462225665
##$YMIN_p= -5905427
$$ End of Bruker specific parameters
$$ ---------------------------------
##NTUPLES= NMR SPECTRUM
##VAR_NAME=  FREQUENCY,     SPECTRUM/REAL,   SPECTRUM/IMAG
##SYMBOL=    X,             R,               I
##VAR_TYPE=  INDEPENDENT,   DEPENDENT,       DEPENDENT
##VAR_FORM=  AFFN,          ASDF,            ASDF
##VAR_DIM=   16384,         16384,           16384
##UNITS=     HZ,            ARBITRARY UNITS, ARBITRARY UNITS
##FACTOR=    0.220516191357247, 1,           1
##FIRST=     3104.89889972807, 0,            0
##LAST=      -507.817863277706, 0,           0
##MIN=       -507.817863277706, -5905427,    0
##MAX=       3104.89889972807, 462225665,    0
$$ Real data points
##PAGE= N=1
##DATA TABLE= (X++(R..R)), XYDATA
$$ [...]
5851A28760517j06925j84955l66925j45299j10619j24784j92697j54627N13455
5842A27887141r4457j64795k06947K65267J10060K08003j47171k49251J42933
5833A27750783O4987J0445k54984k2689l11977N4591J08946N5751O1831l43238
5823A27174446r8300j45581k26187k65593k02366k06936m8123k98852n40019p35015
5813A24407474k49761k09190p41105j129645n46011n18006p18971r70715j149822
5804A18174248m80877m74405j250537j200181p01815q59157p33156j067699q42072
5795A10564349j279997j154539j089902q58647j491296j127800q07332j396980
5787A01357856j090745j108563j391989j064463r43102j382358j324784j005510
$$ y = [128760517, 128653592, 128468637, 128101712, 127956413, 127845794, 127721010, 127528313, 127373686, 127887141, 127792684, 127627889, 127420942, 127686209, 127796269, 128004272, 127857101, 127607850, 127750783, 127815770, 127826215, 127571231, 127548542, 127236565, 127291156, 127400102, 127455853, 127517684, 127174446, 127076146, 126930565, 126704378, 126438785, 126236419, 126029483, 125981360, 125682508, 125142489, 124407474, 124157713, 123948523, 123207418, 122077773, 121531762, 121013756, 120294785, 119324070, 118174248, 117693371, 117218966, 115968429, 114768248, 114066433, 113207276, 112474120, 111406421, 110564349, 109284352, 108129813, 107039911, 106181264, 104689968, 103562168, 102754836, 101357856, 100267111, 99158548, 97766559, 96702096, 95758994, 94376636, 93051852, 92046342]
5779I2046342j107606j435802j122028j248471j280764r63583j139197j000266
5771H2748625r85492q19917j215601j122405j174313j090906j238386j482405
5763G3619200j273675p88226q50011q68709r13755j114453o77237p31962j127920
5754F5273252j204649j239724o42720p67030o25927q37576r50812o61316r73862
5745E7369636r83146j001149j052027o38313q71198p39265o64902n16087n96882
5736E0306667r34643j046543n78251o30015r22207m27021q06172j134975p88617
5727D3038223m98722r46749l60927p28822q42376p39016l77157m02605p31055
5718C7410794m89331o48819p94102m03206k29763m07877o03897p12555q63245
$$ y = [92046342, 90938736, 89502934, 88380906, 87132435, 85851671, 84888088, 83748891, 82748625, 81763133, 80943216, 79727615, 78605210, 77430897, 76339991, 75101605, 73619200, 72345525, 71557299, 70707288, 69838579, 68924824, 67810371, 67133134, 66401172, 65273252, 64068603, 62828879, 62186159, 61419129, 60793202, 59955626, 59004814, 58343498, 57369636, 56386490, 55385341, 54333314, 53695001, 52823803, 52084538, 51419636, 50903549, 50306667, 49372024, 48325481, 47747230, 47117215, 46195008, 45767987, 44961815, 43826840, 43038223, 42539501, 41592752, 41231825, 40503003, 39660627, 38921611, 38544454, 38141849, 37410794, 36921463, 36272644, 35478542, 35075336, 34845573, 34437696, 33833799, 33121244, 32257999]
5709C2257999m62842p14714l99190m93240l65896n61519q67755m17044k36401
5700B7739398p22996l53967M4764n81525n27884r3222l85745n15114n75948l40510
5690B3687251k67106n44854P3985l92214m43231k57721m79903n18744k96638k29434
5680B0331391o2412n80361q4140m26673o49143L9794k50832l43315l66890l25825
5670A7281594k14015j67632k22258j53708r2030j11082k28699j43440l26380l93979
5660A5228371j21873j03775J9235n15515k3624p0418k01080k74275k64669n03799
5650A3168578L13971j26379k74860k59224q3066k55168j04984k09396m7467j79586
5640A1942419Q6321J49340l36900k17402p19756J00188J79144j99042m69914K1409
$$ y = [32257999, 31795157, 31080443, 30681253, 30188013, 29822117, 29260598, 28392843, 27975799, 27739398, 27016402, 26662435, 26707199, 26125674, 25597790, 25504568, 25118823, 24603709, 24027761, 23687251, 23420145, 22875291, 22949276, 22557062, 22113831, 21856110, 21376207, 20857463, 20560825, 20331391, 20268979, 19688618, 19604478, 19177805, 18528662, 18568456, 18317624, 17974309, 17607419, 17281594, 17067579, 16899947, 16677689, 16523981, 16431951, 16320869, 16092170, 15948730, 15622350, 15228371, 15106498, 15002723, 15021958, 14506443, 14482819, 14412401, 14211321, 13937046, 13672377, 13168578, 13482549, 13356170, 13081310, 12822086, 12739020, 12483852, 12378868, 12169472, 12122005, 11942419, 12028740, 12178080, 11841180, 11623778, 10904022, 11004210, 11183354, 10984312, 10514398, 10535807]
5630A0535807O2144R3039o66830J59816K12829k42344l32429j47370l75848K30467
5620I529281k57241j02587k09213l25789r2890J41243L40244j43494l15709k14132
5610H349713k5334j40698q9273M3691J09720k96251p1353q7983k05048k68059
5600G319125L047m849m23952M60977l19142o26622k16510J20886j09653J32697
5590F336004k1884L07983R1893j90750p7483r1901k04624J21690K03901j29417
5580F345412L8995P4639k34565j49946M7236k05829j79120r3882j6684n512J44758
5569E765502k9084L0994m24170J0425K1737J15740j48338J5218o4277m2064J34539
5558E386222j76543j61162m4416J17668J14024j63122J56917N2065m81035k58458
$$ y = [10535807, 10597951, 10690990, 10024160, 10183976, 10396805, 10154461, 9822032, 9674662, 9298814, 9529281, 9272040, 9169453, 8960240, 8634451, 8541561, 8682804, 9023048, 8879554, 8563845, 8349713, 8324379, 8183681, 8094408, 8138099, 8247819, 7951568, 7880215, 7792232, 7587184, 7319125, 7322172, 7317323, 6893371, 7354348, 7035206, 6408584, 6192074, 6312960, 6203307, 6336004, 6314120, 6622103, 6713996, 6523246, 6445763, 6353862, 6149238, 6270928, 6474829, 6345412, 6384407, 6459046, 6224481, 6074535, 6121771, 5915942, 5736822, 5642940, 5626256, 5620744, 5765502, 5736418, 5767412, 5343242, 5353667, 5375404, 5491144, 5342806, 5358024, 5293747, 5251683, 5386222, 5209679, 5048517, 5004101, 5121769, 5235793, 5072671, 5229588, 5281653, 4800618, 4542160]
5548D542160K87387J34263K71846j94086j58898M0463j10147k32676J18593K03270
5538D902175j2880k78048K2980m5752K0524P5050k8094M30320j76917n63194q5060
5527D261104M96720L76399k74191k98299n8143q0253j36563n2792j08487J30461
5517D255956K08933p4691K3499K0028j0912N2392o777J6462K9061p1530j47676
5506D294745m2221p3961P7567j12575J09250r9464k24441Q0042o2728k42178K10576
5495C914612j43177k41055Q7220j39225J51337j89029m6738K54244l1393l5712
5485C581084j01362q4118K9579J48502J76848k30469j77730K1743M2732j49701
5475C257108O9709R6825j90161J17943K13821j62466l64808J60999K39854j44803
$$ y = [4542160, 4829547, 4963810, 5235656, 5041570, 4882672, 4923135, 4812988, 4580312, 4698905, 4902175, 4889295, 4611247, 4634227, 4588475, 4608999, 4684049, 4655955, 5086275, 4909358, 4346164, 4261104, 4757824, 5134223, 4860032, 4561733, 4503590, 4423337, 4286774, 4233982, 4125495, 4255956, 4464889, 4390198, 4413697, 4433725, 4422813, 4475205, 4468428, 4484890, 4513951, 4442421, 4294745, 4252524, 4178563, 4256130, 4143555, 4252805, 4153341, 3928900, 4008942, 3946214, 3704036, 3914612, 3771435, 3530380, 3617600, 3478375, 3629712, 3440683, 3393945, 3648189, 3616796, 3581084, 3479722, 3395604, 3425183, 3573685, 3750533, 3520064, 3342334, 3364077, 3406809, 3257108, 3326817, 3423642, 3233481, 3351424, 3565245, 3402779, 3037971, 3198970, 3438824, 3294021]
5465C294021m552m8537J18374m7926m24827R468J10886L7665J50364O548k73170
5454B928314J8277J59611j94926j62887J57943k63723J58019L4512R547J94497
5444C039184k13406Q8012K9058j80482j31944K43515j73012j09857R0884J20355
5434B802307K35993m7612j28650j25104l0226K74112k30256k1709j76040K15911
5424B768726k062j37063Q1262n3812j14414P4789j2422J35792L59579l22132k76379
5413B501864K4842k38347N15326j57368j23075J12149l93769O233J99086Q1229
5403B528170O9972M50170J08909j59653l89285k55841K6566K64334J16389j1933
5393B747798J80986J43441m7989q7070J84837q9556j78435j69520J06831L56103
$$ y = [3294021, 3289469, 3240932, 3359306, 3311380, 2886553, 2896021, 3006907, 3044572, 3194936, 3201484, 2928314, 2946591, 3106202, 2911276, 2748389, 2906332, 2642609, 2800628, 2835140, 2844687, 3039184, 2825778, 2913790, 2942848, 2762366, 2630422, 2873937, 2700925, 2591068, 2681952, 2802307, 3038300, 2990688, 2862038, 2736934, 2706708, 2980820, 2750564, 2728855, 2552815, 2768726, 2766664, 2629601, 2710863, 2657051, 2542637, 2617426, 2605004, 2740796, 3100375, 2778243, 2501864, 2526706, 2288359, 2803685, 2646317, 2523242, 2635391, 2241622, 2247855, 2446941, 2528170, 2598142, 3048312, 3157221, 2997568, 2608283, 2352442, 2379008, 2643342, 2759731, 2747798, 2928784, 3072225, 3024236, 2937166, 3122003, 3032447, 2854012, 2684492, 2791323, 3147426]
5383C147426l1850r3438J59978j8693q3723M888k33554O4153Q9819n3093J56663
5372C108576R4240n0721l3236j40331K87812l44069q1544Q2716K11293J14198
5362C248934q1838J08253O7635K05364n0704L32677J051r7176m03510O6276l7515
5351C359447K46193J9813J30963j97031q202N04456K5586j03642O2623Q3209j59430
5340C963985J88574J77003l55692m31512J43767O4793J47787o3755j29598k35341
5330C470011L26906J42299L41557r1928j50909p8829k04948j85543K45699L89255
5320D203570r7275R9708M61893K35735j91805k57706m1188J61194K2555J81341
5310D778022n0754M0491M72640P5134J26120k03179l5922j55942j2840J51347
$$ y = [3147426, 3115576, 3022138, 3182116, 3163423, 3079700, 3084588, 2851034, 2915187, 3005006, 2951913, 3108576, 3202816, 3152095, 3118859, 2978528, 3266340, 2922271, 2840727, 2923443, 3134736, 3248934, 3167096, 3275349, 3342984, 3548348, 3497644, 3830321, 3831372, 3734196, 3330686, 3396962, 3359447, 3605640, 3625453, 3756416, 3559385, 3551183, 4055639, 4081225, 3977583, 4040206, 4123415, 3963985, 4152559, 4329562, 3973870, 3542358, 3686125, 3750918, 3898705, 3834950, 3705352, 3470011, 3796917, 3939216, 4280773, 4188845, 4037936, 3959107, 3754159, 3568616, 3814315, 4203570, 4106295, 4206003, 4667896, 4903631, 4711826, 4454120, 4412932, 4574126, 4596681, 4778022, 4727268, 4767759, 5240399, 5315533, 5441653, 5238474, 5202552, 5046610, 5033770, 5185117]
5300E185117j04695M25117J20931k94634M60090L24111q6406J80706K20900k81631
5290F149606L44033M88435l68400j6145Q588J3170L68799O91959N6670O2069M9906
5279G848690L73049N25179J08711J20421L52268L25628L66812K18748K84119N86748
5269A1110373M84207P01747L02296N18832O95520Q53143M92056L88220N12474
5260A6058868P43982R98006J047693N97355R42274J233840J150331J228893J270996
5251B5272238J020453J264589J416669J326851J650030J462537J101007J564690
5243C6079064J235874P93658J102613J151886J226154J209486J369392J287016
5235D5455143J621340R22231J123371J975772J533653J427390J682947J870241
$$ y = [5185117, 5080422, 5505539, 5626470, 5331836, 5791926, 6116037, 6029631, 6210337, 6431237, 6149606, 6493639, 6982074, 6613674, 6597529, 6606117, 6619287, 6988086, 7680045, 7736715, 7798784, 7848690, 8221739, 8746918, 8855629, 8976050, 9328318, 9653946, 10020758, 10239506, 10523625, 11110373, 11594580, 12296327, 12598623, 13117455, 13812975, 14666118, 15158174, 15546394, 16058868, 16802850, 17800856, 18848549, 19445904, 20388178, 21622018, 22772349, 24001242, 25272238, 26292691, 27557280, 28973949, 30300800, 31950830, 33413367, 34514374, 36079064, 37314938, 38108596, 39211209, 40363095, 41589249, 42798735, 44168127, 45455143, 47076483, 47998714, 49122085, 51097857, 52631510, 54058900, 55741847, 57612088]
5227E7612088K268832K071135K120329K221338K667875K463088K809448L025816
5219G7259949L012866L266800L243199K972377K914847K243263K295439J757341
5211I8966081Q65717M25256L26999j39806n25101m97140k14067k66912l92385
5202I8548642m68363m79397k21666R7194k3543k59863K40174J50037L61698L25529
5192I8270442P20833R03425N23395P43646Q55573J044971J040651Q62439O29058
5183A05594433N64217j11255q32374j692452k128935k584930k770365k928998
5175I3109341l211962l024316l394261l032462k350041k680854k970131k490237
5167F9955077k284482k258435k160331k022705j882383j816834j706960j515736
$$ y = [57612088, 59880920, 61952055, 64072384, 66293722, 68961597, 71424685, 74234133, 77259949, 80272815, 83539615, 86782814, 89755191, 92670038, 94913301, 97208740, 98966081, 99831798, 100257054, 100584053, 100444247, 99919146, 99422006, 99207939, 98941027, 98548642, 98080279, 97600882, 97379216, 97476410, 97452867, 97193004, 97433178, 97583215, 97944913, 98270442, 98991275, 99894700, 100418095, 101161741, 102017314, 103062285, 104102936, 104965375, 105594433, 106158650, 106047395, 105215021, 103522569, 101393634, 98808704, 96038339, 93109341, 89897379, 86873063, 83478802, 80446340, 78096299, 75415445, 72445314, 69955077, 67670595, 65412160, 63251829, 61229124, 59346741, 57529907, 55822947, 54307211]
5159E4307211j398636j668161q70433q19652j186873o52761j449950r59569j224100
5150D4077076j191075j479967j592106j419026j353568j618487j536148j894624
5142C1992075j712840j482643j587037j470887j286000j253070j225639n89470
5134B1384489j108706j090312j081165o89930p41614p54946o75392q04747n62611
5125A3875066o28940r9265n73819q72602j01082o06446o21426l97179j72432m74532
5115I327343l62008j90573l72043k13001k82978k55052k80318j89698j44256r7160
5105F940256k54256n40000J104Q0120m64622k09685j13079j22179N4864k73307
5095E099216l06714L8102j397j5872J33935l20664j92347p5433L9782L3568k60378
$$ y = [54307211, 52908575, 51240414, 50369981, 49550329, 48363456, 47710695, 46260745, 45301176, 44077076, 42886001, 41406034, 39813928, 38394902, 37041334, 35422847, 33886699, 31992075, 30279235, 28796592, 27209555, 25738668, 24452668, 23199598, 21973959, 21384489, 20275783, 19185471, 18104306, 17414376, 16672762, 15917816, 15242424, 14437677, 13875066, 13246126, 13146861, 12573042, 11700440, 11599358, 10992912, 10371486, 9974307, 9801875, 9327343, 8965335, 8774762, 8402719, 8189718, 7906740, 7651688, 7371370, 7181672, 7037416, 6940256, 6686000, 6146000, 6147104, 6227224, 5762602, 5552917, 5439838, 5317659, 5372523, 5099216, 4792502, 4830604, 4829207, 4813335, 4947270, 4626606, 4434259, 4358826, 4398608, 4432176, 4171798]
5084D171798j14070k13165j80023l8004j8631Q865j95189j89337l5853Q3917j29530
5073C150778k83359j5217j99849m512l35356K87152L7409l2690Q9694k16939l4699
5062B442412J35577l77017K18820K31085k80630Q9781q4824P0910M1317P8054
5052B565485j54131j72123J51324l6093j39637l3105j55357l1959q5072J18495
5042B027827j93669K26722J9902o2655K26486l15859j60664K12396J00861j44929
5032A936418q6448j91120J43784n397J11347k36573j25297K95178j19917l17407
5022A404568j26Q4712M0608R6645K31517k01760r1962j22326j28805J63866k23967
5011A252970K58471J29090K00998N0636l9659j29935l50723J36492J64272k80085
$$ y = [4171798, 4057728, 3844563, 3664540, 3626536, 3607905, 3616770, 3421581, 3232244, 3196391, 3280308, 3150778, 2867419, 2852202, 2652353, 2647841, 2312485, 2599637, 2637046, 2604356, 2694050, 2477111, 2442412, 2577989, 2200972, 2419792, 2650877, 2370247, 2460028, 2375204, 2446114, 2487431, 2565485, 2411354, 2239231, 2390555, 2354462, 2214825, 2181720, 2026363, 1994404, 1909332, 2027827, 1834158, 2060880, 2080782, 2018127, 2244613, 1928754, 1768090, 1980486, 2081347, 1936418, 1849970, 1658850, 1802634, 1797237, 1908584, 1672011, 1546714, 1841892, 1721975, 1404568, 1404442, 1489154, 1529762, 1626407, 1857924, 1656164, 1564202, 1441876, 1313071, 1476937, 1252970, 1511441, 1640531, 1841529, 1892165, 1852506, 1722571, 1371848, 1508340, 1672612, 1392527]
5001A392527K70422J20530N5362J28230j43546j56063m8842j27802M0534k14542
4991A316810Q6575M1980r4622M2255k52438K5205l7043l45875K23334K23382k0414
4980A209149O8474j78855J29129L072J67483j41537M9881j4841J2931J62696K09742
4969A677324j8238n5368k13076m35574M50248J24809L6238P9822N4677j35920
4959A564942L4984J7750K3549K30633O300k98564K12254J8895O0229K38160L3234
4948B142366K43457J35039K9171L39678n6766L00626K34520O3809L12664M12212
4938D156776J46203N49049O89264L25425K14502J39532O2157j28748J6459o00121
4928E570498m39503l85511m68016n58696j88436l10969O4833j73800k37388j39413
$$ y = [1392527, 1662949, 1783479, 1838841, 1967071, 1823525, 1667462, 1618620, 1490818, 1531352, 1316810, 1403385, 1445365, 1350743, 1392998, 1140560, 1165765, 1128722, 782847, 1006181, 1229563, 1209149, 1277623, 1098768, 1227897, 1230969, 1398452, 1256915, 1306796, 1291955, 1304886, 1467582, 1677324, 1659086, 1603718, 1390642, 955068, 1405316, 1530125, 1566363, 1646185, 1700862, 1564942, 1599926, 1617676, 1641225, 1871858, 1878158, 1579594, 1791848, 1810743, 1870972, 2109132, 2142366, 2385823, 2520862, 2550033, 2889711, 2832945, 3133571, 3368091, 3431900, 3744564, 4156776, 4302979, 4852028, 5541292, 5866717, 6081219, 6220751, 6282908, 6154160, 6170619, 5570498, 5130995, 4745484, 4277468, 3718772, 3530336, 3219367, 3284200, 3110400, 2873012, 2733599]
4918B733599j2213J14877r1399o5054j6754j13066j76651l28846K47597j40547
4908B151543J13701Q4352L20509K7353j81215J13599r2861j16183J61757K10113
4898B792668K6926q0186l82688P2625K89185q6216j27313l61051M2385J63759
4888B350094j24383Q8382j50600J13189J95622Q4209j44430o5757O3390j82523
4878B227193p9139N1949o1540K01030j97364R571q3894P2468K6777k08884j63328
4867A794839j50463l0559K14522J0746j50629K57472r1319k25266K43244k91868
4857A580719K00242m1143j53071L01511p1394j50308k10440K42301j08982J04805
4847A694240K73525j87687R417M7839j71410j94204O9052j00409j17294K40792
$$ y = [2733599, 2721386, 2836263, 2744864, 2679810, 2663056, 2549990, 2373339, 2044493, 2292090, 2151543, 2265244, 2349596, 2670105, 2697458, 2516243, 2629842, 2536981, 2420798, 2582555, 2792668, 2819594, 2739408, 2356720, 2429345, 2718530, 2632314, 2505001, 2143950, 2186335, 2350094, 2225711, 2314093, 2163493, 2276682, 2472304, 2556513, 2412083, 2346326, 2409716, 2227193, 2148054, 2200003, 2138463, 2339493, 2142129, 2151700, 2067806, 2140274, 2167051, 1958167, 1794839, 1644376, 1613817, 1828339, 1839085, 1688456, 1945928, 1854609, 1629343, 1872587, 1580719, 1780961, 1739818, 1586747, 1888258, 1816864, 1666556, 1456116, 1698417, 1589435, 1694240, 1967765, 1780078, 1789495, 1837334, 1665924, 1471720, 1540772, 1440363, 1323069, 1563861]
4837A563861j7052k64449o477k7717K9385M19384q5158l25918K92129Q9631L8886
4826A706505j98259K5421N8542O900J21323r0081j80143J4473k70975q1424O8193
4815A180475J76799n1214J04677j402n5193J31663K39220r7462k94114L97889
4805A731338K5115K24788r3849k73673J52549R4835K74568L5956k09151N1515
4795B013991L78606L70403J74821k9071K28568O11094P65378O35289M57927J73896
4785E780902q9210l8326n72556k23650k57634l21302k62973l88005o16950l4443
4775B975853k89503k47897l97393M39326j9519n46098k06878J10543N0672J66267
4765B035373r7454n30141J28089K70543J53925j10259k66180j89800q7613K97326
$$ y = [1563861, 1546809, 1282360, 1275883, 1248166, 1277551, 1696935, 1611777, 1285859, 1577988, 1667619, 1706505, 1508246, 1533667, 1592209, 1599109, 1720432, 1630351, 1450208, 1464681, 1193706, 1112282, 1180475, 1357274, 1306060, 1410737, 1409335, 1354142, 1485805, 1725025, 1627563, 1333449, 1731338, 1756453, 1981241, 1887392, 1613719, 1766268, 1861103, 2135671, 2171627, 1962476, 2013991, 2392597, 2763000, 2937821, 2908750, 3137318, 3748412, 4513790, 5149079, 5607006, 5780902, 5691692, 5653366, 5080810, 4857160, 4599526, 4278224, 4015251, 3627246, 3010296, 2975853, 2686350, 2438453, 2041060, 2480386, 2460867, 1914769, 1707891, 1818434, 1869106, 2035373, 1937919, 1407778, 1535867, 1806410, 1960335, 1850076, 1583896, 1394096, 1306483, 1603809]
4755A603809j00540J20300K99318j67784j60549K20000J21079k8441m56151l96051
4745A054990K40463j85308J46068k99987j1984l6769j48698K48236K50919p2219
4735A185711J19753j88091J78868r2494K8621M6519j15582q9962m4209M3130j07070
4724I65194N4277K76855k39181J6007L66827l47307M8036K45021q847p7631J4832
4713A314083J91247Q9219k98559O5064l6427J02931L6181k695j53935J15476r5410
4702A327175J78822J23007k37637K45146J03425k80287j62214J22175j8683L620
4692A404549q5387l34859N33784K23384l91203K47616q7594N2203N1507J16146
4682A730146p5308n048J41646L06044j45143l17740o587N25241p2035k5298K37110
$$ y = [1603809, 1503269, 1623569, 1922887, 1755103, 1594554, 1814554, 1935633, 1907192, 1451041, 1054990, 1295453, 1110145, 1256213, 956226, 944242, 907473, 758775, 1007011, 1257930, 1185711, 1305464, 1117373, 1296241, 1203747, 1232368, 1278887, 1163305, 1073343, 1029134, 1072264, 965194, 1019471, 1296326, 1057145, 1073152, 1439979, 1092672, 1140708, 1385729, 1376882, 1299251, 1314083, 1505330, 1594549, 1295990, 1361054, 1324627, 1427558, 1463739, 1461044, 1307109, 1422585, 1327175, 1505997, 1629004, 1391367, 1636513, 1739938, 1459651, 1297437, 1419612, 1400929, 1404549, 1319162, 984303, 1518087, 1741471, 1350268, 1597884, 1510290, 1562493, 1614000, 1730146, 1654838, 1649790, 1791436, 2097480, 1952337, 1634597, 1628010, 2153251, 2081216, 2055918, 2293028]
4671B293028L24652Q5659j15331m3533L1804p7094J03329K90193J7052J80273
4661C090032j21485j83265L5271p8731L94526N17035K30342L7889O8813J18991
4651D109418J10145N58200K71449L67494L51679K19354K04523L34495O16233J42674
4641G285664L15115M50184P31079R51327R30429P67959P04630J168448J495699
4632A4800534J294043J214199J728228K030737K631374L621019L720189M288567
4624C5328890L977444J091157Q85479J846834J416973j68713k188136k342297
4616C9847631j471096q77978k73099m6521O40086R32204J653684K509413K944087
4607D5858411L107065L123550L911601L410625L252589M177660M530617M477910
$$ y = [2293028, 2617680, 2703339, 2588008, 2544475, 2576279, 2499185, 2602514, 2892707, 2909759, 3090032, 2968547, 2785282, 2820553, 2741822, 3136348, 3653383, 3883725, 3921614, 3990427, 4109418, 4219563, 4777763, 5049212, 5416706, 5768385, 5987739, 6192262, 6526757, 7142990, 7285664, 7600779, 8050963, 8782042, 9733369, 10663798, 11431757, 12136387, 13304835, 14800534, 16094577, 17308776, 19037004, 21067741, 23699115, 27320134, 31040323, 35328890, 39306334, 40397491, 41282970, 43129804, 44546777, 44378064, 42189928, 39847631, 38376535, 37498557, 37225458, 37178937, 37819023, 38751227, 40404911, 42914324, 45858411, 48965476, 52089026, 56000627, 59411252, 62663841, 66841501, 71372118, 75850028]
4599G5850028M398668M638477M550175L684362L093731L608379L539970L756864
4591A07120654K892326K688748K203481J154706R9729p7451o3077m70550j738131
4582A13810435k962511k834701l169341l695022m032480l869474l566732m188033
4574H5492141m669649m840720m863574m570945m599375m553036m190592l911360
4566D9292890m522638m300833l327234l433825k893350k859469k863300k133697
4558B2958544j859432j460921j362115j242694j294502j419279p57544n05367
4550A3056690p32851o17786p82556r34562l52905k64500p72102m72621j72095
4541G954712k09740n94854j24484o83757m25964K8090J15311l13200l99095k40253
$$ y = [75850028, 80248696, 84887173, 89437348, 93121710, 96215441, 99823820, 103363790, 107120654, 110012980, 112701728, 114905209, 116059915, 116159644, 116082193, 116019116, 115548566, 113810435, 110847924, 108013223, 104843882, 101148860, 97116380, 93246906, 89680174, 85492141, 80822492, 75981772, 71118198, 66547253, 61947878, 57394842, 53204250, 49292890, 44770252, 40469419, 37142185, 33708360, 30815010, 27955541, 25092241, 22958544, 21099112, 19638191, 18276076, 17033382, 15738880, 14319601, 13562057, 13056690, 12323839, 11706053, 10923497, 9988935, 9636030, 9371530, 8599428, 8126807, 7954712, 7744972, 7150118, 7025634, 6341877, 5915913, 5944003, 6059314, 5746114, 5347019, 5106766]
4531E106766n4544J7358n93700q8547j56427j518J8460k07294j16299j31984J4703
4520C806974l33847j41974o7516P0768R2343k36592k92804R855K02910k24755
4510B885362p2946K15751R4874k08628m36860j31795j84458l62125M93555M9629
4500B342359m00420J22526l3535P042J97196j85556J58565l3655k73545j27476
4490A773501K19570L4368j39759m12Q7028R6312k71310J3077r4214N6815k35804
4479A539172J13617K27247J57794J19932K32107j40557j51719l0127J4537J70337
4469B252340N8869m1715K77253L9472r4940n5217L7986K22613R7891L72895j90683
4458B976764j00294J03196J3070J00256j37906j84508P392J8170k51155L19522
$$ y = [5106766, 5052222, 5069580, 4475880, 4387333, 4230906, 4229388, 4247848, 4040554, 3924255, 3792271, 3806974, 3473127, 3331153, 3263637, 3334405, 3426748, 3190156, 2897352, 2907207, 3110117, 2885362, 2812416, 3028167, 3123041, 2914413, 2477553, 2345758, 2161300, 1799175, 2292730, 2342359, 1941939, 2064465, 2030930, 2037972, 2235168, 2049612, 2208177, 2174522, 1900977, 1773501, 1993071, 2027439, 1887680, 1887268, 1974296, 2070608, 1799298, 1812375, 1718161, 1774976, 1539172, 1652789, 1880036, 2037830, 2157762, 2389869, 2249312, 2097593, 2067466, 2082003, 2252340, 2311209, 2269494, 2546747, 2586219, 2491279, 2436062, 2474048, 2696661, 2794552, 3167447, 2976764, 2876470, 2979666, 2992736, 3092992, 2955086, 2770578, 2777970, 2796140, 2544985, 2864507]
4448B864507j94300k46674O9029l45617k19264p2353j01992j68502l9603J26049
4438A671280j07487j66764r6364o4936J00524j04406j55100m8404K04290M22p9147
4427A153908j5442l6525l02017L19362J39372K96251j00510j62931K49238p8013
4417A462693j52334j72690k99918j06174J19829K40856J891K5777J60558k2908
4407A257580L78298m16574K0139J70659k00655p6067L77744J11330j99749k55560
4397A167145K37842L09004j23574k52310O0707J42363j43515r8692M917J77353
4387A481240L5768L17260m67036j22225R419L57495J47157K86513j39317p9252
4377A827022r876K05092Q8707l1805l02665l19268J56430Q8657J5038j2607J78420
$$ y = [2864507, 2670207, 2423533, 2492562, 2146945, 1927681, 1855328, 1753336, 1584834, 1545231, 1671280, 1563793, 1397029, 1300665, 1235729, 1336253, 1231847, 1076747, 1028343, 1232633, 1233055, 1153908, 1138466, 1101941, 799924, 1119286, 1258658, 1554909, 1454399, 1291468, 1540706, 1462693, 1310359, 1137669, 837751, 731577, 851406, 1092262, 1094153, 1119930, 1280488, 1257580, 1635878, 1219304, 1239443, 1410102, 1209447, 1133380, 1511124, 1622454, 1422705, 1167145, 1404987, 1713991, 1590417, 1338107, 1398814, 1541177, 1397662, 1298970, 1303887, 1481240, 1517008, 1834268, 1367232, 1245007, 1254426, 1611921, 1759078, 2045591, 1906274, 1827022, 1817146, 2022238, 2110945, 2079140, 1776475, 1457207, 1613637, 1702294, 1717332, 1704725, 1883145]
4366A883145L19502j63834j92252M0468q2683M7973m7674K24013J67712K82961
4356B479331L7636m9012j47603M21050J81674M9145j92242j78482J25090J66746
4346B893333N96343J32815k6658L43962J71791L86524L60429K43129j83131M57561
4336E376098P70297L33381J50612N72054M95145K83119K59453O20232N42659N66922
4326I969972M41808N11598Q13194P05547P20415J122505Q49339O20602J025244
4317A6780224O95497P94976O08119Q27663J232356R93492P08599J326423J055789
4308B5023138Q84304J315832J383409R54139R00879J92230R22060O98068O95123
4299C2969182J265395L26046J80307P36498J006524Q25578Q12227N11815N27002
$$ y = [1883145, 2202647, 2038813, 1846561, 1887029, 1804346, 1852319, 1804645, 2028658, 2196370, 2479331, 2516967, 2467955, 2320352, 2741402, 2923076, 2972221, 2779979, 2601497, 2726587, 2893333, 3489676, 3622491, 3595833, 3939795, 4111586, 4498110, 4858539, 5101668, 4918537, 5376098, 6146395, 6479776, 6630388, 7202442, 7697587, 7980706, 8240159, 8860391, 9403050, 9969972, 10411780, 10923378, 11736572, 12442119, 13162534, 14285039, 15134378, 15754980, 16780224, 17475721, 18270697, 18878816, 19706479, 20938835, 21932327, 22640926, 23967349, 25023138, 25907442, 27223274, 28606683, 29560822, 30461701, 30653931, 31575991, 32274059, 32969182, 34234577, 34560623, 34740930, 35477428, 36483952, 37309530, 38121757, 38633572, 39160574]
4290C9160574K31811L24527K82407k57659j47493j55442n30893m50378l69456
4281C8087998l57929k44751j44386m06165k98926o37643l86781p10885o11554
4272C4288978m78677j420171j026204j210049l87003p48001j183238q32957n64205
4263B6438473m85445o54713n55108n73719j148889q59460r87954r19936n06414
4254A9746835p99374p02712m93262o08304n96739n44437l01571J9414p56829o30056
4244A4332965j069528n39017n14624m03419l16022k16703l21094l39565m38182
4235A0174811l47835k69223m54318m66684k00514l39292k76114p42124k26929
4226F851778M1661l52331l5122K2088J0289o22624m13023J77970J39981k06234
$$ y = [39160574, 39392385, 39716912, 39999319, 39741660, 39594167, 39438725, 38907832, 38457454, 38087998, 37730069, 37485318, 37340932, 36934767, 36635841, 35998198, 35611417, 34900532, 34288978, 33810301, 32390130, 31363926, 30153877, 29766874, 29018873, 27835635, 27002678, 26438473, 25953028, 25298315, 24743207, 24169488, 23020599, 22161139, 21173185, 20253249, 19746835, 18947461, 18244749, 17751487, 17143183, 16546444, 16002007, 15700436, 15719850, 14963021, 14332965, 13263437, 12724420, 12209796, 11806377, 11490355, 11273652, 10952558, 10612993, 10174811, 9826976, 9557753, 9103435, 8636751, 8436237, 8096945, 7820831, 7078707, 6851778, 6893439, 6541108, 6505986, 6528074, 6538363, 5915739, 5502716, 5680686, 5820667, 5614433]
4216E614433m10445m03464j6781l05359K52223k37767m05404J26498J47468j61922
4206D199480k7712K06391j97739J3691l05458q3792K0284n2020N6629l85504l61031
4195C083219L17253K33446l31959l07198j04741l582n2158m4933j55257k57829
4185B376261K347J49676m8416N7525r0877j20208n2169R4159J16145J26205r0766
4174B519882k00624M6636j47478k29781R5032n509J79152l703n8192q99J71756
4163B366272J21397m14784q2453K11499J71797N6425k11476j10655j61711K44815
4153B191126J50049n08579k00852K73789L36778p9183n075j71819K94208k3147
4143B257295J96730L78671l93865k75285m9667n7280J38401m4320l3508k59874
$$ y = [5614433, 5203988, 4800524, 4783743, 4478384, 4730607, 4492840, 4087436, 4213934, 4361402, 4199480, 4171768, 4378159, 4180420, 4194111, 3888653, 3804861, 3825145, 3773125, 3829754, 3444250, 3083219, 3400472, 3633918, 3301959, 2994761, 2890020, 2886438, 2834280, 2789347, 2634090, 2376261, 2378608, 2528284, 2479868, 2537393, 2446516, 2326308, 2274139, 2368298, 2484443, 2610648, 2519882, 2319258, 2365894, 2218416, 1988635, 2083667, 2078158, 2257310, 2253607, 2195415, 2194516, 2366272, 2487669, 2072885, 1990432, 2201931, 2373728, 2430153, 2218677, 2108022, 1946311, 2191126, 2341175, 1832596, 1631744, 1905533, 2242311, 2163128, 2158053, 1986234, 2280442, 2257295, 2454025, 2832696, 2438831, 2163546, 2113879, 2056599, 2195000, 2150680, 2117172, 1857298]
4133A857298j33456K58088M2044J04505j14160k4415J40002l9386n4504K02797
4123B238813K42640j95465l7997K23793O6710m4713l49550q2215R2583l9653K41823
4112B356769K00977m89906L76038P4751k3880L5452L90442j42058o3622J88912
4102B903875L3578j3147O3665J51922M86678O2259k28245j75707J62876K33637
4092C681391j06386M1052r674R7668J2776M77524l79685J7818L76984K01341J52738
4081D563547J32364R8426K26666j83555j64820K52023M32445L81712O47492K37886
4071F624186J6832L81020K38519K23148l0459L33411O22482J90192O21780M30813
4061I651924L59343O79833J73997P93424P79900O94002N84646Q12340J112305
$$ y = [1857298, 1723842, 1981930, 2023974, 2128479, 2014319, 1989904, 2129906, 2090520, 2036016, 2238813, 2481453, 2285988, 2247991, 2471784, 2538494, 2493781, 2144231, 2062016, 2154599, 2114946, 2356769, 2557746, 2067840, 2443878, 2518629, 2494749, 2530201, 2920643, 2778585, 2714963, 2903875, 2937453, 2924306, 2987971, 3139893, 3626571, 3688830, 3460585, 3284878, 3447754, 3681391, 3575005, 3616057, 3606383, 3704051, 3716827, 4194351, 3814666, 3832484, 4209468, 4410809, 4563547, 4695911, 4794337, 5021003, 4837448, 4672628, 4924651, 5357096, 5738808, 6386300, 6624186, 6641018, 7022038, 7260557, 7483705, 7453246, 7786657, 8409139, 8599331, 9221111, 9651924, 10011267, 10691100, 10865097, 11658521, 12438421, 13132423, 13717069, 14529409, 15641714]
4052A5641714Q34115J086822J280453J639508J512358J849236K222406L015597
4044B9082209K372231J169852J011747J043228M2291j199726j212526j342151
4036C0967155q64595p90344n62311n48031k38356O0237L71800N55324O57292O24546
4026C0232717N40071R11414J047091J478362J783416J985684J594628K113460
4018D1686843K556819K561914K607766K878929L122459L211281L358682K783943
4010F4768636K086714K122531K197903J920324P78797J514314J473957J003283
4002G7866459J616981K048969J880651K017643K249103K424433K644877K473437
3994I5222553K049271K758676K436233K387112K405069K454839K914307L151252
$$ y = [15641714, 16475829, 17562651, 18843104, 20482612, 21994970, 23844206, 26066612, 29082209, 31454440, 32624292, 33636039, 34679267, 34721558, 33521832, 32309306, 30967155, 30102560, 29312216, 28749905, 28201874, 27963518, 28023755, 28395555, 28950879, 29608171, 30232717, 30772788, 31684202, 32731293, 34209655, 35993071, 37978755, 39573383, 41686843, 44243662, 46805576, 49413342, 52292271, 55414730, 58626011, 61984693, 64768636, 66855350, 68977881, 71175784, 73096108, 73874905, 75389219, 76863176, 77866459, 79483440, 81532409, 83413060, 85430703, 87679806, 90104239, 92749116, 95222553, 97271824, 100030500, 102466733, 104853845, 107258914, 109713753, 112628060, 115779312]
3986A15779312L656600L631428L973637M489340M835394L832018L230038K389954
3978A45817721J244120k80616j196119k201867k945941l425293l766653m032816
3970A29212536l660856l775541l015239k708712k620289k234630k172450k327611
3962A06697208k278578k615729k516538k318083k677240k364499k188414j787546
3954H7950581j810833j734798q79080j389194j331038r44858r34268p48103j227405
3945G6951004j866035j876861k149734k351072k095725k029615k156730j883129
3937F0542103j508760r88173j059684o71107j32817m3709M14069P05155J228143
3928E8485220J766593J875349K079542K986230K914989L213625L399724L551412
$$ y = [115779312, 119435912, 123067340, 127040977, 131530317, 136365711, 140197729, 143427767, 145817721, 147061841, 146781225, 145585106, 143383239, 140437298, 137012005, 133245352, 129212536, 125551680, 121776139, 118760900, 116052188, 113431899, 111197269, 109024819, 106697208, 104418630, 101802901, 99286363, 96968280, 94291040, 91926541, 89738127, 87950581, 86139748, 84404950, 83525870, 82136676, 80805638, 79860780, 78926512, 78178409, 76951004, 75084969, 73208108, 71058374, 68707302, 66611577, 64581962, 62425232, 60542103, 59033343, 58045170, 56985486, 56314379, 56181562, 56137853, 56551922, 57257077, 58485220, 60251813, 62127162, 64206704, 67192934, 70107923, 73321548, 76721272, 80272684]
3920H0272684L445141L411338L871533M001191L234852K543477J924941J396822
3912A04101979J304966P90091K40455K7458k23141m56770o76290m69977k53324
3903A04385447j274796j238760q25068j824184j881903k366066k897991l151827
3895H8924852l477752l973153m092146m413494m518825l992237m307865l665377
3887E6484003l495616l453772k917506l166942l006016k125820k051381k159027
3879C4107923j969195j504669j701985j452722j342604q30972q24746j120210
3871B3360820r17259r28157l61336n69852p69650q23211n10700n27716n06032
3862A7446907o27885m03529k17830l43570m80277k49974l47656k67842N4335m9330
$$ y = [80272684, 83717825, 87129163, 91000696, 95001887, 98236739, 100780216, 102705157, 104101979, 105406945, 106197036, 106437491, 106464949, 106241808, 105785038, 105108748, 104638771, 104385447, 103110651, 101871891, 101046823, 99222639, 97340736, 94974670, 92076679, 88924852, 85447100, 81473947, 77381801, 72968307, 68449482, 64457245, 60149380, 56484003, 52988387, 49534615, 46617109, 43450167, 40444151, 38318331, 36266950, 34107923, 32138728, 30634059, 28932074, 27479352, 26136748, 25305776, 24481030, 23360820, 22443561, 21515404, 21154068, 20584216, 19814566, 18991355, 18480655, 17952939, 17446907, 16819022, 16415493, 16197663, 15854093, 15373816, 15123842, 14776186, 14508344, 14562679, 14513349]
3852A4513349k64509l07020k06468K04914N80l12836k02204J4875K79147M5339
3842A3765167M9118j50919L7176j97507j73418J90480j42475m9289K17616M55901
3832A4001850k9843j45373K88944O14678M14177K24604N28834L28494M02797R26696
3822A7555858P45754N12048O13366O69895Q56280N77027P21608Q42904Q01508
3813B3896248M21810P35772N73283L06566R13263P45295K24903P43810N82079
3804B9143029N72201M97181P18366O56356N47934J013064O49618N92735M55805
3795C4846289O31448K37588j77780J62311k97815n53894n68390r67736q74600
3786C2437421j104764j104101j113072n10524o91465n33636l29593n49933m85356
$$ y = [14513349, 14248840, 13941820, 13735352, 13940266, 13940846, 13628010, 13425806, 13440681, 13719828, 13765167, 13814285, 13663366, 13700542, 13503035, 13329617, 13520097, 13377622, 13328333, 13545949, 14001850, 13972007, 13826634, 14115578, 14730256, 15144433, 15369037, 15897871, 16226365, 16629162, 17555858, 18301612, 18813660, 19427026, 20096921, 20953201, 21530228, 22251836, 23094740, 23896248, 24318058, 25053830, 25627113, 25933679, 26846942, 27592237, 27817140, 28560950, 29143029, 29715230, 30212411, 30930777, 31587133, 32135067, 33148131, 33797749, 34390484, 34846289, 35477737, 35715325, 35537545, 35699856, 35402041, 34848147, 34279757, 33312021, 32437421, 31332657, 30228556, 29115484, 28604960, 27913495, 27379859, 27050266, 26500333, 26014977]
3777B6014977j70807K46609L95142J42625k07510K28278O59172R18307J026332
3768B9253125J056933J184589J486412J470684J629343J619111J942181K617919
3760D2260297K524247K405579L255405L592102L530609M271241M598154M980574
3752G1418208N429616O109995O288204O961231P157305P525956P736710P405231
3744A26032456P475974P577834P146143O067656N364549M459895L652237K372983
3736A70149727J607163R04204J60304m37845p67973j475400j512042j705246k329657
3727A64593235k958925l019378l598156m240330m432570m898806n096223n873098
3719A30475749n956743n795212o086162o023685n951838o019195n593097n570229
$$ y = [26014977, 25844170, 26090779, 26485921, 26628546, 26421036, 26649314, 27308486, 28226793, 29253125, 30310058, 31494647, 32981059, 34451743, 36081086, 37700197, 39642378, 42260297, 44784544, 47190123, 50445528, 54037630, 57568239, 61839480, 66437634, 71418208, 76847824, 82957819, 89246023, 96207254, 103364559, 110890515, 118627225, 126032456, 133508430, 141086264, 148232407, 154300063, 159664612, 164124507, 167776744, 170149727, 171756890, 172661094, 172821398, 172383553, 171615580, 170140180, 168628138, 166922892, 164593235, 161634310, 158614932, 155016776, 150776446, 146343876, 141445070, 136348847, 130475749, 124519006, 118723794, 112637632, 106613947, 100662109, 94642914, 89049817, 83479588]
3711H3479588n336251n114683m575901m279392l847020l406229l391225l314527
3703E0214360k401656k572334k532988j933729j647763j853592j704824j018952
3695C4548522q28403j071418j009944n30147j250471m62591l96419q3808n00045
3686B8415276o48642r0146j91125K19283M6987M7733J91208j29888J78294L33741
3676B8372721J08436m1794k04123N3523J21839l04178m62439k98648k76911o29633
3666B6438793o34016o34969m62327q02773q30504o13583r95787p87799o06818
3657B0070217k29089j08878j45604N2632m61206l31456L01926L18444L01986L83200
3647B0152172L40762L58019M52460N27255Q73742P43676R13739O70975P63243
$$ y = [83479588, 78143337, 73028654, 68452753, 64173361, 60326341, 56920112, 53528887, 50214360, 47812704, 45240370, 42707382, 40773653, 39125890, 37272298, 35567474, 34548522, 33720119, 32648701, 31638757, 31108610, 29858139, 29395548, 28999129, 28915321, 28415276, 27766634, 27676488, 27485363, 27704646, 27751633, 27799366, 27990574, 27860686, 28038980, 28372721, 28481157, 28439363, 28235240, 28288763, 28410602, 28106424, 27643985, 27345337, 27068426, 26438793, 25804777, 25169808, 24707481, 23904708, 23074204, 22460621, 21464834, 20677035, 20070217, 19841128, 19732250, 19586646, 19639278, 19178072, 18846616, 19148542, 19466986, 19768972, 20152172, 20492934, 20850953, 21303413, 21830668, 22704410, 23448086, 24361825, 25032800, 25796043]
3638B5796043Q45754Q12168N15723O36981N65762P39501N07511j38138O21830
3629C0903135l435J74789j80454l44636o0546l69954l7797k27682k46380m96669
3619B9110371r55754o10823n60737p92323q29361q91148m83100r70520j218078
3610B1798527p34745o95608j068957r67140r25248o97595l92709n81038o29385
3601A5106102r54705m52346k75662m94669l75866k46789k61108l30221J3304j64243
3591A1563797j62970J38525m13182P404o8272j51161L86553K80361K72727J04881
3581A1958663K04161J79287O16251N05405O15621L72544K76067P44236O12667
3572A6084902P53478P87814N77534R23483N85485Q43266N02043K72383N38222
$$ y = [25796043, 26641797, 27453965, 27969688, 28606669, 29172431, 29911932, 30419443, 30281305, 30903135, 30899700, 31074489, 30894035, 30549399, 30488853, 30118899, 30081102, 29853420, 29607040, 29110371, 28154617, 27543794, 26983057, 26190734, 25361373, 24470225, 23987125, 23016605, 21798527, 21063782, 20368174, 19299217, 18332077, 17406829, 16709234, 16316525, 15735487, 15106102, 14151397, 13699051, 13423389, 12928720, 12552854, 12306065, 12044957, 11714736, 11728040, 11563797, 11400827, 11539352, 11126170, 11133574, 11065302, 10914141, 11300694, 11581055, 11853782, 11958663, 12162824, 12342111, 12958362, 13463767, 14079388, 14451932, 14727999, 15472235, 16084902, 16838380, 17626194, 18203728, 19127211, 19712696, 20555962, 21058005, 21330388, 21868610]
3563B1868610J58032o3751M66511q1687M6664L99945K966K46617j68735k33288
3553B2641884L43448J08570j31676r4903l18046l69179J79605J05490l36594k09385
3543B1919214k30749j14767Q2617J5932r385N33231L81459R13939M10379M99412
3533B4401282O78074J130780J185930J455344J273686J482799J489059K048647
3525C5145601K351013J865848K574484L071245L172194L584402L592002M306343
3517E9663132M364697M356948N139966N108141N253063M957755N141836N091400
3509I9076938M680065M350640M525750L662899L884421L640765L392576L664755
3501A30878809L562497L429570M172872L793878L406017L176977K993641K719104
$$ y = [21868610, 22026642, 21962891, 22429402, 22347715, 22394379, 22794324, 22797290, 23043907, 22875172, 22641884, 22985332, 23093902, 22962226, 22867323, 22549277, 22180098, 22359703, 22465193, 22128599, 21919214, 21688465, 21573698, 21656315, 21672247, 21662862, 22196093, 22577552, 23491491, 23901870, 24401282, 25079356, 26210136, 27396066, 28851410, 30125096, 31607895, 33096954, 35145601, 37496614, 39362462, 41936946, 45008191, 48180385, 51764787, 55356789, 59663132, 64027829, 68384777, 73524743, 78632884, 83885947, 88843702, 93985538, 99076938, 103757003, 108107643, 112633393, 116296292, 120180713, 123821478, 127214054, 130878809, 134441306, 137870876, 142043748, 145837626, 149243643, 152420620, 155414261, 158133365]
3493A58133365J859311J268051M66368K72596l45747j296794j258703j228383
3485A57870064j763366j763989j783121j976748j861012j859783k422025k510357
3477A41929663l082382l077892l483251l688058m137620m685493m601418m624431
3469A10549118m742760m767526m483723m352057m325546m029601m193479l867487
3461G5786939l943836l768959l567400l590391k921443l132698k514194k568716
3453D9779302k520640k186495k037308j791964j452199j514891j271222j011471
3445C5993112n67748q51184m84760n68779p99570k31795M1042K37062l33220J57281
3435C2591441J16425k91574l2748P1122j00480l29015J41035L78744J4275K77843
$$ y = [158133365, 159992676, 161260727, 161727095, 161999691, 161653944, 160357150, 159098447, 157870064, 156106698, 154342709, 152559588, 150582840, 148721828, 146862045, 144440020, 141929663, 138847281, 135769389, 132286138, 128598080, 124460460, 119774967, 115173549, 110549118, 105806358, 101038832, 96555109, 92203052, 87877506, 83847905, 79654426, 75786939, 71843103, 68074144, 64506744, 60916353, 57994910, 54862212, 52348018, 49779302, 47258662, 45072167, 43034859, 41242895, 39790696, 38275805, 37004583, 35993112, 35425364, 34574180, 34089420, 33520641, 32721071, 32489276, 32530318, 32767380, 32434160, 32591441, 32707866, 32416292, 32383544, 32454666, 32354186, 32025171, 32166206, 32544950, 32559225, 32837068]
3425C2837068J47450m40524k64800Q8264m68587q01898n89996p16341j268111
3416B8522525r72419r14849o86818j191587r63793m67814p87879p76412n11117
3407B1249837m32331n09065m38895j20600r018m85442l08495O35597L58784J15053
3397B0055425J81629J16868K21559n842L22495k33471j44610k76279k55476k296
3387A9980002l68043n10594K95977K14327R552K5638k18797K53351M73392L21165
3377B0475970O35793N41478P85232Q21102Q38027J336469J448118J276685J219582
3368B9378456J471947J650562J830695K087107K534453K240896K437909K900061
3360D6532086L537332L686364L935990M368729M743175N232463N695046O254730
$$ y = [32837068, 32984518, 32543994, 32279194, 32367458, 31898871, 31096973, 30506977, 29790636, 28522525, 27550106, 26635257, 25948439, 24756852, 23793059, 23325245, 22537366, 21760954, 21249837, 20817506, 20308441, 19869546, 19748946, 19739928, 19254486, 18945991, 19581588, 19940372, 20055425, 20237054, 20353922, 20575481, 20569639, 20892134, 20658663, 20514053, 20237774, 19982298, 19980002, 19611959, 19101365, 19397342, 19611669, 19621221, 19646859, 19428062, 19681413, 20154805, 20475970, 21111763, 21653241, 22438473, 23259575, 24097602, 25434071, 26882189, 28158874, 29378456, 30850403, 32500965, 34331660, 36418767, 38953220, 41194116, 43632025, 46532086, 50069418, 53755782, 57691772, 62060501, 66803676, 72036139, 77731185, 83985915]
3352H3985915O506465O442559O514284O547744O495526N672712M464986L363823
3344A29994014K191651J173541m97390j933421l085999m371705m836730n747541
3336A12886420n860683n692715o245272n903591n647014n048135m751269n007907
3328F8729834m195720l885663l863453l700070l201309k927560k804167k475095
3320D1676797k150466k361962j850402j472166j291058j271603j415008r52558
3312B8911574j065010n83246n27123o32916n99700m33741n66305o19285m85019
3303B3399229m15292p02789l40316n57180m48007l66790n75702l19043l42058
3294A9332052m00874p77205q44045r14286k81935m73270p09592j46588m27720
$$ y = [83985915, 90492380, 96934939, 103449223, 109996967, 116492493, 122165205, 126630191, 129994014, 132185665, 133359206, 132861816, 130928395, 127842396, 123470691, 118633961, 112886420, 107025737, 101333022, 95087750, 89184159, 83537145, 78489010, 73737741, 68729834, 64534114, 60648451, 56784998, 53084928, 49883619, 46956059, 44151892, 41676797, 39526331, 37164369, 35313967, 33841801, 32550743, 31279140, 29864132, 28911574, 27846564, 27263318, 26736195, 26103279, 25503579, 25069838, 24503533, 23884248, 23399229, 22983937, 22281148, 21940832, 21383652, 20935645, 20568855, 19993153, 19674110, 19332052, 18931178, 18153973, 17309928, 16395642, 16113707, 15640437, 14930845, 14784257, 14356537]
3285A4356537m29037p14056k12490J26372l51571l94452j44510k85810l90609
3276A1560374m21130l46464k17273m27257K5427K00536m84904j09791J39584K96162
3266A0215264p0537k45102k69941k65889J68741Q8518j82439l68445j04558m4133
3256H921479K70125k62954m482Q8961k59540l60919k67282j75233r9111n6723
3246G794321k76619k0153k18155l70461l00916k49550m33952k10373K70985k61969
3236E723158k20866K27791M1440j21246o5891j36891j97369O3931k05392P1868
3226E180533L2800k46546k51280j83329L38669J79589o9637j71353J47123J96605
3216E153174O4622k53568K42214j58502j27180L99735j90121L27022Q58k37442
$$ y = [14356537, 13927500, 13213444, 13000954, 13127326, 12775755, 12381303, 12236793, 11950983, 11560374, 11139244, 10792780, 10575507, 10148250, 10173677, 10374213, 9889309, 9779518, 9919102, 10215264, 10144727, 9899625, 9629684, 9363795, 9532536, 9621054, 9438615, 9070170, 8965612, 8921479, 9191604, 8928650, 8924168, 9013129, 8753589, 8392670, 8125388, 7950155, 7851044, 7794321, 7517702, 7497549, 7279394, 6908933, 6608017, 6358467, 5924515, 5714142, 5985127, 5723158, 5502292, 5730083, 5771523, 5650277, 5584386, 5447495, 5250126, 5314057, 5108665, 5180533, 5213333, 4966787, 4715507, 4532178, 4870847, 5050436, 4980799, 4809446, 4956569, 5153174, 5217796, 4964228, 5206442, 5047940, 4920760, 5320495, 5130374, 5457396, 5458254, 5220812]
3206E220812J62598J4618K71188J46717k33743K52789j85771J82168M7082j26572
3196E751886Q3520r6306k8643K10591J83180j45281K98944j02857j92341L95229
3186F357922j13903m3319j45066J91817J57157n8751M32597K10678p5757j7843
3176F895532j3938j74994O7601r2580M41170Q1503m4902j07142Q5928K27853o244
3165G359787J60868K85653Q1873P9078j53749M98208M23375M67036K67212J59552
3155I628893L23427L85710K81657N39783Q1235J18246L34003J28379P77872N01314
3145A3100519K60563L79965L54762N72054O57558M28160O52295M45043J046953
3136A7897872J070023Q83404O82709J216242R36176J176792J663969J564644J633894
$$ y = [5220812, 5383410, 5398028, 5669216, 5815933, 5582190, 5834979, 5649208, 5831376, 5878458, 5751886, 5835406, 5739100, 5710457, 5921048, 6104228, 5958947, 6257891, 6155034, 5962693, 6357922, 6244019, 6200700, 6055634, 6247451, 6404608, 6345857, 6778454, 6989132, 6913375, 6895532, 6881594, 6706600, 6774201, 6681621, 7122791, 7204294, 7159392, 7052250, 7138178, 7366031, 7359787, 7520655, 7806308, 7888181, 7967259, 7813510, 8311718, 8735093, 9202129, 9469341, 9628893, 9952320, 10338030, 10619687, 11159470, 11240705, 11358951, 11692954, 11821333, 12599205, 13100519, 13361082, 13741047, 14095809, 14667863, 15325421, 15753581, 16405876, 16850919, 17897872, 18967895, 19851299, 20534008, 21750250, 22686426, 23863218, 25527187, 27091831, 28725725]
3127B8725725J276890J688349J974197K403760K666222K508761K945570L600249
3119D7789723L598880M650830M924511N312101N805894N863084O165895O921062
3111I1031980P026405P666918Q927006J0081687J1182900J2439204J3683670J4844993
3103A76884763J6653948J7686427K0109482K1825239K4668686K7610446L0248175
3096C35687166L2523960L2360495K8293698K0560001J1114877J685468p830308
3089D54395357j5935648k1501524k4509747k5589427k5718064k4782603k3329465
3082B93028879k0922557j7874713j5495676j3299012j2122419j0408268r572200
3075A93334034p758977o923017o446028n744894o059953o193476p190664p545943
$$ y = [28725725, 30002615, 31690964, 33665161, 36068921, 38735143, 41243904, 44189474, 47789723, 51388603, 56039433, 60963944, 66276045, 72081939, 77945023, 84110918, 91031980, 98058385, 105725303, 114652309, 124733996, 135916896, 148356100, 162039770, 176884763, 193538711, 211225138, 231334620, 253159859, 277828545, 305438991, 335687166, 368211126, 400571621, 428865319, 449425320, 460540197, 462225665, 454395357, 438459709, 416958185, 392448438, 366859011, 341140947, 316358344, 293028879, 272106322, 254231609, 238735933, 225436921, 213314502, 202906234, 193334034, 185575057, 178652040, 172206012, 166461118, 160401165, 154207689, 147017025, 139471082]
3067A39471082p382091p882570q026646p470045p360851o699398o364691n730250
3059H2554540n460108m904371m259091m061115l972014l592742l263340k973055
3051E0068704l050302k412013k194734k416011k293958j667217j393008j406602
3043C3234859j877653j562315j112858j284713j004692r82358j060879r73236
3035B3376155q97639q90597o51157p93602n12881n71004p22513o96724m86611
3026A7153427p63773o53813o64754p01984k08263l97408n58984n06518j35745
3017A2562185l54052o23982m15875m22033k5855k89981k76942k95746k27976m40821
3007I188922k56447m21921l72905k5482k11834j62666m41478j00378j27702m35
$$ y = [139471082, 132088991, 124206421, 116179775, 108709730, 101348879, 94649481, 88284790, 82554540, 77094432, 72190061, 67930970, 63869855, 59897841, 56305099, 53041759, 50068704, 47018402, 44606389, 42411655, 39995644, 37701686, 36034469, 34641461, 33234859, 31357206, 29794891, 28682033, 27397320, 26392628, 25410270, 24349391, 23376155, 22478516, 21587919, 20936762, 20143160, 19630279, 19059275, 18336762, 17640038, 17153427, 16389654, 15735841, 15071087, 14369103, 14160840, 13763432, 13204448, 12697930, 12562185, 12208133, 11584151, 11168276, 10746243, 10720388, 10430407, 10153465, 9857719, 9629743, 9188922, 8932475, 8510554, 8137649, 8112167, 7900333, 7737667, 7296189, 7195811, 7068109, 7067674]
2997G067674m78388l17493M3819l04533k08483L2507N3508K9325j67291j53775
2987E596870l07081O2976j3762j0596j29211j21220o02103q6634R0581n1844k78611
2976D149365K51709N8606J47546m1332m81519J96800J15312k66605l21536K23461
2966D031807J06731o4185n8091l11019k16090j4618j26742J6122q2460P8591m03009
2955B957037L99977r4806j77857K92491j92190l59290j74912L95287J70752n01264
2945B715225j35562K62434j46356m10090J23775k9176q8820O9339j2600J72800
2935B520969J34233j52031J13883o6810q4114k16962m13251K3536L12588p9722
2925B092319j60341L20333m34680o914J08926j31063K39542j913K00202J5617
$$ y = [7067674, 6589286, 6271793, 6315612, 6011079, 5802596, 5835103, 5888611, 5917936, 5750645, 5596870, 5289789, 5352765, 5339003, 5328407, 5199196, 5077976, 4475873, 4389239, 4479820, 4427976, 4149365, 4401074, 4459680, 4607226, 4565894, 4084375, 4281175, 4396487, 4129882, 3808346, 4031807, 4138538, 4074353, 4016262, 3705243, 3489153, 3474535, 3347793, 3363915, 3281455, 3360046, 2957037, 3357014, 3262208, 3084351, 3376842, 3184652, 2825362, 2650450, 3045737, 3216489, 2715225, 2579663, 2842097, 2695741, 2285651, 2409426, 2380250, 2291430, 2360769, 2348169, 2520969, 2655202, 2503171, 2617054, 2550244, 2466130, 2249168, 1835917, 1859453, 2172041, 2092319, 1931978, 2252311, 1817631, 1810717, 1919643, 1788580, 2028122, 2026209, 2226411, 2242028]
2915B242028q8343j67296l6702J16133r4509O6054k0882o1706k77781R5463j38024
2904A634435Q9178n0875j57384n08724p7240L92957J6946K51835J62479q6380
2894A667227p3069l85956j97667L11213L12915M4308l39250j77879J71641J07112
2884A440595j00430p084J15749l5108r6278K22387l99645k59165L38268J69740
2874A389029l33733j23856k9211M6298L55402j05866K0786j89710M6555l15050
2864G60644j63419N39481N7265k06076o0105N3415J04711o8886l40007J91522
2854H68545J96530L11551q2122j56938q4588K31574J16917k69992m35723K87543
2844I83297Q766p9409j46531k20714O2930J62893K81372K1314O5912o1231Q816
$$ y = [2242028, 2153685, 1986389, 1949687, 2065820, 1971311, 2037365, 2016483, 1954777, 1676996, 1772459, 1634435, 1723613, 1672738, 1515354, 1006630, 929390, 1322347, 1339293, 1591128, 1753607, 1667227, 1594158, 1208202, 1010535, 1321748, 1634663, 1678971, 1339721, 1161842, 1333483, 1440595, 1340165, 1333081, 1448830, 1413722, 1317444, 1539831, 1140186, 881021, 1219289, 1389029, 1055296, 931440, 902229, 948527, 1303929, 1198063, 1218849, 1029139, 1075694, 760644, 597225, 1136706, 1193971, 987895, 927790, 981205, 1085916, 1017030, 677023, 868545, 1065075, 1376626, 1294504, 1137566, 1052978, 1284552, 1401469, 1131477, 695754, 983297, 992063, 912654, 766123, 545409, 608339, 771232, 1052604, 1073918, 1139830, 1078599, 1087415]
2833A087415k7804J8142p1098k95947K46158J72436Q8965K9671k3005O06522j55488
2822A675967k11896L01941J7587k17117J81820J12523j96592K12550j4309M11253
2812B273727K53255J25790r1487P7937J20296j56240Q7288J69086j82739J12614
2802B789527j51841p84908j35203L33849J15885m66622p584k1863j43922J14364
2792A641682N5660k34428M3664j98646j09787J36164k7601P9952j54101l33001
2782H99558Q6111J82962k44272M4110K94287p1740k43170j20048J42497O5762
2772A036057k99859k61533j6871J46685k25285j52203K91748K90587m58949R5405
2762D45782L20095m09387m7558k59384j29606J71270k1248L5100J67099Q049L30991
$$ y = [1087415, 1059611, 1077753, 1006655, 710708, 956866, 1129302, 1218267, 1247938, 1224933, 1831455, 1675967, 1464071, 1766012, 1783599, 1566482, 1748302, 1860825, 1664233, 1876783, 1862474, 2273727, 2526982, 2652772, 2561285, 2639222, 2759518, 2603278, 2690566, 2859652, 2676913, 2789527, 2637686, 1852778, 1717575, 2051424, 2167309, 1700687, 1693103, 1671240, 1527318, 1641682, 1697342, 1462914, 1506578, 1307932, 1198145, 1334309, 1306708, 1386660, 1232559, 899558, 985669, 1168631, 924359, 968469, 1262756, 1191016, 947846, 827798, 970295, 1036057, 736198, 474665, 457794, 604479, 379194, 226991, 518739, 809326, 350377, 445782, 765877, 356490, 308932, 49548, -80058, 91212, 69964, 105064, 272163, 280212, 611203]
2751F11203M0936J42554l09937K8036l2647J71837K0863j72879K32324J1666j52650
2740E91306k235k78545j46135k4142J20954k21209K76255K58418Q928k12094l25830
2729D5671p1071J12268p7655K26340L93274l7985n18060l2792K13107n3904l7759
2718A61434k97622q3218J03449O0923m4839J86487J30460L19651l50961O3692
2708B49456K34019q7786m27673K08364J19671l22651j9186J71186j14557K44736
2698B55579K0396m22882j09411P0676L30374J22858Q0244m9753j93330K18479
2688C23230P3960K52463K7151M3155p9955K00316k09387l47165P3493j65144q1082
2677A11035J732R9151M1606Q0720o8327P4811j48620m8651q1839j86385M3438
$$ y = [611203, 652139, 794693, 484756, 512792, 480145, 651982, 672845, 499966, 732290, 743956, 591306, 589071, 310526, 164391, 140249, 261203, 39994, 316249, 574667, 583595, 371501, 45671, -25400, 86868, 9213, 235553, 628827, 590842, 72782, 39990, 253097, 199193, 161434, -136188, -219406, -115957, -55034, -99873, 86614, 217074, 536725, 185764, 249456, 483475, 395689, -31984, 176380, 296051, -26600, -45786, 125400, 10843, 255579, 275975, -146907, -256318, -185642, 144732, 267590, 347834, 298081, 104751, 323230, 397190, 649653, 676804, 719959, 640004, 840320, 630933, 283768, 357261, 192117, 111035, 112767, 211918, 253524, 334244, 265917, 340728, 192108, 143457, 61618, -124767, -81329]
2666h1329L41042J06005l02732L49379l917J59977N6459k07422j12318j9379N5078
2655C40843n8834k57760K78477m4755q5580J68194M066l4203L7618j44058J03911
2644C07919q1851k33696R8561J93005q3210j00468M51108R8497r4108k26391K187
2633C31553m4375J25356k3131j04520o873j17584k24949K03618K12772j25424
2623B26443j85095K14734p6690J41007J37187k98843j28640K42745J3148m447
2613B81549k5359J38329K9618M1663p3592l06306M1614K17029K63032j24959J92702
2602F75320J06472j71092L0470l07207j23757j41625Q5107J18646K25021l29354
2592A68001j76267J5452J69937J65751l15173K10364Q6792j60181j05324J90727
$$ y = [-81329, 259713, 365718, 62986, 412365, 408448, 568425, 624884, 417462, 305144, 285765, 340843, 282009, 24249, 302726, 257971, 172391, 340585, 344651, 310448, 348066, 204008, 307919, 226068, -7628, 90933, 283938, 200728, 100260, 551368, 649865, 555757, 329366, 331553, 287178, 412534, 389403, 284883, 278010, 160426, -64523, 139095, 351867, 226443, 41348, 256082, 179392, 320399, 457586, 158743, 30103, 272848, 285996, 281549, 256190, 394519, 424137, 465800, 392208, 85902, 127516, 344545, 607577, 482618, 675320, 781792, 610700, 641170, 333963, 210206, 68581, 153688, 272334, 497355, 168001, -8266, 7186, 177123, 342874, 27701, 238065, 324857, 164676, 59352, 250079]
2582B50079j64877n4993N9746j68739m79918J792J66125J05326O6867R9610n2645
2571a71627K61671n1015j09640m8948L01954J23310J27402k21466l29077K72507
2561A55071j32335J31914M2349j07779J04125r3909J01955j87813j0338n184j06999
2550a08943j85349M03355K34045l15081p5425J11183K04126k96891J80539p1186
2540H0373Q4793j23836j92539O1452K81497l4467o243J45856J74233J6994O6423
2529E54536l1362k88020k60877J27318K9130K36160m27604k31959L39104J29562
2519A75988N8313J8823M3481k06181M5027J76648K18089j51045l38680K59345
2509B99808m2645k03287r0477M4436J0413q1577K50638K2106j10709k8840q5600
$$ y = [250079, 85202, 30209, 89955, -78784, -558702, -556910, -390785, -285459, -218592, -118982, -171627, 90044, 39029, -70611, -119559, 182395, 305705, 433107, 211641, -117436, 155071, 22736, 154650, 196999, 89220, 193345, 99436, 201391, 13578, 3240, -1944, -108943, -294292, 109063, 343108, 28027, -47398, 63785, 267911, -28980, 151559, 80373, 165166, 41330, -151209, -89757, 191740, 157273, 151030, 296886, 471119, 488113, 554536, 523174, 235154, -25723, 101595, 130725, 366885, -60719, -292678, 46426, 175988, 234301, 253124, 296605, 90424, 135451, 312099, 530188, 379143, 40463, 299808, 257163, 53876, -36601, 7835, 18248, -63329, 187309, 209415, 98706, 69866, -15734]
2498a5734M343m056L21722k48674K1713P5644J21638R8410l34924l11192O5532
2487b05578L23194j23597L86513J48819j88006l67692r071l2552P769n7411L71087
2476B53475j52235o5276J70940q190k2782l74137j11075K67893R6093K46591o1490
2465B39807J48321m1838k7407j86695r8621L21295r7902r7971k89037L55716K16747
2454D42415P7347n43288j23090K7309J04047J71407k60243L61707k2926k10070
2444B4615J06234o5939J54173J30364l53474n4286j41261K47877K41513k66146
2434B3670j4621k24867P799J30345J69575m4484j6824n2572K66395K32929l59160
2423A18185j50093P4070n3954K171r1940O3970k34245Q9322M45856l44168m8458
$$ y = [-15734, -11391, -15447, 306275, 57601, 79314, 154958, 276596, 375006, 40082, -271110, -205578, 117616, -5981, 380532, 529351, 341345, -26347, -35418, -67970, -60201, -117612, 253475, 101240, 35964, 206904, 198714, 175932, -198205, -309280, -41387, 54706, 301297, 239807, 388128, 346290, 318883, 132188, 33567, 354862, 256960, 158989, -130048, 225668, 442415, 519762, -23526, -146616, -119307, -15260, 156147, -104096, 257611, 234685, 24615, 130849, 64910, 219083, 349447, -4027, -58313, -199574, 48303, 289816, 23670, 9049, -215818, -208019, -77674, 91901, 47417, 30593, -21979, 244416, 477345, 118185, -31908, 42162, -11792, -9621, -101561, -37591, -271836, -182514, 263342, -80826, -129284]
2412a29284j3086p1805K73501j72876K9577j6569j50337K18658P7794L72984k00771
2401B17786J4640j50820J21301J71930j87141k68515P6563R6097m1517j54498
2391a04174j3270J26463j04985p1693K00829k73611k8499K835j72973K46861L42729
2380A50512j14566k5229N8009j25185p9560K66176L0202l13814k36119Q2829J74553
2369a32192N0293j96585L28110L33988l26180k67306q5470M43332K3124K36107
2359D07221j43422J07537k78299j87796m9044l3595Q0394l53087K09326L79400
2349A38635l14059J78473L752J41878J71834m7219K4797k04836l8554l8932J63954
2338A79723J9483m3994l8312N8697k3960k42854K62318L4313n112L09844L91316
$$ y = [-129284, -142370, -214175, 59326, -113550, -83973, -100542, -250879, -32221, 45573, 418557, 217786, 232426, 81606, 202907, 374837, 187696, -80819, -4256, 91841, 50324, -104174, -117444, 9019, -95966, -167659, 33170, -240441, -268940, -266105, -439078, -192217, 150512, 35946, 10717, 68726, -56459, -136019, 130157, 160359, -153455, -389574, -306745, -132192, -81899, -278484, 49626, 383614, 57434, -209872, -295342, 147990, 171114, 407221, 263799, 371336, 93037, -94759, -143803, -177398, -97004, -450091, -240765, 138635, -175424, 3049, 6801, 148679, 320513, 273294, 298091, 93255, 54701, 15769, 179723, 199206, 155212, 116900, 175597, 151637, -91217, 171101, 205414, 200302, 510146, 901462]
2327I01462o3725k46584k38337j17966L7271M63819k35585m5062N8197l9693l96717
2316G7080K36480J31959q2247L14484J11199K51611M652L30531J31818L03490
2306A811057L53706L81349j6536n6584k18152p9997l63346k48523j00260j8924
2296A443790l6429k52615l10280o1730j27336M39749J45210k73823k86550l59471
2286C20515J30760J39443m6074l41633j97647M79990L18596j45546j66397j70608
2276C21399j74865l9213k18002K0132L75395j61108l88853K30064K28901K19987
2266D13837K2359R6464l9130j89503k32556L1729J83536K9831r9237l32266O2315
2255e2621O9843K02777l543J5405j67183J45463n7639o2014P4291J64330K5194
$$ y = [901462, 837737, 591153, 352816, 234850, 272121, 735940, 500355, 455293, 513490, 473797, 77080, 313560, 445519, 363272, 677756, 788955, 1040566, 1045218, 1375749, 1507567, 1811057, 2164763, 2546112, 2529576, 2472992, 2254840, 2174843, 1811497, 1562974, 1462714, 1443790, 1407361, 1154746, 844466, 782736, 655400, 1095149, 1240359, 966536, 679986, 320515, 451275, 590718, 544644, 203011, 5364, 485354, 803950, 658404, 492007, 321399, 146534, 107321, -110681, -90549, 284846, 123738, -265115, -35051, 193850, 413837, 436196, 532660, 493530, 304027, 71471, 103200, 286736, 316567, 217330, -114936, -52621, 17222, 219999, 216456, 231861, 64678, 210141, 152502, 90488, 164779, 329109, 354303]
2244C54303R94Q9617k67508J18370Q2074l8578j00594j57750K37754k85280m4074
2233a0672j30581J35094O1236J77508m5136N6751k7178K20406J65136k74881k12003
2222A15680k28973L4482J17971j43013k19271K19614R5519K03760k98333O7987
2212c4577N0422o1617j26408j42025O131p5750L76873r5717o594R2662j21927
2201a38527M2976J83268N979r7103p3881K1809J80301j730l18190K6983K24133
2190E6018l73073L41375J16117r2446j10614k09828j39616K70779K25067P9807
2180A63586k21307J63682j89271K0088L0554j4738J05487j24193o1960J96333
2170F8261L02793J23728m30818l02034p7286O9704q8752J97777L03819j69431
$$ y = [354303, 355297, 444914, 177406, 295776, 377850, 339272, 238678, 80928, 318682, 33402, -10672, -141253, -6159, 55077, 232585, 187449, 244200, 217022, 437428, 602564, 327683, 115680, -113293, -78811, 39160, -103853, -323124, -103510, -7991, 195769, -102564, -34577, 15845, -45772, -172180, -314205, -308074, -383824, -6951, -102668, -109262, -16600, -138527, -95551, 87717, 93696, -3407, -77288, -55479, 124822, 123092, -195098, -168115, 56018, -317055, 24320, 140437, 47991, -62623, -272451, -412067, -141288, 83779, 163586, -57721, 105961, -83310, -63222, -32668, -47406, 58081, -66112, -128072, 68261, 371054, 494782, 63964, -238070, -315356, -245652, -334404, -136627, 167192, -2239]
2160b239n7837J02519K0071J97668N9990j35272N8995n35958k7516K85994J28871
2149I5286m0508m5288k0249K4306K31863N6027n3690l39401m4822k1527j98221
2138c56224P8889J11783J18706j7173m7907j30629J92395O2852l0678j0878J46886
2127A18022p4794j75573k84377j18054O26319J29951k5971k62527Q9734J30444
2117A53174l93243K12022L24406m1075j50760j25505j87726K41438N4095p5401
2107A1425p5238J08173j6310j03685O9663J17801j92139j31969J52315o6643j77225
2096c03832J09660J0613j64767M2527L54938p2270q8325N3991r9962K8415O7255
2085f1757j9223J37913K45219k5119l64668l17871L61062j20978j44989J34008
$$ y = [-2239, -60076, 42443, 62514, 260182, 320172, 184900, 243895, -292063, -319579, -33585, 95286, 54778, 9490, -10759, 13547, 245410, 301437, 247747, -91654, -136476, -158003, -356224, -277335, -165552, -46846, -64019, -111926, -242555, -50160, 12692, -17986, -28864, 118022, 43228, -132345, -416722, -534776, 91543, 221494, 195523, -67004, 22730, 153174, -240069, -28047, 296359, 255284, 104524, -20981, -208707, 32731, 86826, 11425, -63813, 44360, 28050, -75635, -5972, 111829, -80310, -212279, -59964, -126607, -303832, -194172, -183559, -348326, -305799, 49139, -23131, -111456, -57465, -157427, -129012, -61757, -80980, 56933, 302152, 277033, -87635, -405506, -44444, -165422, -310411, -176403]
2075a76403J20227J49575j70617O8211n16875N7352M7129R8362L39167p078J42739
2064A51789k2511k39948K01497K53075l03883k78233L47496l26041K0380J88728
2054g651q8396k34711M96545l0721m23949K06775N2647K51110l22859J7801O5439
2043a7970J76386J52462n1223l66987j32191N4482J37082O5075J44222K59534
2033D20872o560j07277k44407o9453J19607j35641N8624j22485j17450k6630L20477
2022H9677k0778R4016K25723n06205k49485P4188k5384J19344j0831j58822K32340
2011a36217L8355J03515j04515K02013K10638j24731m225K74591j60838k55822
2001D2764J00137r5622J67812j94826J67445r6424p5316j71933O1358j19882m0465
$$ y = [-176403, -56176, 93399, -77218, -9007, -525882, -468530, -421401, -323039, 16128, 9050, 151789, 129278, -110670, 90827, 343902, 40019, -238214, 109282, -216759, -196379, -7651, -96047, -330758, 165787, 135066, -288883, -82108, -29461, 221649, -101210, -83409, -17970, 158416, 310878, 259655, -107332, -239523, -185041, -47959, 17116, 161338, 420872, 414312, 307035, 62628, -6825, 112782, -22859, 35765, -86720, -204170, -230800, 89677, 68899, 162915, 388638, -117567, -367052, -292864, -318248, -198904, -209735, -368557, -136217, -97862, 5653, -98862, 103151, 313789, 189058, 184833, 459424, 298586, 42764, 142901, 47279, 215091, 20265, 187710, 91286, 15970, -155963, -94605, -214487, -254952]
1990b54952L97206J0287j61521J79019j82762J82484n6041l87345m0127L23124
1980I372K17606m42797l5888K9288R6725L56965j6992p2510k10254k17788L13409
1969B7136l1589k94305J42789K7886j22574J54456J61115J34295p5074J0887n7936
1958G7086Q7571J81408M3858k1882N9389j87258k62047p0062k54859p185J93484
1947a60497K5717K15771j40659k2917J51185j84145O7298k0506r7181L26532m31343
1936b70745o0467N32523r2759J789k8006l9178k07155r950m7765M1238j37601
1925c18076J06415L27222k64755L0268K352L55463k29435l30977M36478J42623
1915B57578J59553l5280j57691J12663j20332q1084n4799j6545J58290J64422
$$ y = [-254952, 142254, 152541, -8980, 170039, -12723, 169761, 113720, -273625, -313752, 9372, 226978, -215819, -251707, -222419, -125694, 231271, 214279, 141769, -68485, -286273, 27136, -4453, -298758, -155969, -128083, -250657, -96201, 64914, 199209, 124135, 135022, 77086, 164657, 346065, 389923, 368041, 427430, 240172, -21875, -91937, -346796, -353981, -160497, -134780, 80991, -59668, -82585, 68600, -115545, -48247, -68753, -165934, 160598, -270745, -331212, 201311, 108552, 110341, 82335, 43157, -163998, -173948, -221713, -180475, -318076, -211661, 115561, -149194, -118926, -116574, 238889, 9454, -321523, 114955, 257578, 417131, 381851, 224160, 336823, 216491, 135407, 80608, 64063, 222353, 386775]
1905C86775J62870m69718O636J74992N3359k72945j76354k3043J2326J48915o5217
1894f1404q578O3927J70316R2756l80929k8652L0188k80808j21990N1393O7416
1883d06365J78289M56189l68836K44291k06591P3085J37826l65450J72851K81669
1873A96958J92129j16664p9679m8655j34148K9680k5254k75934Q8691M9149L05875
1862A82148o4141J23510j94745n6279R3462o2500K25229j50290P2036J02245K02194
1851D72869m42343J89998l07952o1285K65950J81461J78020J24076j91918J6993
1841D25869j01691j58922m9843R9146K7865o5835k77817k19750J34398J79868
1831f712l9811r012q7798j19056r1749L0547J25337k68398K88178M3006J87744
$$ y = [386775, 549645, 79927, 86563, 261555, 314914, 41969, -134385, -157428, -145102, 3813, -61404, -69982, -6055, 164261, 257017, -123912, -152564, -122376, -403184, -525174, -473781, -406365, -228076, 228113, -140723, 103568, -103023, -29938, 107888, -257562, -84711, 196958, 389087, 272423, 192744, 144089, 9941, 39621, 14367, -261567, -172876, -123727, 182148, 118007, 241517, 46772, -9507, 83955, 21455, 246684, 96394, 168430, 270675, 472869, 30526, 220524, -87428, -148713, 117237, 298698, 476718, 600794, 408876, 425869, 324178, 165256, 115413, 214559, 242424, 176589, -101228, -320978, -186580, -6712, -46523, -55535, -143333, -262389, -354138, -323591, -198254, -466652, -178474, -135468, 52276]
1820E2276p5471j72622K22343K91971N0724m8487j88464l26003J14000l7247j46208
1809b63188P3793o7691K22082K39423N8501j62692N266j06897j47819l86806L877
1798e32151J00157J52585P8947K3799O5478J25606l6730M7448q7214N2100o5062
1787g5037K8056o2568j06658k7782k10052R7074K03389l319m0604J78826R8335
1776G9660K19870J26229j14386j92634k6473r1910J76232j99865j29022l7312
1766a89611k69280N78009j00216j61767L2370P5112M5886j98143K89759m9911
1756E2208Q4859q2414l45485Q2257m0460K02902K45179j49951q9999j53935l2271
1745b27110L3562L7302J12990j87410M24275l1713N8807j51025p855j03104l18688
$$ y = [52276, -23195, -195817, 26526, 318497, 369221, 320734, 132270, -193733, -79733, -116980, -263188, -189395, -257086, -35004, 204419, 262920, 100228, 105494, -1403, -149222, -536028, -532151, -431994, -279409, -200462, -176663, -111185, 14421, -22309, 25139, -62075, -9975, -75037, -46981, -109549, -216207, -243989, -454041, -356967, -153578, -156897, -197501, -18675, 79660, 299530, 425759, 311373, 118739, 92266, 356, 176588, -23277, -152299, -189611, -458891, 119118, 18902, -142865, -110495, -35383, 10503, -187640, 102119, 52208, 137067, 54653, -290832, -208575, -249035, -46133, 199046, 49095, -40904, -194839, -227110, -193548, -156246, -43256, -230666, 193609, 161896, 220703, 69678, 61823, -41281, -359969]
1734c59969J63267L44632l43207J55808K15945O1757J58619j59172K7738m48282
1724a82864J43731P91j79919l57617L52817K59223j10111q7148Q8917N1584L9553
1713A8957p6626k02055j71222K06303L72542L43807J54412n21543j34742L88697
1703C78530j88789N2864M8548K3550k56203r8460N4322n0372O2466J91738J7636
1692B35830l3696j55145P7558O6388j83646J1799l5060k11273M7520K03641r398
1681A4518N6022R7903l70483J06300l1237l55020J76861K31062J74752J85613
1671B86291j13115m03935k5421p1070P3426J81648k1977K79210j70841l15860
1661c01644J49943o3191M27307K33347j0422l24145j89350n7831P559j82728o8640
$$ y = [-359969, -196702, 147930, -195277, -39469, 176476, 238233, 396852, 237680, 265418, -182864, -39133, -38342, -218261, -575878, -223061, 36162, -73949, -161097, -72180, -20596, 18957, -57669, -259724, -430946, -224643, 147899, 491706, 646118, 124575, -10167, 378530, 189741, 242605, 291153, 314703, 58500, -39960, 14362, -36010, 26456, 218194, 235830, 202134, 46989, 124547, 190935, 7289, 19088, -15972, -227245, -179725, 23916, 14518, 70540, 168443, -202040, -95740, -126977, -481997, -305136, -74074, 100678, 286291, 173176, -230759, -256180, -327250, -253824, -72176, -94153, 185057, 14216, -301644, -151701, -214892, 212415, 445762, 435340, 111195, -78155, -135986, -128427, -311155, -379795]
1650c79795J96285J63881j845J46159J05919l0853l93577J97442n1871k19223
1640b67478N05666l7639j08908J65874n1717j20958N7145j71429J50123L2328
1630A53007j85814J16449l3561J773j60172J22612R2883n12829J24014K22505
1620e9133J5709k7174n7593k80487o1048N9873N1236J44578J46388m8416J95756
1609G9689J00586M0410L1281n0187k35518J74977j09810M7563M133j28328o5853
1598a11057j08971L39337j83338j92342J27959j0475n7411J94230p5112N2621
1588b4559N5058j33926K06280J26996k18766j8522N0196L00098P5053j48240l48227
1577g8559o8072J51261j66915j707m2740k67008M83586j09419r6252K88860k7446
$$ y = [-379795, -183510, -19629, -21474, 124685, 230604, 199751, -193826, 3616, -48255, -267478, 238188, 200549, 91641, 257515, 205798, 84840, 141985, -29444, 120679, 153007, -32807, 83642, 50081, 51854, -108318, 14294, 107177, -405652, -281638, -59133, -43424, -70598, -128191, -408678, -469726, -409853, -358617, -214039, -67651, -116067, 79689, 180275, 220685, 251966, 201779, -33739, 141238, 31428, 78991, 83124, -45204, -111057, -220028, 119309, -64029, -256371, -128412, -138887, -196298, -2068, -77180, -24559, 30499, -103427, 102853, 229849, 11083, -7439, 42757, 342855, 417908, 269668, -78559, -146631, 4630, -162285, -163992, -206732, -473740, 9846, -99573, -195825, 93035, 65589]
1566F5589M2685J09825p0062j17468P0069n103l22453m5715L12823P5583J044
1555A16817j27541J24835j42912m0307M29032l25399k40997K66861j6433J25325
1545A69281P1650j05492J33163r487Q4116l46017k2099M8977n9077K40662k93076
1534h7399k1370J14745j38381j07395J1499j05139K51508N81634j12090J5104
1524D02716k22143j10614j34652K95581J15402k65902j39750j93135R2344J92644
1514C2491m4280m01026J93620J20840o356l11796K60230R1573o4600j75126R4015
1503b10415q7014L1209J34046j11428j57777M75027R6912j871J24197m61422m05108
1492e73644J0308K00518j11725J44073j36541K22528M25879n2713r6770K40245
$$ y = [65589, 108274, 218099, 148037, 30569, 100638, 95535, -226918, -272633, 40190, 115773, 116817, -10724, 114111, -28801, -69108, 359924, 34525, -206472, 60389, 43956, 169281, 240931, 135439, 268602, 259115, 343231, -2786, -24885, 24092, -34985, 205677, -87399, -108769, 5976, -132405, -239800, -228301, -333440, -81932, 499702, 387612, 402716, 180573, 69959, -64693, 230888, 346290, 80388, -59362, -252497, -160153, 32491, -11789, -412815, -219195, -98355, -104711, -416507, -156277, -64704, -129304, -304430, -210415, -297429, -266220, -132174, -243602, -401379, 73648, 170560, 168689, 292886, -168536, -573644, -563336, -362818, -474543, -330470, -467011, -244483, 181396, 128683, 31913, 272158]
1482B72158J20765l62507k44306K40658K45891k16264k19090O8654l887l2269
1472a30197p7930o9436M59324p6077m4158k29825j16961K17491p3730N3238J58650
1461G0389O7163j26378j73262R1330L3935l8358o5009j14625L21027R7483k17480
1450e3785k07000j25126O8257N4846M8051q3993r4902K92920K288L56332k34236
1439B3652l00631J03832J73771k37484L66498k170m98640J75947Q6938L44381
1429B36094J10185l98419L444l97936J78997K82483j77103k73499K6953J00810
1419c07991K16387K81681k49731R2592m9406j29349k43397L7141K11405L54369
1409B13701k94563j1363K33965k3824k28405n0748J58215R3481j82263k11382
$$ y = [272158, 392923, 30416, -213890, 26768, 272659, 56395, -162695, -94041, -97928, -130197, -208127, -277563, 181761, 105684, 61526, -168299, -285260, -67769, -141499, -88261, 70389, 137552, 11174, -162088, -70758, -36823, -75181, -140190, -254815, 66212, 163695, -53785, -260785, -385911, -317654, -262808, -214757, -298750, -393652, -100732, -98444, 257888, 23652, -276979, -173147, 624, -236860, 129638, 127468, -371172, -195225, -108287, 236094, 346279, -52140, -48696, -446632, -267635, 14848, -162255, -435754, -408801, -307991, -91604, 190077, -59654, 32938, -16468, -145817, -389214, -352073, -140668, 213701, -80862, -92225, 141740, 117916, -110489, -161237, -3022, 90459, -91804, -303186]
1399c03186N3819Q5335N2893O6441J32863J71223K9215q4383R1333j63567k16928
1388h4942l25967K8697k1470O6526M56898M5909l20736l5257L8775k22760K9150
1377c45177J72264K80377p7697k00133J17553j02796o0699K1620O1384K67871
1367A34567j09324J95791J90893l72561j72544J24293K06401j73772j18967n6923
1357a52146n561j85075K57295P2874j74393n7867l3612P0506J1144J791P6624
1346a18420J48063J40881l78817q5815R7628k08833O2787K70414j4451o3012l9398
1335a88973M8767L58472j36178O9m10857K89391J90523k6415p2169Q8910N5993
1324A97533j17088o8446m8873n1367L35504l8376p9727k6911L2377j1142l0300
$$ y = [-303186, -249367, -164032, -111139, -44698, 88165, 259388, 288603, 204220, 295553, 131986, -84942, -410909, -382212, -403682, -337156, 119742, 165651, -155085, -190342, -151567, -374327, -345177, -172913, 107464, 29767, -170366, -52813, -155609, -216308, -194688, -133304, 134567, 25243, 221034, 411927, 39366, -133178, -8885, 197516, 23744, -95223, -152146, -157707, -342782, -85487, -12613, -187006, -244873, -278485, -207979, -196835, -195044, -118420, 29643, 170524, -208293, -294108, -196480, -405313, -342526, -72112, -86563, -149575, -188973, -140206, 218266, 82088, 82157, -328700, -39309, 151214, 124799, 52630, 141540, 197533, 80445, 11999, -36874, -88241, 247263, 208887, 129160, 102249, 134626, 123484, 93184]
1313I3184j06638j22372j01409K31066K44687n2399r9637j29976J8004k32223
1303b57713L05157M7205j84739J69848K48828j89850p9314J96032j41799k33438
1293a19783M8595j48874J1834K5896J26030j89571j90641K23871K54809J03649
1283A45815r3496j48079K44174n615O4202N1372l62385r6790p276N7074J50534
1272d70r8478N7681k74347j65509Q7090K8079K11966k4253P4102J29282k25324
1261b00181j75816O2292j95519L13667L8022J62573l28133n0790M83335l45217
1251b35767K23104j24314l17607J41416K70318j1296N9078n8581q5741j26513
1241b65903m4577L9240J76388K90249k24176l80332K44771K08599J42479q6283
$$ y = [93184, -13454, -135826, -237235, -6169, 238518, 186119, 86482, -43494, -25490, -257713, 47444, 94649, -90090, 79758, 328586, 138736, 59422, 255454, 113655, -119783, -71188, -220062, -208228, -182332, -56302, -245873, -436514, -212643, 42166, 145815, 52319, -95760, 148414, 142799, 207001, 258373, -104012, -200802, -208078, -151004, -470, -98948, -41267, -315614, -481123, -394033, -365954, -153988, -178241, -104139, 25143, -200181, -375997, -313705, -509224, -195557, -157535, 5038, -323095, -373885, 109450, -235767, -12663, -136977, -454584, -313168, -42850, -54146, 4932, -53649, -139390, -265903, -310480, -271240, -94852, 195397, -28779, -409111, -164340, 44259, 186738, 100455]
1231A00455J82170L89231k98338l58326J13750M26435r9911m89495j297M4696
1221I370j00330l27665m378K72705M26524j84657p2936j15942j97973R4748K05576
1210E042J5844j35545Q1312j58701L43243K25821J36668j4309k16983j82979Q2897
1199A82310n8085K92703l96156j724k7302q1771J82194J68646j7166l25619L2207
1188d9763J2735L13927K78978n05213J3077n776l59258L48928J39392j81463j00663
1177i5099q2244L28771J97434l30668J34159J67792k34852P3807j1307j21211
1167B6582k4495N9936J9998l1572j52398j05180k16266q5211K70942m7555M82727
1156A97508K09604j26074J9424k73300l08727K36923L6887m0364j50188N069J92737
$$ y = [100455, 282625, 671856, 373518, 15192, 128942, 555377, 455466, -34029, -35326, 9370, -90960, -418625, -423003, -150298, 276226, 91569, 18633, -97309, -295282, -200534, 5042, 20886, -114659, -33347, -192048, 151195, 377016, 513684, 499375, 282392, 99413, 182310, 124225, 416928, 20772, 19048, -8254, -90025, 92169, 260815, 243649, -81970, -49763, -37028, 276899, 555877, 50664, 63741, 57965, -301293, 47635, 187027, 5564, -95099, -177343, 151428, 348862, 18194, 152353, 320145, 85293, 159100, 147793, 26582, 2087, 62023, 82021, 50449, -101949, -207129, -423395, -508606, -237664, -285219, 197508, 407112, 281038, 300462, 27162, -281565, -44642, -7755, -48119, -198307, -193238, -501]
1145e01O7233j7403j33344j64786M4568L90554o1431k64313j28622P9189J66438
1134b2418K70647N7641n43473o4183J1484L8786K03992k54323J09602R8980K17515
1123A24250R4131K54933l89523l42713m0957p3991L99896P0966j33665l1152J64068
1112I6243j55522q3756o2475K11640j5105k1029K84475j90546j32136q9069L77428
1101B20148P4629j90291l26558o8327L72329k12078j06026N53285j22815k37571
1091d3275L3396j64353K23718k69790L39760L05711k04845J35549J3905k10066
1081A59710j89002j08526L2786j01743Q5823J83918o5395j17253l7124L20337
1071A63531j34439K87345M2616K13739j56591m7453P9271k66951K35756k77815
$$ y = [-501, 66732, 49329, -84015, -248801, -204233, 186321, 124890, -139423, -268045, -188856, -22418, 248229, 305870, -237603, -301786, -290302, -251516, -47524, -301847, -192245, -93265, 124250, 218381, 473314, 83791, -258922, -299879, -373870, 26026, 96992, -36673, -67825, 96243, -59279, -143035, -205510, 6130, -8975, -30004, 254471, 63925, -68211, -157280, 220148, 294777, 104486, -222072, -290399, 81930, -130148, -236174, 317111, 194296, -43275, -9879, -174232, 49486, -220304, 119456, 425167, 220322, 355871, 369776, 159710, -29292, -137818, -105032, -206775, -120952, 62966, -2429, -119682, -156806, 163531, 29092, 316437, 359053, 572792, 416201, 368748, 448019, 181068, 416824, 139009]
1061A39009m55665Q8663M30104J46466k20796j03150m650j29615L13635l55155
1051a51154k56143l6085L30871K91862n1612k97140K18197l01902K7370K59720
1041C3984J12674r0357k15025J45601L28997j56029k87066J99427l1730j16585
1031g6109K72577J90555l64115J33383p6896J45464L16211l19188j06498j93466
1021g8082k68579K79763K58340l0278N3504K09718l94618j89377m8253K09456
1011A594L951j25111N3108J60315l4678k54960K05777J8276j3895j40218K5101
1000a00740j53678j26304N64174K53205l97597j76540J97525p8657j43867M3080
990a19399L11421P9411k0988l4365N2326J3531q7136j26342J815l5410L65063
$$ y = [139009, -316656, -227993, 202111, 348577, 127781, 24631, 19981, -109634, 204001, -151154, -407297, -443382, -112511, 179351, 127739, -169401, 48796, -253106, -225736, 33984, 146658, 56301, -158724, -13123, 315874, 159845, -127221, 72206, 40476, -76109, 196468, 387023, 22908, 156291, 79395, 224859, 541070, 221882, 115384, -78082, -346661, -66898, 191442, 161164, 214668, 424386, 29768, -159609, -207862, 1594, 5545, -119566, -66458, 93857, 59179, -195781, 9996, 28272, 14377, -125841, -100740, -254418, -380722, 183452, 436657, 39060, -137480, 60045, -18612, -162479, -119399, 192022, 271433, 250445, 216080, 268406, 281937, 194801, 68459, 70274, 34864, 399927]
979C99927k32308L9194k19608J73518O0807o4498J84749l32150M6145o8912J43803
968A30667K9343j38514j89737L51372J06985n0849k8277k9711j59610j77050j03025
957b58406p3285K54818j44377j98425K53686K60011n302j05300J23151l7765K30324
946B99130j38076k69919K46102Q1031j38555k25131k35947K57121J10994J91641
936A78391j49528j0843J76804p427k1163N5645k43780J32325j2770K6289m01508
925b77565J3758J74088J34931J54692J46377K67003l34834k9777j21664k9885
915I7124r8998K47928k94612p2154J28172L81290k40463j40236q3885o613J26698
904D4251p3235k11781j231M4705K15364K09715m01592J31944o7297l95170J08981
$$ y = [399927, 167619, 206813, -12795, 160723, 221530, 157032, 341781, 9631, 55776, -13136, 130667, 160010, 21496, -168241, 183131, 290116, 239267, 210990, 181279, 21669, -155381, -258406, -331691, -76873, -221250, -419675, -165989, 94022, 88720, -16580, 106571, 68806, 299130, 161054, -108865, 137237, 218268, 79713, -145418, -381365, -124244, -13250, 178391, 28863, 18020, 194824, 187397, 166234, 221879, -21901, 110424, 97654, 123943, -277565, -263807, -89719, 45212, 199904, 346281, 613284, 278450, 248673, 127009, 97124, -1874, 246054, -48558, -120712, 7460, 388750, 148287, 8051, -75834, -82447, 44251, -28984, -240765, -241996, -197291, 18073, 227788, -173804, -41860, -109157, -504327, -395346]
893c95346J43460P8380J08682L5531J13619L73102k1495n5295j23678l87429o7714
882a98183J59873j27689O9580j14803J29475K5384Q3227k14327k6499L75349j34757
871B6630j35938R7386Q745j52472o5849q6871K02467K03719J15380J14381k47003
860H0575j60847L32085k86333L1535K98065q6448j4154j58712L9773Q9253n9185
849A05607J18421o1054k39636r3934K21389J19605k5829j3347J77762l46008j62782
838a99806J80916k14480j2717K7602M20276p4646j55644K19827J25590P5187l14938
827G7167m13265n5575r5315R1821L72535k5719J54389j93134n6911L2023K43664
816A31680j86533J46947J51822p0902k71623j9808r4458J28983m2977l524J47674
$$ y = [-395346, -251886, -173506, -64824, -29293, 84326, 457428, 435933, 380638, 256960, -130469, -198183, -38310, -165999, -96419, -211222, -81747, -56363, 26864, -187463, -213962, 161387, 26630, -109308, -11922, -3177, -155649, -221498, -308369, -105902, 97817, 213197, 327578, 80575, -80272, 251813, -34520, -2985, 295080, 208632, 194478, 35766, 75539, 164792, 105607, 224028, 162974, -76662, -170596, 50793, 170398, 144569, 131222, 308984, -37024, -199806, -18890, -233370, -246087, -218485, 201791, 127145, -28499, 191328, 316918, 392105, 77167, -336098, -391673, -486988, -395167, -22632, -48351, 106038, -87096, -144007, -111984, 131680, -54853, 92094, 243916, 173014, -98609, -118417, -212875, -83892, -126869, -130393, 17281]
805A7281n6952m553K074j16208J68309n5663J16496K48495l98281J16381N6210
794I3589J95127r3181k18464J76620J06399j58172K2951j54663J22255N2262j44816
783i3k2691M9179J60901k92711K53359k37396k21627K95879K27827k51723k0330
772e9426K96606p0589k96734j16679R5459L0993q2973j57169k47565L71982K46823
761A0728j4148J62807m21324L3789k52555o7524J96434J71805K11679j43837k56432
750c68578P4230l0611J95798J29036N4730m7245j15166J38001j5395O3198j45442
739f7444k16294Q0368J69295K7548j99789L39136P6177k31544J770L71744k31646
728A19321n8750k11034J7308J05404l02037Q0109J10473j9603J88179m0533O1382
$$ y = [17281, -39671, -44224, -42150, -158358, 9951, -45712, 70784, 319279, -79002, 37379, 93589, 288716, 195535, -22929, 153691, 260090, 101918, 124869, -29794, 92461, 144723, -93, -22784, 26395, 187296, -105415, 147944, -89452, -311079, -15200, 212627, -39096, -59426, 237180, 166591, -130143, -246822, -151363, -120370, -203343, -360512, -608077, -236095, 10728, -3420, 159387, -261937, -228148, -480703, -548227, -351793, -179988, 31691, -112146, -368578, -294348, -324959, -129161, -125, 54605, 7360, -107806, 30195, 14800, 77998, -67444, -283738, -203370, -34075, -6527, -206316, 132820, 208997, -22547, -20777, 350967, 119321, 60571, -150463, -133155, -27751, -329788, -249679, -139206, -158809, 29370, -11163, 50219]
717E0219K89251k81385j88917k1644j68162k0066j45928J09902Q1092K40330J49119
706I3811j8427J99933K9448l89908O2171K00687k03522m0882m0543K23329J55973
695B72070j80721K74297j26330l61915J02395K8091j39013J51475J60314J95757
685C76420k18122k14560J74378m03495o5760L4070L76336J31j56827K65706j40778
674B7499K19078k53395K9898L96300k28861l43035j6648J96473j73050J40028
664e713J3852J86091K35284j69537j44267j33305p826O7010j57630l01555K16940
653b00656L6454n4445K73781j01975M40480j96798m16594M58321L22891k38520
643C22939k91166n33843L40888l6959L30764J55713L17654m56354n44009J17371
$$ y = [50219, 339470, 58085, -130832, -152476, -320638, -340704, -486632, -376730, -295638, -55308, 93811, 75384, 275317, 304765, -85143, -22972, 177715, -25807, -66689, -107232, 116097, 272070, 91349, 365646, 239316, -122599, -20204, 7887, -131126, 20349, 180663, 376420, 158298, -56262, 118116, -285379, -351139, -317069, 59267, 59398, -97429, 168277, 27499, 246577, -6818, 23080, 419380, 190519, -152516, -169164, 27309, -145741, -5713, 8139, 194230, 429514, 259977, 115710, -17595, -25421, 41589, -116041, -417596, -200656, -164202, -218647, 55134, -46841, 393639, 196841, -219753, 238568, 561459, 322939, 31773, -502070, -161182, -198141, 132623, 288336, 605990, 149636, -394373, -277002]
633b77002L9330K11318J09252k58826j07674L31003j9745r52j4869k26383N602
622b08946J96363o3236K08425j4154j64538j43413P055k9507K95040k37032k19477
611c73420J88810J63785J20022K26911m9593j38891j81854q5407M4366k75076
601c60347N4846o0155K6809R1125j05320k03620O1878J49729J65819K23517M55889
590E00170K67067L099l67750n39261p8643J9112K61887M0480q4074j17463M51779
579C56403L8285j04788l30225j72434j18609L12138J47557j90395k2565n5732
569a40365L28758Q3052n20205j0394J2984m4917J67607k5362K12716n1680J98705
558B10899J93103J48114q7351M9733k20606j55020l70299m38098K84642L13541
$$ y = [-277002, -237672, -26354, 82898, -175928, -283602, 47401, 27656, 26704, 11835, -214548, -208946, -12583, -75819, 132606, 118452, -46086, -189499, -182444, -211951, 83089, -153943, -373420, -184610, -20825, 99197, 326108, 276515, 137624, -44230, -129637, -85271, -360347, -305501, -365656, -338847, -247722, -353042, -556662, -494784, -345055, -179236, 44281, 500170, 767237, 770336, 402586, -136675, -215318, -196206, 65681, 106161, 22087, -95376, 356403, 394688, 289900, -40325, -212759, -331368, -19230, 128327, -62068, -84633, -140365, 188393, 271445, -248760, -259154, -246170, -291087, -123480, -148842, 63874, 12194, 210899, 404002, 552116, 464765, 514498, 293892, 138872, -231427, -669525, -384883, -71342]
548g1342m4344J28696j90515l9789O5810j04568P8067L01922K7220j43376J15755
537A23536P9598q7337j42329J01054J67544J41922k68709k22785j26221r226K02029
526d0924J90000Q9957j75432o0997J75514n5749j3957j95132l01698q1667K44532
515b25553J24323L2089J7660P2121j43853j50172K19670j40327j32522M86558
505A59994l69540J88018j49633k69519R7658L18954K24272q8235N8525J6652R3415
494B80561P5528n7694j44706J05021k65707p7564J57131Q1299l23562j90227O9332
483b90588J04303M8671J22052K51409l87536k72227M30886J39483O1443J81853
473C89749l89160l998P1568j189J30519m6984j44829J4381M7116k84504J08295
$$ y = [-71342, -115686, 13010, -177505, -217294, -151484, -256052, -177985, 123937, 151157, 7781, 123536, 203134, 115797, -26532, 74522, 242066, 383988, 115279, -107506, -233727, -242953, -40924, 149076, 239033, 63601, 2604, 178118, 122369, 108412, -86720, -388418, -470085, -225553, -101230, -69141, -51481, 20640, -123213, -273385, -53715, -194042, -326564, 159994, -209546, -21528, -171161, -440680, -343022, -24068, 200204, 111969, 170494, 187146, 280561, 356089, 298395, 153689, 258710, -6997, -84561, 72570, 153869, -169693, -359920, -290588, -186285, -137614, -15562, 235847, -151689, -423916, 6970, 146453, 207896, 389749, 589, -3409, 68159, 66970, 197489, 150505, 5676, 20057, 67173, -217331, -109036]
462a09036k4916J00407J94749M07337k50948L1574p6004n4271l15899j7082j3192
451a27281k17808K74732M8717J83003J16126M3584j49434k48550m5050M03766
441B81805k53887n2908J1670m80345K45790L84295j70683j3870M3996O316P412
430I591J11930K8697J34414j25738P4560J44661l05652j29004L70592J05384r6623
419C22812n9427J47727Q3064l16819j17397O130J87395K22620j83399l91675O0154
408c8815j3671m7065j44037L06562M15506n6332k95790r7334o9858J14835k96886
397b22885m6300K96294J2214Q8730J22396m66799L8864L07719K17965k11886k24626
386h8314J43560J99432l22644Q9253J92650J1107j98032r3791L69531l61262J35462
$$ y = [-109036, -133952, -33545, 161204, 568541, 317593, 349167, 273163, 218892, -97007, -114089, -127281, -345089, -70357, -21640, 161363, 277489, 321073, 171639, -76911, -121961, 281805, 27918, -24990, -13320, -493665, -247875, 136420, -34263, -48133, -4137, 2179, 9591, 121521, 150218, 284632, 158894, 233454, 378115, 72463, -56541, 314051, 419435, 322812, 263385, 411112, 494176, 177357, 59960, 66090, 253485, 476105, 292706, -98969, -38815, -52486, -99551, -243588, 62974, 478480, 422148, 126358, 29024, -40834, 74001, -222885, -269185, 27109, 39323, 128053, 250449, -216350, -177486, 130233, 348198, 136312, -88314, 55246, 254678, -67966, 21287, 213937, 225044, 27012, -66779, 302752, -58510, 76952]
375G6952j74633Q3462j9560Q9307J23315n2613m5976K8821m3161J26937Q9556
364B82407J3450j04745p0611J81909q3295j06165l3836k5401J91769j16952j25645
353B885Q7702R4667J0490j52662K44823n3749k04513j61631m4507R4075k178J41910
341E7312k81705J91889K78654n22783j3007L59395N8497O4841J9904N5437J4690
330B83124k99738l84678j89350J51770N06459k01480k9731L10326K62649j63396
320B45955j01013Q5187J3216J1847k86396R469j69731J32618J46254k1628R4488
309A60266k12719J85057K88845k88418r8941R0219L8162J24632j48843k67544
299a29284k53876R5234q8993j13679K48668Q17R5404K84501J43214j45483K6144
$$ y = [76952, -97681, -14219, -33779, 55528, 178843, 126230, 80254, 109075, 65914, 192851, 282407, 295857, 191112, 120501, 302410, 219115, 112950, 79114, 53713, 245482, 128530, 2885, 90587, 185254, 195744, 43082, 287905, 234156, 29643, -131988, -176495, -82420, -84598, 57312, -224393, -32504, 246150, -276633, -289640, 69755, 128252, 193093, 212997, 268434, 283124, -16614, -401292, -590642, -438872, 67587, -133893, -163624, 146702, 409351, 245955, 144942, 230129, 243345, 255192, -31204, -21735, -191466, -58848, 87406, 65778, 160266, -52453, 132604, 421449, 133031, 34090, 124309, 162471, 287103, 138260, -129284, -383160, -287926, -376919, -490598, -241930, -241113, -145709, 138792, 282006, 136523, 162667]
288A62667l42047r0734M00085K9612j7690K782M3449k4909K7821N0796r5126k3044
276A23662j59771j13796K28610J4733n5022J18648J44330O8131k00769o8022q5841
265A4893M8030k49406j85136P1966L20097L78045J85129l5385j16596K5804j08311
254C49130l73251k4091J03138l0959j09108K47735j18392l05729K28303J68512
244A35288m297J86851J44501j82017j49488M8912m4719j01642j26446j88458K01717
233g9798J1390J11543O6021M2603J17002k58102r7531K08813l5890j67600J43008
222F1459P0163j64186P0017L2433L37651q0512j0403J75247m94028l49311K57812
211i3658K23300K58610R6629K00535o0435m37954J1245P247j08398j48035K53723
$$ y = [162667, -179380, -270114, 129971, 159583, 141893, 144675, 188124, 163215, 191036, 241832, 146706, 123662, -36109, -149905, 78705, 93438, 38416, 157064, 301394, 369525, 168756, 100734, 14893, 62923, -186483, -371619, -299653, 20444, 398489, 583618, 548233, 431637, 457441, 349130, -24121, -48212, 54926, 23967, -85141, 162594, 44202, -261527, -33224, 135288, 130991, 317842, 462343, 280326, 130838, 179750, 135031, 33389, -93057, -281515, -79798, -68408, 43135, 109156, 151759, 268761, 10659, -86872, 121941, 86051, -81549, 61459, 131622, -32564, 37453, 69886, 407537, 327025, 316622, 491869, -2159, -351470, -93658, 129642, 388252, 484881, 685416, 624981, 187027, 198272, 205519, 97121, -50914, 202809]
200B02809N9942k59302J22287L18450m81027k25046K81404m7225J72932k4414
190A20810n0610N6245k13890j48634j18829N02440J32572k46607k19301J0065
180a75739K42834J09546Q1J89555J10548l83236k33043n3290J77509K4031O8817
169G7613O2502J84738L4040l3296l04665K8729r9205R6717k2989p7202j3581m4118
157a10717K23957m6472o8106Q7839j59607J66612J46110j57843L8339k9244L3
146I0901N8092O0084q4086J01393k3236j30949j8101K83509k8675j51371j95278
135c7717J3408J21380j84987N3542K22122o2997l42449m6702J52433l6195L02184
124A54022J29734q5352J48462k28207p3732j73583p0458K26739r9139K33985m3998
$$ y = [202809, 262751, 3449, 125736, 444186, -36841, -261887, 19517, -27708, 145224, 120810, 70200, 126445, -87445, -236079, -354908, 147532, 280104, 33497, -185804, -175739, 67095, 176641, 176722, 366277, 476825, 93589, -139454, -192744, -15235, 8796, 77613, 140115, 324853, 358893, 325597, 20932, 49661, -49544, 47173, 24184, -53018, -66599, -110717, 113240, 66768, -1338, 86501, -73106, 93506, 239616, 81773, 120112, 90868, 90901, 148993, 209077, 124991, 226384, 203148, 72199, 54098, 337607, 308932, 157561, -37717, -24309, 97071, -87916, -34374, 187748, 124751, -217698, -264400, -111967, -148162, 154022, 283756, 198404, 346866, 118659, 44927, -128656, -199114, 27625, -71514, 162471, 118473]
113A18473k01634j29442K95554K35618j12778r7226J23127J04209j44898j32902
103E8101o9782J03052K19352l6397l4032j2755M31m3127j13651J18401r3383r6021
91A89K22303P3515j38326j40393J21760n3524o774K88308p1429j82482J07409
80B20556J17705j18550M782m0319j89626o6019P2100Q6182k53232k3234J30342
69e9313m4948K943J78967J65570q2563l9365j61071J06418J34373n4633q0202
58F6176K46732j10435j5393J46813P926j53961p4621j17984o6417n1340Q8023
47c4481R3047P5598l9549P5532J66189j57009j72769j60374L69450q9310J11619
36B37943M3902n7052J1890J4814p0447l0745L329n5664M876j7809o3578J19739
$$ y = [118473, -83161, -212603, 82951, 318569, 205791, 108565, 231692, 335901, 191003, 58101, -11681, 91371, 310723, 274326, 240294, 227539, 227970, 184843, 71192, 189593, 96210, 189, 222492, 296007, 157681, 17288, 139048, 85524, 78750, 367058, 295629, 113147, 220556, 338261, 219711, 224493, 184174, -5452, -71471, 629, 86811, -166421, -189655, -59313, -104261, -101318, 77649, 243219, 160656, 121291, -39780, 66638, 201011, 146378, 66176, 312908, 202473, 187080, 333893, 341819, 187858, 113237, -4747, -71164, -122504, -34481, 58566, 134164, 94615, 170147, 336336, 179327, 6558, -153816, 215634, 126324, 237943, 281845, 224793, 236683, 251497, 181050, 150305, 153634, 97970, 102846, 85037, 21459, 141198]
24A41198J6615l8285J36774o800k78601j3224J14602o7912P4679k18J25524J01484
12C05836J173j29099j17994p7819R3586j02028R3344J44030n8538j16381j1048
1B5062J77001
$$ y = [141198, 157813, 119528, 256302, 249502, -29099, -42323, 72279, 4367, 79046, 78828, 204352, 305836, 307009, 177910, 59916, -17903, 75683, -26345, 66999, 211029, 152491, 36110, 25062, 202063]
$$ [...]
##END NTUPLES=NMR SPECTRUM
##END=
