##TITLE=1H_EC-3355(II-2)x
 200.13MHz, CDCl3,
 8 sc
 
 6.8.2025
##JCAMPDX= 6.0         $$ Bruker NMR JCAMP-DX V2.0
##DATA TYPE= NMR SPECTRUM
##DATA CLASS= NTUPLES
##ORIGIN= UXNMR, Bruker Analytische Messtechnik GmbH
##OWNER= pz
$$ XWIN-NMR		Version 3.5
$$ Wed Aug  6 14:08:05 2025 Russian Standard Time (UT+4h)  she@DPX200
##.OBSERVE FREQUENCY= 200.1313
##.OBSERVE NUCLEUS= ^1H
##.ACQUISITION MODE= SIMULTANEOUS
##.ACQUISITION SCHEME= undefined
##.AVERAGES= 8
##.DIGITISER RES= 18
##SPECTROMETER/DATA SYSTEM= spect
##.PULSE SEQUENCE= zg30
##.SOLVENT NAME= CDCl3
##.SHIFT REFERENCE= (INTERNAL, CDCl3, 0, 15.51)
##AUDIT TRAIL= $$ (NUMBER, WHEN, WHO, WHERE, WHAT)
$$ ##TITLE= Audit trail, XWIN-NMR		Version 3.5
$$ ##JCAMPDX= 5.01
$$ ##ORIGIN= Bruker BioSpin GmbH
$$ ##OWNER= she
$$ F:/spectra/data/she/nmr/H-C/1/pdata/1/auditp.txt
$$ ##AUDIT TRAIL=  $$ (NUMBER, WHEN, WHO, WHERE, WHAT)
(   1,<2025-08-06 14:06:49.03 +0400>,<she>,<DPX200>,
      <created by zg, POWCHK disabled, PULCHK disabled
       configuration hash MD5:
       00 E9 B6 7A A2 85 ED C7 34 08 36 98 17 FE 4E 26
       data hash MD5: 16K
       9F 47 06 C1 63 E4 F6 BF CF B2 D2 5D 90 CA 54 12>)
(   2,<2025-08-06 14:06:51.39 +0400>,<she>,<DPX200>,
      <Start of raw data processing
       efp BC_mod = 2 LB = 0.25 FT_mod = 6 PKNL = 1 PHC0 = -1351.131 PHC1 = 3.392303 SI = 16K 
       data hash MD5: 16K
       3D 22 29 01 F2 E5 10 13 22 A3 48 45 A8 BC 73 12>)
(   3,<2025-08-06 14:07:10.70 +0400>,<she>,<DPX200>,
      <pk PHC0 = 157.0621 PHC1 = 3.6 
       data hash MD5: 16K
       05 F4 0E 96 BB 9F 64 51 50 F4 8F 7E 6E AF C8 62>)
(   4,<2025-08-06 14:07:14.71 +0400>,<she>,<DPX200>,
      <abs ABSG = 5 
       data hash MD5: 16K
       78 A8 0C EF 55 27 EB C9 2E A8 6C 60 5A C4 9C 05>)
$$ ##END=
$$ 
$$ hash MD5
$$ 89 76 17 42 CD E9 2B 7F C1 A4 D0 ED 79 3C 7A 5A
##$RELAX= 
##$RELAX= 
##$RELAX= 
##$RELAX= 
##$RELAX= 
##$RELAX= 
$$ Bruker specific parameters
$$ --------------------------
##$DU= <F:/spectra>
##$EXPNO= 1
##$NAME= <H-C>
##$PROCNO= 1
##$TYPE= <nmr>
##$USER= <she>
##$AMP= (0..31)
100 100 100 100 100 100 100 100 100 100 100 100 100 100 100 100 100 100 
100 100 100 100 100 100 100 100 100 100 100 100 100 100 
##$AQSEQ= 0
##$AQ_mod= 1
##$AUNM= <au_zg>
##$AUTOPOS= <>
##$BF1= 200.13
##$BF2= 200.13
##$BF3= 200.13
##$BF4= 200.13
##$BF5= 200.13
##$BF6= 200.13
##$BF7= 200.13
##$BF8= 200.13
##$BYTORDA= 1
##$CFDGTYP= 0
##$CFRGTYP= 5
##$CHEMSTR= <none>
##$CNST= (0..31)
1 1 145 1 1 1 1 1 1 1 1 1 1 1 1 1 1 1 1 1 1 1 1 1 1 1 1 1 1 1 1 1 
##$CPDPRG= <>
##$CPDPRG1= <>
##$CPDPRG2= <>
##$CPDPRG3= <>
##$CPDPRG4= <mlev>
##$CPDPRG5= <mlev>
##$CPDPRG6= <mlev>
##$CPDPRG7= <mlev>
##$CPDPRG8= <mlev>
##$CPDPRGB= <>
##$CPDPRGT= <>
##$D= (0..31)
0 0.7 0 0 0 0 0 0 0 0 0 0.03 0 0 0 0 0 0 0 0 0 0 0 0 0 0 0 0 0 0 0 0 
##$DATE= 1754474808
##$DBL= (0..7)
120 120 120 120 120 120 120 120 
##$DBP= (0..7)
150 150 150 150 150 150 150 150 
##$DBP07= 0
##$DBPNAM0= <>
##$DBPNAM1= <>
##$DBPNAM2= <>
##$DBPNAM3= <>
##$DBPNAM4= <>
$$ [...]
##$SUBNAM3= <"">
##$SUBNAM4= <"">
##$SUBNAM5= <"">
##$SUBNAM6= <"">
##$SUBNAM7= <"">
##$SUBNAM8= <"">
##$SUBNAM9= <"">
##$SW= 18.0517328524113
##$SWIBOX= (0..15)
0 0 2 0 0 0 0 0 0 0 0 0 0 0 0 0 
##$SW_h= 3612.71676300578
##$TD= 16384
##$TD0= 1
##$TE= 0
##$TE2= 300
##$TE3= 300
##$TEG= 300
##$TL= (0..7)
0 120 120 120 120 120 120 120 
##$TP= (0..7)
150 150 150 150 150 150 150 150 
##$TP07= 0
##$TPNAME0= <>
##$TPNAME1= <>
##$TPNAME2= <>
##$TPNAME3= <>
##$TPNAME4= <>
##$TPNAME5= <>
##$TPNAME6= <>
##$TPNAME7= <>
##$TPOAL= (0..7)
0.5 0.5 0.5 0.5 0.5 0.5 0.5 0.5 
##$TPOFFS= (0..7)
0 0 0 0 0 0 0 0 
##$TUNHIN= 0
##$TUNHOUT= 0
##$TUNXOUT= 0
##$USERA1= <user>
##$USERA2= <user>
##$USERA3= <user>
##$USERA4= <user>
##$USERA5= <user>
##$V9= 5
##$VALIST= <valist>
##$VCLIST= <CCCCCCCCCCCCCCC>
##$VD= 0
##$VDLIST= <DDDDDDDDDDDDDDD>
##$VPLIST= <PPPPPPPPPPPPPPP>
##$VTLIST= <TTTTTTTTTTTTTTT>
##$WBST= 1024
##$WBSW= 4
##$XGAIN= (0..3)
0 0 0 0 
##$XL= 0
##$YL= 0
##$YMAX_a= 328286
##$YMIN_a= -361615
##$ZGOPTNS= <>
##$ZL1= 120
##$ZL2= 120
##$ZL3= 120
##$ZL4= 120
##$ABSF1= 15.5673
##$ABSF2= -2.484551
##$ABSG= 5
##$ABSL= 3
##$ALPHA= 0
##$AQORDER= 0
##$ASSFAC= 0
##$ASSFACI= 0
##$ASSFACX= 0
##$ASSWID= 0
##$AUNMP= <proc_1d>
##$AZFE= 0.1
##$AZFW= 0.1
##$BCFW= 0
##$BC_mod= 2
##$BYTORDP= 0
##$COROFFS= 0
##$CY= -3
##$DATMOD= 1
##$DC= 0
##$DFILT= <>
##$DTYPP= 0
##$F1P= 0
##$F2P= 0
##$FCOR= 1
##$FTSIZE= 16384
##$FT_mod= 6
##$GAMMA= 0
##$GB= 0
##$INTBC= 1
##$INTSCL= 3.241238e-09
##$ISEN= 128
##$LB= 0.25
##$LEV0= 0
##$LPBIN= 0
##$MAXI= 10000
##$MC2= 0
##$MEAN= 0
##$ME_mod= 0
##$MI= 1.114404
##$NCOEF= 0
##$NC_proc= -6
##$NLEV= 6
##$NOISF1= 3.799351
##$NOISF2= 2.8
##$NSP= 0
##$NTH_PI= 0
##$NZP= 0
##$OFFSET= 15.51
##$PC= 1
##$PHC0= -1194.069
##$PHC1= 6.992303
##$PH_mod= 1
##$PKNL= yes
##$PPARMOD= 0
##$PSCAL= 0
##$PSIGN= 0
##$REVERSE= no
##$SF= 200.13000234161
##$SI= 16384
##$SIGF1= 3
##$SIGF2= 2
##$SINO= 0.751879
##$SIOLD= 32768
##$SREGLST= <19F.Aceton>
##$SSB= 0
##$STSI= 16384
##$STSR= 0
##$SW_p= 3612.71676300578
##$SYMM= 0
##$S_DEV= 0
##$TDeff= 16384
##$TDoff= 0
##$TI= <>
##$TILT= no
##$TM1= 0
##$TM2= 0
##$TOPLEV= 0
##$USERP1= <user>
##$USERP2= <user>
##$USERP3= <user>
##$USERP4= <user>
##$USERP5= <user>
##$WDW= 1
##$XDIM= 16384
##$YMAX_p= 344472951
##$YMIN_p= -1542302
$$ End of Bruker specific parameters
$$ ---------------------------------
##NTUPLES= NMR SPECTRUM
##VAR_NAME=  FREQUENCY,     SPECTRUM/REAL,   SPECTRUM/IMAG
##SYMBOL=    X,             R,               I
##VAR_TYPE=  INDEPENDENT,   DEPENDENT,       DEPENDENT
##VAR_FORM=  AFFN,          ASDF,            ASDF
##VAR_DIM=   16384,         16384,           16384
##UNITS=     HZ,            ARBITRARY UNITS, ARBITRARY UNITS
##FACTOR=    0.220516191357247, 1,           1
##FIRST=     3104.01638212449, 0,            0
##LAST=      -508.700380881286, 0,           0
##MIN=       -508.700380881286, -1542302,    0
##MAX=       3104.01638212449, 344472951,    0
$$ Real data points
##PAGE= N=1
##DATA TABLE= (X++(R..R)), XYDATA
$$ [...]
6095I32832j9395l4493n7651K00568m591k0961n3846j35796J29648j28084j91587
6084F16644N7548J12388o2486J71167n0916j30196o9141q7337q5226k4888J70824
6073F18381K02400O9101j6903N5611j1769m2810j04991l8685j47323J09859J19400
6062H12271j25991k5326q0474j75360m1026O0080r7303r669K5164N1646n2694
6051C41318P1623j3162j78793J45200R2880Q6079k8346q0555k583j07816K47232
6040E73077j33148J9867m329k7778l7237o0835n1919N8005O1484o3368o5956k14016
6028E3847q096K77715n3882j08070R7062l2434o6964L8851J34900J23993r3625
6017C63297k7062r3365l981n9063k294j98751O6532P983n9110Q6532L4529j8297
$$ plain form
6095 932832 913437 878944 821293 1021861 1017270 996309 942463 806667 936315 808231 616644
6084 616644 674192 786580 724094 895261 844345 714149 645008 557671 472445 447557 618381
6073 618381 820781 889882 872979 928590 916821 874011 769020 730335 583012 692871 812271
6062 812271 686280 660954 580480 405120 364094 424174 326871 317202 342366 394012 341318
6051 341318 412941 399779 220986 366186 459066 545145 516799 436244 433661 325845 573077
6040 573077 439929 459796 455467 427689 390452 329617 277698 335703 397187 333819 267863 53847
6028 53847 45751 323466 269584 161514 258576 226142 159178 198029 332929 456922 363297
6017 363297 336235 242870 238889 179826 177532 -21219 45313 53296 -5814 80718 115247 96950
6005I6950p5814j3853P0868O6252J2135k653N8186J09881j79183m7214p0482J60185
5993A85258J01819O6292j90473O2671J0116r0374J19336K9035J6120k08203j16371
5982a4774l0208N3384J05934n8878Q9826J72p6454J39392K7719M9836j07444M7426
5970B25931N3293j29434J45566l1482j2047m154J11470j83000R1884j0082n3874
5959B04071q3659L961N6442o7708J04724j5302J3340j69321N9072J73368J0493
5948B89481j9382o3767l4547J44357j61047k43055J56016O9051j13881K5795n984
5937D3037N4826j05965m4587J25860N5980L4525k107Q365j64753O753M7924j477
5925E8381k05007M8721J41613J41606j0962k19447j19425K28678Q7665q0485j23146
$$ plain form
6005 96950 21136 7283 78151 144403 156538 153885 212071 321952 142769 95555 25073 185258
5993 185258 287077 353369 162896 225567 235683 145309 264645 293680 309800 101597 -14774
5982 -14774 -44982 8402 114336 55458 145284 145456 69002 208394 236113 285949 178505 225931
5970 225931 279224 149790 295356 263874 251827 247673 359143 176143 268027 257945 204071
5959 204071 120412 124373 180815 113107 217831 202529 215869 46548 105620 278988 289481
5948 289481 270099 206332 171785 316142 155095 -87960 68056 137107 23226 49021 43037
5937 43037 97863 -8102 -52689 73171 129151 163676 161569 169934 5181 11934 59858 58381
5925 58381 -146626 -97905 43708 185314 174352 -45095 -164520 64158 151823 71338 -51808
5914e1808P371M0162M8338Q4194N1911j47383J53846N020n8418J29886j60184
5903A02935M3654J2292q3437l4300J1910l1861O353M3695R9023j20208J68640
5892B18696j5249K30224j63133j16101p0130m9737J03483k43753L2111J44931
5882G1342N1132K7903K0242r5049J55109K4605O1217J16799p0714m0971j23198
5871A98417k4405m3914l6622J03379q4216k2503J04741J47217J2021p5064J0737
5860B89788K0766r1846P3234M1943j24961q5397J41913J2528p8512M9033J7440
5849B65929L9065m4893J4076n1076j07547m1258L51417m7642j74488o1176J44899
5838B87306m2754j85895O6504J70840M4280j63566N6555J04323j94710m748J24541
$$ plain form
5914 -51808 -44437 -4275 44063 128257 180168 32785 186631 191651 133233 263119 102935
5903 102935 146589 158881 75444 41144 53054 21193 27546 71241 170264 50056 218696
5892 218696 203447 433671 270538 154437 84307 34570 138053 -105700 -73589 71342
5882 71342 122474 150377 170619 75570 230679 255284 316501 433300 362586 321615 198417
5871 198417 174012 130098 93476 196855 112639 90136 194877 342094 354115 279051 289788
5860 289788 310554 218708 291942 333885 208924 123527 265440 277968 199456 248489 265929
5849 265929 304994 260101 274177 223101 115554 74296 425713 378071 203583 142407 287306
5838 287306 244552 58657 125161 296001 340281 176715 233270 337593 142883 138135 262676
5827B62676O5233J00093L8023r9657j39477R7788k7414j06294O0750J06003k36609
5816A21115N1080K85856K2363j23841j43207l6296q0543l7386J71155K4707P5240
5805C30243J23349k79196P2191n7088K04183L1684q0463q2071j60251J73643N5032
5794C31256l0158k17536o6590J85450Q6425n8712M7813N85L9100q0995n1594j34714
5782E0330J99556J2374L593k3561J377K4080j3036j00718q4703J93752N5927J17348
5770D36319j8800r0260m9287l8967N8302J2013p6998k8832k4229J7633J3770J16882
5758C27546o60k40685o6927K09152P8773j65672K3159k3329R2457j00920L1034
5747A63928K09576k3137M384m4034R7142j23040m8691K15891j05588o1438J80953
$$ plain form
5827 262676 327909 428002 466025 366368 226891 324679 297265 190971 251721 357724 121115
5816 121115 172195 458051 480414 356573 213366 177070 96527 59141 230296 255003 330243
5805 330243 453592 174396 246587 189499 393682 425366 344903 262832 102581 276224 331256
5794 331256 301098 83562 16972 202422 288847 230135 277948 278533 317633 236638 185044 50330
5782 50330 249886 262260 265853 242292 243669 267749 254713 153995 69292 263044 318971 436319
5770 436319 417519 327259 277972 239005 297307 309320 232322 203490 179261 196894 210664 327546
5758 327546 326886 86201 19274 228426 307199 141527 164686 141357 233814 132894 163928
5747 163928 373504 350367 354751 310717 407859 284819 236128 452019 346431 284993 465946
5736D65946q3110p1192J828l1248P4010J3447k680M4788k089j368J082k27204
5724A82210j27818M0749J65897J22439P0657o2586j43506o0440J04557J09237
5714D01396k0412r3848J9863J56817q5041j22497R25J49619N2379p2654m4827
5703C41720J26937Q9488n6295j7677r9278q1363o7223j17239J88350m8550P8767
5692C37637n897Q3140J52568q1134j9536m54j59763M5355N6491J63960k1070q3
5680E51214Q4446j16567j22338M941J25882j15479J9945j1093N7327Q718M2861
5669E29857j2794k09621R6946K63486K8927p5817l2m3795q1063Q7227J01865R7266
5657G82452l8791l4056R6864J80969r6973k3922o7111N0639M1692j48262k3973
$$ plain form
5736 465946 382836 311644 313472 282224 356234 369681 367001 411789 409700 408332 409414 182210
5724 182210 54392 95141 261038 383477 454134 391548 248042 187602 292159 401396
5714 401396 380984 287136 306999 463816 378775 256278 257203 406822 459201 386547 341720
5703 341720 468657 558145 501850 484173 384895 303532 236309 119070 307420 258870 337637
5692 337637 331740 414880 567448 486314 466778 466324 306561 351916 408407 572367 551297 551214
5680 551214 635660 519093 396755 401696 527578 412099 432044 420951 478278 486996 529857
5669 529857 517063 307442 404388 667874 696801 620984 620952 577157 496094 583321 685186 782452
5657 782452 743661 709605 806469 987438 890465 866543 799432 850071 891763 743501 719528
5646G19528N9152R1774N5106n9950l6473m4751K04888J68385o7766P6322M177
5635A170392j31976P2684J11121J598Q5873o3013n5729L23173Q3742q0367N7269
5624A574767R4464M026k00030j780J61613L5476J29102J19776m004J69094J95435
5613B277939J36876M3122m5809n9401Q428J02738J27540J05313o7539k6441J40421
5602B743187L16829k9845J67792O8676L5082K3599L6746L12913j47328J58407
5592C686058O1194P9674K29926K01813J49041M4150P7553J80672K2980J32466
5582D865527K13435K18612M98103L73327K07917J85508L82148N43402M42079O24546
5572H554604K51469L30144K89408K27647K83071K42364J54568N3270J48270P6808
$$ plain form
5646 719528 778680 870454 925560 865610 829137 784386 989274 1157659 1089893 1166215 1170392
5635 1170392 1038416 1111100 1222221 1223819 1309692 1246679 1190950 1514123 1597865 1517498 1574767
5624 1574767 1669231 1673257 1473227 1471447 1633060 1668536 1797638 1917414 1913410 2082504 2277939
5613 2277939 2414815 2457937 2412128 2352727 2361155 2463893 2591433 2696746 2629207 2602766 2743187
5602 2743187 3060016 3030171 3197963 3266639 3301721 3325320 3362066 3674979 3527651 3686058
5592 3686058 3747252 3826926 4056852 4258665 4407706 4451856 4529409 4710081 4733061 4865527
5582 4865527 5078962 5297574 5795677 6169004 6376921 6562429 6944577 7487979 7930058 8554604
5572 8554604 8806073 9136217 9425625 9653272 9936343 10178707 10333275 10386545 10534815 10611623
5562A0611623J59974J78469K29876K33038L84886K01799J62649L04786L34474
5553A2801574M71747M33335O30704M49667N09778M95667L77406P13605N13740
5544A7397223M66252O42720K94643M76775L81178J42960J07347K75953O4776j96221
5534B0053606J19391J81200J57285M24712J65681J01786K94581L62091M84612
5525B2344945M78933M65194O18162P72994O49477M65927N36508N37691J17367
5516B6987198Q7558P2682K338O2896L0985k94085m38300l54824l1891N1976K8060
5505B6204593k45304O0884j03007P6523J74064J97042M10990M18745L56653K23483
5495B7774666L70832M58322L55245K68877K73757q3166j98412k54693l89837k92260
$$ plain form
5562 10611623 10771597 10950066 11179942 11412980 11797866 11999665 12162314 12467100 12801574
5553 12801574 13273321 13706656 14337360 14787027 15296805 15792472 16169878 16883483 17397223
5544 17397223 17863475 18506195 18800838 19277613 19658791 19801751 19909098 20185051 20249827 20053606
5534 20053606 20172997 20354197 20511482 20936194 21101875 21203661 21498242 21860333 22344945
5525 22344945 22823878 23289072 23907234 24680228 25329705 25795632 26332140 26869831 26987198
5516 26987198 27074756 27147438 27149776 27212672 27243657 26949572 26511272 26156448 26124557 26176533 26204593
5505 26204593 25959289 26020173 25917166 25993689 26167753 26364795 26775785 27194530 27551183 27774666
5495 27774666 28145498 28603820 28959065 29227942 29501699 29418533 29220121 28965428 28575591 28283331
5485B8283331k92339n06085n71978o03377o65563m09214l58975j31085l53262
5476B4391453k50824q8540R3158R8040j83750O7063Q4205j4771j91196J2358k45831
5465B3771365j21017r5258n42116l96405n76688p05191n66234p13062q56334n54883
5455A8644177o07839p71220l82286n07826l85841m75085m67189m02321m85483
5446A4159087k01939k17808k61520j60817l66733j61214j14285L7126j91110k98743
5436A2222044j27147m98007m49056o02566m03582n97028m17220j63962k07752
5427H755724l95667n13388l91199m59850m14577k84135l5238q5641n88404k41444
5417E346181j25176l52182k85460j09453k96771o0638k13045j54902M3085j49675
$$ plain form
5485 28283331 27990992 27484907 26912929 26309552 25643989 25234775 24875800 24744715 24391453
5476 24391453 24140629 24052089 24145247 24243287 24059537 24126600 24210805 24196034 24004838 24017196 23771365
5465 23771365 23650348 23555090 23012974 22616569 22039881 21334690 20768456 20055394 19199060 18644177
5455 18644177 18036338 17265118 16882832 16375006 15989165 15514080 15046891 14644570 14159087
5446 14159087 13957148 13739340 13477820 13317003 12950270 12789056 12674771 12711897 12520787 12222044
5436 12222044 12094897 11596890 11147834 10545268 10141686 9544658 9127438 8963476 8755724
5427 8755724 8360057 7846669 7455470 6995620 6581043 6296908 6261670 6176029 5587625 5346181
5417 5346181 5221005 4868823 4583363 4473910 4177139 4116501 3903456 3748554 3791639 3641964
5407C641964p8408j79665j63700k0154J086k37114n9854K4412k6949k90975q5214
5396B525429j37855n4917j15673m7090j21165j23684K2322j08921R2448l3946
5386A896948o4560M4488j19653n6399j65982J80532K7086k4659q3304j51631p0868
5375A411998K547m8608l7457j33791Q5735J61684j24534n7376j5559K1178p6042
5364A189775R7417k7061j16448j24093n8531J02278J03161j70779j12631K2147
5354I05235p8944q054M1058J59488j43212j07714j0387L8799N2732R3097N5754
5343I97852J6684J51488j86647j11033m3512l234q3432M663L9885J58398K5380
5332I66492j78409j8111r2304r239O0288l9585P9936l51o5313M3418j69631o0396
$$ plain form
5407 3641964 3563556 3383891 3220191 3200037 3201123 2964009 2904155 2928567 2901618 2610643 2525429
5396 2525429 2387574 2332657 2216984 2169894 2048729 1925045 1947367 1838446 1930894 1896948
5386 1896948 1832388 1876876 1757223 1700824 1534842 1715374 1742460 1717801 1634497 1482866 1411998
5375 1411998 1414545 1365937 1328480 1194689 1280424 1442108 1317574 1260198 1244639 1265817 1189775
5364 1189775 1287192 1260131 1143683 1019590 961059 1063337 1166498 995719 883088 905235
5354 905235 826291 818237 859295 1018783 875571 767857 757470 796269 849001 942098 997852
5343 997852 1014536 1166024 979377 868344 824832 821598 738166 742829 782714 941112 966492
5332 966492 788083 769972 677668 668429 728717 689132 769068 768717 703404 746822 577191 516795
5320E16795K3908o1406J52573J09452k47711q7618J71491M3696M3585m3170J03169
5309G24764p8997j17400j28965Q7202J84633J4680p3946k6017O8533K3022k04274
5298D73235M1399j6055p3132P8814J6317K21948J02317j09671j90779j15434k3881
5287D05078M8649m8582R5286l2865Q4873J02243r3521Q988K1266k43637O6119
5276D13897J01404M303J55450k01030L0955K01489k144l2274j28138m8595k6250
5265D69067m0767n498Q9051J21046m4168J9680J13339l626r7375O5752p8857q7545
5253E20099l0262J18600L7453j5611J97312o7724J2624j40891P766J39364q2340
5242F96390J05556J55469j52384k8945J54865j63181r4865j11940J28906J0550
$$ plain form
5320 516795 540703 479297 631870 741322 493611 405993 577484 621180 664765 621595 724764
5309 724764 645767 528367 399402 486604 671237 685917 611971 585954 654487 677509 473235
5298 473235 514634 498579 425447 504261 520578 742526 844843 735172 544393 428959 405078
5287 405078 453727 405145 500431 467566 552439 654682 561161 570149 591415 347778 413897
5276 413897 515301 519604 675054 474024 504979 706468 704324 672050 543912 495317 469067
5265 469067 428300 422802 511853 632899 588731 608411 721750 718124 620749 686501 607644 520099
5253 520099 489837 608437 645890 630279 827591 759867 772491 631600 639366 778730 696390
5242 696390 801946 957415 805031 776086 930951 767770 672905 560965 689871 700421
5232G00421M235Q1174J28892j12031N6471J60985p3835j12529l3760o3135J8359
5221G55247J52438L7778R8050J2063K2377l9187Q9991j1758N9133K4865K2885
5210A223882O6901J156l657J09741J30704R1033K0703q7657j10469J45633j3835
5199A574135J08340J50869k1233j83543n8146M3340O8989J27123J60763J62059
5189B132696K7956J12769R9844J58757k7970R923l1140r0266K33313J73681K42461
5178C042024M4900J3641J08642P1298J93209p3451J85219N4864o308J50871L4926
5167C819835J35720J76794K62925L13625J23101Q8372R0759J69777M29561K80661
5157E891130J63849J84954L78638L47922N51979N86165K70635K72040M16135L55192
$$ plain form
5232 700421 704656 785830 914722 802691 859162 1020147 946312 833783 800023 736888 755247
5221 755247 907685 945463 1043513 1055576 1077953 1038766 1128757 1116999 1176132 1200997 1223882
5210 1223882 1290783 1291939 1288282 1398023 1528727 1619760 1640463 1552806 1442337 1587970 1574135
5199 1574135 1682475 1833344 1812111 1628568 1570422 1613762 1682751 1809874 1970637 2132696
5189 2132696 2160652 2273421 2373265 2532022 2504052 2513975 2482835 2392569 2625882 2799563 3042024
5178 3042024 3086924 3100565 3209207 3280505 3473714 3400263 3585482 3640346 3634038 3784909 3819835
5167 3819835 3955555 4132349 4395274 4708899 4832000 4920372 5011131 5180908 5610469 5891130
5157 5891130 6054979 6239933 6618571 6966493 7518472 8104637 8375272 8647312 9063447 9418639
5147I418639K07754K65442J23071O1563J42405K89542J36974J92929Q6904J01322
5137A1026545J66674K8506k8546J69922M2184L62477L10947K16611K67732L84505
5127A2947557L34741M07747M29051O20320O49582M81146P00909O08450P95652
5118A7975155P68580Q31563O88651P08923N06484L21387K25474J86503J09969
5109B2322689M4784j01812j84169k09511k82676j7218J05633j6839k4694J0594
5099B1646781J29247J13413J45189K36915J74598J01280K34801K73048K19609
5090B3274881L39931M25352K18348N27014N08488M74052O55892L51937N28564
5081B7304459L23710J99019P1703p5590r1015j00275K3758J21530j15394r3913
$$ plain form
5147 9418639 9626393 9891835 10014906 10076469 10218874 10508416 10645390 10838319 10925223 11026545
5137 11026545 11193219 11221725 11193179 11363101 11405285 11767762 12078709 12295320 12563052 12947557
5127 12947557 13282298 13690045 14119096 14739416 15388998 15870144 16571053 17179503 17975155
5118 17975155 18743735 19575298 20263949 20972872 21479356 21800743 22026217 22212720 22322689
5109 22322689 22367473 22265661 22081492 21871981 21589305 21572087 21677720 21660881 21636187 21646781
5099 21646781 21776028 21889441 22034630 22271545 22446143 22547423 22782224 23055272 23274881
5090 23274881 23614812 24040164 24258512 24785526 25294014 25768066 26423958 26775895 27304459
5081 27304459 27628169 27827188 27898891 27823301 27732286 27632011 27655769 27777299 27661905 27567992
5071B7567992J73457r6888P8184j88488r4901J65172r0320q3565j72644p5409
5061B7182590j41697k09465k4350k50531k53472l86408n82116o18916p00608m70832
5051B3544195k46711l50769k25923j54520l24985l21515l85713k45639m30515
5042B0857905m44798j89897j92170j60176k15729p1767Q3473j39055J56175P913
5032A9691874o2090j05890k84957j60730m82499n90855p05349l98168o10789p89709
5022A5500838o03263o66701n49366n27668n14858l68436n14741l04268m05971
5013A1045566k97978j45159k20627k29312l03973j58607j6837J9269k08517j0796
5003I473029m4414j81743m5462j9129j73732k62537k7099j00707l30193j47327
$$ plain form
5071 27567992 27741449 27644561 27722745 27534257 27439356 27604528 27514208 27430643 27257999 27182590
5061 27182590 27040893 26831428 26807078 26556547 26303075 25916667 25334551 24715635 24015027 23544195
5051 23544195 23297484 22946715 22720792 22566272 22241287 21919772 21534059 21288420 20857905
5042 20857905 20413107 20223210 20031040 19870864 19655135 19583368 19666841 19527786 19683961 19691874
5032 19691874 19629784 19523894 19238937 19078207 18595708 18004853 17299504 16901336 16290547 15500838
5022 15500838 14897575 14230874 13681508 13153840 12638982 12270546 11755805 11451537 11045566
5013 11045566 10747588 10602429 10381802 10152490 9848517 9689910 9673073 9692342 9483825 9473029
5003 9473029 9428615 9246872 9201410 9182281 9008549 8746012 8718913 8618206 8288013 8140686
4993H140686l53364l05955l87553l25475l97024m55606l78495j44852j78839l19917
4983D893606j39564k09869k00460j51659j24175k64640r5601j27037k39626j40597
4973C200378o3864O6626j45361j53168Q6620m452p6631j81773j33996q7448k42423
4962B264508M0793M7530Q251Q3082k05555k68608j1123J078j09663R6491r1931
4951A854853j07636J4975q6741j07805n8691J55860O365j51916j49634J37266
4941A506896o3072m1614o6423q0354L5590L6275j30995L4746o037q4513n3902
4930A086597M6452j4946j26167k0549K13075L3275j82863L9911l6020j21884M3028
4919I59909r3870j40214J17979N063R6858o4956q3717p7156k703R5767J20940
$$ plain form
4993 8140686 7787322 7481367 7093814 6768339 6371315 5915709 5537214 5392362 5213523 4893606
4983 4893606 4754042 4544173 4343713 4192054 4067879 3803239 3707638 3580601 3340975 3200378
4973 3200378 3136514 3203140 3057779 2904611 2991231 2986779 2910148 2728375 2594379 2506931 2264508
4962 2264508 2305301 2352831 2361082 2444164 2238609 1970001 1958878 1959956 1850293 1946784 1854853
4951 1854853 1747217 1762192 1675451 1567646 1508955 1664815 1671180 1519264 1369630 1506896
4941 1506896 1443824 1402210 1335787 1255433 1291023 1327298 1196303 1231049 1225012 1140499 1086597
4930 1086597 1133049 1118103 991936 971387 1184462 1217737 1034874 1074785 1038765 916881 959909
4919 959909 866039 725825 843804 848867 945725 880769 797052 719896 717193 812960 933900
4908I33900j92853j79786M9444k4622N3035M0069j26573Q6606M5287o908P8377
4897G55976j19276J01569o2219n0086k1245P3447j6259L5805M3756j62195K8002
4886F07275j14070K44054o3487n5590k65224J15101K55499j47040L3036O2188
4876F71742j63457q3031k3646M8267J84516p6640j40792J36054L0737j99490r7814
4865B86446L7123J10702N0263n5420M0323k0570K6497r7945p1551K1407J19218
4854D46493l2711m7725j3780K1064o7429J10764K0347o2178J16804r6165l9484
4843C56000K1662R2258n6104M763O4427o057l1689n2969q7508K3372L7446Q8691
4831D54292K8883j30413o4640M9212r6330r1802l4429K38302J21930k1567j40116
$$ plain form
4908 933900 741047 561261 610705 586083 639118 679187 552614 639220 684507 677599 755976
4897 755976 636700 738269 676050 625964 604719 678166 661907 697712 741468 579273 607275
4886 607275 493205 737259 673772 618182 352958 468059 723558 576518 609554 671742
4876 671742 508285 425254 401608 449875 634391 557751 416959 553013 583750 384260 286446
4865 286446 323569 434271 484534 429114 469437 448867 475364 377419 305868 327275 446493
4854 446493 413782 366057 352277 373341 305912 416676 437023 374845 491649 395484 356000
4843 356000 377662 469920 413816 418579 483006 476949 445260 392291 304783 328155 365601 454292
4831 454292 483175 352762 288122 337334 241004 149202 114773 353075 475005 453438 313322
4820C13322K08378n3666j08187l722l5243N6773L359J35270k03707j11728N2626
4809B53475K3005j4649l3786J49230J14730r7068L7437J12301N4832j63547q5533
4798C50427q5936N5923J6140L0454P0986k6080K1037j03584P5513p5726r918j08635
4786B10601N7805J14569l8071R2292o8463j44048K26470J06361m9688j41377j35023
4775B31428J11673J30410j04668R512n7207k8640J43847q307j89505R3581n095
4764C27029m8922k2751k0965n0505O6654K42309l442J38548p565l3622r4635o9788
4752D22345m5008J05636l3151k4229l2401R8557P2295j588j8458r3294J73185
4741F23889L546j29807k55401J38998Q6911J68318r7302m8396R183j2326K8705
$$ plain form
4820 313322 521700 468034 359847 356125 320882 377655 381014 516284 312577 200849 253475
4809 253475 276480 261831 228045 377275 492005 394937 432374 544675 599507 435960 350427
4798 350427 264491 320414 336554 367008 437994 411914 432951 329367 404880 329154 319236 210601
4786 210601 268406 382975 344904 437196 368733 224685 451155 557516 507828 366451 231428
4775 231428 343101 473511 368843 378355 321148 292508 436355 428048 238543 332124 327029
4764 327029 278107 255356 234391 183886 250540 492849 489407 627955 620390 586768 492133 422345
4752 422345 377337 482973 449822 425593 393192 491749 564044 562456 543998 450704 623889
4741 623889 627435 497628 242227 381225 468136 636454 539152 490756 499939 487613 516318
4730E16318o7823O6742J09527j96169o1351K6467j5505m4225j9701K18104q4060
4719D48324J64262l285K2939j72414J68785P2647j43691j43262J1491m9867R1937
4708D67866K2547M5988j9828J16294N2229k2295J37788j3932o8405j89531N164
4697E33885N0554J5157m7112j6000M9019J79935m5356N503o6249j07413j7204
4686E34719N4488L7818m7377j19401O4473J9466J99063q2338n6704l6307j72374
4675C95526J32169J12064m0908K662R2637j9453K8272k14550J73790Q1708l1562
4664G12355j01362m3055m9602n2553K88146n6095j05137j31577j9657J32720L6094
4653F10277R5255j01672j9840m761n8236J55005O4037j2832p2521r9608P7856
$$ plain form
4730 516318 448495 515237 624764 428595 367244 393711 378206 333981 314280 532384 448324
4719 448324 612586 609301 632240 459826 628611 701258 557567 414305 425796 375929 467866
4708 467866 490413 536401 516573 632867 685096 662801 800589 786657 718252 528721 533885
4697 533885 584439 599596 552484 536484 585503 765438 720082 725585 659336 551923 534719
4686 534719 589207 627025 579648 460247 524720 544186 743249 660911 604207 567900 395526
4675 395526 527695 639759 598851 601513 694150 674697 702969 488419 662209 743917 712355
4664 712355 610993 567938 518336 465783 753929 697834 592697 461120 441463 574183 610277
4653 610277 705532 603860 584020 579259 521023 676028 740065 727233 654712 555104 632960
4642F32960M8283j11420j8789N2306M7252j08802p8878J56835N6015j39136M0608
4631E77234P3196j689J12108j36371l2918j9300L8469K0393P1319M4015j0368
4620G36088q0009N1037j06609m7910r221J80244J42759k43720j55503J9790J19386
4609F06332j72636Q6542R7265N0710J32746j30057j51216Q4092K8170l340J5346
4598F43954J46481N1364j76381j37933l0737N2056J85242j08407J28646M5614
4588G99899p6184q1517k0450l4514k3875N7747O6557J65279j69798M8445p9158
4577F52431P8168N3110r1307p2221Q9410M7541m2118q041q7308j9442O2132J4087
4565F76442j05230j15293q284J87599N2708K408J01357L5523l0903p4193p9837
$$ plain form
4642 632960 681243 569823 551034 603340 650592 541790 462912 619747 675762 536626 577234
4631 577234 650430 648741 760849 624478 591560 572260 610729 631122 702441 746456 736088
4620 736088 656079 707116 600507 552597 543376 723620 866379 622659 467156 486946 606332
4609 606332 433696 520238 617503 668213 800959 670902 519686 603778 631948 628608 643954
4598 643954 790435 841799 665418 527485 496748 548804 734046 625639 754285 799899
4588 799899 723715 642198 621748 587234 563359 621106 687663 852942 683144 731589 652431
4577 652431 730599 783709 692402 620181 709591 757132 715014 706973 619665 600223 662355 676442
4565 676442 571212 455919 447635 635234 687942 690350 791707 827230 796327 722134 642297
4554F42297J9168K0107J68991j14911K4853L1786J31555O679r4620J10026j08586
4543H37345j52783P662O685K43957N872l3288j46906n2350n9959L9097Q5633o8392
4531G12573J21838j0803N9791K1364J30131J6318k7036r3370J19037J33856j55794
4520A027905l9012q8328Q5489J03453J53760K9470J5632J38841k05341J7024K46496
4509A485389j9558j40770r0184J06842j23599J72046J05119r4918J23142L8825
4499A562334j12837k4747n2182O5862J49683O1207n3014J40398K95121j91556
4489A840269J00456K882J6897m1669J9264O4571M9068J18499J28632J51496J10753
4478B561118j43090K3217K11454n4734P5290P9741J9732J96901m1243M1194J11251
$$ plain form
4554 642297 661465 681572 850563 735652 760505 792291 923846 930525 835905 945931 837345
4543 837345 684562 692224 698909 942866 948738 915450 768544 716194 656235 695332 780965 712573
4531 712573 834411 823608 883399 904763 1034894 1051212 1024176 930806 1049843 1183699 1027905
4520 1027905 988893 900565 986054 1089507 1243267 1272737 1288369 1427210 1221869 1238893 1485389
4509 1485389 1465831 1325061 1234877 1341719 1218120 1390166 1495285 1400367 1523509 1562334
4499 1562334 1449497 1424750 1372568 1438430 1588113 1649320 1596306 1736704 2031825 1840269
4489 1840269 1940725 1943607 1960504 1918835 1938099 2002670 2051738 2170237 2298869 2450365 2561118
4478 2561118 2418028 2441245 2652699 2597965 2673255 2752996 2772728 2969629 2928386 2969580 3080831
4467C080831J28316l0019J37307O0395J41813N5772J55735Q2215P8136L29724
4457D220225Q3252P7183J22370K9020j22604K12277L03761R5190L5999J47848
4447E204521K17183J98506R9577K75544J40842K49609L01951J47064L02766K60290
4437G397853K71296K13220L44683J79383L36828M78357M88962M27586L91764N77055
4427A1106987O16344P58431O81461N19055N07838O62493M89499M58131L57631
4418A6157870O28284N83902P26214Q90506Q08855R93846Q82231J122404R30836
4409B3724948P93723M92095J60349K64647l1185J828L44376M79178M04378P42416
4399B7376753Q67707R42674J012454Q09529P52949M08238k2477m15562m00756
$$ plain form
4467 3080831 3209147 3179128 3316435 3376830 3518643 3574415 3730150 3812365 3890501 4220225
4457 4220225 4303477 4380660 4503030 4532050 4409446 4621723 4925484 5020674 5056673 5204521
4447 5204521 5421704 5620210 5719787 5995331 6136173 6385782 6687733 6834797 7137563 7397853
4437 7397853 7669149 7882369 8227052 8406435 8743263 9221620 9710582 10138168 10529932 11106987
4427 11106987 11723331 12481762 13163223 13682278 14190116 14852609 15342108 15800239 16157870
4418 16157870 16786154 17370056 18096270 18986776 19795631 20789477 21671708 22794112 23724948
4409 23724948 24518671 25010766 25171115 25435762 25404577 25406405 25750781 26229959 26634337 27376753
4399 27376753 28244460 29187134 30199588 31009117 31762066 32170304 32147827 31732265 31331509
4390C1331509m02019l93423l14883k71890j89475K09547L35754L23622K51787
4381C0880529K02478Q0787k89329l81568p07016n59256m11005o41579l89606p1047
4371B7713388L0306K8163j06177o704n4548j27588k30800j33356m56820k19156
4361B6436708j54693l79748j7264J05614j50138k6541J7564j97652n131N7769
4351B5686488j8606q7109J29324J08120p264J24485L36824L11070L70222N57586
4341B7511140N21470N11371Q20436N99312L94367K35588K25612J71065l7854p6202
4331C0876305k13395j77353k01576j81991o7113j52205k77633J62179J60129J82415
4321C0109762K88248L84419L03752M02875L89861M73642M11317J24098J09008
$$ plain form
4390 31331509 30929490 30536067 30221184 29949294 29759819 29969366 30305120 30628742 30880529
4381 30880529 31083007 31163794 30874465 30492897 29785881 29226625 28815620 28174041 27784435 27713388
4371 27713388 27743694 27771857 27665680 27658976 27604428 27476840 27246040 27112684 26655864 26436708
4361 26436708 26282015 25902267 25885003 25990617 25840479 25813938 25831502 25633850 25628719 25686488
4351 25686488 25667882 25580773 25710097 25818217 25810953 25935438 26272262 26583332 26953554 27511140
4341 27511140 28032610 28543981 29364417 29963729 30358096 30593684 30819296 30990361 30952507 30876305
4331 30876305 30662910 30485557 30283981 30101990 30034877 29882672 29605039 29767218 29927347 30109762
4321 30109762 30398010 30782429 31086181 31489056 31878917 32352559 32763876 32887974 32996982
4312C2996982k02094n63741l76952m29754m36142j69701k79955k55070j78877
4303C0104696m12644l68304k80739m63802m10453n34666m82207m91933n12214
4294B6147734n13761n65006k68657l11125m89236k02138Q8989J12029j58175J49378
4284B3990032J27612Q7001K04542o593l81391n56557o75667p98122q66542q11788
4274B0312527o12014q47194p51434o58915m68673m26962n85598m01169k28136
4265A5332432l38951m75997l43495k28908m09961l61466l77686l52774j96243
4256A2246951l73940m32007j40650k31764k33623j32264n9886q5606j25159M4719
4246A0476771k23009J9276j09770k51243j56007j6015k36467p8811k29660j16478
$$ plain form
4312 32996982 32794888 32231147 31854195 31424441 30988299 30818598 30538643 30283573 30104696
4303 30104696 29692052 29323748 29043009 28579207 28168754 27634088 27151881 26659948 26147734
4294 26147734 25633973 25068967 24800310 24489185 23999949 23797811 23886800 23998829 23840654 23990032
4284 23990032 24117644 24204645 24409187 24402594 24021203 23464646 22788979 21990857 21124315 20312527
4274 20312527 19700513 18853319 18101885 17442970 16974297 16547335 15961737 15560568 15332432
4265 15332432 14993481 14517484 14173989 13945081 13535120 13173654 12795968 12443194 12246951
4256 12246951 11873011 11441004 11300354 11068590 10834967 10702703 10642817 10557211 10432052 10476771
4246 10476771 10253762 10273038 10163268 9912025 9756018 9740003 9503536 9424725 9195065 9078587
4236I078587O4471l204j73870p4480k8238o8810q1401k18339q9231k74738k32231
4225G898516k55209l35874l01084j57129k90535k55632j67532k93647k92152j84181
4215E365541j49400J84470k06103l9410k3285j60081j98648k8291m414m4547O5852
4204D761684l9554N0858k2915N4148r303J8397p9091R344q901N402q5972P0934
4192D725031K428K3942Q882q1283J13770k5034K7004P9078Q2033q684p5426N5971
4180D927712o9869J40552J9100l0640k1868J36079K25122O950L00841r0157N6282
4169E600104l2450j2199k5410n12L8937J32812K10529j09504R9386K10013J63761
4158F275467N3435K55022J15462K95344J54075K05829K92765K71363J53692P8531
$$ plain form
4236 9078587 9143058 9139854 8965984 8891504 8863266 8794456 8713055 8494716 8405485 8130747 7898516
4225 7898516 7643307 7307433 7006349 6849220 6558685 6303053 6135521 5841874 5549722 5365541
4215 5365541 5216141 5400611 5194508 5155098 5131813 4971732 4773084 4744793 4740379 4695832 4761684
4204 4761684 4722130 4772988 4750073 4804221 4794918 4813315 4734224 4743568 4734667 4740069 4654097 4725031
4192 4725031 4727459 4751401 4760283 4679000 4792770 4767736 4794740 4873818 4955851 4947167 4871741 4927712
4180 4927712 4857843 4998395 5017495 4986855 4964987 5101066 5326188 5333138 5633979 5543822 5600104
4169 5600104 5567654 5555455 5530045 5529533 5568470 5701282 5911811 5802307 5901693 6111706 6275467
4158 6275467 6328902 6583924 6699386 6994730 7148805 7354634 7647399 7918762 8072454 8150985
4148H150985K67839L47250l1837J01502M58815L92735K83403L63409M00873J83942
4138A0918916Q9946K67344J79329l2265O8833J22021J35285J33750K81109L05055
4128A2469323L11718J94827L35376K73808L59639K87994K03254L9620M52021L61973
4118A5289553J05594j7873P7528K38603K33320K16382L42796R2848M26612O46633
4108A7651996J94586L79056M80479L59832N91634P40698M68198N32362P44850
4099B2143691N06639N98075Q46505P09917N87447O81049O26544O50330M46368
4090B7796565K81779L97043K32512K65690K88700J76483J7675L9426J82352K93944
4080B9972169J57054M44163J53623o4843L97573N66366N09530N22255M71976P06488
$$ plain form
4148 8150985 8418824 8766074 8734237 8835739 9294554 9687289 9970692 10334101 10734974 10918916
4138 10918916 11008862 11276206 11455535 11423270 11492103 11614124 11749409 11883159 12164268 12469323
4128 12469323 12781041 12975868 13311244 13585052 13944691 14232685 14435939 14475559 14927580 15289553
4118 15289553 15395147 15377274 15454802 15693405 15926725 16143107 16485903 16578751 17005363 17651996
4108 17651996 17846582 18225638 18706117 19065949 19657583 20398281 20866479 21398841 22143691
4099 22143691 22650330 23248405 24094910 24804827 25392274 26073323 26699867 27350197 27796565
4090 27796565 28078344 28475387 28707899 28973589 29262289 29438772 29456447 29495873 29678225 29972169
4080 29972169 30129223 30573386 30727009 30662166 31059739 31626105 32135635 32657890 33129866 33836354
4070C3836354P02798P13772O04601O19372O21736K59404M25870Q78378N94505
4061C9256790K78339K80642K96514J62527N6054J09830J23100o6615k93304M071
4051D0207948j32209l1053L5764O1146J01263M10218J05660J50321L93985K42562
4041D1545605K73369K26641N14191L58981J68073M41038M04783M23902Q18386
4032D5174969N07137N25446Q98001R72043R76180J227394J359197J625737J676279
4023E4942383K141428K296493K574374K684635K694191K941225K718573K395708
4015G5389010K370679J794440J137234O03811K73918j32971n17705q32064r82418
4006G9103934r10183p47838m74467o73334n04883m44422p24856j061199j274901
$$ plain form
4070 33836354 34539152 35252924 35857525 36476897 37098633 37358037 37783907 38662285 39256790
4061 39256790 39535129 39815771 40112285 40274812 40330866 40440696 40563796 40497181 40203877 40207948
4051 40207948 40075739 40044686 40080450 40141596 40242859 40653077 40758737 40909058 41303043 41545605
4041 41545605 41818974 42045615 42559806 42918787 43086860 43527898 43932681 44356583 45174969
4032 45174969 45682106 46207552 47105553 48077596 49053776 50281170 51640367 53266104 54942383
4023 54942383 57083811 59380304 61954678 64639313 67333504 70274729 72993302 75389010
4015 75389010 77759689 79554129 80691363 81295174 81569092 81436121 80918416 80086352 79103934
4006 79103934 78193751 77445913 76971446 76298112 75793229 75348807 74623951 73562752 72287851
3997G2287851j599138j982341k193415k538795k897143l135916l151760l194951
3989E1594392l122518l009436l027303k610499k548129k200667k022705j942862
3981C1110273j809013j606932j501010j319406j227196j112797j006361q06003
3973B0721555q37016q65831o37648o51416n96912o48506m23442l45095n32010
3964A5183679m27311o36395m75118l64639l14752l19284l66913l73025l98556
3955A1507686j93855k08078k82899k72983k70916m2595l13582j79537J7822k35492
3945I525571q9775j76780m09704m2013j44594P6506o3920k24225N79k6358O500
3934H431787j07927j19966r075J51600K0637j32741j90902K58868O664J33945
$$ plain form
3997 72287851 70688713 68706372 66512957 63974162 61077019 57941103 54789343 51594392
3989 51594392 48471874 45462438 42435135 39824636 37276507 35075840 33053135 31110273
3981 31110273 29301260 27694328 26193318 24873912 23646716 22533919 21527558 20721555
3973 20721555 19884539 19018708 18381060 17729644 17132732 16484226 16060784 15715689 15183679
3964 15183679 14756368 14119973 13644855 13280216 12965464 12646180 12279267 11906242 11507686
3955 11507686 11313831 11105753 10822854 10549871 10278955 10236360 9922778 9743241 9761063 9525571
3945 9525571 9435796 9259016 8849312 8807299 8662705 8739211 8675291 8451066 8451645 8425287 8431787
3934 8431787 8323860 8203894 8194819 8346419 8367056 8234315 8043413 8302281 8308945 8442890
3924H442890J61995p901m9745J32710q2183P3529K17816J57058L2330N2774K20926
3913I352199J89981J40206J25419K1483P1252J38788K43171J60269q8829J12217
3903A0466156O4525r0387J88234J16946j45119P6047J86105M5995j20413j6727
3893A0771362k7750K94560J21983J70426K65535J46020K53433K52065L57308K16192
3883A2821134K36419N36010M91520M14162M56588M34755P00717O96395N77518
3874A7365218P31671Q87495R19907R62055J002689J012564J325984J302317J202752
3865B6712652J435846J297015J326563J420258J153553J152369J051888O19899
3857C6170043N37489L96525J96932J34448R1235j86220k9169m34382l30755l3077
$$ plain form
3924 8442890 8604885 8596984 8547239 8679949 8597766 8671295 8889111 9046169 9078499 9131273 9352199
3913 9352199 9542180 9682386 9807805 9829288 9900540 10039328 10282499 10442768 10353939 10466156
3903 10466156 10530681 10440294 10628528 10745474 10600355 10676402 10862507 10908502 10788089 10771362
3893 10771362 10743612 11038172 11160155 11330581 11596116 11742136 11995569 12247634 12604942 12821134
3883 12821134 13057553 13593563 14085083 14499245 14955833 15390588 16091305 16787700 17365218
3874 17365218 18096889 18984384 19904291 20866346 21869035 22881599 24207583 25509900 26712652
3865 26712652 28148498 29445513 30772076 32192334 33345887 34498256 35550144 36170043
3857 36170043 36707532 37104057 37300989 37435437 37526672 37340452 37311283 36876901 36546146 36513069
3847C6513069k66666k13296j87955l86829j5160k30485J7843J05560l898K5387
3837C5357570j5446L86861k1923J58973K19378K37649L02627N93061O60145P06103
3827C8584998Q74218Q74394J209946J459244J605831K134525K214996K700617
3819E1658769L104594L534995M078189M380160M884904N530370N796312N758652
3811H8726945N535812N361335M821420M350716L831561L028198K357882J857684
3803A19871553R56772P30079Q0124m62336q96776j351713j511794j793179k007545
3794A13615185k100515k284993k753064l133137l363256l627271m052424m377703
3786H7922822m443504m419173m522579m557781m615009m253607m093879l979113
$$ plain form
3847 36513069 36246403 36033107 35845152 35458323 35443163 35212678 35230521 35336081 35332183 35357570
3837 35357570 35342124 35728985 35707062 35866035 36085413 36323062 36625689 37218750 37878895 38584998
3827 38584998 39459216 40333610 41543556 43002800 44608631 46743156 48958152 51658769
3819 51658769 54763363 58298358 62376547 66756707 71641611 77171981 82968293 88726945
3811 88726945 94262757 99624092 104445512 108796228 112627789 115655987 118013869 119871553
3803 119871553 120828325 121558404 121638528 121176192 120279416 118927703 117415909 115622730 113615185
3794 113615185 111514670 109229677 106476613 103343476 99980220 96352949 92300525 87922822
3786 87922822 83479318 79060145 74537566 69979785 65364776 61111169 57017290 53038177
3778E3038177l465725l430311l143788k854651k682773k235096k001703j892766
3770C1331364j847890j634563j310826j334640j075458j009031j129625p71926
3762B1217405q78572n72755n12640o52600n59764n00963j93261j27422l42746
3753A6876682m5383j25633P123P7595J10777N588J7454K01429K6241L23345L79345
3742A7854563J9751j7459J78706j22414l13369r7853l26929m31326n11930n29166
3732A5702574n56767o25303o45396n64135n79200o45624n84723n06234l29403
3723A0665789l23475m37812k87156l82947l31201k90110j67194k00948j00832
3714H144114j34585j86469j56337k25182j01444j0604n3497k81651j74552j08274
$$ plain form
3778 53038177 49572452 46142141 42998353 40143702 37460929 35225833 33224130 31331364
3770 31331364 29483474 27848911 26538085 25203445 24127987 23118956 21989331 21217405
3762 21217405 20338833 19766078 19253438 18600838 18041074 17540111 17346850 17219428 16876682
3753 16876682 16831299 16705666 16712789 16790384 16901161 16906749 16924203 17125632 17151873 17475218 17854563
3742 17854563 17874314 17856855 18035561 17913147 17599778 17501925 17174996 16743670 16231740 15702574
3732 15702574 15145807 14520504 13875108 13310973 12731773 12086149 11501426 10995192 10665789
3723 10665789 10342314 9904502 9617346 9234399 8903198 8613088 8445894 8244946 8144114
3714 8144114 8009529 7823060 7666723 7441541 7340097 7329493 7275996 6994345 6819793 6711519
3704F711519q7579M0775K3938q9649l5809N5103j43160j9820L0138r762j33376
3693F342318j34320K4775R7249o2540j6496j12964l7540K6291o2073j81324j0981
3682E872395Q7266L1520j24440p929P981J09640L093o8962Q3568J35361j6303
3671F113190O8869m965K48J57689J65724O5101P9105j9079P4788L22094p2438
3660F950326J82598m8110J36170K15778J87602M12219K22357M0060K04416K12419
3650H715835L39951L15806M32104K45066L38299N71707N58762N74151M46699N54543
3640A3092923P37885M02755O37224N36488N97226M81929N59062N24774L86358
3631A7956624K31393K68154M26799N11716L16725L69830K62559K76945L70847
$$ plain form
3704 6711519 6623940 6664715 6688653 6599004 6563195 6618298 6475138 6455318 6485456 6475694 6342318
3693 6342318 6207998 6232773 6330022 6267482 6250986 6138022 6100482 6126773 6064700 5883376 5872395
3682 5872395 5959661 5991181 5866741 5858812 5866793 5976433 5979526 5910564 5994132 6129493 6113190
3671 6113190 6182059 6177094 6177342 6335031 6500755 6565856 6644961 6625882 6700670 7022764 6950326
3660 6950326 7132924 7084814 7220984 7436762 7624364 8036583 8258940 8299000 8503416 8715835
3650 8715835 9055786 9371592 9803696 10048762 10387061 10958768 11517530 12091681 12538380 13092923
3640 13092923 13830808 14233563 14870787 15407275 16004501 16486430 17045492 17570266 17956624
3631 17956624 18188017 18456171 18882970 19394686 19711411 20081241 20343800 20620745 20991592
3622B0991592L00825L83776J77349k3351J48518J49392J35327k12901L6858k0995
3612B2066390M7250R7585J11844Q1289O9303J01956J04848L30917M07703L45791
3602B3764876M52558O15323N77389P81922O28884Q25165P94047J316919J328975
3593C1086058J442646J655872J920803K107514K470916K799245L068801L270346
3585D9822201L802021M252087M567296M782771M886575N229981M996012M845656
3577H7184600M899151M385670M060984L916687L941869L458448L442593L150814
3569A18440816K794650K529571K231339J641066J001513M58157l00975q14724
3561A27981413j219523j915464k293638k567396k980775l129567l490520l740788
$$ plain form
3622 20991592 21292417 21676193 21853542 21830191 21978709 22128101 22263428 22050527 22087385 22066390
3612 22066390 22113640 22211225 22323069 22404358 22473661 22575617 22680465 23011382 23419085 23764876
3602 23764876 24217434 24832757 25410146 26192068 26820952 27646117 28440164 29757083 31086058
3593 31086058 32528704 34184576 36105379 38212893 40683809 43483054 46551855 49822201
3585 49822201 53624222 57876309 62443605 67226376 72112951 77342932 82338944 87184600
3577 87184600 92083751 96469421 100530405 104447092 108388961 111847409 115290002 118440816
3569 118440816 121235466 123765037 125996376 127637442 128638955 129097112 128796137 127981413
3561 127981413 126761890 124846426 122552788 119985392 117004617 113875050 110384530 106643742
3553A06643742m100255m261609m325966m544973m933298m901293m597846m506824
3545G0471678m513176m237582l989401l511835l289231k995538k656499k480460
3537D2797956k057510j895365j897260j303540j229409j282981j074417q44947
3529C1212527o44227n93612n37099o47569m02957l54071k55417l74506l29187
3520B7073882k82938P565q1741k67330n3533o0091k10407j57328j6360m1718J34424
3509B6044425N2116K0960p7720j77932j69091m59800l85153m48593m05978m28976
3499B3564258n29555n82297n68390l97590n95196o04735k88046o34557n04682
3490A8859210l75665k95937k97137m56203j48135m7923p7701J07059M1029J62636
$$ plain form
3553 106643742 102543487 98281878 93955912 89410939 84477641 79576348 74978502 70471678
3545 70471678 65958502 61720920 57731519 54219684 50930453 47934915 45278416 42797956
3537 42797956 40740446 38845081 36947821 35644281 34414872 33131891 32057474 31212527
3529 31212527 30568300 29974688 29437589 28790020 28387063 28032992 27777575 27403069 27073882
3520 27073882 26790944 26798509 26716768 26449438 26395905 26335814 26125407 25968079 25951719 25910001 26044425
3509 26044425 26096541 26117501 26039781 25861849 25692758 25232958 24847805 24399212 23993234 23564258
3499 23564258 23034703 22452406 21884016 21486426 20891230 20286495 19998449 19363892 18859210
3490 18859210 18483545 18187608 17890471 17434268 17286133 17238210 17160509 17267568 17308597 17471233
3480A7471233K82074L13287L60063K14634O7865J32275J29256J29603K33587p8286
3470A9255591j43937l05360k89553j61062r3199k31646j63205j32649j53292j77061
3460A7404627r6860n5907q4046k51929J8218K5011J03400J22658k9197J77384
3450A7333359K37636M9223K57265K54833K03329L42775K07417J82989N36492J27439
3440A9732757L10721K70725N01510Q35807P06107R80032R78332J162076J346582
3431B6824649J495738J650544J711744J962286K362592K237083K706765K799954
3423D3751355L329913L836543M336033M610032M848081M979933N101375M908251
3415G9701516M484109L764403L017192K121867P66352n94970j949232k893139
$$ plain form
3480 17471233 17753307 18066594 18426657 18641291 18709156 18841431 18970687 19100290 19333877 19255591
3470 19255591 19111654 18806294 18516741 18355679 18262480 18030834 17867629 17734980 17581688 17404627
3460 17404627 17307767 17251860 17167814 16915885 16934103 16959114 17062514 17185172 17155975 17333359
3450 17333359 17570995 17620218 17877483 18132316 18335645 18678420 18885837 19068826 19605318 19732757
3440 19732757 20043478 20314203 20815713 21651520 22357627 23337659 24315991 25478067 26824649
3431 26824649 28320387 29970931 31682675 33644961 36007553 38244636 40951401 43751355
3423 43751355 47081268 50917811 55253844 59863876 64711957 69691890 74793265 79701516
3415 79701516 84185625 87950028 90967220 93089087 93855439 93260469 91311237 88418098
3407H8418098l604704m111801m582941m721984m716660m336465m393127l931471
3399E4018945l407669l374366l072386k457361k402982k255539j994767j697724
3391C3356151j542021j292869j238754r86756j032736j017034o18916o28607m20525
3382B4577933m44745m86857m73276m64642o85959o98655n82972o84750m07108
3373A9648969o81426o09816p38298n26418l01077n59969n34908m35636l46921
3364A4914500m00505o08065q05017o08388m42346l51452m45078k80410l51821
3355A0621418k57630l11571m87525l60770k14660k72586j73577k80634j19501
3346H142964j53781j21651k22945j0257p7623j54033j26632k5819m588k21065
$$ plain form
3407 88418098 84813394 80701593 76118652 71396668 66680008 62343543 57950416 54018945
3399 54018945 50611276 47236910 44164524 41707163 39304181 37048642 35053875 33356151
3391 33356151 31814130 30521261 29282507 28295751 27263015 26245981 25627065 24998458 24577933
3382 24577933 24133188 23646331 23173055 22708413 22022454 21323799 20740827 20056077 19648969
3373 19648969 18967543 18357727 17619429 17093011 16791934 16231965 15697057 15261421 14914500
3364 14914500 14513995 13905930 13100913 12492525 12050179 11698727 11253649 10973239 10621418
3355 10621418 10363788 10052217 9564692 9203922 8989262 8716676 8543099 8262465 8142964
3346 8142964 7989183 7867532 7644587 7634330 7556707 7402674 7276042 7250223 7245635 7024570
3336G024570j40266j11066j0968l02006l15350k62223j44598j86733j85439j64003
3326E201918o7381k8462j72687P1993j5892j01580m8500n3934K998j47815J3560
3315D654218o1328k16844j57015P8928l7197n6623J44458r772k13751j56495O8672
3304D037251l7674m9291o9915n4369m6955J77711p7188j85303j2289P1657J2889
3293C766524J11194p1713k3782j13849J43715J83053L9433K9685o9274N2516p0826
3282C976676l2857M920K8520L30668K19737j82835r2386J07126n3254O2830K7933
3271D397078R8761J54852k24294J40739o3884J25312J33456M432J0174j0125J41398
3260D907899L4742P9051P2771K02608Q5931J09002j18493m9546J71978j06388
$$ plain form
3336 7024570 6884304 6773238 6762270 6460264 6144914 5882691 5738093 5551360 5365921 5201918
3326 5201918 5134537 5106075 4933388 5005381 4989489 4887909 4839409 4785475 4788473 4640658 4654218
3315 4654218 4592890 4376046 4219031 4297959 4260762 4204139 4348597 4338825 4125074 3968579 4037251
3304 4037251 3999577 3950286 3880371 3826002 3779047 3956758 3879570 3694267 3681978 3753635 3766524
3293 3766524 3877718 3806005 3782223 3668374 3812089 3995142 4034575 4064260 3994986 4047502 3976676
3282 3976676 3943819 3948739 3977259 4307927 4527664 4344829 4252443 4359569 4306315 4369145 4397078
3271 4397078 4495839 4650691 4426397 4567136 4503252 4628564 4762020 4766452 4776626 4766501 4907899
3260 4907899 4942641 5021692 5094463 5297071 5383002 5492004 5373511 5323965 5495943 5389555
3250E389555J58553J04945R0576N1160J72391J82294J00700J91090R0767J82344
3240F714375K29276P9293K52475J58843J33583L28683K26898O3622L75686L62342
3230H925076J02728J65261N32525O07962K76972M82747M60501M05335N32053N55733
3220A3046893P04302O13595O12995O01427M73323O93543O56750N09303N73854
3211A8485985O57988O63998M20842M61146M43039K09083L68190O47944N48665
3202B2906880J83860Q2626J68665J76672R9534j42082K76942M52666K00996L81341
3192B4788100O12698N80383N08707N48969O21512O57349N32698N14661Q27242
3183C0192319Q64362Q76731J028989Q00769R80319J345948J080256J173830J308534
$$ plain form
3250 5389555 5548108 5653053 5743629 5794789 5967180 6149474 6250174 6441264 6532031 6714375
3240 6714375 6943651 7022944 7275419 7434262 7567845 7896528 8123426 8187048 8562734 8925076
3230 8925076 9027804 9193065 9725590 10333552 10610524 11093271 11553772 11959107 12491160 13046893
3220 13046893 13751195 14364790 14977785 15579212 16052535 16746078 17402828 17912131 18485985
3211 18485985 19143973 19807971 20228813 20689959 21132998 21342081 21710271 22358215 22906880
3202 22906880 23090740 23173366 23342031 23518703 23618237 23476155 23753097 24205763 24406759 24788100
3192 24788100 25400798 25981181 26489888 27038857 27660369 28317718 28850416 29365077 30192319
3183 30192319 31056681 31933412 32962401 33763170 34743489 36089437 37169693 38343523 39652057
3174C9652057J538641J969167K226964K791641L033581L554395L653454M102213
3166F2522113M536585N110563N782239O176787O888259P769375Q407954R279528
3158A16473403J0352965J1744017J3105760J5503742J9027807K3378998K7939104
3151B37525796L1177616L2207072K7879809J5682658k299506j8653974k7814091
3144B95705380k9067281k6184329k2399440j9213438j6794757j5184567j3271968
3137A53589600j1763176j0428049r749054r454346r060220q119395p084319n911541
3129H2019500n020307m399352l751944l289632k926199k617785k183350k102099
3121E5728832j802048j485417j563045j301498r56623p89804o97223n43706k05314
$$ plain form
3174 39652057 41190698 43159865 45386829 48178470 51212051 54766446 58419900 62522113
3166 62522113 67058698 72169261 77951500 84128287 91016546 98785921 107193875 116473403
3158 116473403 126826368 138570385 151676145 167179887 186207694 209586692 237525796
3151 237525796 268703412 300910484 328790293 344472951 342173445 323519471 295705380
3144 295705380 266638099 240453770 218054330 198840892 182046135 166861568 153589600
3137 153589600 141826424 131398375 121649321 112194975 103134755 95015360 87931041 82019500
3129 82019500 76999193 72599841 68847897 65558265 62632066 60014281 57830931 55728832
3121 55728832 53926784 52441367 50878322 49576824 48620201 47830397 47133174 46589468 46384154
3112D6384154r9851J93044M71331P86325J004788J391627J401721J605854J704885
3103E4843878J477073P62040q5631o72835j710573k462936k758712k782618k892673
3094D3717013k720186k521599k461719k044013j894046j774568j853492j682224
3086B6765166j621763j210599j261454j259924j144744r44336p59663p80527o44518
3077A7137638p28676o74396p88093o17544n63283m66362l86182l74620k97611
3068A2240871m38110m60698o44077k82393k43202m31029k35789j07968k47562
3059I150043k93499l65261j71175k26410k82636j87969k30582k84579k50541l27376
3049F530015j49418q3323n9406j39474k52333p2125k12792k18151O3223o474j72311
$$ plain form
3112 46384154 46284303 46477347 46948678 47735003 48739791 50131418 51533139 53138993 54843878
3103 54843878 56320951 57082991 56997360 56324525 54613952 52151016 49392304 46609686 43717013
3094 43717013 40996827 38475228 36013509 33969496 32075450 30300882 28447390 26765166
3086 26765166 25143403 23932804 22671350 21411426 20266682 19322346 18562683 17782156 17137638
3077 17137638 16408962 15734566 14946473 14328929 13765646 13299284 12913102 12538482 12240871
3068 12240871 11802761 11342063 10697986 10415593 10172391 9741362 9505573 9397605 9150043
3059 9150043 8856544 8491283 8320108 8093698 7811062 7623093 7392511 7107932 6857391 6530015
3049 6530015 6380597 6297274 6237868 6098394 5846061 5773936 5561144 5342993 5406216 5399742 5227431
3038E227431j08634k46988r8242j76147j29449j91763q6908j31266j34182r4770
3028C829082j7258J28609j62887L0610m5882k31523j10471j17882L1031r4154
3018C239275m1375j35215k0783P8798j40190j69708J06882M3188j79154N5257
3008B836975j13090j49643L1061m8137N625P597j7190J5818k20233J0926J40436
2997B500145q0994k2285q2955j29115N0575k0812j36048r943j09002P2514K5209
2986B057289O2741o3485L607j47118j04756n3128j6884n0373K6247J55754p1448
2975A798446N5655n5124j59589O947P4455L8533j00894n4071j5884p4763j38270
2964A375441J17758J3127j39358l5681L3242J14781j02829r1620k914q8785N3745
$$ plain form
3038 5227431 5118797 4871809 4773567 4597420 4467971 4276208 4189300 4058034 3923852 3829082
3028 3829082 3811824 3940433 3777546 3808156 3762274 3530751 3420280 3302398 3333429 3239275
3018 3239275 3197900 3062685 3041902 3120700 2980510 2810802 2917684 2960872 2781718 2836975
3008 2836975 2723885 2574242 2605303 2557166 2562791 2570388 2553198 2569016 2348783 2359709 2500145
2997 2500145 2419151 2396866 2313911 2184796 2235371 2214559 2078511 2068568 1959566 2032080 2057289
2986 2057289 2120030 2056545 2060152 1913034 1808278 1755150 1738266 1687893 1714140 1869894 1798446
2975 1798446 1854101 1798977 1639388 1646335 1720790 1759323 1658429 1604358 1588474 1513711 1375441
2964 1375441 1493199 1506326 1366968 1331287 1364529 1479310 1376481 1284861 1281947 1193162 1246907
2953A246907m5852R157k78745N899J34511l5683M1977J32487J58471o5833j45370
2942A157926J0737j13851j65388K19225N019l5019j31507r682m541j965L4045
2931I64999N0961J24244j2907P7364j03877o6854K801j60585K9976l0467Q9252
2920I64907p6455M9714k9561j36002q001J49266K5821o5825j94278L7492L7500
2909G54578r9800m0097K18076m181P6780L4701o6385L81L5957P9484j14918j32284
2897G42292j7011R312J28691m9326k8500j79289O3152K22910r0330k0430p3181
2886G08290L6137r919M2296J29074j36502j895K15401l6825k193N5743p9413L6367
2874I56561P0015J08045N4002J1236J27819J28985K03538n0443l7490K10080L25094
$$ plain form
2953 1246907 1201055 1210212 931467 937366 1071877 1036194 1078171 1210658 1369129 1303296 1157926
2942 1157926 1168663 1054812 889424 1108649 1113668 1078649 947142 937460 932919 930954 964999
2931 964999 1015960 1140204 1127297 1204661 1100784 1033930 1036731 876146 906122 875655 964907
2920 964907 888452 938166 908605 772603 764602 913868 939689 873864 679586 717078 754578
2909 754578 654778 614681 832757 828576 905356 940057 873672 874053 910010 989494 874576 742292
2897 742292 725281 734593 863284 813958 785458 606169 669321 892231 801901 781471 708290
2886 708290 744427 734508 776804 905878 769376 767481 982882 946057 943864 999607 920194 956561
2874 956561 1026576 1134621 1188623 1199859 1327678 1456663 1660201 1609758 1572268 1782348 2107442
2863B107442o7966j0663M9491J36184j73553l69618k05547N9676l5472j8694k1162
2852A450118k29163j23113K7427n8711L6371n4804j82440n5291O6414N8426j66725
2841G68509j22495O8755K0182l5859K255K5691o776j55932k5836J40645p0808
2830F08331J31073l9665J4307Q0452k9086K9662r7442J1546r8929j02306P18M3581
2818E52242P0450j08945O2863M9057Q2469j5075n95J37824l6473p1024k00617
2807E22176M6339M6801j00190j47129J06152J38993m4416o633O318j15231m1928
2796D11252R3463k0854j95291Q020J29143n8911O4572M0091k03665k9155J8818
2785B57483P9595K6145j57630M9824l0267k4757K39867R6696m8486o9130m1719
$$ plain form
2863 2107442 2039476 2028813 2078304 2214488 2040935 1671317 1465770 1525446 1489974 1471280 1450118
2852 1450118 1220955 1097842 1125269 1066558 1102929 1048125 865685 810394 876808 935234 768509
2841 768509 646014 714769 734951 699092 701347 727038 720262 564330 538494 679139 608331
2830 608331 739404 699739 714046 794498 765412 795074 697632 709178 610249 507943 508661 552242
2818 552242 622692 513747 576610 625667 708136 693061 692466 830290 793817 722793 522176
2807 522176 568515 615316 515126 367997 474149 613142 568726 562093 568411 453180 411252
2796 411252 504715 483861 288570 296590 425733 366822 431394 471485 267820 238665 257483
2785 257483 337078 363223 205593 255417 225150 200393 440260 536956 488470 419340 377621
2774C77621p6170q2583O9617P9663j37745m8372J1235J404J31170P9985l3170
2763C72655o4384m5882O5326j15535L9381Q2552n0710J22815N1919j10326j0601
2752C37210j1372m9251J0697j0029O9427J7493j32087J6101Q1614K6403r099J07209
2740D54316o3216j1765k1587j55345J29741P6974p8498j51869M1619L3379j20585
2729A33164k7516l2430J64434k2731j04867J05692m9347R8703L7468j93857n8865
2718D9848J87182Q4544j55744k8121J19925k7865r1867n8249P7897N6705j00218
2707A14037L7407L0181O9282j4263k5097J28211R299j73256L4017L8134J02444
2696C50396K7636k2834Q665o7980j16230m2048K98116p8546m4120j01292R6856
$$ plain form
2774 377621 301451 218868 288485 368148 230403 182031 193266 194670 325840 405825 372655
2763 372655 308271 262389 327715 212180 251561 334113 283403 406218 458137 347811 337210
2752 337210 325838 276587 287284 277255 346682 364175 232088 248189 329803 356206 347107 454316
2740 454316 391100 379335 357748 202403 332144 409118 330620 178751 220370 253749 133164
2729 133164 105648 73218 237652 214921 110054 215746 166399 265102 302570 108713 49848
2718 49848 237030 321574 165830 137709 257634 229769 137902 79653 157550 214255 114037
2707 114037 151444 181625 250907 236644 211547 339758 349057 175801 209818 247952 350396
2696 350396 378032 355198 363863 295883 179653 137605 435721 357175 313055 211763 308619
2685C08619L345n868R7175j47187k39414j2493J13534J29328L6902J38133p4129
2674C47945k06850j17503J52398J65274l24674k29706N7531K08411M007J11916
2664A68749P1802m7521r7513N3993p7177N7164N4688L3569n5227q1161O9849j56872
2652e657J11338L9194p702K9273q7107o7977O7290l1345M5028n9898J27757O3326
2640B23520j37819M2744r608K5978N6518j00503q8791n990K0799K00430N0793
2629B78071j20859J15307M6204r1571r2996l1374r0940J0450J62611n973p9837
2618I9093R3450N0712l6324N5454j45608p6136J48033K5525m7597M5766q8587
2607A23781J09100j46833j50071J94531P612J4068k31048K8569n6351J3486J85147
$$ plain form
2685 308619 311964 306096 403271 256084 16670 4177 117711 247039 283941 422074 347945
2674 347945 141095 23592 175990 341264 16590 -213116 -155585 52826 56833 168749
2664 168749 240551 193030 95517 149510 72333 129497 184185 217754 162527 81366 151215 -5657
2652 -5657 105681 144875 137173 166446 79339 11362 78652 47307 92335 32437 160194 223520
2640 223520 85701 128445 118837 144815 201333 100830 12039 6049 26848 227278 278071
2629 278071 157212 272519 318723 227152 134156 102782 11842 22292 184903 178930 99093
2618 99093 192543 243255 206931 262385 116777 40641 188674 214199 166602 212368 123781
2607 123781 232881 86048 -64023 130508 138120 152188 -78860 -50291 -106642 -93156 91991
2596I1991K4394J27057l01144L9895O8019r5422k11285K15041O8024N6241J51573
2585B34384l3247j15472n1644J08207J64511M8902P4520J3067j3895j22269j2196
2574B94868K3672j04838N0355P5908o4555M2552n2030q5841J6269q6451J12401
2563B22310J51227k24947j27039J14760L3973O2026q0783j21403j08616M9610
2553b8882J34562j10773K5236J27989j79025R8015j30621R5689R5796l3066O263
2542A01183q7924m2993J36408r102o3010M4112N9781M8589n3472m2127j17932
2531b6487r1535P4860p7128K27533N9717O9238o7971j03769O5937J01942k11864
2520B0473j68178K22235l1547N6877K7191k3784m1432J7098n5560j20232p283
$$ plain form
2596 91991 116385 243442 -57702 -17807 50212 -45210 -256495 -41454 26570 82811 234384
2585 234384 201137 85665 34021 142228 306739 355641 430161 443228 429333 307064 294868
2574 294868 318540 213702 264057 339965 275410 317962 265932 180091 196360 109909 222310
2563 222310 373537 148590 21551 136311 170284 232310 151527 30124 -78492 -28882
2553 -28882 105680 -5093 20143 148132 -30893 67122 -63499 32190 127986 94920 101183
2542 101183 13259 -29734 106674 97572 34562 78674 138455 187044 133572 91445 -26487
2531 -26487 -118022 -43162 -120290 107243 166960 236198 168227 64458 130395 232337 20473
2520 20473 -147705 74530 42983 99860 127051 103267 61835 78933 23373 -96859 -104142
2509a04142J40885o8373J94744O3766j06391k06347Q7283Q4159J33574j9997q6049
2498A13112j4531j49892P9023J1908r3665j8493J81595j1173K6093M270K62220
2487C90467n7523j05067j05426O6239P0758l4768n9466j03095K7915M5740l5507
2476A00267o4588J58322L8928Q6113R559q4670k4253j31001o0837j6850o389J31640
2464A36241r1167Q6886p3869J58056J13400k04395j33939j4572O9235Q723J41814
2453A96413j2099K4798Q4501M7413r5749q8352R0453O9544L1896j35857n2447
2442A60514L3632O9780j3681j51389J8214J8456J23694R0072N8560r3M8047m6621
2430D09185k81026J10726P8527N6122n4030r611K3278O2824r6355K2530m225j37729
$$ plain form
2509 -104142 36743 -31630 163114 226880 120489 -85858 1425 85584 219158 199161 113112
2498 113112 98581 -51311 27712 39620 -54045 -72538 109057 97884 123977 128247 390467
2487 390467 332944 227877 122451 188690 259448 224680 165214 62119 90034 135774 100267
2476 100267 35679 194001 232929 319042 328601 243931 219678 88677 27840 10990 4601 136241
2464 136241 45074 131960 58091 216147 329547 125152 -8787 -23359 45876 54599 196413
2453 196413 184314 209112 293613 341026 245277 156925 247378 316922 348818 212961 160514
2442 160514 194146 263926 250245 98856 117070 135526 259220 349292 407852 407759 455806 409185
2430 409185 128159 238885 317412 373534 319504 309893 333171 395995 299640 322170 317945 180216
2418A80216J33313J56741j90808J9726J40543J6233J65427j00216q2730Q0200
2408E18645O9063N746l7024J15617J03405K5160k22322j41157K31715L2132J9226
2397G20206P2118j98054O4297J71661Q9651P4009q016O096m1354J40914J02742
2386A194270J09199j34829J77114N9402J39500J6074K9209M6265K10365N5912
2376A902481p202K6935j9136k5006L8981L20901N9187n260K72251l8371J0779
2365B536540N8936R1072k6537K56847k22603q1221K4613j7758J07700k6951K2473
2354B723111J2872O731j7132k4618J32082P9844p3183P3940J09374p020l4081
2343B981920J39464R8116L08223m1862J68443J60448J22599K0756J18449n1964
$$ plain form
2418 180216 313529 470270 279462 299188 439731 455964 621391 521175 438445 518645
2408 518645 587708 593454 556430 672047 775452 800612 578290 437133 668848 700980 720206
2397 720206 792324 594270 658567 830228 919879 993888 985872 991968 950614 1091528 1194270
2386 1194270 1303469 1168640 1345754 1405156 1544656 1560730 1589939 1636204 1846569 1902481
2376 1902481 1895279 1922214 1903078 1878072 1917053 2237954 2297141 2291881 2564132 2525761 2536540
2365 2536540 2595476 2686548 2660011 2916858 2694255 2613034 2637647 2619889 2727589 2700638 2723111
2354 2723111 2735983 2742714 2725582 2700964 2833046 2912890 2839707 2913647 3023021 3016001 2981920
2343 2981920 3121384 3219500 3527723 3485861 3654304 3814752 3937351 3958107 4076556 4024592
2333D024592L18433K47956J85550L37565M85464M98189N40176M94765M51285P65285
2323H349260Q41477O24992O78150N63933O43664Q61893J325937J396029J685622
2314A6970957J857825K624618L284144M465198M927481O640339N480677K880482
2306D9131721l188403p627577n794065m225801l161005k747567k139948k441733
2298A7805622j762319j363892j176475r00103q22027j254619r91776r50517p47382
2289G836512o30360o13340m14839n28883m32906k58443k64308l91777k99517j83789
2279C818350j53176j9883l55204j70199j53252K7737j05813j33714k61906j19293
2269B373647k22645L9445M5485j58844j80823j64481l4131j13801o6870K0517
$$ plain form
2333 4024592 4343025 4590981 4776531 5114096 5599560 6097749 6637925 7132690 7583975 8349260
2323 8349260 9190737 9815729 10493879 11057812 11701476 12563369 13889306 15285335 16970957
2314 16970957 18828782 21453400 24737544 29202742 34130223 40770562 46251239 49131721
2306 49131721 45943318 38315741 32521676 28295875 25134870 22387303 20247355 17805622
2298 17805622 16043303 14679411 13502936 12602833 11780806 10526187 9534411 8583894 7836512
2289 7836512 7206152 6592812 6177973 5649090 5216184 4957741 4693433 4301656 4002139 3818350
2279 3818350 3665174 3645291 3290087 3119888 2966636 2994373 2888560 2754846 2492940 2373647
2269 2373647 2151002 2190447 2235932 2077088 1896265 1731784 1697653 1583852 1516982 1537499
2259A537499j52514j15334N6600J1552j00059J06052j28429l8672k24632J13989
2249A066052J35309k41843j32961J54980N2243L5036J2370n4089j65080p6274
2239G85743J9232j98126O1415j14061n1230l1044n2897J21103J20487n7379L3483
2228F36726m066L7904k7270q9699l1836J17735o3085l2736j53819M6504n695j05212
2216C25451M6637N3673M9297j09634k3186O2370j46530N1207P5255O776l3485
2205C57831r5596r4023O2673J67029m4799j30988P2216J16774p6959j15315L8998
2194B57841o170n9246j16804N9921N2928O7989j07964q5497O7741J32871J4086
2183B77696M067L6767o1332J5762m8097J7917j35288l7542r6034J34081J05079
$$ plain form
2259 1537499 1384985 1269651 1326251 1337803 1237744 1343796 1215367 1176695 952063 1066052
2249 1066052 1201361 959518 826557 981537 1033780 1068816 1081186 1027097 862017 785743
2239 785743 804975 606849 668264 554203 502973 471929 419032 540135 660622 603243 636726
2228 636726 632660 670564 643294 553595 521759 639494 576409 543673 389854 436358 430663 325451
2216 325451 372088 425761 475058 365424 342238 404608 258078 309285 384540 391316 357831
2205 357831 262235 168212 230885 397914 353115 222127 294343 411117 334158 218843 257841
2194 257841 251671 192425 75621 135542 188470 256459 148495 62998 130739 263610 277696
2183 277696 281763 318530 257198 272960 224863 242780 107492 69950 -26084 107997 213076
2172B13076j3573O463j4914J1691n4093j12417o0689O0717J94822q2679n6658
2161I1746m3518R158P0202o4229P3315r1733n5549j9386P8273J9802J40551N6692
2149B65324j38587j17262j57J11527p1528k7342J1996J12452l6043r5178O2763
2138G7965M4501o6719j11249M087q9082P5118Q8398m9651q1810K8933L29429j72741
2126G7179r2615J35356k1834j20638k3879q948J2300L3304J45479p7136j54249
2115i5681J81978O5341n1750n1795O9714j72198J86564J27362j05210j50192j61233
2104a57100j56897K46926R033j28944J14627r0614J16627J72606p3981J7946Q7201
2093A57430q779o6033n768j9830o8882m352J3429R9593r8724o9841L7150Q1420
$$ plain form
2172 213076 199503 205966 191052 202743 148650 36233 -24456 36261 231083 148404 91746
2161 91746 48228 57386 127588 63359 136674 44941 -10608 -29994 48279 68081 208632 265324
2149 265324 126737 9475 9318 120845 49317 21975 33971 146423 110380 15202 77965
2138 77965 122466 55747 -55502 -51415 -140497 -65379 23019 -26632 -108442 -79509 249920 77179
2126 77179 -15436 119920 98086 -22552 -46431 -55379 -43079 -9775 135704 58568 -95681
2115 -95681 86297 151638 99888 48093 117807 -54391 132173 259535 154325 4133 -157100
2104 -157100 -313997 -67071 -58038 -186982 -72355 -162969 -46342 126264 52283 70229 157430
2093 157430 148651 82618 76850 57020 -11862 -16214 -2785 96808 -1916 -71757 -34607 46813
2081D6813j19327J41304j8291j44483l036Q2624P8945j53629N4285m1155P1054
2070d896J39471L2937l9425j78784M1625O2859j3245R0084j57694m2604L9969
2059b9703R0832N7510K5305p3223J0314k7476J33284j27724j95708P2753K20264
2048A56428M3753j02431j21312J2399K77487R4214m7038o1836J04929N243l6565
2037C25271N4462j20590q7609Q8574j38697P3905R0267l5129r1293l1045j89098
2026f0982J08951m6569l522J32784k2903l3776n9201j8242O7716k6802n3395K1186
2014E245J64848P0362m4262j40617p8262J6357j5265J49124j8363l5965k3073
2003E0129P0269j1816n5372n5030O8455n2558j75021n4118Q6959k7849L9939J1300
$$ plain form
2081 46813 -72514 68790 50499 -93984 -97020 -14396 64549 -89080 -34795 -75950 -4896
2070 -4896 134575 167512 128087 -50697 -9072 53787 40542 130626 -27068 -69672 -29703
2059 -29703 61129 118639 143944 70721 81035 53559 186843 59119 -136589 -63836 156428
2048 156428 200181 97750 -23562 -11163 266324 360538 313500 251664 356593 361836 325271
2037 325271 379733 259143 171534 260108 121411 195316 285583 250454 159161 128116 -60982
2026 -60982 47969 1400 -2122 130662 107759 73983 14782 -3460 64256 37454 -15941 5245
2014 5245 170093 240455 196193 55576 -22686 -6329 -21594 127530 109167 73202 50129
2003 50129 120398 108582 53210 -1820 66635 14077 -160944 -215062 -128103 -155952 -116013 -104713
1991a04713n1583P5375J74459m1857j61610N9757K9563M8515o7554o350P1503
1980B5505r1128J19915J39746j14446p7563Q1308P9204R2460N7379k12115j01282
1969a017q8810Q4289J9196R00r7342K3951L8786K08072j08776k39768Q0497M1845
1957c8177j0585M9167Q597M616l9119L5694n461K5575L010n2958l0843O2122O5332
1944G6970l6559J3604l7839o0346l5352k4183J5653J04803q6949j10581J92954
1933A2175J13631p8819Q5658p949j94048r9082K57064J1223k10654L2877l4306
1922a12230Q960Q321k7940J5150R0374j70145k0312J73635k643M2240j46609J39570
1910a629J04827p2564j60284J39010P4260L273j61817k5891r9510j03499n8793
$$ plain form
1991 -104713 -156296 -80921 93538 51681 -109929 -50172 -20609 27906 -39648 -45998 25505
1980 25505 -65623 54292 194038 79592 2029 83337 162541 255001 312380 100265 -1017
1969 -1017 -89827 -5538 13658 14558 -82784 -58833 -20047 188025 79249 -160519 -80022 -38177
1957 -38177 -48762 405 9002 13618 -25501 10193 4732 30307 33317 -19641 -50484 11638 76970
1944 76970 40411 54015 16176 -44170 -79522 -103705 -88052 16751 -70198 -180779 12175
1933 12175 125806 46987 132645 124696 -69352 -168434 88630 99853 -110801 -77924 -112230
1922 -112230 -103270 -94949 -122889 -107739 -17365 -187510 -207822 -34187 -36830 5410 -141199 -1629
1910 -1629 103198 30634 -129650 9360 83620 86893 -74924 -100815 -200325 -303824 -362617
1899c62617J63043K42210R8178j77666O7376L1075o2115J22987j34033j50605
1889a62167j62968j8547J73251Q5272J11727j5841q4568M6518p6907k4689N4053
1878g4866J27252l3132J3216P3691q1561n1065j10408Q459O0670J74461n7088
1867D9629k4200l4823k4500N5247J5134Q1578j45432O4999k846l4974O1421j55592
1855i4359j50722k2321j7088K10935J06228M930j1507r2671J33232J05459j43407
1844B8709j69742L0923J55775O6501j08300m8849n1633Q8037O6075L6554j460
1833I2590J05590j61491r4459N4989n0849L5156Q1263L0388n2645k4643j43300
1822a27411J39096J0120N1494m7030n382p552j09276Q7399l2888j18427J78479
$$ plain form
1899 -362617 -199574 42636 140814 -36852 30524 61599 -516 122471 -11562 -162167
1889 -162167 -325135 -343682 -170431 -85159 26568 10727 -73841 -27323 -104230 -128919 -74866
1878 -74866 52386 19254 32470 106161 24600 -26465 -136873 -128414 -67744 106717 49629
1867 49629 25429 -9394 -33894 21353 36487 118065 -27367 37632 34786 -188 61233 -94359
1855 -94359 -245081 -267402 -284490 -73555 32673 37603 26096 -66575 66657 172116 28709
1844 28709 -141033 -110110 45665 112166 3866 -44983 -96616 -8579 57496 94050 92590
1833 92590 198180 36689 -57770 -2781 -53630 -18474 62789 93177 40532 15889 -127411
1822 -127411 11685 21805 73299 26269 20887 13335 -95941 -8542 -41430 -159857 18622
1811A8622j9421Q6660j71892R0198J5329n7213K16974M6375j95485N299Q0404
1800A15850j40471K0255O3088P2216j4689j76361m572P4283K9927k26816O410
1789a80880J11735Q0249M9933k17604J5998N3280j28008j08225K63534P7106M5404
1778F2522j09632K1850N7568q0596O7636L2228l5478n6686o1608J7593J09372
1767B4769L8366M8086n473o5575m6323j53633n7584L6738R3883l018M0996l7127
1755h5895n7324N9779J3104J79075k0684j0565R1994p5552k19141n7489J2533
1744a70165Q2929J85917M591o0599j68672j47628J02787M7207N9238N5694o9207
1733g7908n2907P2640J21360j5027R3819p4771r2402J09635j37948j6250K7496
$$ plain form
1811 18622 -799 85861 -86031 4167 19496 -37717 179257 225632 30147 35446 115850
1800 115850 -24621 -4366 58722 130938 116249 -60112 -64684 9599 39526 -187290 -180880
1789 -180880 -69145 11104 61037 -156567 -140569 -87289 -215297 -323522 -59988 17118 62522
1778 62522 -47110 -25260 32308 -48288 19348 51576 16098 -40588 -102196 -84603 24769
1767 24769 63135 111221 105748 40173 -6150 -159783 -217367 -180629 -86746 -89764 -48768 -85895
1755 -85895 -143219 -83440 -70336 108739 88055 77490 169484 93932 -125209 -182698 -170165
1744 -170165 -87236 98681 103272 42673 -125999 -273627 -170840 -123633 -64395 -8701 -77908
1733 -77908 -130815 -58175 63185 48158 141977 67206 -25196 84439 -53509 -69759 -42263
1722d2263j40012R8930l9543M2814L9127L3340K11537j25751L0111k3002j01647
1711a6359j58999J53994J43499K1414j62580j5173O6431m5853j02254O5136P8006
1700B7262N1897O6180m699p1838r2288K839k9300L977n1092Q3538l5271N7861
1688I066q2910Q6306q9246n0926J65819L8009J39347m0199p1965j75632r9691
1677a72022J57318o058M1367K1131k4567p1979m7888j31137k4930K64072N3505
1666E8812k03000R4009O0918R7603q470j44093j02844l008R6427P6186q0976M7553
1654a0883m6820j1058r934M3487n0059N1974j7444r3480Q9965K10879p7489k47871
1642a68733O5525p0927r8596J63004Q7824L7156j23550K1994K6072P3502N5397
$$ plain form
1722 -42263 -182275 -83345 -122888 -80074 -40947 -7607 203930 78179 108290 85288 -16359
1711 -16359 -175358 -21364 122135 143549 -19031 -34204 32227 -13626 -115880 -50744 27262
1700 27262 79159 145339 140640 68802 -23486 -20647 -49947 -45970 -97062 -13524 -48795 9066
1688 9066 -73844 12462 -76784 -127710 38109 76118 215465 175266 103301 -72331 -172022
1677 -172022 -14704 -20762 20605 41736 17169 -54810 -102698 -233835 -258765 5307 58812
1666 58812 -144188 -50179 10739 108342 99872 -44221 -147065 -150073 -53646 22540 -58436 -10883
1654 -10883 -57703 -68761 -78695 -35208 -85267 -33293 -50737 -144217 -54252 156627 79138 -168733
1642 -168733 -103208 -174135 -272731 -109727 -21903 15253 -108297 -86303 -60231 13271 68668
1631F8668q5489j94312K0821J79910m3077n7893L5217N2022j57180P2035j05658
1620b14936K7136J7675J30913M0363j36313L2721L9261J77035Q825j06875j25611
1609a09806k7014M6550k0761J05837P8041K5060q3337j15659r58l8356J47728
1598G325l6670j01565k5565L8750M3525j4173R239N0730j9251L208J69219j19640
1586E132J50997M9856r6410l19216N9057J49981r3678J56957o4795q6002J4711
1575g3410r0744K7466J7609J14513l329O7504P3995j22152j64598p9973J19602
1564a13517k6509n0099R3478J9015q644o5988l9632q8727l9085O0670r365j619
1552b70022J73202M1032l3588J38969k8281j69752j3075J43967M5058k14531K6508
$$ plain form
1631 68668 -16821 -211133 -190312 -10402 -53479 -111372 -76155 -24133 -181313 -109278 -214936
1620 -214936 -187800 -170125 -39212 1151 -135162 -102441 -63180 113855 122680 15805 -109806
1609 -109806 -136820 -90270 -111031 -5194 72847 97907 14570 -101089 -102047 -140403 7325
1598 7325 -29345 -130910 -156475 -117725 -74200 -88373 -79134 -28404 -47655 -44447 124772 5132
1586 5132 156129 205985 109575 -209641 -150584 -603 -94281 62676 -2119 -88121 -73410
1575 -73410 -164154 -136688 -119079 -4566 -7895 59609 133604 11452 -153146 -233119 -113517
1564 -113517 -140026 -190125 -96647 -77632 -86276 -152264 -191896 -280623 -319708 -259038 -268403 -270022
1552 -270022 -96820 -55788 -89376 49593 21312 -148440 -161515 -17548 27510 -187021 -160513
1541a60513P9380J17982M0518n1315J26808q502k75576k5207p732l1636J02465
1530i3328J55864m859K5800j18293m5300O0759o8264p0177j70812N0748J38879
1519a38983o631O2860j39999k8160J28280q4083j606Q5871K020n1760n0101O2221
1507a60071R7682l0301r955l5209O4443J76993P760j74837r5467j13874P918J81686
1495h3232O192P344L5268j62289p41K6993L8791m2007p1613L4907M6249N3955
1483a10183R2315P650l416q3605K22162J43953l6374k31141j27742N8519l0440
1472i8302l9860L953K8403J43943J5275j35896K4090M37L8261j16473J5514J39065
1460A8410p7209j16123J6719k4120J42651J88522j41806L2426j6157j19965K0132
$$ plain form
1541 -160513 -81133 36849 77367 26052 152860 144358 -131218 -156425 -164157 -195793 -93328
1530 -93328 62536 57677 83477 -34816 -80116 -19357 -87621 -157798 -328610 -277862 -138983
1519 -138983 -145614 -82754 -222753 -250913 -122633 -206716 -208322 -122451 -120431 -172191 -222292 -160071
1507 -160071 -62389 -92690 -102645 -137854 -73411 103582 111342 -63495 -158962 -272836 -264918 -83232
1495 -83232 -77040 -69696 -34428 -196717 -197458 -170465 -131674 -173681 -245294 -210387 -164138 -110183
1483 -110183 -17868 -10218 -13634 -97239 124923 268876 232502 1361 -126381 -67862 -98302
1472 -98302 -138162 -134209 -105806 38137 53412 -82484 -58394 -57957 -19696 -136169 -120655 18410
1460 18410 -58799 -174922 -158203 -182323 -39672 148850 7044 39470 23313 -96652 -76520
1449g6520M7623N9777p7918r6774r5906l3095J08048J3871J08959M9646l3840
1438b6129j3827J28046l7354j94386n7907J78361R1846j02393j41764l2023j91048
1427c98578J76921p6954J07351K76136L5459j31606l6958q5440J12337R7690m9055
1416B7303k5185j67141M9122n1677J64384K3981r9283J0342R940j79347L0523
1405b07038J12525p5665K2889p1899J1915O1201M8223J26677l5565q7729J03832
1394I366j04231J13206o1015O5503j58352m5665J86380L0022J23060j19417k7622
1383A1235j45283p9323J78872P6470j21410m039J7616J95000k20556J8712J3362
1372e9344k8980j30747J06024J90419J4255o6330j19256n2808l9123r082L6991
$$ plain form
1449 -76520 -28897 30880 -47038 -143812 -239718 -272813 -164765 -150894 -41935 7711 -26129
1438 -26129 -39956 88090 50736 -143650 -201557 -23196 68650 -33743 -175507 -207530 -398578
1427 -398578 -221657 -298611 -191260 84876 120335 -11271 -48229 -133669 -21332 76358 27303
1416 27303 2118 -165023 -115901 -167578 -3194 20787 -78496 -68154 -58214 -237561 -207038
1405 -207038 -94513 -170178 -147289 -219188 -207273 -146072 -97849 28828 -6737 -94466 9366
1394 9366 -94865 18341 -42674 22829 -135523 -181188 5192 35214 158274 38857 11235
1383 11235 -134048 -213371 -34499 41971 -79439 -83478 -65862 129138 -91418 -72706 -59344
1372 -59344 -88324 -219071 -113047 77372 91627 25297 -93959 -146767 -185890 -194972 -157981
1361a57981j00320J73931l4766n7294P4110m6000K18681j03929k33024K5736J44180
1350i6676O6802J07638k522R772p7479p0812M7874P9866j33930l4708J94961l6263
1338E4523M0653j0156j1560r048J6209j78760k4523R3233L2128m8896q6298j27056
1326b59551N5366J39369O2700N3036N3263J804R5369j83497M4694n8343j29740
1315a25530j14907J2663m1934Q4650J16769L1527j1601K08849m5821o2755N9024
1304A10934j42036m8580P4160p9123j6425J78065l7956l7385j24307P4188J42149
1293I3684j15041j89570R8038R2000J32084l4956o9752r4079l4434P2242m6060
1282i5844R5579j5001M80K4820m1535J21184j18631q2358m8502Q8195J30129m9070
$$ plain form
1361 -157981 -258301 -84370 -119136 -176430 -102320 -148320 70361 -33568 -266592 -240856 -96676
1350 -96676 -29874 77764 75242 85014 7535 -63277 -15403 64463 -69467 -104175 90786 54523
1338 54523 95176 85020 73460 64412 80621 -98139 -122662 -29429 2699 -46197 -132495 -259551
1326 -259551 -204185 -64816 -2116 50920 104183 105987 201356 17859 62553 4210 -125530
1315 -125530 -240437 -227774 -269708 -185058 -68289 -36762 -48363 160486 114665 51910 110934
1304 110934 -31102 -79682 -5522 -84645 -101070 76995 39039 1654 -122653 -48465 93684
1293 93684 -21357 -210927 -112889 -20889 111195 76239 6487 -87592 -122026 -49784 -95844
1282 -95844 -265 -15266 -14786 10034 -31501 89683 -28948 -111306 -159808 -71613 58516 9446
1270I446j4129k1032K5896O8226k8277K7080j45456J11129j1790O1861L4438l9437
1258G7955p8337L0629N9094j96203j6004j0879p0465Q9940M391q596P7762P5504
1246C4791p9212R2072k3960j6922r8400J24276J24360N1958j70475M6826k6615
1235E8699l6847q9279k7912Q5660M2088n2040n3713J56451R0496o9677j78944
1224g5018q6437J97113J0352q1015P6203j3437k1351j9428j16481j4289Q4779
1213e9009K6915O888J97122j28240j88947p6476J17983R3366j692M970r0620P9118
1201a8622j55390O0566m2928J33920M5179r6600M8919j1332J37650N4323J6771
1190A72456k07366k2974n3683O5169J32752k0796o8924L5037M3488j10071l7275
$$ plain form
1270 9446 -4683 -25715 181 68407 40130 67210 -78246 32883 21093 82954 117392 77955
1258 77955 -382 30247 89341 -106862 -122866 -133745 -204210 -114270 -109879 -118475 -40713 34791
1246 34791 -44421 47651 23691 6769 -91631 32645 157005 208963 38488 85314 58699
1235 58699 21852 -67427 -95339 -9679 32409 -19631 -73344 83107 173603 103926 -75018
1224 -75018 -161455 35658 46010 -35005 41198 27761 6410 -13018 -129499 -143788 -59009
1213 -59009 -32094 -25206 171916 43676 -145271 -221747 -103764 -10398 -12090 -7120 -97740 -18622
1201 -18622 -174012 -113446 -156374 -22454 22725 -73875 -24956 -36288 101362 155685 172456
1190 172456 -34910 -57884 -111567 -46398 86354 65558 -3366 31671 75159 -34912 -72187
1179g2187q8558R1687J76240J30573k96388K1828L5940J75184k24129j77736K31866
1168D320n1379J09712m3081j96809J7754l6334K13501j17374o5556M9589o0584
1157a76241J81921L7017m2574P0814p0969n3698O0146J77393j49457J45711m4648
1146A35415r7872m4773q0384p8718R0040j7924J6119k7399K9695n3676J30287
1135H10l6097Q2826r404J2407P1240j90424l7670M1566R3924L8660m5303O2329
1123H4864N5560k03200Q0204n0921J8564J04417M7696j30934m0021r2942r059
1112a35772M9223J40420P0705n2959o7412J9812N6276L0507k5544J17753m2830
1101A60179j67984R8869q2173j565Q8182j17964O2145J05110L9629j37495n3498
$$ plain form
1179 -72187 -160745 -69058 107182 237755 -58633 -36805 -865 174319 -49810 -227546 4320
1168 4320 -47059 62653 19572 -177237 -159483 -195817 17684 -99690 -165246 -115657 -176241
1157 -176241 5680 42697 123 70937 -32 -53730 6416 183809 34352 180063 135415
1146 135415 37543 -7230 -87614 -166332 -76292 -94216 -78097 -105496 -75801 -129477 810
1135 810 -35287 47539 38135 50542 121782 -68642 -106312 -64746 29178 67838 22535 84864
1123 84864 140424 -62776 17428 -33493 -14929 89488 137184 6250 -33771 -126713 -135772
1112 -135772 -86549 53871 124576 71617 4205 24017 80293 110800 85256 203009 160179
1101 160179 -7805 91064 8891 7326 95508 -22456 39689 144799 184428 46933 -6565
1090f565j86412P8751K08833k6782j85028O3624N2305R0802O0901k7974q7251
1079C5204p1837K8502P2097j25698q875K01091q8221j8697j10894O7311P3345
1068E3328r4083q7446R9297J00828j1481j3485J12961l5432j66149L1448P6445
1057F6231Q6099l0360k0811j15740L2374l9722L8234j7952j98326J19514m814
1046h5273Q4274k4795p3478P8952q383J67282j29429L3004N2689r0836j48634
1035a44627q0757K24291p405j10616N7719l9852J03749R181J1539J0746j06444
1024g2476M4782M1459K7505m9644M6974K9732L5142p4707j84378O2380N8621J46269
1012A11659J44201j57992j5766j20649p5315P4078P9692K6368k25159O2824K12318
$$ plain form
1090 -6565 -192977 -114226 94607 67825 -117203 -53579 -1274 89528 150429 122455 35204
1079 35204 -36633 -8131 63966 -61732 -70607 130484 42263 23566 -87328 -20017 53328
1068 53328 -40755 -128201 -28904 71924 60443 46958 159919 124487 -41662 -10214 66231
1057 66231 152330 121970 101159 -14581 17793 -21929 16305 -1647 -199973 -80459 -85273
1046 -85273 -999 -25794 -99272 -20320 -28703 138579 9150 42154 94843 4007 -144627
1035 -144627 -225384 -1093 -8498 -119114 -61395 -101247 2502 11683 23222 33968 -72476
1024 -72476 -27694 13765 41270 -8374 38600 68332 103474 28767 -155611 -93231 -34610 111659
1012 111659 255860 97868 82102 -38547 -113862 -39784 39908 66276 -158883 -96059 116259
1001A16259P2409k24658m6130J15129q9596j33949J36530p2590L9929J60875j03473
990b9265n304n0109N3160O2359Q0770K7754M0291j04162O7818j40298j18563J12761
978b788J29110p1333j1698j01429N93L8058M7337o0634j1322J42049N8070J5071
966A71084l9348K9284J3153O075j34980j03853P6176J43730K0408O6546k83448
955c5173J4738K79086j86456j70558P0959J7938m5548K5771j55418l1118j8871
944b34650P3409Q9517n4611J04125N1294n1439p9743j19814L763J40446J0622
933f7081K2505J55097l716r3624m025j10414J0666j1487J51383l3609j0740m0164
921c5209r2512M2024J77907p0542j85846n7987J62632M0050j5819K1385n2884
$$ plain form
1001 116259 188668 -35990 -82120 33009 -56587 -190536 -54006 -126596 -86667 74208 -29265
990 -29265 -34569 -84678 -31518 30841 111611 139365 179656 75494 143312 3014 -115549 -2788
978 -2788 126322 54989 43291 -58138 -57545 -19487 27850 -32784 -44106 97943 156013 171084
966 171084 131736 161020 174173 180248 45268 -58585 17591 161321 181729 248275 -35173
955 -35173 -20435 258651 72195 -98363 -27404 -9466 -55014 -29243 -184661 -215779 -234650
944 -234650 -161241 -71724 -126335 -22210 29084 -22355 -102098 -221912 -218149 -77703 -67081
933 -67081 -44576 110521 106805 13181 9156 -101258 -90592 -102079 49304 15695 4955 -35209
921 -35209 -127721 -85697 92210 21668 -164178 -222165 -59533 -19483 -35302 -13917 -66801
910f6801J11531J4141m3865j15715j11898J25884J53093K1830o4334p2065J27694
899G9495K9300K228o8901O8077l5105O9322r80j57854M9005l7423O0103o9696
887a2429p2106Q8585M0608q9139J18716J42634n3736k5768p5497l8866M0062n6122
875F942k22987l7286N4846N1567m1808J59574n8095J0198K4498n7329l8624Q8362
863f0142O6959k1267N472n3099r5801K6920p9325M9159n0702J39043R2218K0887
851D0322J10686K2470M8817j72904q1616J35552j51045P2116j40734J5374J81172
840H0210m9680n6582p694j11925N2611K08676p1092o6835Q2299j6244k2227j58969
828a37452k13367J17482Q4851j8271L9610R8325J26623J33219j03473O7482j23515
$$ plain form
910 -66801 44730 58871 15006 -100709 -212607 -86723 66370 88200 23866 -48199 79495
899 79495 108795 111023 42122 110199 75094 144416 143436 -14418 34587 -2836 57267 -12429
887 -12429 -84535 4050 44658 -44481 74235 216869 163133 137365 61868 23002 63064 6942
875 6942 -216045 -253331 -198485 -146918 -188726 -29152 -87247 -77049 -52551 -109880 -148504 -60142
863 -60142 6817 -14450 -8978 -62077 -157878 -130958 -210283 -161124 -211826 -72783 19435 40322
851 40322 151008 173478 222295 49391 -32225 103327 -47718 24398 -116336 -100962 80210
840 80210 30530 -26052 -33746 -145671 -93060 115616 44524 -22311 59988 43744 21517 -137452
828 -137452 -350819 -233337 -148486 -166757 -127147 -28822 97801 231020 127547 195029 71514
817G1514m3910Q0961K4056M2735M2229j22546O31J6259K5615j51175J8787L2306
805C7462J09465O0824q4036q012K0320J6847j42182o8433K1298j74414Q2754M9403
793g8704o2448n9478J41633J5424J15317l1091O3922J18007l3498r3496N5846
782A51434j25443K7495j22137O5890R8075p8303n9790K0329r5959M1537K2860
771e4012p2528J8805M3227O5709j47023L9004k1525J63804j92875L9672K09767
760I2025P7219j36688j47898R9676R878Q4431R3784o3178J7610q4300k9462j13625
748a00528j43969P4628K86738J73559k39588K4880L692k56298J04334P3103l0452
737b9901k8362K87449k36156k10027M4531N9730R9246j30516n177P2168k0457
$$ plain form
817 71514 27604 108565 132621 175356 217585 95039 95670 111929 137544 -13631 5156 37462
805 37462 146927 207751 123715 115703 136023 152870 10688 -57745 -36447 -210861 -128107 -78704
793 -78704 -141152 -200630 -58997 -43573 71744 40653 104575 222582 189084 95588 151434
782 151434 25991 53486 -68651 -2761 95314 17011 -42779 -22450 -118409 -76872 -54012
771 -54012 -126540 -107735 -64508 1201 -145822 -106818 -128343 35461 -157414 -117742 92025
760 92025 169244 32556 -115342 -15666 -5788 78643 172427 109249 126859 42559 13097 -100528
748 -100528 -244497 -169869 116869 290428 50840 75720 79412 -176886 -72552 551 -29901
737 -29901 -58263 229186 -6970 -216997 -172466 -112736 -13490 -144006 -149183 -77015 -97472
726i7472m385J71940r026Q3228N5273r3547j840k3366l6102j3467L2265q7778
714b4277J72946l8050k8219J04k5593O5238j80263N3126K12893J5056P5499n3112
702B45348k41687j444J31155p2450N7422j43975J09164O9476r1159l0368j75451
691a43969q3680Q4880N2720P1053M8618R8569o7242q3337N8220j77815M6350l7799
679a33432J804O3952J99037J9624n5185j70710K82038o4973M8890K8993k73892
668e3854n6501K8584o9823N444k2829P8054J57742l1449j6241r6282k6343k281
656a05779J43375p6747l2387P0597R3365L2488K7449j77014N1870j2897R950N658
644B9928K7330j67286J7583k6224J18908r2791j14130J50125Q2056k07408Q2005
$$ plain form
726 -97472 -101857 70083 61057 144285 199558 106011 104171 80805 44703 31236 63501 -24277
714 -24277 148669 110619 82400 82504 56911 122149 -58114 -4988 207905 222961 298460 245348
702 245348 3661 2217 133372 60922 118344 -25631 83533 153009 61850 31482 -143969
691 -143969 -227649 -142769 -90049 -18996 29622 128191 60949 -22388 35832 -141983 -95633 -133432
679 -133432 -131628 -67676 131361 150985 95800 -74910 207128 142155 191045 220038 -53854
668 -53854 -110355 -81771 -151594 -146150 -168979 -90925 66817 35368 19127 -77155 -103498 -105779
656 -105779 37596 -39151 -71538 -941 92424 124912 152361 -24653 27217 14320 24270 29928
644 29928 57258 -110028 -92445 -118669 239 -92552 -206682 -56557 25499 -181909 -99904
633i9904L44182j32523o3412J4297j6839j22066p4831l9335L0954O0204O7865
622c1408j1645n9307J71847J66132k15244K0323J02152r5572P7761M3002j57890
611A0151j0234O0628Q073j6804m4857l8949K13209r2750j19008j5679J90294j07990
599C6084J4745P0210j44898l1579N1408N1506n3676O7320N8838l4165k561j858
587H1374k8418o767j9518m8410j09342r590J29471J61214R3500r9441j34430R9847
575A09490m1588q3158Q0191j7148K4619r6243j2968J99516j35550j19797O5558
564b7078P8047R8758k9841p2569k0967j13552J4064L394J6687j6303o0408j14575
552b44343K0131K07195p888J19936K2882j281j65947R79j46933m8153J38332J94234
$$ plain form
633 -99904 244278 111755 48343 62640 45801 -76265 -151096 -190431 -159477 -99273 -31408
622 -31408 -43053 -102360 69487 235619 20375 40698 142850 47278 125039 168041 10151
611 10151 -83 60545 68618 51814 6957 -31992 181217 88467 -30541 -46220 144074 36084
599 36084 50829 121039 -23859 -55438 -4030 47476 -6200 61120 119958 85793 83232 81374
587 81374 52956 46189 26671 -21739 -131081 -140671 -11200 150014 243514 144073 9643 109490
575 109490 67902 -15256 64935 47787 72406 -23837 -36805 162711 27161 -92636 -27078
564 -27078 50969 149727 119886 47317 26350 -87202 -73138 -69744 -53057 -69360 -129768 -244343
552 -244343 -224212 -17017 -24905 95031 117913 116632 -49315 -48336 -195269 -243422 -105090 89144
540H9144j65029L7787j10904K3084K89786L4061j12767k18085k0992J07082M1125
529e708M6390J59441k08220j40447N0732J15051L6320j00828j20594K27099q1091
518b1855O2940M0539M0290p9855L4316m7400J9573J60659j46579k05068J50775
507H335J01140M3062j09931j19677j4168J7993J76493r1605M8772l8196m5808
496b3590J26911N6218j51276o3861J39994j1725l5756J45270j09756j19475J22974
485G5928p5158P7005j0804o3767Q320N78j27964p701J08996j21625O8576J31453
473F3837J34479n0318J7400n6168j03736j39461K01646R0900q446L7810j33405
462E4538n8856m9658m6467J36879J61963n8293L3814j05717P1358J9574j73751
$$ plain form
540 89144 -75885 -38098 -149002 -125918 163868 197929 85162 -132923 -153915 -46833 -5708
529 -5708 40682 200123 -8097 -148544 -97812 17239 53559 -47269 -167863 59236 -21855
518 -21855 41085 81624 121914 42059 76375 28975 48548 209207 62628 -142440 8335
507 8335 109475 152537 42606 -77071 -91239 -73246 103247 11642 60414 22218 -23590
496 -23590 103321 159539 8263 -55598 84396 72671 36915 182185 72429 -47046 75928
485 75928 770 77775 66971 3204 11524 12102 -115862 -123563 -14567 -136192 -67616 63837
473 63837 198316 147998 165398 109230 5494 -133967 67679 158579 150133 187943 54538
462 54538 -4318 -53976 -100443 36436 198399 140106 173920 68203 139561 159135 -14616
451a4616J7576N0660P9603L2594o5966J1461J58543p9177j44901j27552o0589
440a42364J50179J176j17080j3383K1629J18232J65522l7530j5141k69023M4380
429i3403Q0958j03664Q5372J34153j7045M2826l9467r7598M2031J3933j17289
418f9193O8930R1191L3813K5961j30050p539O0713n1471J52409Q573j39455K6658
406G0540N8193J50865k5060r3143j11522j90K1647m0260k6943M9117Q9766j4859
394A28151r2776J47758J10087j65701o1795N5635Q9337p1869j34263P098k0275
383h613O6563P6128J89426J10522j73477r7918j48957R5902O3610R5903J4178
372B83267k97179o6443j32130K67600Q1941j62046k6725Q563p2701M6358J19098
$$ plain form
451 -14616 2960 53620 133223 165817 99851 111312 269855 190678 45777 -81775 -142364
440 -142364 7815 8991 -108089 -121472 -99843 18389 183911 146381 131240 -137783 -93403
429 -93403 -12445 -116109 -30737 103416 86371 129197 89730 -7868 34163 48096 -69193
418 -69193 -263 90928 124741 150702 20652 13113 73826 22355 174764 183337 43882 70540
406 70540 128733 279598 254538 161395 49873 49683 71330 31070 4127 53244 143010 128151
394 128151 35375 183133 293220 127519 65724 121359 210696 138827 4564 11662 -8613
383 -8613 57950 134078 323504 434026 260549 162631 13674 109576 173186 269089 283267
372 283267 -13912 -80355 -212485 55115 137056 -24990 -51715 -43152 -115853 -69495 49603
361D9603p9424o9309n2072M7127J07658O3909M0082N829K3869K9932j23062o7059
349b2917K9559J82479k5835l8937Q20R3356R7171j37279p5939J10448k4658N9768
337B48036O0055l02989J5742J33396L4034O0156q0578n2864R506J08599L0386
326B63479j31161j8055l0112M686M0810q752L3644J33689q9782p4571O106m7179
314H2802j05680J81590l3487j28107K09062Q0153j11353q8060j24146J7905J41043
303A21722l0733p3720O9307J48517Q599P253k0826j0911O9877j14493J02402q4659
291A92335N5675k1282k29164J07848R0231j7414p7211j2335P0332p0132J2734
280A01617j4093K819n9839N3484L3267J58525q8070j77312j1627r2412J9696p7328
$$ plain form
361 49603 -29821 -99130 -151202 -104075 3583 67492 107574 113403 137272 167204 44142 -22917
349 -22917 6642 189121 163286 124349 125169 218525 315696 178417 102478 212926 188268 248036
337 248036 308091 5102 20844 154240 188274 248430 167852 114988 124494 233093 263479
326 263479 132318 114263 84151 88837 129647 120895 154539 288228 198446 123875 129981 82802
314 82802 -22878 158712 125225 -2882 206180 286333 174980 86920 -37226 -19321 121722
303 121722 90989 17269 86576 235093 243692 250945 230119 219208 289085 174592 276994 192335
291 192335 248010 226728 -2436 105412 195643 178229 101018 88683 159015 88883 101617
280 101617 87524 90343 30504 83988 117255 275780 187710 10398 -1229 -93641 -73945 -151273
268a51273K49546M8872k6719l8121m9710J01643n0047j85676P8970k9103J23716
257G2098M8846n3511l7943P4546N6942L5260L6788j90617K7839O0881N500J18421
245B55050j00001j9608O8493J230j76070L9203o257p8576M2428p9634j46326J23544
233g6524K60795l3382j81333N5278J0164J15836L6255j81346o3920J03827J5467
222F1117m6485R7988J2866O6443N9945M2727r6455j17440J64950j06725K1592
211A60523j3783m1479o8143k1501O6853J1728K01843P0849k47074j67090J18695
200G1421m5617m1634N1276M3457o2812J6574Q6102J4082l2565K44166j09863j27837
188A06750M504L7269J30319R7571k1788k24024k7746J20607k3864j98697J55918
$$ plain form
268 -151273 98273 147145 120426 82305 32595 134238 84191 -101485 -22515 -51618 72098
257 72098 120944 67433 29490 104036 160978 196238 233026 42409 70248 131129 136629 255050
245 255050 155049 135441 203934 205164 29094 68297 62040 -16536 25892 -53742 -200068 -76524
233 -76524 184271 150889 -30444 24834 34998 150834 187089 5743 -58177 45650 61117
222 61117 14632 112620 125486 191929 251874 294601 198146 80706 245656 138931 160523
211 160523 146740 105261 37118 15617 82470 94198 296041 366890 119816 -47274 71421
200 71421 25804 -15830 35446 78903 16091 32665 118767 132849 100284 344450 234587 106750
188 106750 111254 148523 278842 376413 354625 130601 102855 223462 199598 901 156819
177A56819P826m093L2590l2795M0394n0936l0563O828P9291J34285k231q5881
165B51534r0266r5206J22320L4041r3891j78714k0816P3633J17659j03636L4915
154E1573O3728N1070N2973n7470m7330L808L4726J9032j02302q360j00062N627
142c2987N9983j11486Q2351Q889q7877O5925M9885Q934j7347J04447N9771n4839
130A35649O1280P4521n8451j52592N8195J40652N663m7681q8010K3704m4242O5682
118A74370K3685O6868Q2057j45199K445j01598L1555j9806m2922J38108L8925
107B48488p1749m9044n9276P0533J7781n403q2135R0165R224k4164O9788q0880
95A33328o5142O9310k2859j10175N6521n1030J4646Q2950O9778j43687m3577K2494
$$ plain form
177 156819 164645 160552 193142 160347 200741 149805 119242 126070 205361 339646 337415 251534
165 251534 161268 66062 188382 222423 128532 -50182 -70998 2635 120294 16658 51573
154 51573 115301 166371 219344 161874 114544 118352 153078 172110 69808 61448 -38614 -32987
142 -32987 26996 -84490 -2139 6750 -81127 -15202 34683 43617 26270 130717 190488 135649
130 135649 196929 271450 212999 60407 118602 259254 264917 217236 129226 152930 108688 174370
118 174370 198055 264923 346980 201781 204226 102628 134183 114377 71455 209563 248488
107 248488 176739 127695 68419 138952 156733 151330 69195 159360 168584 144420 214208 133328
95 133328 68186 137496 114637 4462 60983 9953 24599 107549 177327 33640 -9937 12557
83A2557L8751Q0504k725m2380l8918K9965k1195J37173p5198n1594q2525M2666
71B7081R5096j15500M465Q8410k3835l160P0221L9042O1094L799M3457l2239j07089
58A50842Q005J18956k07201o9236J23115l519r6307M8061P3632L721o3666J1148
46I7551J11863m9383j0832o4490p5091J52967J51384n4309q7762j20247R8939
35A50590J9681k2451R249l8502m8412l062j4575L2946k3497k8565M8022M6147
23A27571N4912K2534m4749k0177L2064J8801k183k6304K0672q459m624k0564r5427
10E4067L4450L1851p8264k592L2786L8651k3729J10239j550q8252
0A07657
$$ plain form
83 12557 51308 131812 129087 86707 47789 77754 56559 193732 118534 66940 -15585 27081
71 27081 122177 6677 11142 99552 75717 72557 142778 181820 242914 246713 290170 257931 150842
58 150842 158847 277803 70602 1366 124481 120962 24655 72716 146348 150069 86403 97551
46 97551 209414 160031 149199 84709 9618 162585 313969 259660 171898 51651 150590
35 150590 170271 147820 157069 118567 70155 67093 52518 85464 61967 33402 81424 127571
23 127571 182483 205017 160268 140091 172155 190956 188773 162469 183141 174682 170058 149494 54067
10 54067 88517 120368 42104 39512 72298 110949 87220 197459 195909 107657
0 107657
$$ Imaginary data points
##PAGE= N=2
##DATA TABLE= (X++(I..I)), XYDATA
16383a460511P7961j52368L6408J69226q2075M310Q1230J1989J15415J57162m6430
16372a087683j13254k1494J6932O1326j9230n455N1214L1741r045J25350J8060
16361i51538R2447J17596j9920j18105k219P2931P5789q165m3389O2933J3624
16350g08016m090O0951n4171N477J9960L2132J1859k3210J30491J5436L7872M1101
16338d34208j5338j07061M3367R8420O212Q4598L0329j15608o051N9673Q2843
16327b72824O7316N366p710n0414q8974Q8944L8021J06913N9600m2663O4571O1839
16315B9985p0767K203j5616L462N6450n1J18574r603r3000P9664Q7339M513n3111
$$ plain form
16383 -1460511 -1382550 -1534918 -1498510 -1329284 -1411359 -1407049 -1325819 -1313830 -1198415 -1041253 -1087683
16372 -1087683 -1200937 -1222431 -1205499 -1144173 -1163403 -1168858 -1117644 -1085903 -1094948 -969598 -951538
16361 -951538 -859091 -741495 -761415 -879520 -881739 -808808 -733019 -741184 -784573 -721640 -708016
16350 -708016 -712106 -651155 -705326 -699849 -679889 -647757 -635898 -659108 -528617 -513181 -475309 -434208
16338 -434208 -449546 -556607 -513240 -414820 -408608 -324010 -293681 -409289 -415340 -355667 -272824
16327 -272824 -205508 -200142 -207852 -258266 -347240 -258296 -220275 -113362 -53762 -96425 -31854 29985
16315 29985 -40782 -38579 -54195 -50733 5717 5666 124240 114637 21637 101301 188640 193153 140042
$$ [...]
##END NTUPLES=NMR SPECTRUM
##END=
