##TITLE=1H_EC-3355(II-2)
 200.13MHz, CDCl3,
 8 sc
 
 5.8.2025
##JCAMPDX= 6.0         $$ Bruker NMR JCAMP-DX V2.0
##DATA TYPE= NMR SPECTRUM
##DATA CLASS= NTUPLES
##ORIGIN= UXNMR, Bruker Analytische Messtechnik GmbH
##OWNER= pz
$$ XWIN-NMR		Version 3.5
$$ Tue Aug  5 14:12:04 2025 Russian Standard Time (UT+4h)  she@DPX200
##.OBSERVE FREQUENCY= 200.1313
##.OBSERVE NUCLEUS= ^1H
##.ACQUISITION MODE= SIMULTANEOUS
##.ACQUISITION SCHEME= undefined
##.AVERAGES= 8
##.DIGITISER RES= 18
##SPECTROMETER/DATA SYSTEM= spect
##.PULSE SEQUENCE= zg30
##.SOLVENT NAME= CDCl3
##.SHIFT REFERENCE= (INTERNAL, CDCl3, 0, 15.5012)
##AUDIT TRAIL= $$ (NUMBER, WHEN, WHO, WHERE, WHAT)
$$ ##TITLE= Audit trail, XWIN-NMR		Version 3.5
$$ ##JCAMPDX= 5.01
$$ ##ORIGIN= Bruker BioSpin GmbH
$$ ##OWNER= she
$$ F:/spectra/data/she/nmr/H-C/1/pdata/1/auditp.txt
$$ ##AUDIT TRAIL=  $$ (NUMBER, WHEN, WHO, WHERE, WHAT)
(   1,<2025-08-05 14:10:43.57 +0400>,<she>,<DPX200>,
      <created by zg, POWCHK disabled, PULCHK disabled
       configuration hash MD5:
       00 E9 B6 7A A2 85 ED C7 34 08 36 98 17 FE 4E 26
       data hash MD5: 16K
       BF 77 46 C3 B3 E6 35 E5 00 2C AA 9F A1 9B 33 3E>)
(   2,<2025-08-05 14:10:45.87 +0400>,<she>,<DPX200>,
      <Start of raw data processing
       efp BC_mod = 2 LB = 0.25 FT_mod = 6 PKNL = 1 PHC0 = -1198.036 PHC1 = 10.1923 SI = 16K 
       data hash MD5: 16K
       E3 7A F9 F9 EA 9F 49 6D 43 47 92 02 5F 8E 71 C7>)
(   3,<2025-08-05 14:11:07.90 +0400>,<she>,<DPX200>,
      <pk PHC0 = -2.472622 PHC1 = 2.6 
       data hash MD5: 16K
       9F D7 84 10 62 DE A9 5A BC 9B 07 A3 51 6E 20 D9>)
(   4,<2025-08-05 14:11:12.06 +0400>,<she>,<DPX200>,
      <abs ABSG = 5 
       data hash MD5: 16K
       3C D7 85 D4 F8 BD 80 DB 83 C9 A2 DF 91 69 31 8D>)
$$ ##END=
$$ 
$$ hash MD5
$$ AF C8 B1 45 E5 E9 9E 40 23 75 8A CB 42 C4 42 34
##$RELAX= 
##$RELAX= 
##$RELAX= 
##$RELAX= 
##$RELAX= 
##$RELAX= 
$$ Bruker specific parameters
$$ --------------------------
##$DU= <F:/spectra>
##$EXPNO= 1
##$NAME= <H-C>
##$PROCNO= 1
##$TYPE= <nmr>
##$USER= <she>
##$AMP= (0..31)
100 100 100 100 100 100 100 100 100 100 100 100 100 100 100 100 100 100 
100 100 100 100 100 100 100 100 100 100 100 100 100 100 
##$AQSEQ= 0
##$AQ_mod= 1
##$AUNM= <au_zg>
##$AUTOPOS= <>
##$BF1= 200.13
##$BF2= 200.13
##$BF3= 200.13
##$BF4= 200.13
##$BF5= 200.13
##$BF6= 200.13
##$BF7= 200.13
##$BF8= 200.13
##$BYTORDA= 1
##$CFDGTYP= 0
##$CFRGTYP= 5
##$CHEMSTR= <none>
##$CNST= (0..31)
1 1 145 1 1 1 1 1 1 1 1 1 1 1 1 1 1 1 1 1 1 1 1 1 1 1 1 1 1 1 1 1 
##$CPDPRG= <>
##$CPDPRG1= <>
##$CPDPRG2= <>
##$CPDPRG3= <>
##$CPDPRG4= <mlev>
##$CPDPRG5= <mlev>
##$CPDPRG6= <mlev>
##$CPDPRG7= <mlev>
##$CPDPRG8= <mlev>
##$CPDPRGB= <>
##$CPDPRGT= <>
##$D= (0..31)
0 0.7 0 0 0 0 0 0 0 0 0 0.03 0 0 0 0 0 0 0 0 0 0 0 0 0 0 0 0 0 0 0 0 
##$DATE= 1754388643
##$DBL= (0..7)
120 120 120 120 120 120 120 120 
##$DBP= (0..7)
150 150 150 150 150 150 150 150 
##$DBP07= 0
##$DBPNAM0= <>
##$DBPNAM1= <>
##$DBPNAM2= <>
##$DBPNAM3= <>
##$DBPNAM4= <>
$$ [...]
##$SUBNAM3= <"">
##$SUBNAM4= <"">
##$SUBNAM5= <"">
##$SUBNAM6= <"">
##$SUBNAM7= <"">
##$SUBNAM8= <"">
##$SUBNAM9= <"">
##$SW= 18.0517328524113
##$SWIBOX= (0..15)
0 0 2 0 0 0 0 0 0 0 0 0 0 0 0 0 
##$SW_h= 3612.71676300578
##$TD= 16384
##$TD0= 1
##$TE= 0
##$TE2= 300
##$TE3= 300
##$TEG= 300
##$TL= (0..7)
0 120 120 120 120 120 120 120 
##$TP= (0..7)
150 150 150 150 150 150 150 150 
##$TP07= 0
##$TPNAME0= <>
##$TPNAME1= <>
##$TPNAME2= <>
##$TPNAME3= <>
##$TPNAME4= <>
##$TPNAME5= <>
##$TPNAME6= <>
##$TPNAME7= <>
##$TPOAL= (0..7)
0.5 0.5 0.5 0.5 0.5 0.5 0.5 0.5 
##$TPOFFS= (0..7)
0 0 0 0 0 0 0 0 
##$TUNHIN= 0
##$TUNHOUT= 0
##$TUNXOUT= 0
##$USERA1= <user>
##$USERA2= <user>
##$USERA3= <user>
##$USERA4= <user>
##$USERA5= <user>
##$V9= 5
##$VALIST= <valist>
##$VCLIST= <CCCCCCCCCCCCCCC>
##$VD= 0
##$VDLIST= <DDDDDDDDDDDDDDD>
##$VPLIST= <PPPPPPPPPPPPPPP>
##$VTLIST= <TTTTTTTTTTTTTTT>
##$WBST= 1024
##$WBSW= 4
##$XGAIN= (0..3)
0 0 0 0 
##$XL= 0
##$YL= 0
##$YMAX_a= 606543
##$YMIN_a= -688855
##$ZGOPTNS= <>
##$ZL1= 120
##$ZL2= 120
##$ZL3= 120
##$ZL4= 120
##$ABSF1= 15.48466
##$ABSF2= -2.567189
##$ABSG= 5
##$ABSL= 3
##$ALPHA= 0
##$AQORDER= 0
##$ASSFAC= 0
##$ASSFACI= 0
##$ASSFACX= 0
##$ASSWID= 0
##$AUNMP= <proc_1d>
##$AZFE= 0.1
##$AZFW= 0.1
##$BCFW= 0
##$BC_mod= 2
##$BYTORDP= 0
##$COROFFS= 0
##$CY= -3
##$DATMOD= 1
##$DC= 0
##$DFILT= <>
##$DTYPP= 0
##$F1P= 0
##$F2P= 0
##$FCOR= 1
##$FTSIZE= 16384
##$FT_mod= 6
##$GAMMA= 0
##$GB= 0
##$INTBC= 1
##$INTSCL= 3.241238e-09
##$ISEN= 128
##$LB= 0.25
##$LEV0= 0
##$LPBIN= 0
##$MAXI= 10000
##$MC2= 0
##$MEAN= 0
##$ME_mod= 0
##$MI= 1.114404
##$NCOEF= 0
##$NC_proc= -5
##$NLEV= 6
##$NOISF1= 3.799351
##$NOISF2= 2.8
##$NSP= 0
##$NTH_PI= 0
##$NZP= 0
##$OFFSET= 15.50119
##$PC= 1
##$PHC0= -1200.509
##$PHC1= 12.7923
##$PH_mod= 1
##$PKNL= yes
##$PPARMOD= 0
##$PSCAL= 0
##$PSIGN= 0
##$REVERSE= no
##$SF= 200.130004105529
##$SI= 16384
##$SIGF1= 3
##$SIGF2= 2
##$SINO= 0.751879
##$SIOLD= 32768
##$SREGLST= <19F.Aceton>
##$SSB= 0
##$STSI= 16384
##$STSR= 0
##$SW_p= 3612.71676300578
##$SYMM= 0
##$S_DEV= 0
##$TDeff= 16384
##$TDoff= 0
##$TI= <>
##$TILT= no
##$TM1= 0
##$TM2= 0
##$TOPLEV= 0
##$USERP1= <user>
##$USERP2= <user>
##$USERP3= <user>
##$USERP4= <user>
##$USERP5= <user>
##$WDW= 1
##$XDIM= 16384
##$YMAX_p= 385596127
##$YMIN_p= -1018075
$$ End of Bruker specific parameters
$$ ---------------------------------
##NTUPLES= NMR SPECTRUM
##VAR_NAME=  FREQUENCY,     SPECTRUM/REAL,   SPECTRUM/IMAG
##SYMBOL=    X,             R,               I
##VAR_TYPE=  INDEPENDENT,   DEPENDENT,       DEPENDENT
##VAR_FORM=  AFFN,          ASDF,            ASDF
##VAR_DIM=   16384,         16384,           16384
##UNITS=     HZ,            ARBITRARY UNITS, ARBITRARY UNITS
##FACTOR=    0.220516191357247, 1,           1
##FIRST=     3102.25325547408, 0,            0
##LAST=      -510.463507531698, 0,           0
##MIN=       -510.463507531698, -1018075,    0
##MAX=       3102.25325547408, 385596127,    0
$$ Real data points
##PAGE= N=1
##DATA TABLE= (X++(R..R)), XYDATA
$$ [...]
$$ plain form
6065 4117518 3778508 3541927 3360088 3170972 2982488 2910284 2891583 2805838 2787479 2781781 2757243
6054 2757243 2703606 2630578 2613446 2704847 2669043 2778764 2912531 2998649 3074742 3108088 2972909
6043 2972909 2713179 2436080 2219015 2069710 1861822 1794446 1741318 1610906 1451796 1352918
6033 1352918 1291678 1211685 1171629 1181682 1122480 1155845 1126090 1055121 1027904 996528 996396 960198
6021 960198 888685 864335 853584 826397 786183 660502 627696 669759 679760 624811 658660
6010 658660 669810 640396 657315 660278 632774 622419 634240 595269 658915 619829 543408 482835
5998 482835 411647 456064 556755 639140 623415 648371 592824 560010 522496 546140 519862
5987 519862 500142 484397 518497 563523 531129 571512 606829 559082 486480 613677 584486
$$ packed form
6065D117518l39010k36581j81839j89116j88484p2204j8701q5745j8359n698k4538
6054B757243n3637p3028j7132R1401l5804J09721J33767Q6118P6093L3346j35179
6043B972909k59730k77099k17065j49305k07888o7376n3128j30412j59110r8878
6033A352918o1240p9993m0056J0053n9202L3365k9755p0969k7217l1376j32l6198
6021I60198p1513k4350j0751k7187m0214j25681l2806M2063J0001n4949L3849
6010F58660J1150k9414J6919K963k7504j0355J1821l8971O3646l9086p6421o0573
5998D82835p1188M4417J00691Q2385j5725K4956n5547l2814l7514K3644k6278
5987E19862j9720j5745L4100M5026l2394M0383L5317m7747p2602J27197k9191
$$ plain form
5976 584486 556821 589053 568661 520776 576589 500294 448436 494567 535977 542456 517047 464255
5964 464255 521082 511133 484136 389455 421376 463520 477282 528933 527855 505504 447702 454570
5952 454570 486651 473273 423123 435954 424448 425039 436035 380424 352923 396237 445745 498264
5940 498264 470660 454049 414879 405789 401948 407998 490696 489892 344901 356611 367221 339010
5928 339010 355711 349897 267636 353448 301717 265420 257684 292003 311980 332472 304413 269684
5916 269684 325735 402326 322582 244546 306940 285700 280434 389708 347968 338940 334070 287335
5904 287335 276851 346483 341024 276630 307293 182615 207609 238182 260685 153791 124002
5893 124002 169020 185521 204572 192695 225376 215898 173142 175584 205149 218958 232640 263805
$$ packed form
5976E84486k7665L2232k0392m7885N5813p6295n1858M6131M1410O479k5409n2792
5964D64255N6827r949k6997r4681L1921M2144J3762N1651j078k2351n7802O868
5952D54570L2081j3378n0150J2831j1506N91J0996n5611k7501M3314M9508N2519
5940D98264k7604j6611l9170r090l841O050Q2698q04j44991J1710J0610k8211
5928C39010J6701n814q2261Q5812n1731l6297p736L4319J9977K0492k8059l4729
5916B69684N6051P6591p9744p8036O2394k1240n266J09274m1740r028m870m6735
5904B87335j0484O9632n459o4394L0663j24678K4994L0573K2503j06894k9789
5893A24002M5018J6501J9051j1877L2681r478m2756K442K9565J3809J3682L1165
$$ plain form
5881 263805 196707 107812 146126 136014 98597 152152 233879 178820 141749 132728 110207 97453
5869 97453 209256 190157 159426 206303 240413 262702 203074 149029 154370 176735 244593 225155
5857 225155 261579 212513 223186 220719 157018 210571 190513 259139 278034 240347 233848 171105
5845 171105 162181 138556 140318 168775 247721 216235 220430 255330 213966 267545 179926 184674
5833 184674 157453 164830 184034 203675 150617 144618 126372 182118 180591 163169 224641 281007
5821 281007 285600 250586 221033 122919 202523 240679 213191 202276 196210 247825 194743 187192
5809 187192 183078 225438 174333 199961 181440 226177 144833 19459 108078 203581 112956 120789
5797 120789 167822 153487 150294 203405 196144 173338 186446 170791 181314 193605 152356 136802
$$ packed form
5881B63805o7098q8895L8314j0112l7417N3555Q1727n5059l7071r021k2521j2754
5869I7453J11803j9099l0731M6877L4110K2289n9628n4045N341K2365O7858j9438
5857B25155L6424m9066J0673k467o3701N3553k0058O8626J8895l7687o499o2743
5845A71105q924k3625J762K8457P8946l1486M195L4900m1364N3579q7619M748
5833A84674k7221P377J9204J9641n3058n999j8246N5746j527j7422O1472N6366
5821B81007M593l5014k9553r8114P9604L8156k7488j0915o066N1615n3082p551
5809A87192m114M2360n1105K5628j8521M4737q1344j25374Q8619R5503r0625P833
5797A20789M7033j4335l193N3111p261k2806J3108j5655J0523J2291m1249j5554
$$ plain form
5785 136802 162042 133473 128062 61200 116775 192409 139069 130558 171738 210159 164375 129589
5773 129589 146220 193213 207460 236599 250287 248684 269543 207134 242582 182433 147254 200376
5761 200376 199209 224958 251918 160611 140824 196419 203710 200563 138036 151482 215084 238685
5749 238685 157010 119654 151196 206075 221684 254871 285258 315644 390670 276873 264952
5738 264952 241050 320552 257861 247234 217211 191728 158881 243479 266815 254379 225576 224961
5726 224961 227439 248998 318335 297656 243908 135618 158544 242963 216646 273726 330437 302095
5714 302095 260494 253155 237661 266093 283657 313759 324966 240730 159133 116329 162923 292358
5702 292358 357582 310361 256636 263405 314851 258496 266329 284098 287956 349352 357847 340228
$$ packed form
5785A36802K5240k8569n411o6862N5575P5634n3340q511M1180L8421m5784l4786
5773A29589J6631M6993J4247K9139J3688j603K0859o2409L5448o0149l5179N3122
5761B00376j167K5749K6960r1307j9787N5595P291l147o2527J3446O3602K3601
5749B38685q1675l7356L1542N4879J5609L3187L0387L0386P5026j13797j1921
5738B64952k3902P9502o2691j0627l0023k5483l2847Q4598K3336j2436k8803o15
5726B24961K478K1559O9337k0679n3748j08290K2926Q4419k6317N7080N6711k8342
5714C02095m1601p339j5494K8432J7564L0102J1207q4236q1597m2804M6594J29435
5702B92358O5224m7221n3725O769N1446n6355P833J7769L858O1396Q495j7619
$$ plain form
5690 340228 367061 265159 268804 321653 371872 377335 338034 305165 314614 253922 239013 243350
5678 243350 326144 374905 344979 260447 314355 418000 451324 449787 489823 502477 454435 517888
5666 517888 503631 452911 384632 374422 426399 452485 421250 351002 403830 491286 436196 478461
5654 478461 525379 535618 595762 559390 512982 506195 514373 541270 572985 554389 531245 554319
5642 554319 560344 634008 641616 649244 643224 691273 737894 774006 802798 798161 796736 777675 781810
5629 781810 803299 772627 727490 758359 787236 842591 858252 896908 954807 973574 956115 967118
5617 967118 1058576 1026717 950785 1046287 1156515 1154705 1229834 1177765 1185038 1277043 1293140 1280275
5605 1280275 1283049 1233326 1151861 1227921 1257506 1302532 1274573 1371779 1391209 1311391 1251127 1393431
$$ packed form
5690C40228K6833j01902L645N2849N0219N463l9301l2869R449o0692j4909M337
5678B43350Q2794M8761k9926q4532N3908J03645L3324j537M0036J2654m8042O3453
5666E17888j4257n0720o8279j0210N1977K6086l1235p0248N2828Q7456n5090M2265
5654D78461M6918J0239O0144l6372m6408o787Q178K6897L1715j8596k3144K3074
5642E54319O025P3664P608P628o020M8049M6621L6112K8792m637j425j9061M135
5629G81810K1489l0672m5137L0869K8877N5355J5661L8656N7899J8767j7459J1003
5617I67118R1458l1859p5932R5502J10228j810P5129n2069P273R2005J6097j2865
5605A280275K774m9723q1465P6060K9585M5026k7959R7206J9430p9818o0264J42304
$$ plain form
5593 1393431 1474197 1534909 1672386 1649183 1613439 1596495 1690383 1842369 1902971 1951883 1896338
5582 1896338 1783711 1794906 1782346 1756707 1677941 1672592 1608804 1540474 1593195 1589277 1616528 1619462
5570 1619462 1638133 1650344 1685243 1680952 1810164 1957353 1970288 2113065 2236116 2397739 2570373
5559 2570373 2658696 2707968 2679173 2517833 2383421 2281264 2075204 1976730 1799304 1776519
5549 1776519 1797817 1667152 1606324 1547901 1494308 1563453 1613609 1533332 1563395 1658851 1759138
5538 1759138 1774835 1897659 2022594 2110165 2230494 2528508 2727630 2826988 2876920 2807527
5528 2807527 2577220 2376868 2190470 2004325 1775766 1696903 1724579 1588403 1520686 1442801
5518 1442801 1437297 1438314 1489486 1447920 1388982 1449977 1456949 1525964 1690422 1718513 1828759 1917611
$$ packed form
5593A393431Q0766O0712J37477k3203l5744j6944R3888J51986O0602M8912n5545
5582A896338j12627J1195j2560k5639p8766n349o3788o8330N2721l918K7251K934
5570A619462J8671J2211L4899m291J29212J47189J2935J42777J23051J61623J72634
5559B570373Q8323M9272k8795j61340j34412j02157k06060r8474j77426k2785
5549A776519K1298j30665o0828n8423n3593O9145N0156q0277L0063R5456J00287
5538A759138J5697J22824J24935Q7571J20329K98014J99122R9358M9932o9393
5528B807527k30307k00352j86398j86145k28559p8863K7676j36176o7717p7885
5518A442801n504J017N1172m1566n8938O0995O972O9015J64458K8091J10246Q8852
$$ plain form
5506 1917611 2063241 2189440 2304666 2354639 2336577 2291415 2131085 1896868 1646682 1630230
5496 1630230 1551305 1427984 1389693 1363816 1321484 1329481 1266200 1241282 1316423 1330915 1380309
5485 1380309 1367946 1476702 1566284 1479369 1556744 1655796 1709145 1762909 1813724 1957287 2070486
5474 2070486 1987780 1909395 1898494 1924334 1947335 2049128 2086583 2167327 2101400 2069482 2111389
5463 2111389 2134743 2201336 2265161 2406929 2527103 2673055 2796436 3027307 3398779 3586664
5453 3586664 3797555 3914089 3794283 3722671 3560107 3397671 3276710 3262849 3242708 3303867
5443 3303867 3339000 3367629 3372462 3475278 3478459 3481785 3554832 3565417 3697409 3874542 4085135
5432 4085135 4227049 4412180 4570476 4719518 5007323 5415475 5730044 5954330 6026665 5829015
$$ packed form
5506A917611J45630J26199J15226M9973j8062m5162j60330k34217k50186j6452
5496A630230p8925j23321l8291k5877m2332P997o3281k4918P5141J4492M9394
5485A380309j2363J08756Q9582q6915P7375R9052N3349N3764N0815J43563J13199
5474B070486q2706p8385j0901K5840K3001J01793L7455Q0744o5927l1918M1907
5463B111389K3354O6593O3825J41768J20174J45952J23381K30871L71472J87885
5453C586664K10891J16534j19806p1612j62564j62436j20961j3861k0141O1159
5443C303867L5133K8629M833J02816L181L326P3047J0585J31992J77133K10593
5432D085135J41914J85131J58296J49042K87805M08152L14569K24286P2335j97650
$$ plain form
5422 5829015 5620751 5347094 5063482 4824548 4635511 4427713 4221821 4109196 3953046 3876460
5412 3876460 3812709 3769886 3773155 3882344 3941775 3985586 4026844 4168012 4258777 4222954 4216826
5401 4216826 4122599 4033107 4020465 3941042 3825735 3681560 3468601 3234525 2953396 2772451
5391 2772451 2543697 2317911 2264746 2164479 2120796 2032175 1972659 1937135 1761702 1749036 1716891
5380 1716891 1694589 1654296 1742767 1787315 1773198 1815733 1716586 1699105 1572414 1480027 1508637
5369 1508637 1423837 1246806 1101117 1033421 999549 959349 847926 788462 798742 803744 805402
5358 805402 800089 852136 802618 669209 723060 664167 683706 715951 627734 610267 585676 599629
5346 599629 684743 679309 648973 619977 603563 626760 713996 671852 622212 603467 612341 506035
$$ packed form
5422E829015k08264k73657k83612k38934j89037k07798k05892j12625j56150p6586
5412C876460o3751m2823L269J09189N9431M3811M1258J41168R0765l5823o128
5401D216826r4227q9492j2642p9423j15307j44175k12959k34076k81129j80945
5391B772451k28754k25786n3165j00267m3683q8621n9516l5524j75433j2666l2145
5380A716891k2302m0293Q8471M4548j4117M2535r9147j7481j26691r2387K8610
5369A508637q4800j77031j45689o7696l3872m0200j11423n9464J0280N002J658
5358H05402n313N2047m9518j33409N3851n8893J9539L2245q8217j7467k4591J3953
5346E99629Q5114n434l0336k8996j6414K3197Q7236m2144m9640j8745Q874j06306
$$ plain form
5334 506035 498491 516747 471466 499588 577401 504667 515076 612204 568418 595683 567761 572069
5322 572069 481132 511129 478908 487488 512865 444599 423777 458844 392525 448471 543470 489565
5310 489565 489063 485318 472469 445887 386190 361869 366438 416575 374582 375152 380825 406229 380606
5297 380606 479530 488688 391137 415899 353952 408142 426277 504857 492672 476934 421136 346608
5285 346608 416712 403586 423175 417920 477074 443623 388878 367728 370464 377618 349390 453446
5273 453446 400516 343330 402715 467668 417148 454395 469577 392205 365719 433536 533091 563146
5261 563146 456312 415038 333509 317088 399645 406078 407631 527904 495312 383058 368600
5250 368600 391827 455592 432740 505666 484884 495880 492456 513025 504266 397497 328852 398089
$$ packed form
5334E06035p544J8256m5281K8122P7813p2734J0409R7128m3786K7265k7922M308
5322E72069r0937K9997l2221Q580K5377o8266k0822L5067o6319N5946R4999n3905
5310D89565n02l745j2849k6582n9697k4321M569N0137m1993N70N673K5404k5623
5297C80606R8924R158r7551K4762o1947N4190J8135P8580j2185j5738n5798p4528
5285C46608P0104j3126J9589n255N9154l3451n4745k1150K736P154k8228J04056
5273D53446n2930n7186N9385O4953n0520L7247J5182p7372k6486O7817R9555L0055
5261E63146j06834m1274q1529j6421Q2557O433J553J20273l2592j12254j4458
5250C68600K3227O3765k2852P2926k0782J0996l424K0569q759j06769o8645O9237
$$ plain form
5238 398089 417326 378174 346276 390609 414553 368522 346274 418969 456113 533315 590809 544215
5226 544215 461356 391260 367401 494537 506933 518152 526171 447875 480520 502926 490138 508009
5214 508009 446819 377044 413719 447449 459572 513208 547970 513496 509531 447687 426419 410436
5202 410436 473326 436258 476973 457817 442151 430965 442534 503136 504601 414178 444962 512731
5190 512731 565964 544345 480334 505317 514783 522532 502351 574222 536958 486607 581150 566283
5178 566283 551238 571803 577218 606823 554727 519448 557134 537478 568878 550445 525451 580880
5166 580880 617422 590869 563149 566325 575634 592589 542913 556489 543249 642296 756116 713132
5154 713132 619225 641849 703823 690586 675987 644203 582541 604285 682048 752198 677404 700961
$$ packed form
5238C98089J9237l9152l1898M4333K3944m6031k2248P2695L7144P7202N7494m6594
5226E44215q2859p0096k3859J27136J2396J1219Q019p8296L2645K2406j2788J7871
5214E08009o1190o9775L6675L3730J2123N3636L4762l4474l965o1844k1268j5983
5202D10436O2890l7068M0715j9156j5666j1186J1569O0602J465r0423L0784O7769
5190E12731N3233k1619o4011K4983R466P749k0181P1871l7264n0351R4543j4867
5178E66283j5045K0565N415K9605n2096l5279L7686j9656L1400j8433k4994N5429
5166E80880L6542k6553k7720L176R309J6955m9676J3576j3240R9047J13820m2984
5154G13132r3907K2624O1974j3237j4599l1784o1662K1744P7763P0150p4794K3557
$$ plain form
5142 700961 727140 705328 753627 792212 704045 656455 690008 766249 794652 770024 787324 682392
5130 682392 649374 718879 795513 804136 801656 879519 924087 845643 806711 859241 861751 886203
5118 886203 918187 1046876 1061114 996197 969120 1003216 1021585 1009673 1039165 1113917 1152933
5107 1152933 1188623 1368362 1366972 1319430 1376170 1478555 1504642 1544623 1599024 1654233 1676771
5096 1676771 1751530 1871855 1938877 2008588 2138798 2254255 2388827 2500149 2629022 2799870
5086 2799870 2982614 3215031 3467503 3602847 3668709 3807107 3974474 4190883 4533442 4735528
5076 4735528 4978575 5319241 5739879 6246288 6894244 7712654 8465513 8931863 9312317 9599345
5066 9599345 10115270 10775356 11341704 12001603 12907731 14300131 16300099 18503771 19103727
$$ packed form
5142G00961K6179k1812M8299L8585q8167m7590L3553P6241K8403k4628J7300j04932
5130F82392l3018O9505P6634Q623k480P7863M4568p8444l8932N2530K510K4452
5118H86203L1984J28689J4238o4917k7077L4096J8369j1912K9492P4752L9016
5107A152933L5690J79739j390m7542N6740J02385K6087L9981N4401N5209K2538
5096A676771P4759J20325O7022O9711J30210J15457J34572J11322J28873J70848
5086B799870J82744K32417K52472J35344O5862J38398J67367K16409L42559K02086
5076D735528K43047L40666M20638N06409O47956Q18410P52859M66350L80454K87028
5066I599345N15925O60086N66348O59899R06128J392400J999968K203672N99956
$$ plain form
5057 19103727 18044727 16094011 14119066 12570003 11332281 10392676 9561870 8866336 8219930
5048 8219930 7516756 6779154 6035178 5480004 5012622 4607341 4164425 3862979 3621895 3457968
5038 3457968 3228011 3070503 2939329 2747428 2655247 2582690 2442836 2268757 2258888 2250744 2146646
5027 2146646 1982834 1902046 1892148 1924214 1838500 1812495 1659988 1622704 1622941 1634423 1521762
5016 1521762 1483745 1534365 1555392 1491326 1457636 1398171 1359274 1402088 1354279 1392977 1395917 1371625
5004 1371625 1390120 1371790 1381269 1354552 1326821 1341562 1274307 1229643 1176783 1177542 1174109 1076540
4992 1076540 1060185 1108946 1058715 1043321 1075720 1087826 1056381 991497 995833 983280 1055510 1155623
4980 1155623 1111761 1129011 1103792 1067692 1073360 1158442 1200124 1131482 1154592 1209730 1158269 1134857
$$ packed form
5057A9103727j059000j950716j974945j549063j237722r39605q30806o95534o46406
5048H219930p03174p37602p43976n55174m67382m05281m42916l01446k41084j63927
5038C457968k29957j57508j31174j91901r2181p2557j39854j74079r869q144j04098
5027B146646j63812q0788r898L2066q5714k6005j52507l7284K37J1482j12661
5016A521762l8017N0620K1027o4066l3690n9465l8897M2814m7809L8698K940k4292
5004A371625J8495j8330R479k6717k7731J4741o7255m4664n2860P59l433r7569
4992A076540j6355M8761n0231j5394L2399J2106l1445o4884M336j2553P2230J00113
4980A155623m3862J7250k5219l6100N668Q5082M1682o8642K3110N5138n1461k3412
$$ plain form
4968 1134857 1118341 1146862 1222726 1245212 1255265 1256222 1185411 1224551 1294721 1276905 1306764 1308914
4956 1308914 1374311 1342103 1296123 1368506 1320427 1377957 1378666 1370433 1314913 1386576 1311643 1326637
4944 1326637 1325926 1359333 1371980 1384364 1411325 1428358 1413388 1362764 1472406 1484142 1440085 1375470
4932 1375470 1343411 1362635 1379111 1316901 1272719 1341621 1376817 1359940 1330348 1276209 1283548 1339334
4920 1339334 1310824 1323099 1435612 1417560 1451871 1399866 1334317 1428426 1465525 1459449 1494946
4909 1494946 1457436 1455624 1408555 1463442 1473306 1469015 1508645 1525218 1472948 1527603 1529815 1543148
4897 1543148 1504154 1470415 1553863 1530957 1663227 1733582 1750772 1785914 1743513 1755551 1732376
4886 1732376 1795694 1808675 1800985 1784115 1765674 1823125 1861893 1872572 1898841 1896487 1894166 1900927
$$ packed form
4968A134857j6516K8521P5864K2486J0053R57p0811L9140P0170j7816K9859K150
4956A308914O5397l2208m5980P2383m8079N7530P09q233n5520P1663p4933J4994
4944A326637p11L3407J2647J2384K6961J7033j4970n0624J09642J1736m4057o4615
4932A375470l2059J9224J6476o2210m4182O8902L5196j6877k9592n4139P339N5786
4920A339334k8510J2275J12513j8052L4311n2005o5549R4109L7099o076L5497
4909A494946l7510j812m7069N4887R864m291L9630J6573n2270N4655K212J3333
4897A543148l8994l3739Q3448k2906J32270P0355J7190L5142m2401J2038k3175
4886A732376O3318J2981p690j6870j8441N7451L8768J0679K6269k354k321O761
$$ plain form
4874 1900927 1976263 1989176 1956733 2009981 2003193 2040372 2083553 2155966 2228731 2218737 2275834 2224008
4862 2224008 2261970 2315449 2306869 2285223 2355308 2444862 2466376 2499703 2574833 2595183 2590721 2688320
4850 2688320 2697255 2798560 2784053 2764989 2915413 2944199 3011886 3084155 3148023 3249431 3299288
4839 3299288 3328052 3409642 3625587 3715340 3825846 3900512 3842909 3981560 4142438 4155178 4212019
4828 4212019 4339449 4412767 4601165 4739900 4855193 4986674 5181393 5332676 5355237 5476778
4818 5476778 5621504 5812699 5968643 6176237 6387756 6562654 6885655 7175930 7460495 7901656
4808 7901656 8301343 8746704 9174459 9536399 9887580 10329751 10780457 11365766 11921201 12485512
4798 12485512 13159965 13805144 14438269 15204392 15971123 16659133 17428727 18326079 19293474
$$ packed form
4874A900927P5336J2913l2443N3248o788L7179M3181P2413P2765r994N7097n1826
4862B224008L7962N3479q580k1646P0085Q9554K1514L3327P5130K0350m462R7599
4850B688320Q935J01305j4507j9064J50424K8786O7687P2269O3868J01408M9857
4839C299288K8764Q1590K15945Q9753J10506P4666n7603J38651J60878J2740N6841
4828D212019J27430P3318J88398J38735J15293J31481J94719J51283K2561J21541
4818E476778J44726J91195J55944K07594K11519J74898L23001K90275K84565M41161
4808G901656L99687M45361M27755L61940L51181M42171M50706N85309N55435N64311
4798A2485512O74453O45179O33125P66123P66731O88010P69594Q97352R67395
$$ plain form
4789 19293474 20320727 21394154 22592037 23811547 25052184 26323889 27786530 29579477
4781 29579477 31768033 34374405 37190338 39912868 42115386 43622733 44671958 45698528
4773 45698528 46710020 47514382 48142822 48652898 48978246 49703514 50631098 51609212 52641162
4764 52641162 53682184 54792311 56182751 57925070 59776167 61597938 63209399 64689131
4756 64689131 66073845 67566168 69169038 70996033 73115671 75607939 78382098 81485864
4748 81485864 84407050 86556769 87240478 86370484 84311003 81805548 79345891 76858712
4740 76858712 74483320 72144651 70158579 68440770 66733390 64786216 62593490 60246833
4732 60246833 57998210 55989373 54350812 52887999 51613981 50438932 49282280 48344281
$$ packed form
4789A9293474J027253J073427J197883J219510J240637J271705J462641J792947
4781B9579477K188556K606372K815933K722530K202518J507347J049225J026570
4773D5698528J011492Q04362O28440N10076L25348P25268R27584R78114J031950
4764E2641162J041022J110127J390440J742319J851097J821771J611461J479732
4756F4689131J384714J492323J602870J826995K119638K492268K774159L103766
4748H1485864K921186K149719O83709q69994k059481k505455k459657k487179
4740G6858712k375392k338669j986072j717809j707380j947174k192726k346657
4732F0246833k248623k008837j638561j462813j274018j175049j156652r37999
$$ plain form
4724 48344281 47695972 47184458 46857823 46553676 46001978 45473823 44974350 44484571 43400260
4715 43400260 41498412 38735289 35604726 32692782 30201870 28154072 26326224 24719925
4707 24719925 23481166 22249969 21058965 19962350 19028204 18139726 17306212 16618961 15904740
4698 15904740 15249737 14565573 13936346 13395102 12869335 12282417 11768497 11323858 10954890
4689 10954890 10539660 10255800 9879771 9518378 9208766 8832314 8519582 8281295 7942638
4680 7942638 7683523 7504478 7341575 7237446 7042132 6904346 6758250 6734789 6650540 6402416
4670 6402416 6219947 6151737 6189272 6091726 6075996 6008350 5960534 5920047 5844177 5852689 5878088
4659 5878088 5849085 5807260 5721984 5655667 5592309 5495430 5420740 5261110 5133109 4956188 4777421
$$ packed form
4724D8344281o48309n11514l26635l04147n51698n28155m99473m89779j084311
4715D3400260j901848k763123l130563k911944k490912k047798j827848j606299
4707B4719925j238759j231197j191004j096615r34146q88478q33514o87251p14221
4698A5904740o55003o84164o29227n41244n25767n86918n13920m44639l68968
4689A0954890m15230k83860l76029l61393l09612l76452l12732k38287l38657
4680G942638k59115j79045j62903j04129j95314j37786j46096k3461q4249k48124
4670F402416j82469o8210L7535r7546j5730o7646m7816m0487p5870Q512K5399
4659E878088k9003m1825q5276o6317o3358r6879p4690j59630j28001j76921j78767
$$ plain form
4648 4777421 4610007 4452993 4297813 4254029 4175000 4056668 3960460 3796713 3779759 3705657
4638 3705657 3626392 3526824 3517259 3509650 3492827 3433284 3425297 3431231 3462660 3410480 3322265 3249885
4626 3249885 3225031 3186115 3100961 3227643 3121458 2992499 2899053 2787931 2708845 2613571 2496737
4615 2496737 2457109 2437852 2372684 2318929 2320530 2176677 2045135 2068310 2031089 1986089 1980260
4604 1980260 1980647 1963205 1892321 1910417 1831079 1803579 1776286 1715684 1676940 1698274 1699663 1756467
4592 1756467 1756005 1603659 1537158 1654681 1685716 1747233 1761125 1684367 1616190 1538390 1577159
4581 1577159 1624638 1607487 1571863 1543667 1544848 1467221 1486019 1486676 1364961 1493802 1530297 1535392
4569 1535392 1473765 1425478 1461474 1508923 1571537 1536240 1506453 1493956 1486420 1511749 1520965 1549639
$$ packed form
4648D777421j67414j57014j55180m3784p9029j18332r6208j63747j6954p4102
4638C705657p9265r9568r565p609j6823n9543p987N934L1429n2180q8215p2380
4626C249885k4854l8916q5154J26682j06185j28959r3446j11122p9086r5274j16834
4615B496737l9628j9257o5168n3755J601j43853j31542K3175l7221m5000n829
4604A980260L87j7442p0884J8096p9338k7500k7293o0602l8744K1334J389N6804
4592A756467m62j52346o6501J17523L1035O1517J3892p6758o8177p7800L8769
4581A577159M7479j7151l5624k8196J181p7627J8798O57j21715J28841L6495N095
4569A535392o1627m8287L5996M7449O2614l5297k9787j2497p536K5329R216K8674
$$ plain form
4557 1549639 1576106 1550626 1545902 1534482 1509513 1499108 1461999 1502421 1483145 1406451 1401954 1418107
4545 1418107 1376937 1418201 1373667 1313475 1420819 1341418 1328888 1384506 1307965 1295021 1321971
4534 1321971 1323273 1329938 1367440 1435750 1377263 1250804 1194208 1179915 1211854 1201018 1233564 1286783
4522 1286783 1337503 1261519 1264892 1252050 1257528 1169442 1146655 1168001 1223459 1190858 1116301 1098242
4510 1098242 1110870 1056406 1099668 1099050 1112448 1144400 1071309 1154995 1142660 1019140 969396 1158495
4498 1158495 1172463 1122845 1159612 1215606 1260784 1217284 1170788 1135023 1112050 1129543 1151114
4487 1151114 1193171 1171376 1176723 1123571 1076866 1008917 1023420 1037807 1154380 1143031 1119646
4476 1119646 1172706 1162806 1210581 1236213 1256015 1217811 1206626 1177539 1188774 1193229 1225872 1216787
$$ packed form
4557A549639K6467k5480m724j1420k4969j0405l7109M0422j9276p6694m497J6153
4545A418107m1170M1264m4534o0192J07344p9401j2530N5618p6541j2944K6950
4534A321971J302O665L7502O8310n8487j26459n6596j4293L1939j0836L2546N3219
4522A286783N0720p5984L373j2842N478q8086k2787K1346N5458l2601p4557j8059
4510A098242J2628n4464M3262o18J3398L1952p3091Q3686j2335j23520m9744J89099
4498A158495J3968m9618L6767N5994M5178m3500m6496l5765k2973J7493K1571
4487A151114M2057k1795N347n3152m6705o7949J4503J4387J16573j1349k3385
4476A119646N3060r900M7775K5632J9802l8204j1185k9087J1235M455L2643r085
$$ plain form
4464 1216787 1170896 1295564 1286232 1301837 1337254 1247648 1162318 1192540 1216234 1258072 1241572
4453 1241572 1231799 1294011 1325542 1353122 1454071 1396766 1425420 1380459 1464932 1461255 1383844 1417226
4441 1417226 1460542 1435335 1381815 1483441 1483824 1526156 1565329 1533325 1450160 1397845 1387641 1349729
4429 1349729 1357588 1372313 1301331 1269702 1379944 1322473 1245584 1292923 1321923 1377516 1357045
4418 1357045 1322488 1296686 1371475 1341205 1326194 1376287 1334787 1308841 1339646 1244740 1308336
4407 1308336 1338273 1426840 1347699 1233493 1271332 1261687 1266785 1274223 1256943 1294508 1245670 1199185
4395 1199185 1217021 1283268 1216981 1263600 1236945 1286326 1358701 1312125 1241102 1200635 1177393
4384 1177393 1215859 1202205 1262593 1254466 1296504 1333815 1244332 1211811 1289965 1308377 1365367 1398878
$$ packed form
4464A216787m5891J24668r332J5605L5417q9606q5330L0222K3694M1838j6500
4453A241572r773O2212L1531K7580J00949n7305K8654m4961Q4473l677p7411L3382
4441A417226M3316k5207n3520J01626L83M2332L9173l2004q3165n2315j0204l7912
4429A349729P859J4725p0982l1629J10242n7471p6889M7339K9000N5593k0471
4418A357045l4557k5802P4789l0270j5011N0093m1500k5946L0805r4906O3596
4407A308336K9937Q8567p9141j14206L7839r645N098P438j7280L7565m8838m6485
4395A199185J7836O6247o6287M6619k6655M9381P2375m6576p1023m0467k3242
4384A177393L8466j3654O0388q127M2038L7311q9483l2521P8154J8412N6990L3511
$$ plain form
4372 1398878 1473107 1528814 1447336 1400161 1325681 1347018 1293211 1297948 1245729 1289058 1327350 1334297
4360 1334297 1224754 1210181 1318580 1321146 1280869 1438597 1314878 1278169 1351810 1325267 1374641
4349 1374641 1372152 1378490 1444322 1406694 1365735 1476857 1518964 1444158 1444854 1469336 1564886 1533655
4337 1533655 1472248 1512061 1567297 1601483 1637809 1680040 1635705 1683719 1707962 1718371 1730359
4326 1730359 1800062 1849311 1912925 1946567 1972679 2043817 2090321 2198855 2304712 2370597 2419096
4315 2419096 2524954 2557800 2544884 2641058 2831464 2956560 3043024 3193852 3291690 3403279
4305 3403279 3651581 3876628 4026285 4133484 4335067 4602963 4897464 5186390 5385972 5634527
4295 5634527 5927868 6150787 6448538 6791876 7148016 7482972 7920653 8459990 9012365 9556011
$$ packed form
4372A398878P4229N5707q1478m7175p4480K1337n3807M737n2219M3329L8292O947
4360A334297j09543j4573J08399K566m0277J57728j23719l6709P3641k6543M9374
4349A374641k489O338O5832l7628m0959J11122M2107p4806O96K4482R5550l1231
4337A533655o1407L9813N5236L4186L6326M2231m4335M8014K4243J0409J1988
4326A730359O9703M9249O3614L3642K6112P1138M6504J08534J05857O5885M8499
4315B419096J05858L2846j2916R6174J90406J25096Q6464J50828R7838J11589
4305C403279K48302K25047J49657J07199K01583K67896K94501K88926J99582K48555
4295E634527K93341K22919K97751L43338L56140L34956M37681N39337N52375N43646
$$ plain form
4285 9556011 10120058 10748407 11275595 11717789 12191279 12492346 12848709 13239050 13557923 14017422
4275 14017422 14593287 15307771 16209131 17095216 18034828 19053619 19959382 20577655 21012079
4266 21012079 21251705 21224757 21156330 21171659 21177457 21371556 21782544 22314723 23042647 23823717
4256 23823717 24739153 25496436 26104550 26286224 26014409 25634350 25131681 24508747 23865843
4247 23865843 23310212 22910792 22657858 22588610 22650958 22703901 22871340 22911125 22788340 22422163
4237 22422163 21861688 21071199 20154151 19270021 18333072 17513124 16704824 16040701 15591953
4228 15591953 15217938 14820882 14567941 14290083 13907424 13499629 12950168 12348826 11721471
4219 11721471 11085288 10381527 9703671 9149010 8676518 8311725 7883295 7615988 7312548
$$ packed form
4285I556011N64047O28349N27188M42194M73490L01067L56363L90341L18873M59499
4275A4017422N75865P14484R01360Q86085R39612J018791R05763O18273M34424
4266B1012079K39626k6948o8427J5329N798J94099M10988N32179P27924P81070
4256B3823717R15436P57283O08114J81674k71815l80059n02669o22934o42904
4247B3865843n55631l99420k52934o9248O2348N2943J67439L9785j22785l66177
4237B2422163n60475p90489r17048q84130r36949q19948q08300o64123m48748
4228A5591953l74015l97056k52941k77858l82659m07795n49461o01342o27355
4219A1721471o36183p03761o77856n54661m72492l64793m28430k67307l03440
$$ plain form
4210 7312548 6994985 6707660 6491880 6264688 6042561 5745080 5346368 5028936 4779995 4528738
4200 4528738 4307728 4067676 3938553 3805658 3669165 3573125 3475483 3472740 3412429 3273507
4190 3273507 3158313 3104845 3029609 2966165 2877692 2835409 2739587 2698246 2618595 2558057 2514923
4179 2514923 2415385 2343742 2296670 2240168 2182637 2127904 2049714 1979220 1896055 1914708 1922157 1823707
4167 1823707 1756278 1798278 1814940 1783400 1784422 1788525 1691295 1737542 1784050 1764264 1739431 1748289
4155 1748289 1740396 1783441 1784063 1765357 1810140 1800529 1795852 1757802 1764748 1647073 1623494 1697388
4143 1697388 1699724 1637999 1696528 1622218 1540160 1499200 1458196 1453348 1550254 1604868 1557832 1589563
4131 1589563 1609043 1657397 1631182 1611556 1568601 1635749 1603605 1646844 1630976 1684983 1765571
$$ packed form
4210G312548l17563k87325k15780k27192k22127k97481l98712l17432k48941k51257
4200D528738k21010k40052j29123j32895j36493r6040r7642k743o0311j38922
4190C273507j15194n3468p5236o3444q8473m2283r5822m1341p9651o0538m3134
4179B514923r9538p1643m7072n6502n7531n4733p8190p0494q3165J8653P449r8450
4167A823707o7429M2000J6662l1540J022M103r7230M6247M6508j9786k4833Q858
4155A748289p893M3045O22j8706M4783r611m677l8050O946j17675k3579P3894
4143A697388K336o1725N8529p4310q2058m0960m1004m848R6906N4614m7036L1731
4131A589563J9480M8354k6215j9626m2955O7148l2144M3239j5868N4007Q0588
$$ plain form
4120 1765571 1726387 1747511 1667642 1685795 1765600 1759831 1749683 1819900 1842623 1766647 1791538 1849105
4108 1849105 1797951 1802529 1845246 1951416 1867804 1932716 2020398 2053827 2149440 2167521 2208654
4097 2208654 2229715 2240985 2280754 2337606 2364512 2411534 2469753 2479155 2541756 2633703 2697486 2846190
4085 2846190 2868314 2771407 2840431 2864874 2909096 2889106 2945668 3060285 3062257 3115622 3281256
4074 3281256 3372705 3329963 3414213 3547260 3614951 3577039 3586025 3640720 3570667 3606869 3590919
4063 3590919 3629636 3743139 3776884 3852591 3951312 3942095 3919145 3965913 3946865 3943806 3907887 3909038
4051 3909038 3969660 3989779 3941915 4009621 4078098 4165692 4191355 4101026 4061315 4129183 4228296
4040 4228296 4219306 4202543 4293101 4433260 4502829 4597097 4647435 4671332 4634960 4647428 4772549
$$ packed form
4120A765571l9184K1124p9869J8153P9805n769j0148P0217K2723p5976K4891N7567
4108A849105n1154M578M2717J06170q3612O4912Q7682L3429R5613J8081M1133
4097B208654K1061J1270L9769N6852K6906M7022N8219R402O2601R1947O3783J48704
4085B846190K2124r6907O9024K4443M4222j9990N6562J14617J972N3365J65634
4074C281256R1449m2742Q4250J33047O7691l7912Q986N4695p0053L6202j5950
4063C590919L8717J13503L3745P5707R8721r217k2950M6768j9048l059l5919J151
4051C909038O0622K0119m7864O7706O8477Q7594K5663r0329l9711O7868R9113
4040D228296q990j6763R0558J40159O9569R4268N0338K3897l6372J2468J25121
$$ plain form
4029 4772549 4876293 4949819 5052293 5121440 5169698 5296526 5367585 5479769 5720455 5782034
4019 5782034 5758662 5858593 5952310 6126451 6233036 6254500 6392621 6552696 6623707 6784770
4009 6784770 6921753 7010135 7171426 7347827 7457222 7616624 7750799 7848031 7978745 8045835
3999 8045835 8117494 8292249 8406517 8490923 8508164 8565190 8588874 8655133 8888751 9002580 9141575
3988 9141575 9241323 9230307 9149746 9191202 9242801 9348848 9440510 9580878 9664522 9757381 9873853
3977 9873853 9959902 9979031 9953676 9979981 10034207 10121708 10109289 10173988 10333248 10285653 10153406
3966 10153406 10152995 10172843 10180421 10314125 10494614 10540356 10586260 10861401 11247018 11542328 11911913
3955 11911913 12312843 12809771 13090570 13352714 13612565 13744708 13867682 14121298 14293517
$$ packed form
4029D772549J03744P3526J02474O9147M8258J26828P1059J12184K40686O1579
4019E782034k3372R9931R3717J74141J06585K1464J38121J60075P1011J61063
4009F784770J36983Q8382J61291J76401J09395J59402J34175R7232J30714O7090
3999H045835P1659J74755J14268Q4406J7241N7026K3684O6259K33618J13829J38995
3988I141575R9748j1016q0561M1456N1599J06047R1662J40368Q3644R2859J16472
3977I873853Q6049J9129k5355K6305N4226Q7501j2419O4699J59260m7595j32247
3966A0153406m11J9848P578J33704J80489M5742M5904K75141L85617K95310L69585
3955A1911913M00930M96928K80799K62144K59851J32143J22974K53616J72219
$$ plain form
3946 14293517 14496462 14736799 15009486 15372714 15880165 16360105 16928754 17533618 18234152
3937 18234152 18939085 19697754 20694391 21740957 22966392 24186499 25476726 26691011 27990561
3928 27990561 29354098 30721905 32327773 34256831 36568290 39259431 42355757 45293731
3920 45293731 47807147 49592050 50546950 51096063 51688008 52289844 52868490 53443899 54088303
3911 54088303 55153878 56793076 58903078 61147114 63428597 65323140 66700749 67614104
3903 67614104 68278350 68633237 68934702 69314040 69849289 70575456 71658655 73259258 75279723
3894 75279723 77891208 81355260 85435352 89682798 93159350 94565237 93253287 89708683
3886 89708683 85072539 80485397 76555562 73231644 70464416 68066217 66042403 64490475
$$ packed form
3946A4293517K02945K40337K72687L63228N07451M79940N68649O04864P00534
3937A8234152P04933P58669R96637J046566J225435J220107J290227J214285J299550
3928B7990561J363537J367807J605868J929058K311459K691141L096326K937974
3920D5293731K513416J784903R54900N49113N91945O01836N78646N75409O44404
3911E4088303J065575J639198K110002K244036K281483J894543J377609R13355
3903F7614104O64246L54887L01465L79338N35249P26167J083199J600603K020465
3894G5279723K611485L464052M080092M247446L476552J405887j311950l544604
3886H9708683m636144m587142l929835l323918k767228k398199k023814j551928
$$ plain form
3878 64490475 63411989 62850260 62580409 62257933 61794617 60856802 59384743 57332650 54729103
3869 54729103 51939228 49520583 47584677 46041179 44966671 44053385 43396560 43005888 42794729
3860 42794729 42599800 42003725 40608745 38468579 35875690 33329960 31066374 29075369
3852 29075369 27393919 25880427 24617579 23554980 22461612 21337803 20334342 19351438
3844 19351438 18526986 17814587 17087611 16544517 16023632 15630082 15330707 15095791 14795777
3835 14795777 14628840 14482307 14297749 14158365 14143912 14106223 13991338 13964768 13736179 13546562
3825 13546562 13291422 12980027 12621044 12334676 12004494 11526516 11215260 10962977 10840064
3816 10840064 10600589 10504261 10484895 10452999 10299068 10294253 10284766 10188523 10184169 10188449 10188031 10157937
$$ packed form
3878F4490475j078486n61729k69851l22476m63316r37815j472059k052093k603547
3869E4729103k789875k418645j935906j543498j074508r13286o56825l90672k11159
3860D2794729j94929n96075j394980k140166k592889k545730k263586j991005
3852B9075369j681450j513492j262848j062599j093368j123809j003461r82904
3844A9351438q24452p12399p26976n43094n20885l93550k99375k34916l00014
3835A4795777j66937j46533j84558j39384j4453l7689j14885k6570k28589j89617
3825A3546562k55140l11395l58983k86368l30182m77978l11256k52283j22913
3816A0840064k39475r6328j9366l1896j53931m815r487r6243m354M280m18l0094
$$ plain form
3804 10157937 10139182 10047785 10058224 10050498 10064386 10092858 10035197 9910197 10004009 9876411 9779644
3793 9779644 9842474 9817974 9840476 9917479 9957136 9989465 10135975 10322858 10564921 10763677 11000329
3782 11000329 11277355 11464735 11690446 11919171 12179250 12501160 12871869 13244321 13729730
3773 13729730 14253148 14743572 15405323 16070742 16583363 17132823 17744214 18482245 19243580
3764 19243580 20125709 21118658 22119873 23214465 24501333 25853409 27463429 29239291
3756 29239291 31103968 33217837 35542547 38233276 41303889 44479420 47868066 51319771
3748 51319771 54554284 57490406 60082505 62056055 63308588 64102604 64198253 63765985 62935430
3739 62935430 62023361 61145211 60552821 60185809 60172751 60408110 60608358 60716916 60507382 59951217
$$ packed form
3804A0157937j8755r1397J0439p726J3888K8472n7661j25000R3812j27598r6767
3793I779644O2830k4500K2502P7003L9657L2329J46510J86883K42063J98756K36652
3782A1000329K77026J87380K25711K28725K60079L21910L70709L72452M85409
3773A3729730N23418M90424O61751O65419N12621N49460O11391P38031P61335
3764A9243580Q82129R92949J001215J094592J286868J352076J610020J775862
3756B9239291J864677K113869K324710K690729L070613L175531L388646L451705
3748E1319771L234513K936122K592099J973550J252533P94016R5649m32268q30555
3739F2935430r12069q78150n92390l67012j3058K35359K00248J08558k09534n56165
$$ plain form
3729 59951217 58842987 57212173 54878795 52080501 48922803 45611510 42150831 38672200
3721 38672200 35446118 32453847 29758368 27289318 25144305 23370733 21742511 20236255
3713 20236255 18974462 17942306 16906122 16081094 15358836 14551826 13913301 13343269 12731753
3704 12731753 12320950 11928954 11558101 11297861 10994398 10664180 10391715 10224787 10024505
3695 10024505 9857051 9703451 9559929 9343157 9119186 8958275 8881578 8775600 8597213 8438434
3685 8438434 8352002 8244030 8135459 8012287 7973538 7903729 7806927 7755613 7657888 7671821 7632952
3674 7632952 7572907 7562389 7515422 7426414 7389747 7425504 7450602 7416432 7403888 7445974 7505250
3663 7505250 7531498 7545513 7684885 7722171 7748441 7851867 7948983 7988824 8195392 8314710 8451095
$$ packed form
3729E9951217j108230j630814k333378k798294l157698l311293l460679l478631
3721C8672200l226082k992271k695479k469050k145013j773572j628222j506256
3713B0236255j261793j032156j036184q25028p22258q07010o38525n70032o11516
3704A2731753m10803l91996l70853k60240l03463l30218k72465j66928k00282
3695A0024505j67454j53600j43522k16772k23971j60911p6697j05978j78387j58779
3685H438434q6432j07972j08571j23172l8749o9809r6802n1314r7725J3933l8869
3674G632952o0045j0518m6967q9008l6667L5757K5098l4170j2544M2086N9276
3663G505250K6248J4015J39372L7286K6270J03426R7116L9841K06568J19318J36385
$$ plain form
3652 8451095 8558725 8625638 8781943 8962491 9176238 9343652 9480095 9588715 9751327 9876249
3642 9876249 9951712 10066391 10194741 10260987 10306929 10480357 10586422 10695329 10845671 10949828
3632 10949828 11161031 11338057 11540357 11728818 11827566 11913817 12127748 12310616 12498131 12790891
3622 12790891 13067381 13300779 13584505 13943337 14262307 14789044 15365077 15946406 16603430
3613 16603430 17571675 18508223 19402578 20252101 21223844 22030333 22802331 23573479 24245542
3604 24245542 24919174 25346618 25783580 26083410 26394383 26637727 26834997 26915910 26949616 26971457
3594 26971457 26835582 26558110 26228284 25741318 25300892 24767026 24154055 23578116 23069401
3585 23069401 22602543 22250240 21949204 21696793 21608779 21759515 21954004 22203119 22561129 23095179
$$ packed form
3652H451095J07630O6913J56305J80548K13747J67414J36443J08620J62612J24922
3642I876249P5463J14679J28350O6246M5942J73428J06065J08907J50342J04157
3632A0949828K11203J77026K02300J88461R8748Q6251K13931J82868J87515K92760
3622A2790891K76490K33398K83726L58832L18970N26737N76033N81329O57024
3613A6603430R68245R36548Q94355Q49523R71743Q06489P71998P71148O72063
3604B4245542O73632M27444M36962K99830L10973K43344J97270Q0913L3706K1841
3594B6971457j35875k77472l29826m86966m40426n33866o12971n75939n08715
3585B3069401m66858l52303l01036k52411q8014J50736J94489K49115L58010N34050
$$ plain form
3575 23095179 23737475 24439941 25233142 26067880 27000537 27991111 29145208 30484040 31888722
3566 31888722 33467676 35130905 36933046 38870665 40997738 43394970 46029913 48831385
3558 48831385 52010215 55467283 59258169 63607927 68303298 73422163 78868598 84316650
3550 84316650 89829899 95221109 100284633 105199557 109822413 114182274 118238576 121804860
3542 121804860 124642978 126861497 128364299 129069333 129174970 128728013 127727912 126205432
3534 126205432 124385820 122324393 119916157 117256532 114258557 111038164 107607781 104079661
3526 104079661 100492572 96864052 93335550 90054161 87004756 84231138 81848498 79897110
3518 79897110 78611664 78077536 78351592 79564000 81691969 84261814 86098249 87169495
$$ packed form
3575B3095179O42296P02466P93201Q34738R32657R90574J154097J338832J404682
3566C1888722J578954J663229J802141J937619K127073K397232K634943K801472
3558D8831385L178830L457068L790886M349758M695371N118865N446435N448052
3550H4316650N513249N391210N063524M914924M622856M359861M056302L566284
3542A21804860K838118K218519J502802P05034J05637m46957j000101j522480
3534A26205432j819612k061427k408236k659625k997975l220393l430383l528120
3526A04079661l587089l628520l528502l281389l049405k773618k382640j951388
3518G9897110j285446n34128K74056J212408K127969K569845J836435J071246
$$ plain form
3510 87169495 88111775 89733746 92358166 95744749 99186850 101812923 103972647 106399777
3502 106399777 109646752 113736010 118482977 123626211 128683063 133510184 138196692 142497997
3494 142497997 146078276 148871911 151038800 152614974 153812887 155099479 156837478 159249421
3486 159249421 162340738 166010187 169112986 170778551 171346997 171316297 170993871 170161932 168038561
3477 168038561 163340814 156180367 147382890 138144249 129015541 120310743 112091554 104399753
3469 104399753 97478140 91242787 85753305 80791391 76442078 72717594 69348817 66440979
3461 66440979 63685229 60889627 58273670 55692106 53280236 50964186 48748916 46684744
3453 46684744 44658928 42700072 40932855 39297073 37789789 36459663 35259895 34286490
$$ packed form
3510H7169495R42280J621971K624420L386583L442101K626073K159724K427130
3502A06399777L246975M089258M746967N143234N056852M827121M686508M301305
3494A42497997L580279K793635K166889J576174J197913J286592J737999K411943
3486A59249421L091317L669449L102799J665565N68446l0700l22426q31939k123371
3477A68038561m697747p160447q797477r238641r128708q704798q219189p691801
3469A04399753o921613o235353n489482m961914m349313l724484l368777k907838
3461F6440979k755750k795602k615957k581564k411870k316050k215270k064172
3453D6684744k025816j958856j767217j635782j507284j330126j199768r73405
$$ plain form
3445 34286490 33338519 32402642 31762374 31176251 30616309 30082150 29758010 29518382 29249935
3436 29249935 29168246 29065675 28925272 28949477 29103532 29327027 29751540 30164441 30497758 30927151
3426 30927151 31384136 31796334 32062947 32158357 32307033 32309751 32179109 31908146 31553937 31105778
3416 31105778 30568701 30061060 29592062 29050846 28553227 28049649 27536637 27258327 26962191
3407 26962191 26690233 26381474 26024510 25627218 25196635 24778993 24292598 23834573 23383305
3398 23383305 22889987 22385115 21951839 21562949 21138900 20858689 20690261 20475339 20263463
3389 20263463 20017782 19817429 19812121 19762138 19830538 19982090 20155046 20455173 20783994 21217638
3379 21217638 21723382 22277497 22866355 23641857 24595560 25706469 27182610 29048736 31209916
$$ packed form
3445C4286490r47971r35877o40268n86123n59942n34159l24140k39628k68447
3436B9249935q1689j02571j40403K4205J54055K23495M24513M12901L33317M29393
3426C0927151M56985M12198K66613R5410J48676K718j30642k70963l54209m48159
3416C1105778n37077n07641m68998n41216m97619n03578n13012k78310k96136
3407B6962191k71958l08759l56964l97292m30583m17642m86395m58025m51268
3398B3383305m93318n04872m33276l88890m24049k80211j68428k14922k11876
3389B0263463k45681k00353n308m9983O8400J51552J72956L00127L28821M33644
3379B1217638N05744N54115N88858P75502R53703J110909J476141J866126K161180
$$ plain form
3370 31209916 33555985 35613797 37142486 37694437 36807243 35175892 33286685 31673793
3362 31673793 30264807 29170492 28320742 27659031 27179741 26870052 26775858 26776857 26952955 27357782
3352 27357782 27923227 28484974 29282991 30223334 31337129 32709385 34335299 36375835 38856329
3343 38856329 41703041 44682332 47292013 49387020 50429399 50440283 50006965 49660217 49878926
3334 49878926 50707545 52202330 53993117 56010930 58275109 60712281 63269454 65952118
3326 65952118 68680196 71356747 73984682 76072376 77671224 78736090 79347210 79525909
3318 79525909 79279246 78670270 77645811 76175008 74165652 71821860 69118941 66186217
3310 66186217 63076446 59778058 56525662 53331752 50095916 46873180 43877385 41158667
$$ packed form
3370C1209916K346069K057812J528689N51951q87194j631351j889207j612892
3362C1673793j408986j094315q49750o61711m79290l09689r4194R99J76098M04827
3352B7357782N65445N61747P98017R40343J113795J372256J625914K040536K480494
3343C8856329K846712K979291K609681K095007J042379J0884m33318l46748K18709
3334D9878926Q28619J494785J790787K017813K264179K437172K557173K682664
3326F5952118K728078K676551K627935K087694J598848J064866O11120J78699
3318G9525909k46663o08976j024459j470803k009356k343792k702919k932724
3310F6186217l109771l298388l252396l193910l235836l222736k995795k718718
$$ plain form
3302 41158667 38569225 36185846 33952989 31817285 29711648 27744931 25998108 24371203
3294 24371203 22790172 21246798 19900962 18699189 17579673 16517919 15546628 14732794
3286 14732794 13983632 13280019 12701949 12187823 11681724 11264741 10936003 10641775 10300086
3277 10300086 9953514 9727993 9484916 9320105 9120880 9016495 9018622 8997244 8955756 9018592
3267 9018592 9088079 9113345 9190102 9220295 9301122 9270212 9243994 9242247 9267575 9234165 9175277 8989521
3255 8989521 8805393 8660686 8470550 8290037 8029644 7690005 7435800 7331167 7159317 7010115
3245 7010115 6831442 6606973 6468681 6361653 6135322 5978970 5869694 5743474 5717354 5618896
3235 5618896 5453899 5337529 5222311 5151920 5092897 5070944 5011345 4916427 4807876 4779699 4747070
$$ packed form
3302D1158667k589442k383379k232857k135704k105637j966717j746823j626905
3294B4371203j581031j543374j345836j201773j119516j061754r71291q13834
3286A4732794p49162p03613n78070n14126n06099m16983l28738k94228l41689
3277A0300086l46572k25521k43077j64811j99225j04385K127k1378m1488O2836
3267I018592O9487K5266P6757L0193Q0827l0910k6218j747K5328l3410n8888j85756
3255H989521j84128j44707j90136j80513k60393l39639k54205j04633j71850j49202
3245G010115j78673k24469j38292j07028k26331j56352j09276j26220k6120r8458
3235E618896j64997j16370j15218p0391n9023k1953n9599r4918j08551k8177l2629
$$ plain form
3224 4747070 4772470 4791411 4750390 4754256 4712271 4678165 4760832 4806810 4831192 4797532 4777780 4797504
3212 4797504 4839888 4905846 4860810 4804480 4779741 4808534 4813135 4843898 4918334 4978438 4972191 5014026
3200 5014026 4940604 4901954 4914704 4893334 4884757 4952166 4977846 5012568 5088722 5131987 5062272 5053131
3188 5053131 5044438 5028099 5053072 4981495 4968728 4959442 5042635 4996986 4940872 4959576 5007544 5056354
3176 5056354 5135642 5155797 5186686 5226741 5310757 5385392 5486570 5544104 5633390 5694056 5679059
3165 5679059 5752104 5880452 5989658 6115626 6216816 6305785 6387769 6477489 6613938 6731021
3155 6731021 6857742 6863134 7072839 7150492 7284216 7437514 7613485 7768927 7949549 8061816
3145 8061816 8228627 8425906 8543869 8731169 8914356 9105217 9294002 9493057 9782845 10131136
$$ packed form
3224D747070K5400J8941m1021L866m1985l4106Q2667M5978K4382l3660j9752J9724
3212D797504M2384O5958m5036n6330k4739K8793M601L0763P4436O0104o247M1835
3200E014026p3422l8650J2750k1370q577O7409K5680L4722P6154M3265o9715r141
3188E053131q693j6339K4973p1577j2767r286Q3193m5649n6114J8704M7968M8810
3176E056354P9288K0155L0889M0055Q4016P4635J01178N7534Q9286O0666j4997
3165E679059P3045J28348J09206J25968J01190Q8969Q1984Q9720J36449J17083
3155F731021J26721N392K09705P7653J33724J53298J75971J55442J80622J12267
3145H061816J66811J97279J17963J87300J83187J90861J88785J99055K89788L48291
$$ plain form
3135 10131136 10494055 10843305 11232391 11647245 12166331 12656063 13022358 13583456 14185999
3126 14185999 14853443 15519417 16267094 17105703 17981910 18930026 19925554 21096708 22477955
3117 22477955 23919712 25357749 26922331 28600214 30336987 32221113 34320644 36612652
3109 36612652 39064755 41859804 44959199 48161996 51181910 53859722 56431179 59177517
3101 59177517 62310894 65964229 70022769 74233317 78809976 84014089 89853449 96576404
3093 96576404 104206753 113007618 122648955 133144215 144567324 157032810 171168253 187852594
3085 187852594 208583556 235248710 269099220 308881693 348991555 378006656 385596127
3078 385596127 372161222 346724423 319433723 295612982 274260076 252020902 227222667
$$ packed form
3135A0131136L62919L49250L89086M14854N19086M89732L66295N61098O02543
3126A4185999O67444O65974P47677Q38609Q76207R48116R95528J171154J381247
3117B2477955J441757J438037J564582J677883J736773J884126K099531K292008
3109C6612652K452103K795049L099395L202797L019914K677812K571457K746338
3101E9177517L133377L653335M058540M210548M576659N204113N839360O722955
3093I6576404P630349Q800865R641337J0495260J1423109J2465486J4135443J6684341
3085A87852594K0730962K6665154L3850510L9782473M0109862K9015101P589471
3078C85596127j3434905k5436799k7290700k3820741k1352906k2239174k4798235
$$ plain form
3071 227222667 201663808 178109035 157647126 140108428 124942094 111670247 100122547
3064 100122547 90361186 82089742 74834118 68607641 63114563 58213224 53999385 50235874
3056 50235874 46922346 43937471 41257604 38869992 36722454 34772345 32877769 31205759
3048 31205759 29679074 28188280 26772077 25357978 24167165 23052931 22049082 21036202
3040 21036202 20058251 19187670 18391785 17582069 16811451 16235646 15618610 15183735 14632184
3031 14632184 14165102 13664598 13237968 12828506 12396563 11938307 11619443 11273548 10892060
3022 10892060 10588533 10268900 9957679 9627398 9303353 9020075 8812170 8532087 8297931
3013 8297931 8050345 7893490 7578162 7219086 7008469 6801541 6639550 6408184 6217087 6101405
$$ packed form
3071B27222667k5558859k3554773k0461909j7538698j5166334j3271847j1547700
3064A00122547r761361q271444p255624o226477n493078m901339m213839l763511
3056E0235874l313528k984875k679867k387612k147538j950109j894576j672010
3048C1205759j526685j490794j416203j414099j190813j114234j003849j012880
3040B1036202r77951q70581p95885q09716p70618n75805o17036m34875n51551
3031A4632184m67082n00504m26630m09462m31943m58256l18864l45895l81488
3022A0892060l03527l19633l11221l30281l24045k83278k07905k80083k34156
3013H297931k47586j56855l15328l59076k10617k06928j61991k31366j91097j15682
$$ plain form
3003 6101405 5931335 5720955 5527149 5526237 5378042 5172868 5055653 4965143 4811664 4810193 4787532
2992 4787532 4701944 4551478 4508024 4423421 4367730 4338319 4257364 4236790 4164637 4178504 4103008
2981 4103008 4008287 3938088 3840847 3746721 3825499 3773450 3686226 3664959 3566226 3415768 3265403
2970 3265403 3280296 3281534 3167413 3123997 3066022 3030749 3076427 3062734 3009333 2930329 2933785 2831946
2958 2831946 2792545 2795615 2682809 2677106 2589154 2464220 2403923 2402886 2352715 2287238 2279450 2236242
2946 2236242 2282193 2258529 2191775 2150675 2163376 2075081 1999618 1941998 1935938 1951233 1939502 1912253
2934 1912253 1937150 1972991 1944808 1891156 1775579 1709627 1742967 1731451 1700551 1734193 1715329
2923 1715329 1683907 1665380 1656565 1625518 1589794 1523369 1459753 1493045 1463829 1284408 1319122
$$ packed form
3003F101405j70070k10380j93806r12j48195k05174j17215r0510j53479j471k2661
2992D787532q5588j50466m3454q4603n5691k9411q0955k0574p2153J3867p5496
2981D103008r4721p0199r7241r4126P8778n2049q7224k1267r8733j50458j50365
2970C265403J4893J238j14121m3416n7975l5273M5678j3693n3401p9004L456j01839
2958B831946l9401L070j12806n703q7952j24934o0297j037n0171o5477p788m3208
2946B236242M5951k3664o6754m1100J2701q8295p5463n7620o060J5295j1731k7249
2934A912253K4897L5841k8183n3652j15577o5952L3340j1516l0900L3642j8864
2923A715329l1422j8527q815l1047l5724o6425o3616L3292k9216j79421L4714
$$ plain form
2912 1319122 1352531 1366451 1402070 1413208 1430584 1402930 1376095 1406947 1364201 1302728 1292856 1413861
2900 1413861 1312627 1285886 1412564 1359561 1348939 1315301 1346329 1347537 1310493 1263904 1251113
2889 1251113 1234399 1244029 1204602 1206493 1290727 1260032 1227166 1236544 1245061 1276747 1281767 1232435
2877 1232435 1354845 1282147 1264028 1296279 1300414 1292763 1275662 1202298 1249807 1230313 1181556 1134863
2865 1134863 1118959 1121698 1090605 1133394 1175934 1167739 1108636 1040657 1051041 1134899 1182539 1163024
2853 1163024 1107974 1045877 1020013 1039632 1024222 972915 1039189 1050331 990326 942140 899392
2842 899392 877804 801036 941928 978885 965795 908396 980443 1055349 1101203 1030656 986524
2831 986524 1017745 1057333 1037476 1065051 1064008 1126402 1200108 1127247 1105521 1075163 1144422 1149467
$$ packed form
2912A319122L3409J3920L5619J1138J7376k7654k6835L0852m2746o1473r872J21005
2900A413861j01234k6741J26678n3003j0622l3638L1028J208l7044m6589j2791
2889A251113j6714R630l9427J891Q4234l0695l2866R378Q517L1686N020m9332
2877A232435J22410p2698j8119L2251M135p651j7101p3364M7509j9494m8757m6693
2865A134863j5904K739l1093M2789M2540q195n9103o7979J0384Q3858M7640j9515
2853A163024n5050o2097k5864J9619j5410n1307O6274J1142o0005m8186m2748
2842H99392k1588p6768J40892L6957j3090n7399P2047P4906M5854p0547m4132
2831I86524L1221L9588j9857K7575j043O2394P3706p2861k1726l0358O9259N045
$$ plain form
2819 1149467 1194608 1222877 1144580 1215181 1272454 1278141 1234748 1233977 1216518 1300351 1353497 1398021
2807 1398021 1566737 1579164 1608586 1592238 1701941 1833872 1959200 2086055 2271637 2472700
2797 2472700 2597523 2699180 2693294 2671069 2415748 2239261 2149893 2055832 1872744 1724550
2787 1724550 1687766 1579843 1416989 1352386 1235938 1171886 1155636 1168790 1122494 1056119 962657
2776 962657 891191 908817 909626 891054 887739 924607 916830 934932 855016 788357 763883 718844
2764 718844 719682 748830 745774 704007 628920 665291 601253 546320 593237 599343 661929 694981
2752 694981 646920 622949 629190 556337 531405 541048 542323 589653 629989 604726 562451 533209
2740 533209 504790 496236 556611 550583 562789 560563 529859 515251 553529 585198 593329 606646
$$ packed form
2819A149467M5141K8269p8297P0601N7273N687m3393p71j7459Q3833N3146M4524
2807A398021J68716J2427K9422j6348J09703J31931J25328J26855J85582K01063
2797B472700J24823J01657n886k2225k55321j76487q9368r4061j83088j48194
2787A724550l6784j07923j62854o4603j16448o4052j6250J3154m6296o6375r3462
2776I62657p1466J7626Q09j8572l315L6868p777J8102p9916o6659k4474m5039
2764G18844Q38K9148l056m1767p5087L6371o4038n4933M6917O106O2586L3052
2752F94981m8061k3971O241p2853k4932R643J275M7330M0336k5263m2275k9242
2740E33209k8419q554O0375o028J2206k226l0704j4608L8278L1669Q131J3317
$$ plain form
2728 606646 555326 494331 453732 479522 531418 545964 572783 526594 450168 439686 483198 412470
2716 412470 427089 359988 292737 360087 392694 496741 493258 515634 502392 505790 487145 482511
2704 482511 470301 519908 447347 374708 338275 419622 392986 406312 415568 364493 362126 335084
2692 335084 266776 319284 310262 383848 374116 332804 320356 310148 415079 336014 292114 317993
2680 317993 336787 370884 382868 338537 348304 397507 312972 317316 339849 278393 292960 420278
2668 420278 369335 261401 327834 362734 369568 399801 347655 364845 368428 432069 352411 342056
2656 342056 344410 338485 367159 367344 412639 300624 335886 302981 304229 309003 269408 262976 356777
2643 356777 308654 249413 310317 367251 358895 323221 329771 367114 410986 385535 317429 304531
$$ packed form
2728F06646n1320o0995m0599K5790N1896J4546K6819m6189p6426j0482M3512p0728
2716D12470J4619o7101o7251O7350L2607J04047l483K2376j3242L398j8645m634
2704D82511j2210M9607p2561p2639l6433Q1347k6636J3326R256n1075k367k7042
2692C35084o8308N2508r022P3586r732m1312j2448j0208J04931p9065m3900K5879
2680C17993J8794L4097J1984m4331R767M9203q4535M344K2533o1456J4567J27318
2668D20278n0943j07934O6433L4900O834L0233n2146J7190L583O3641p9658j0355
2656C42056K354n925K8674J85M5295j12015L5262l2905J248M774l9595o432R3801
2643C56777m8123n9241O0904N6934q356l5674O550L7343M3872k5451o8106j2898
$$ plain form
2631 304531 301418 357837 399590 394150 287441 223218 196034 211168 300106 336695 287527 265180
2619 265180 216007 265118 319273 297634 193564 279129 298870 264837 290417 203964 198020 162681
2607 162681 184140 272562 338868 359667 397111 297990 167629 256668 272604 255739 234019
2596 234019 211937 193008 282179 278572 218306 270972 276760 354980 377096 330294 250186 156232
2584 156232 301766 370042 324143 299462 265061 273365 331425 239220 285780 377678 267100
2573 267100 211440 200751 195983 262098 211653 220920 266873 219126 223091 207617 241069 244181
2561 244181 236393 185731 184328 247815 219393 210434 263646 244797 256028 261426 305930 244681
2549 244681 157653 194381 302903 279806 302322 300230 249413 198523 142955 125781 211488 307413
$$ packed form
2631C04531l113N6419M1753n440j06709o4223k7184J5134Q8938L6589m9168k2347
2619B65180m9173M9111N4155k1639j04070Q5565J9741l4033K5580q6453n944l5339
2607A62681K1459Q8422O6306K0799L7444r9121j30361Q9039J5936j6865k1720
2596B34019k2082j8929Q9171l607o0266N2666N788P8220K2116m6802q0108r3954
2584A56232J45534O8276m5899k4681l4401Q304N8060r2205M6560R1898j10578
2573B67100n5660j0689m768O6115n0445R267M5953m7747L965j5474L3452L112
2561B44181p788n0662j403O3487k8422q959N3212j8849J1231N398M4504o1249
2549B44681q7028L6728J08522k3097K2516k092n0817n0890n5568j7174Q5707R5925
$$ plain form
2537 307413 305661 249932 221856 206439 144067 162340 185053 144281 165997 174715 117259 74008
2525 74008 143562 195733 232321 211751 178338 250749 229385 174028 223665 247064 223072 152661
2513 152661 146451 289739 255194 245861 244377 254917 231175 185845 212914 165648 244217 267512
2501 267512 177548 229591 220990 205196 190277 155354 179226 166027 193524 192811 178415 141113
2489 141113 129007 187710 197848 120195 142645 148449 151418 228636 304575 204329 218417 200509
2477 200509 140089 160790 157392 112336 57294 69142 150539 183663 167096 204304 265187 273211
2465 273211 245204 203009 308734 324651 221483 284681 262890 177375 61442 115118 146505
2454 146505 166990 176843 179141 224468 204172 147374 144476 188834 207017 204324 183072 137184
$$ packed form
2537C07413j752n5729k8076j5417o2372J8273K2713m0772K1716Q718n7456m3251
2525G4008O9554N2171L6588k0570l3413P2411k1364n5357M9637K3399k3992p0411
2513A52661o210J43288l4545r333j484J0540k3742m5330K7069m7266P8569K3295
2501B67512q9964N2043q601j5794j4919l4923K3872j3199K7497p13j4396l7302
2489A41113j2106N8703J0138p7653K2450N804K969P7218P5939j00246J4088j7908
2477B00509o0420K0701l398m5056n5042J1848Q1397L3124j6567L7208O0883Q024
2465B73211k8007m2195J05725J5917j03168O3198k1791q5515j15933N3676L1387
2454A46505K0485R853K298M5327k0296n6798k898M4358J8183k693k1252m5888
$$ plain form
2442 137184 230228 126193 126941 133301 140120 168456 196504 139534 212989 200084 120325 215628
2430 215628 281078 305687 242376 225598 201514 267115 250199 283306 220111 233697 273619 345886
2418 345886 265993 257224 249591 195409 239291 253741 248099 340518 398826 330187 224291 332900
2406 332900 325350 245558 264839 250175 266570 340134 360810 379390 360824 385063 382297 331258
2394 331258 411996 478671 465785 452784 446315 408825 425116 402812 463120 415804 445937 409424
2382 409424 334984 323877 461934 433681 406363 421511 412168 475232 585059 518672 557468
2371 557468 591837 564133 609607 635572 722373 747954 668952 729159 716183 699123 788920 816822
2359 816822 868379 818809 897113 1058050 1085091 1192863 1327738 1354818 1422118 1424124 1544552
$$ packed form
2442A37184R3044j04035P48O360O819K8336K8048n6970P3455j2905p9759R5303
2430B15628O5450K4609o3311j6778k4084O5601j6916L3107o3195J3586L9922P2267
2418C45886p9893q769p633n4182M3882J4450n642R2419N8308o8639j05896J08609
2406C32900p550p9792J9281j4664J6395P3564K0676J8580j8566K4239k766n1039
2394C31258Q0738O6675j2886j3001o469l7490J6291k2304O0308m7316L0133l6513
2382D09424p4440j1107J38057k8253k7318J5148r343O3064J09827o6387L8796
2371E57468L4369k7704M5474K5965Q6801K5581p9002O0207j2976j7060Q9797K7902
2359H16822N1557m9570P8304J60937K7041J07772J34875K7080O7300K006J20428
$$ plain form
2348 1544552 1591534 1645533 1759851 1955164 2170149 2343480 2495073 2672656 2929298 3078841
2338 3078841 3165470 3291369 3404140 3562701 3760827 4049151 4448600 4882016 5273602 5635962
2328 5635962 5977611 6357626 6852129 7304121 7748218 8435344 9300733 10165345 11353999
2319 11353999 12854292 15148372 18158452 22223971 25412765 25538966 23376501 19847659
2311 19847659 16799512 14437461 12604998 11126894 9527435 8076068 7015292 6215434
2303 6215434 5630017 5131768 4778435 4470642 4151822 3797824 3449296 3188299 2917466 2739272
2293 2739272 2531905 2352996 2202652 2085433 1932356 1808094 1728048 1659357 1637487 1527694
2283 1527694 1431775 1350658 1333041 1298655 1167344 1019001 978473 970450 938192 927996 915746
$$ packed form
2348A544552M6982N3999J14318J95313K14985J73331J51593J77583K56642J49543
2338C078841Q6629J25899J12771J58561J98126K88324L99449M33416L91586L62360
2328E635962L41649L80015M94503M51992M44097O87126Q65389Q64612J188654
2319A1353999J500293K294080L010080M065519L188794J26201k162465l528842
2311A9847659l048147k362051j832463j478104j599459j451367j060776p99858
2303F215434n85417m98249l53333l07793l18820l53998l48528k60997k70833j78194
2293B739272k07367j78909j50344j17219j53077j24262q0046o8691k1870j09793
2283A527694r5919q1117j7617l4386j31311j48343m0528q023l2258j0196j2250
$$ plain form
2272 915746 877862 871362 857684 785282 807537 762919 763558 705615 694831 687859 631102 647411
2260 647411 638932 568143 575738 541466 465417 511152 511813 490743 471067 444041 414700 342287
2248 342287 356263 344392 371578 378250 428906 459352 436399 411786 358361 355292 323860 414565
2236 414565 366980 352771 340920 314766 340962 319651 300444 285454 359969 353472 283011 282547
2224 282547 270115 272046 334916 306785 232643 320001 291304 217680 216095 251535 187630 154349
2212 154349 167880 172523 161109 213868 133162 207820 274751 208330 172609 198171 174088 232892
2200 232892 256447 230988 300762 221992 280143 158567 193773 253767 217277 128702 157785
2189 157785 178935 160387 138019 131769 152623 147502 111404 89755 80338 79807 79328 107176 208561
$$ packed form
2272I15746l7884o500j3678p2402K2255m4618O39n7943j0784o972n6757J6309
2260F47411q479p0789P595l4272p6049M5735O61k1070j9676k7026k9341p2413
2248C42287J3976j1871K7186O672N0656L0446k2953k4613n3425l069l1432R0705
2236D14565m7585j4209j1851k6154K6196k1311j9207j4990P4515o497p0461m64
2224B82547j2432J931O2870k8131p4142Q7358k8697p3624j585L5440o3905l3281
2212A54349J3531M643j1414N2759q0706P4658O6931o6421l5721K5562k4083N8804
2200B32892K3555k5459O9774p8770N8151j21576L5206N9994l6490q8575K9083
2189A57785K1150j8548k2368o250K0854n121l6098k1649r417n31m79K7848J01385
$$ plain form
2176 208561 225407 268111 226763 209525 185740 127975 131842 172520 226060 174152 121608 155579
2164 155579 109324 92638 149564 198341 209899 207742 150043 179079 144750 156993 96232 82510
2152 82510 91775 123189 108792 167800 164755 71898 100250 84793 139852 142877 142867 165116 187354
2139 187354 190551 121070 83133 89595 194749 229261 64377 96467 73279 46911 77793 104431
2127 104431 97160 157496 127509 162260 50271 112611 137229 10227 128897 194616 178904
2116 178904 80171 69079 73905 15961 35806 146573 155686 201923 118921 58868 100826 48520
2104 48520 102079 103287 105358 220057 212498 156155 136648 66725 130905 121383 148972 132279
2092 132279 107808 122916 107812 103297 183610 147943 113853 140210 138822 153245 195489 190554
$$ packed form
2176B08561J6846M2704m1348j7238k3785n7765L867M0678N3540n1908n2544L3971
2164A55579m6255j6686N6926M8777J1558k157n7699K9036l4329J2243o0761j3722
2152H2510R265L1414j4397N9008l045r2857K8352j5457N5059L025j0K2249K2238
2139A87354L197o9481l7937O462J05154L4512j64884L2090k3188k6368L0882K6638
2127A04431p271O0336k9987L4751j11989O2340K4618j27002J18670O5719j5712
2116A78904r8733j1092M826n7944J9845J10767R113M6237q3002o0053M1958n2306
2104D8520N3559J208K071J14699p559n6343j9507o9923O4180r522K7589j6693
2092A32279k4471J5108j5104m515Q0313l5667l4090K6357j388J4423M2244m935
$$ plain form
2080 190554 179981 129640 123036 139805 85520 141769 47141 20535 7936 5912 11381 21480
2068 21480 69920 68097 88004 88466 93806 28793 46463 204503 156625 181106 268228 201576
2056 201576 209233 171178 157505 172508 213717 262325 160683 167479 144478 135797 122552 140221
2044 140221 183235 153282 132959 184443 254938 248795 168911 105671 101290 157941 133446 219211
2032 219211 208817 167920 126925 87174 21544 -46525 -31100 67488 101273 141242 137941 126888
2020 126888 120137 47069 114397 167310 97328 45624 90847 27579 64263 51248 -8438 -45555
2008 -45555 -40705 -6505 88085 67141 8366 91372 126058 141019 148043 118237 107270 98734
1996 98734 93255 62869 58494 47034 56337 100559 100792 55063 40324 79119 94721 103168 156675
$$ packed form
2080A90554j0573n0341o604J6769n4285N6249r4628k6606j2599k024N469J0099
2068B1480M8440j823J9907M62N340o5013J7670J58040m7878K4481Q7122o6652
2056B01576P657l8055j3673J5003M1209M8608j01642O796k3001q681j3245J7669
2044A40221M3014k9953k0323N1484P0495o143p9884o3240m381N6651k4495Q5765
2032B19211j0394m0897m0995l9751o5630o8069J5425R8588L3785L9969l301j1053
2020A26888o751p3068O7328N2913o9982n1704M5223o3268L6684j3015n9686l7117
2008d5555M850L4200R4590k0944n8775Q3006L4686J4961P024k9806j0967q536
1996I8734n479l0386m375j1460R303M4222K33m5729j4739L8795J5602Q447N3507
$$ plain form
1983 156675 90071 28800 4672 -11929 -14959 5602 33374 42350 87396 -5575 616 -168 -24879
1970 -24879 21870 27968 -17210 -28866 -49794 15312 10603 22175 27832 112870 104539 63736 48264
1957 48264 121789 127753 28887 -31653 -51388 -17961 -33905 -21285 32723 56226 21586 22427
1945 22427 7332 -41158 10353 108455 76078 109909 37244 73018 122201 120456 159471 132119
1933 132119 -878 20652 64441 60527 126316 92640 106173 114533 113675 93296 38918 48226
1921 48226 -20209 -14429 -23929 22360 81860 114335 126629 68118 60289 89308 47727 37233
1909 37233 18875 63201 112354 83202 119421 149506 67575 -45504 -4347 -18619 19239 25885
1897 25885 -40216 45306 132015 145390 122522 176384 168922 87632 53610 106380 130263 46961
$$ packed form
1983A56675o6604o1271k4128j6601l030K0561K7772Q976M5046r2971O191p84k4711
1970b4879M6749O098m5178j1656k0928O5106m709J1572N657Q5038q331m0803j5472
1957D8264P3525N964r8866o0540j9735L3427j5944J2620N4008K3503l4640Q41
1945B2427j5095m8490N1511R8102l2377L3831p2665L5774M9183j745L9015k7352
1933A32119j32997K1530M3789l914O5789l3676J3533Q360q58k0379n4378R308
1921D8226o8435N780r500M6289N9500L2475J2294n8511p829K9019m1581j0494
1909C7233j8358M4326M9153k9152L6219L0085q1931j13079M1157j4272L7858O646
1897B5885o6101Q5522Q6709J3375k2868N3862p462q1290l4022N2770K3883q3302
$$ plain form
1885 46961 -32413 2918 46214 49032 78995 109810 144264 105550 58034 111332 73292 69167
1873 69167 154008 106408 129522 133317 21065 -35845 43723 101216 96797 57728 -4155 35709
1861 35709 93692 94015 61848 90638 66005 72558 -31603 -2934 40623 -22840 63435 29150
1849 29150 16997 36173 14951 -23704 -34333 22698 -7508 -73709 -28196 36192 57236 63412
1837 63412 19002 46766 80779 -11726 24639 20144 87137 85725 -58045 -16153 18104 22504
1825 22504 56173 -52814 -87630 -49409 -80203 -77069 -31811 9510 22808 41350 9518 30883
1813 30883 28108 50663 9361 -4080 252 79647 140064 64269 18307 -33790 42599 64149
1801 64149 93048 128406 116268 108498 96256 141983 127474 16683 92122 105558 42024 49458
$$ packed form
1885D6961p9374L5331M3296K818K9963L0815L4454l8714m7516N3298l8040m125
1873F9167Q4841m7600K3114L795j12252n6910P9568N7493m419l9069o1883L9864
1861C5709N7983L23l2167K8790k4633O553j04161K8669M3557o3463Q6275l4285
1849B9150j2153J9176k1222l8655j0629N7031l0206o6201M5513O4388K1044O176
1837F3412m4410K7764L4013r2505L6365m495O6993j412j43770M1892L4257M400
1825B2504L3669j08987l4816L8221l0794L134M5258M1321J3298J8542l1832K1365
1813C0883k775K2555m1302j3441M332P9395O0417p5795m5962n2097P6389K1550
1801F4149K8899L5358j2138p770j2242M5727j4509j10791P5439J3436o3534P434
$$ plain form
1789 49458 156468 159726 122614 168740 112612 75804 43489 38137 90375 97654 28442 -11553
1777 -11553 48818 11356 63938 113992 135240 96783 45313 51637 45732 -13097 198 35081
1765 35081 28831 58058 70277 40000 116544 94452 53209 -25600 -82993 -159 -11054 -24788
1753 -24788 -107328 -65476 -107652 -34568 54246 86995 36151 -41269 -30525 65127 25486 -66492
1741 -66492 -95560 -105395 -55851 64789 113940 74896 106027 69992 99940 88399 34041 -22200
1729 -22200 40542 49418 46598 21532 -10584 2144 16533 11498 -34339 49200 91243 119888
1717 119888 78100 110480 111477 94691 76741 -33752 -3626 30504 8924 -63636 22815 77431
1705 77431 45972 856 -16299 -71754 6309 38416 87841 81382 53527 42388 -10550 -66166
$$ packed form
1789D9458J07010L258l7112M6126n6128l6808l2315n352N2238P279o9212l9995
1777a1553O0371l7462N2582N0054K1248l8457n1470O324n905n8829J3295L4883
1765C5081o250K9227J2219l0277P6544k2092m1243p8809n7393Q2834j0895j3734
1753b4788q2540M1852m2176P3084Q8814L2749n0844p7420J0744R5652l9641r1978
1741f6492k9068r835M9544J20640M9151l9044L1131l6035K9948j1541n4358n6241
1729b2200O2742Q876k820k5066l2116J2728J4389n035m5837Q3539M2043K8645
1717A19888m1788L2380R97j6786j7950j10493L0126L4130k1580p2560Q6451N4616
1705G7431l1459m5116j7155n5455P8063L2107M9425o459k7855j1139n2938n5616
$$ plain form
1693 -66166 63817 133683 27792 17219 -7713 -444 -51137 -37050 -59710 -86330 -23327 18996
1681 18996 76734 88086 57973 6389 8486 47934 -75314 45674 51703 21149 -7789 -67253
1669 -67253 -19383 108198 79078 46431 58840 31044 1674 58070 9115 5925 35296 132405
1657 132405 139014 26392 44112 -30495 -81873 -1921 51472 95564 88684 74284 -2074 -24027
1645 -24027 -171670 -92475 -36807 12899 -16461 56213 157406 76223 65320 37284 67899
1634 67899 62071 68360 939 -2431 -19505 -17932 -38272 50061 62502 41448 62436 9686 28216
1621 28216 55203 121441 103561 12964 -4164 -26739 69286 80036 46240 -19574 116423 64733
1609 64733 5458 -43260 13495 16173 -32393 39912 18523 -3239 13595 25519 -56883 -62369
$$ packed form
1693f6166J29983O9866j05891j0573k4932P269n0693J4087k2660k6620O3003M2323
1681A8996N7738J1352l0113n1584K097L9448j23248J20988O029l0554k8938n9464
1669f7253M7870J27581k9120l2647J2409k7796k9370N6396m8955l190K9371R7109
1657A32405O609j12622J7720p4607n1378P9952N3393M4092o880j4400p6358k1953
1645b4027j47643P9195N5668M9706k9360P2674J01193q1183j0903k8036L0615
1634F7899n828O289o7421l370j7074J573k0340Q8333J2441k1054K0988n2750J8530
1621B8216K6987O6238j7880r0597j7128k2575R6025J0750l3796o5814J35997n1690
1609F4733n9275m8718N6755K678m8566P2305k1389k1762J6834J1924q2402n486
$$ plain form
1597 -62369 -30369 943 -17129 -64655 -38812 9904 -130 -70952 -92920 -39336 78922 93951
1585 93951 52320 63552 25153 -11516 40516 61880 21910 9681 101344 114820 92306 51122
1573 51122 40008 -25665 22578 -42491 -73356 34970 9087 20479 102525 133562 48182 77342
1561 77342 102785 107629 -9781 -3746 42434 126649 144684 43512 50107 51556 111819 140771
1549 140771 53695 -5214 -15986 -2343 -46362 10294 106385 75883 17370 2523 -568 -5404
1537 -5404 26095 -17987 8823 -15741 -51006 -56721 11252 66690 70507 35083 -30740 -94854
1525 -94854 -18906 19693 -12352 -8493 80929 89323 5660 31486 54921 -7976 21466 83320
1513 83320 103160 163079 140133 82167 -35935 -32476 -2335 -49950 60227 85139 109842 136473
$$ packed form
1597f2369L2000L1312j8072m7526K5843M8716j0034p0822k1968N3584J18258J5029
1585I3951m1631J1232l8399l6669N2032K1364l9970j2229R1663J3476k2514m1184
1573E1122j1114o5673M8243o5069l0865J08326k5883J1392Q2046L1037q5380K9160
1561G7342K5443M844j17410O035M6180Q4215J8035j01172O595J449O0263K8952
1549A40771q7076n8909j0772J3643m4019N6656R6091l0502n8513j4847l091m836
1537e404L1499m4082K6810k4564l5265n715O7973N5438L817l5424o5823o4114
1525i4854P5948L8599l2045L859Q9422Q394q3663K5826K3435o2897K9442O1854
1513H3320J9840N9919k2946n7966j18102L459L0141m7615J10177K4912K4703K6631
$$ plain form
1501 136473 122642 10389 -86348 1184 494 32883 17232 22344 93264 -348 50959 77149
1489 77149 -1647 21242 64021 62202 75213 48655 19201 57381 15842 86447 38024 65908
1477 65908 22314 -5927 -12769 24322 2567 -30532 -76447 -51680 -86315 -52966 14007 -27705
1465 -27705 -47380 3830 -6762 18196 -27238 -28620 -39604 -91780 -39019 -23065 61034 75155
1453 75155 38681 103610 55872 25699 -40451 -22354 -52936 -7115 21097 3422 4019 96280
1441 96280 85716 38127 85945 29128 -61994 -86822 1759 25856 6396 -16896 35777 46012
1429 46012 103771 79806 91223 49093 63279 50745 4307 -30284 -51235 -37691 86500 74048
1417 74048 -10997 -38447 20083 21808 18642 57557 33704 -2647 13303 16394 52294 84370
$$ packed form
1501A36473j3831j12253r6737Q7532o90L2389j5651N112P0920r3612N1307K6190
1489G7149p8796K2889M2779j819J3011k6558k9454L8180m1539P0605m8423K7884
1477F5908m3594k8241o842L7091k1755l3099m5915K4767l4635L3349O6973m1712
1465b7705j9675N1210j0592K4958m5434j382j0984n2176N2761J5954Q4099J4121
1453G5155l6474O4929m7738l0173o6150J8097l0582M5821K8212j7675N97R2261
1441I6280j0564m7589M7818n6817r1122k4828Q8581K4097j9460k3292N2673J0235
1429D6012N7759k3965J1417m2130J4186j2534m6438l4591k0951J3544J24191j2452
1417G4048q5045k7450N8530J725l166L8915k3853l6351J5950L091L5900L2076
$$ plain form
1405 84370 73328 27269 -14212 -66550 -65000 -11191 49071 24527 -16859 -90545 -109217 32937
1393 32937 101074 133426 115399 55797 62490 -25583 -10602 24836 84544 87075 114699 100019
1381 100019 25915 6682 29214 20987 70220 70867 38068 -16438 -14689 -35909 -78033 -36087
1369 -36087 -48885 23708 59465 571 -49156 -8476 5864 16623 16957 65716 881 -84312
1357 -84312 -39567 40793 -39030 -33497 63586 19288 823 21200 21029 36061 -6617 46987
1345 46987 42053 -91553 -15908 -23896 -18815 46170 82043 75032 108692 107048 -31630 -71072
1333 -71072 -44161 26784 -29184 -52917 11414 62514 54773 77368 62251 108213 43050 -49590
1321 -49590 5098 -42794 -14024 -18048 -40189 -12214 18387 -8028 -79739 -39115 3036 22294
$$ packed form
1405H4370j1042m6059m1481n2338J550N3809O0262k4544m1386p3686j8672J42154
1393C2937O8137L2352j8027n9602O693q8073J4981L5438N9708K531K7624j4680
1381A00019p4104j9233K2532q227M9233O47l2799n4506J749k1220m2124M1946
1369c6087j2798P2593L5757n8894m9727M0680J4340J0759L34M8759o4835q5193
1357h4312M4745Q0360p9823N533R7083m4298j8465K0377j71J5032m2678N3604
1345D6987m934j33606P5645p988N081O4985L5873p011L3660j644j38678l9442
1333g1072K6911P0945n5968k3733O4331N1100p741K2595j5117M5962o5163r2640
1321d9590N4688m7892K8770m024k2141K7975L0601k6415p1711M0624M2151J9258
$$ plain form
1309 22294 67677 102224 13539 -29418 2319 27845 -125143 -97690 -47010 -52887 -41282 39509
1297 39509 64461 13382 34390 -30391 -24700 -54535 -28609 -44290 -30007 -37212 -46529 -12307
1285 -12307 -34157 -67595 -17726 70066 67866 27379 -68278 -35219 -5499 11627 28259 46633
1273 46633 79080 68345 -1251 -107984 -60617 -2773 28531 17708 7998 37015 131351 164533
1261 164533 127166 96858 74396 15657 56962 76476 7632 -66662 -102938 -70754 -11794 53697
1249 53697 108382 100517 82327 69567 -8169 -83900 -38128 -5557 -48203 -79215 -102939 -43613
1237 -43613 -4937 13150 56728 28556 17541 25363 17906 60694 42196 -13188 -45952 -50691
1225 -50691 -24242 53511 86205 69012 34043 -32227 -74629 -41315 -25332 16849 12647 -43248
$$ packed form
1309B2294M5383L4547q8685m2957L1737K5526j52988K7453N0680n877J1605Q0791
1297C9509K4952n1079K1008o4781N691k9835K5926j5681J4283p205r317L4222
1285a2307k1850l3438M9869Q7792k200m0487r5657L3059K9720J7126J6632J8374
1273D6633L2447j0735o9596j06733M7367N7844L1304j0823r710K9017R4336L3182
1261A64533l7367l0308k2462n8739M1305J9514o8844p4294l6276L2184N8960O5491
1249E3697N4685p865j8190j2760p7736p5731M5772L2571m2646l1012k3724N9326
1237d3613L8676J8087M3578k8172j1015P822p457M2788j8498n5384l2764m739
1225e0691K6449P7753L2694j7193l4969o6270m2402L3314J5983M2181m202n5895
$$ plain form
1213 -43248 -53662 -44695 -55600 -15219 -73276 -18512 -13516 -15908 -49147 -131418 -130503 -3468 80648
1200 80648 53380 -45574 -67368 -13721 -28399 -47496 -93135 -58894 53821 63908 -66911
1189 -66911 14037 43667 -4401 -38317 -48626 -72576 -75752 -36574 -44559 -1240 15929 -34794
1177 -34794 -52103 -101854 -53993 30683 65030 -29070 -31472 -9409 20613 47566 3699 28299
1165 28299 -51828 -67256 -112184 -51058 58142 20296 4571 -50 -42286 -30082 19523 55684
1153 55684 105900 4171 -29183 -29701 -6271 63827 62811 -18039 -4085 32257 35702 501
1141 501 47433 31640 -18186 -20900 362 36700 -42667 -80477 -63759 -37685 -13619 -64891
1129 -64891 3348 -1094 -54136 -94033 -41154 -44117 -73886 -54185 3265 -11995 73145 79872
$$ packed form
1213d3248j0414Q967j0905M0381n8057N4764M996k392l3239q2271R15J27035Q4116
1200H0648k7268r8954k1794N3647j4678j9097m5639L4241J12715J0087j30819
1189f6911Q0948K9630m8068l3916j0309k3950l176L9178p985M3319J7169n0723
1177c4794j7309m9751M7861Q4676L4347r4100k402K2063L0022K6953m3867K4600
1165B8299q0127j5428m4928O1126J09200l7846j5725m621m2236J2204M9605L6161
1153E5684N0216j01729l3354n18K3430P0098j016q0850J3954L6342L445l5201
1141E01M6932j5793m9826k714K1262L6338p9367l7810J6718K6074K4066n1272
1129f4891O8239m442n3042l9897N2879k963k9769J9701N7450j5260Q5140O727
$$ plain form
1117 79872 -7837 17265 99666 18882 -60972 33035 59606 -17630 -64822 -103190 -135198 -36925
1105 -36925 -44725 57049 127839 85606 28630 7989 71922 99629 36903 62649 7406 -19141
1093 -19141 -23213 7250 8336 6245 -13986 10251 35732 39782 32686 133099 127035 116758 -70428
1080 -70428 -25042 -60847 -12513 90064 11785 16765 18746 6077 15621 41937 14793 -21675
1068 -21675 -71929 -22394 -44802 -61013 -56045 -43126 -22357 -32753 -143349 -133685 -48498 -52886
1056 -52886 -18920 -48550 -38686 23202 -4833 -55393 -58985 -14366 -9703 -47108 39469 5068
1044 5068 50215 99120 12295 69880 197 -94758 -101968 -64100 -32285 -27337 49199 -3291
1032 -3291 -19784 85988 105731 105648 12113 -3771 69246 44411 -23009 30167 -17912 15416
$$ packed form
1117G9872q7709K5102Q2401q0784p9854R4007K6571p7236m7192l8368l2008R8273
1105c6925p800J01774P0790m2233n6976k0641O3933K7707o2726K5746n5243k6547
1093a9141m072L0463J086k091k0231K4237K5481M050p096J00413o064j0277j87186
1080g0428M5386l5805M8334J02577p8279M980J981j2669R544K6316k7144l6468
1068b1675n0254M9535k2408j6211M968J2919K0769j0396j10596R664Q5187m388
1056e2886L3966k9630R864O1888k8035n0560l592M4619M663l7405Q6577l4401
1044E068M5147M8905q6825N7585o9683r4955p210L7868L1815M948P6536n2490
1032c291j6493J05772J9743q3r3535j5884P3017k4835o7420N3176m8079L3328
$$ plain form
1020 15416 -36360 48893 44457 -12398 -46126 11730 15870 9163 -10001 -31041 -37094 -33474 -38609
1007 -38609 -45683 -33266 -51230 -84893 31329 4156 4147 -25255 -24674 -38348 -54496 -45123 -82810
994 -82810 -30557 -44050 20098 -3494 -42165 -96932 -80698 -37613 42286 -5844 -5933 -15488 65146
981 65146 102095 83183 9336 30422 16205 -17838 -18064 -41534 -3535 67592 75627 -55533
969 -55533 -57154 -49234 -6572 -41659 -74669 -32699 21677 30933 3238 49935 30519 678 11162
956 11162 -5184 -10786 24164 28070 60101 36463 36352 -14970 15005 30209 77082 28644 -112207
943 -112207 -149683 -44056 4413 12653 -24042 -52045 -29019 -37041 -77848 -51240 -37026 -74109
931 -74109 -33924 -32496 -68135 -67584 -31843 981 21345 2461 -1674 895 42403 -21408 -52727
$$ packed form
1020A5416n1776Q5253m436n6855l3728N7856M140o707j9164k1040o053L620n135
1007c8609p074J2417j7964l3663J16222k7173rk9402N81j3674j6148R373l7687
994h2810N2253j3493O4148k3592l8671n4767J6234M3085P9899m8130q9r555Q0634
981F5146L6949j8912p3847K1086j4217l4043k26k3470L7999P1127Q035j31160
969e5533j621P920M2662l5087l3010M1970N4376R256k7695M6697j9416k9841J0484
956A1162j6346n602L4950L906L2031k3638j11n1322K9975J5204M6873m8438j40851
943a12207l7476J05627M8469Q240l6695k8003K3026q022m0807K6608J4214l7083
931g4109M0185J428l5639N51L5741L2824K0364j8884m135K569M1508o3811l1319
$$ plain form
918 -52727 11232 11667 -5971 -70631 -74399 -40433 -33045 -11950 -22663 -10480 19410 20473 -8086
905 -8086 -36429 -20804 23167 -42877 -46600 -67298 -59559 -76238 -36198 3698 46785 51007 -32634
892 -32634 -43557 -1293 -34233 -19531 -50628 -58628 -40123 16041 67458 -35760 -9596 -5925
880 -5925 -31195 -27564 15843 -34126 -113882 8175 -34227 29216 56896 7401 -3526 -92998
868 -92998 11235 31064 -67985 -15389 -98520 -105203 5591 21187 37892 37527 33064 5719
856 5719 -59642 -104611 -93794 -73462 -28706 -68368 -66785 -13817 45895 9936 17997 -68834 -34469
843 -34469 -59441 -28357 26913 368 -77556 -103043 -7652 -10682 -75952 7702 44640 -21446
831 -21446 18261 20649 26497 74654 77888 19990 35248 85982 63922 29362 37237 74095 195859
$$ packed form
918e2727O3959M35j7638o4660l768L3966P388K1095j0713J2183K9890J063k8559
905h086k8343J5625M3971o6044l723k0698P739j6679M0040L9896M3087M222q3641
892c2634j0923M2264l2940J4702l1097q000J8505N6164N1417j03218K6164L671
880e925k5270L631M3407m9969p9756J22057m2402O3443K7680m9495j0927q9472
868i2998J04233J9829r9049N2596q3131o683J10794J5596J6705l65m463k7345
856E719o5361m4969J0817K0332M4756l9662J583N2968N9712l5959Q061q6831L4365
843c4469k4972L1084N5270k6545p7924k5487R5391l030o5270Q3654L6938o6086
831b1446L9707K388N848M8157L234n7898J5258N0734k2060l4560P875L6858J21764
$$ plain form
818 195859 158561 -22604 -56245 38703 21087 -4328 -59905 -67587 -67231 -27304 73552 96496
806 96496 14574 41759 75109 42589 100161 41009 61647 72270 54316 87348 35851 43019
794 43019 50337 7817 -55294 15821 84283 50528 36693 5314 21665 89983 88628 109510
782 109510 37931 26919 69798 5821 -3796 69818 1214 -84907 -38113 -2354 -95497 -62207
770 -62207 -22814 15915 4427 -55907 38095 -3274 32885 44827 6436 -25170 957 45327
758 45327 37147 -25865 -22471 19711 52730 121529 53211 15582 42037 148518 32899 -9676
746 -9676 -20458 -46780 -44361 -31368 -19314 -33552 2529 -34406 -12373 -1445 -39930 -67180
734 -67180 -90461 -57351 26450 63035 17489 -8536 -10497 -15512 18521 -28237 -32871 -76175 -112741
$$ packed form
818A95859l7298j81165l3641R4948j7616k5415n5577p682L56L9927J00856K2944
806I6496q1922K7185L3350l2520N7572n9152K0638J0623j7954L3032n1497P168
794D3019P318m2520o3111P1115O8462l3755j3835l1379J6351O8318j355K0882
782A09510p1579j1012M2879o3977r617P3614o8604q6121M6794L5759r3143L3290
770f2207L9393L8729j1488o0334R4002m1369L6159J1942l8391l1606K6127M4370
758D5327q180o3012L394M2182L3019O8799o8318l7629K6455J06481j15619m2575
746i676j0782k6322K419J2993J2054j4238L6081l6935K2033J0928l8485k7250
734f7180k3281L3110Q3801L6585m5546k6025j961n015L4033m6758m634m3304l6566
$$ plain form
721 -112741 -154199 -57688 -11515 37668 -16211 -26751 76609 69119 -28295 -73745 -107871 -71526
709 -71526 -64139 -99551 -52896 76675 130633 69130 46306 86676 76873 70356 40936 -67604
697 -67604 -102866 -9156 42332 18429 -4242 -8851 7803 68036 46032 -45486 -31110 -56778
685 -56778 23596 26183 -6989 -2812 -42250 944 30095 55835 34369 33408 -59539 -45933 -101201
672 -101201 -105832 -17852 -13004 21274 -27659 -27583 -53138 -91241 31376 81074 -1345 -3034 -18947
659 -18947 -17179 -43521 -50950 37177 39613 -40439 -101673 -114006 -68275 -26579 12211 -48365 -39785
646 -39785 10972 35255 -17049 -60776 -79252 -51765 9581 41779 -13604 27146 -64268 -32059
634 -32059 37602 41093 -53690 -25389 -25747 50742 123625 103370 94064 58046 14361 -39635 -23365
$$ packed form
721a12741m1458R6511M6173M9183n3879j0540J03360p490r7414m5450l4126L6345
709g1526P387l5412M6655J29571N3958o1503k2824M0370r803o517k9420j08540
697f7604l5262R3710N1488k3903k2671m609J6654O0233k2004r1518J4376k5668
685e6778Q0374K587l3172M177l9438M3194K9151K5740k1466r61r2947J3606n5268
672a01201m631Q7980M848L4278m8933P6k5555l8103J22617M9698q2419j689j5913
659a8947J768k6342p429Q8127K436q0052o1234j2333M5731M1696L8790o0576Q580
646c9785N0757K4283n2304m3727j8476K7487O1346L2198n5383M0750r1414L2209
634c2059O9661L491r4783K8301l58P6489P2883k0255r306l6018m3685n3996J6270
$$ plain form
621 -23365 20877 -45839 -48851 39822 28176 -47950 -57153 -12223 -23031 43351 31636 -9382
609 -9382 -24286 28650 30095 21675 45542 -38591 -34121 -16073 -13126 49548 65702 24042 -15747
596 -15747 -18790 -12557 24893 -8631 -14519 2585 82416 34801 89830 85279 37710 652 -84096
583 -84096 11106 -2817 -100567 -109053 -137823 -108948 -176821 -49544 6271 5780 -26132 -101712
571 -101712 -44536 -32138 -20650 -6496 14358 -44594 -99530 -101214 -137488 -50149 1964 -78342
559 -78342 -111494 -82140 -87941 -79345 -75569 -28163 -61149 4229 43199 22008 42356 25453 49201
546 49201 22039 10101 23283 41294 -25935 -18397 -25882 105064 116581 74447 -4850 -19696
534 -19696 -39640 -66199 -14996 -40197 5584 32521 45614 -35648 -23364 561 -86966 -91952
$$ packed form
621b3365M4242o6716l012Q8673j1646p6126r203M4930j0808O6382j1715m1018
609i382j4904N2936J445q420K3867q4133M470J8048K947O2674J6154m1660l9789
596a5747l043O233L7450l3524n888J7104P9831m7615N5029m551m7569l7058q4748
583h4096R5202j3923r7750q486k8770K8875o7873J27277N5815m91l1912p5580
571a01712N7176J2398J1488J4154K0854n8952n4936j684l6274Q7339N2113q0306
559g8342l3152K9354n801Q596L776M7406l2986O5378L8970k1191K0348j6903K3748
546D9201k7162j1938J3182J8011o7229P538p485J30946J1517m2134p9297j4846
534a9696j9944k6559N1203k5201M5781K6937J3093q1262J2284K3925q7527m986
$$ plain form
522 -91952 -70419 -66881 -106550 -82048 -70554 -34352 4 -39276 -126305 -86424 2523 -67968
510 -67968 -108077 -117106 -82787 -28081 -26905 14655 -39864 -49159 8474 14173 36605 -16263 19770
497 19770 -33345 -114108 -43236 -77539 -105108 -104460 -81367 -7445 -83937 -45644 -63295 6828
485 6828 -27577 -88491 -81742 57349 82409 -51220 -113292 -38496 16950 -12272 17911 -39680
473 -39680 -572 -32520 -24071 2192 -63772 -46026 -54592 -43168 -43911 -9398 64564 21559 -47231
460 -47231 -65989 38795 16571 -51000 -58241 -57353 -45754 -57460 -80402 -45757 -49356 -391 -83487
447 -83487 -84566 -77825 -33897 -44721 -15881 -50674 -117292 -79554 -28770 -21754 -39443 -53440 -54094
434 -54094 2765 68369 15840 -1611 106076 76695 -1525 25982 -19524 -71927 -38241 -62508
$$ packed form
522i1952K1533L538l9669K4502J1494L6202L4356l9280q7029L9881Q8947p0491
510f7968m0109r029L4319N4706J176M1560n4519r295N7633N699K2432n2868L6033
497A9770n3115q0763P0872l4303k7569O48K3093P3922p6492L8293j7651P0123
485F828l4405o0914O749J39091K5060j33629o2072P4796N5446k9222L0183n7591
473c9680L9108l1948Q449K6263o5964J7746q566J1424p43L4513P3962m3005o8790
460d7231j8758J04784k2224o7571p241Q88J1599j1706k2942L4645l599M8965q3096
447h3487j079O741M3928j0824K8840l4793o6618L7738N0784P016j7689j3997o54
434e4094N6859O5604n2529j7451J07687k9381p8220K7507m5506n2403L3686k4267
$$ plain form
422 -62508 -25567 487 -20655 -4950 21062 -4777 -62030 -21393 46027 46838 70415 8326
410 8326 -6726 -21599 48056 9794 -8046 -31650 -74652 -62763 -44893 36606 36730 6421 -97946
397 -97946 -123863 -18514 8742 20873 4893 -32204 44020 66934 -23808 -14236 23916 40544
385 40544 17647 -10412 -104149 -40862 67222 -34051 -94109 -114108 -131728 -104081 -61351 -95039
373 -95039 -26287 65629 57509 6491 -13498 25051 45626 10574 37475 -34100 -12398 -52595
361 -52595 -49839 13898 -17448 41447 52405 -7058 -7983 -21356 6849 10372 33184 116830 96253
348 96253 76684 -41831 -22897 -86850 -37191 -3903 68444 83109 59567 72337 8723 -27086
336 -27086 -30366 -111779 -116420 -52519 -77680 -46774 -25547 -43365 -15001 -36750 -24189 -27582 15641
$$ packed form
422f2508L6941K6054k1142J5705K6012k5839n7253M0637O7420Q11K3577o2089
410H326j5052j4873O9655l8262j7840k3604m3002J1889J7870Q1499J24l0309j04367
397i7946k5917J05349K7256J2131j5980l7097P6224K2914r0742R572L8152J6628
385D0544k2897k8059r3737O3287J08084j01273o0058j9999j7620K7647M2730l3688
373i5039O8752R1916q120n1018j9989L8549K0575l5052K6901p1575K1702m0197
361e2595K756O3737l1346N8895J0958n9463r25j3373K8205L523K2812Q3646k0577
348I6253j9569j18515J8934o3953M9659L3288P2347J4665k3542J2770o3614l5809
336b7086l280q1413m641O3901k5161L0906K1227j7818K8364k1749J2561l393M3223
$$ plain form
323 15641 25980 27925 -11717 -58895 -35684 -74877 -49076 -22377 -41846 -102213 -30838 -19509
311 -19509 -26235 -57201 -135844 -150357 -95648 -27387 -25939 -72885 -128392 -40770 32437 -55734
299 -55734 -28754 13114 33632 80249 61176 24736 8335 -60862 -20080 -51031 -102409 -69239
287 -69239 -47423 1166 14723 56913 35170 -30653 -71954 -109557 -37313 9542 997 -5208
275 -5208 -73611 -87056 -52527 -57817 -94725 -48390 -33636 -115806 -46031 684 -19304 -69122
263 -69122 -85617 -32338 -10362 -71714 -23246 -18221 -41273 -67325 -53392 -23264 -17415 -23098 -16383
250 -16383 -25357 -19709 -17864 -30989 -51293 -13562 -50224 -124515 -85855 -40908 -37270 -25759 13426
237 13426 -12628 7647 18515 39532 31297 -1198 1475 47192 75169 6968 -20077 -50327
$$ packed form
323A5641J0339J945l9642m7178K3211l9193K5801K6699j9469o0367P1375J1329
311a9509o726l0966p8643j4513N4709O8261J448m6946n5507Q7622P3207q8171
299e5734K6980M1868K0518M6617j9073l6440j6401o9197M0782l0951n1378L3170
287f9239K1816M8589J3557M2190k1743o5823m1301l7603P2244M6855q545o205
275e208o8403j3445L4529n290l6908M6335J4754q2170O9775M6715j9988m9818
263f9122j6495N3279K1976o1352M8468N025k3052k6052J3933L0128N849n683O715
250a6383q974N648J845j3125k0304L7731l6662p4291L8660M4947L638J1511L9185
237A3426k6054K0275J0868K1017q235l2495K673M5717K7977o8201k7045l0250
$$ plain form
225 -50327 42274 18776 41967 77092 41040 16871 -19038 25553 -13388 9982 -9381 2916
213 2916 -37788 -50285 -16552 -47657 -72919 -304 -49724 -58043 -32324 -25907 -25016 -2147 -60507
200 -60507 -38324 -75798 -110113 -50380 18611 40460 17245 39649 -11085 -65578 1916 -16989
188 -16989 -58976 -284 -13555 -35105 5169 13690 38034 -44209 -73979 -64250 -69473 -33318 -49888
175 -49888 -34703 -37282 1905 -4789 -22274 -51942 -89606 11978 -512 -76010 -91780 -58246
163 -58246 -70166 -63989 -25067 -49413 -64441 -78153 -103255 -132891 -106134 -128964 -11285 -73115
151 -73115 -52106 -29830 -50903 -24130 -55060 -77800 -6336 -40686 -47960 -2055 -24893 18389
139 18389 -7947 -68565 -95814 -100950 -80380 -39784 -33239 -62483 -96366 -152523 -153295 -184148 -174793
$$ packed form
225e0327R2601k3498K3191L5125l6052k4169l5909M4591l8941K3370j9363J2297
213B916m0704j2497L3733l1105k5262P2615m9420q319K5719O417Q91K2869n8360
200f0507K2183l7474l4315N9733O8991K1849k3215K2404n0734n4493O7494j8905
188a6989m1987N8692j3271k1550M0274Q521K4344q2243k9770R729n223L6155j6570
175d9888J5185k579L9187o694j7485k9668l7664J01584j2490p5498j5770L3534
163e8246j1920O177L8922k4346j5028j3712k5102k9636K6757k2830J17679o1830
151g3115K1009K2276k1073K6773l0930k2740P1464l4350p274M5905k2838M3282
139A8389k6336o0618k7249n136K0570M0596O545k9244l3883n6157p72l0853R355
$$ plain form
126 -174793 -88002 -35874 -18563 9307 -48996 -32955 7430 -18140 -44624 -90494 -27904 -69312
114 -69312 -11012 -80163 -120549 -41323 -59248 -95814 -81168 -65243 -84070 -85267 -60060 -29973
102 -29973 -18852 2100 13784 -9797 13405 20009 -27119 -59813 -114998 -124904 -42437 -99223
90 -99223 -73484 18365 12167 -18357 -17095 -21756 -19 -519 32458 55167 63556 -17114 -53307
77 -53307 -40580 -46722 -16126 -49582 -30630 -1917 -29753 -54300 -89134 -61246 18043 -36945
65 -36945 -87745 -62256 -23795 6656 -8540 -13619 -3952 -1534 -8504 -68496 -38752 -99226 -101698
52 -101698 -96602 -62920 -5316 -43793 -66089 11257 38109 35131 1185 -55241 -53235 -64822 -118384
39 -118384 -31182 -20866 -46447 -36756 -33630 -100573 -40571 -91249 -104911 -93746 -53208 -82182
$$ packed form
126a74793Q6791N2128J7311K7870n8303J6041M0385k5570k6484m5870O2590m1408
114f9312N8300o9151m0386P9226j7925l6566J4646J5925j8827j197K5207L0087
102b9973J1121K0952J1684k3581K3202O604m7128l2694n5185r906Q2467n6786
90i9223K5739R1849o198l0524J262m661K1737n00L2977K2709Q389q0670l6193
77e3307J2727o142L0596l3456J8952K8713k7836k4547l4834K7888P9289n4988
65c6945n0800K5489L8461L0451j5196n079R667K418o970n9992K9744o0474k472
52a01698N096L3682N7604l8477k2296P7346K6852k978l3946n6426K006j1587n3562
39a18384Q7202J0316k5581R691L126o6943O0002n0678j3662J1165M0538k8974
$$ plain form
27 -82182 -118631 -122032 -125961 -100810 -85461 -160313 -166428 -67841 -44337 -33383 -67952 -54966 -81709
14 -81709 -67800 -34328 -8839 -64226 -42500 -14250 -8627 -46909 -66292 -41147 -24470 -54252
2 -54252 -4591 -28443
0 -28443
$$ packed form
27h2182l6449l401l929K5151J5349p4852o115R8587K3504J0954l4569J2986k6743
14h1709J3909L3472K5489n5387K1726K8250N623l8282j9383K5145J6677k9782
2e4252M9661k3852
0b8443
$$ Imaginary data points
##PAGE= N=2
##DATA TABLE= (X++(I..I)), XYDATA
$$ plain form
16383 -1505588 -1493904 -1463737 -1418867 -1393880 -1409886 -1394288 -1306463 -1281515 -1289654 -1295916 -1300229 -1223038
16371 -1223038 -1156378 -1201927 -1214053 -1221001 -1169904 -1132658 -1081834 -1064951 -1103471 -1052869 -1019586
16360 -1019586 -1025394 -1006032 -1014800 -947002 -895367 -954320 -892900 -869160 -877175 -893584 -904676 -910525
16348 -910525 -844234 -775226 -790655 -769523 -740150 -766531 -739828 -696761 -633522 -647001 -637561 -678301
16336 -678301 -645818 -526507 -519878 -593523 -548007 -522551 -516428 -445036 -419487 -460290 -412687 -354136
16324 -354136 -368549 -374347 -352544 -340024 -327863 -337910 -330546 -296902 -307215 -309343 -324676 -276767
16312 -276767 -170980 -151685 -211779 -212876 -171659 -81345 -80630 -121420 -92224 -73351 -22500 -17044
16300 -17044 22559 5942 35341 -13904 -62968 -22979 4714 8702 84837 109224 124339 138807
$$ packed form
16383a505588J1684L0167M4870K4987j6006J5598Q7825K4948q139o262m313P7191
16371a223038O6660m5549j2126o948N1097L7246N0824J6883l8520N0602L3283
16360a019586n808J9362q768O7798N1635n8953O1420K3740q015j6409j1092n849
16348i10525O6291O9008j5429K1132K9373k6381K6703M3067O3239j3479R440m0740
16336f78301L2483J19311O629p3645M5516K5456O123P1392K5549m0803M7603N8551
16324c54136j4413n798K1803J2520J2161j0047P364L3644j0313k128j5333M7909
16312b76767J05787J9295o0094j097M1217R0314P15m0790K9196J8873N0851N456
16300a7044L9603j6617K9399m9245m9064L9989K7693L988P6135K4387J5115J4468
$$ plain form
16288 138807 81724 92673 122757 170605 167598 186834 236925 288970 283364 231484 264844 310506
16276 310506 303077 281011 370760 438916 411703 360524 443030 432215 379655 450863 433942 454991
16264 454991 425818 365409 414596 465949 511724 586833 600839 589603 607990 572065 551943
16253 551943 622824 607193 555706 541555 572903 587662 659045 675295 671782 641771 653154 625999
16241 625999 588658 674438 652638 624595 698102 757024 721447 714419 736517 774430 845773 859104
16229 859104 894640 873118 860608 880735 832667 826579 822454 829151 863348 880391 846284 911960
16217 911960 931489 903580 926637 908709 886403 922597 916535 974026 976832 990729 985810 938433
16205 938433 939963 995357 1047842 1001544 1008205 994991 1042825 1037026 1133596 1038428 990371 1090317
$$ packed form
16288A38807n7083J0949L0084M7848l007J9236N0091N2045n606n1880L3360M5662
16276C10506p429k2066Q9749O8156k7213n1179Q2506j0815n2560P1208j6921K1049
16264D54991k9173o0409M9187N1353M5775P5109J4006j1236J8387l5925k0122
16253E51943P0881j5631n1487j4151L1348J4759P1383J6250l513l0011J1383k7155
16241F25999l7341Q5780k1800k8043P3507N8922l5577p028K2098L7913P1343J3331
16229H59104L5536k1522j2510K0127m8068o088m125O697L4197J7043l4107O5676
16217I11960J9529k7909K3057j7928k2306L6194o062N7491K806J3897m919m7377
16205I38433J530N5394N2485m6298O661j3214M7834n799R6570r5168m8057R9946
$$ plain form
16193 1090317 1118067 1098378 1078347 1066806 1104382 1117858 1202855 1177901 1138608 1181279 1201082
16182 1201082 1191405 1135781 1071562 1106507 1155059 1094773 1108796 1104316 1047132 1064524 1076660 1167125
16170 1167125 1212313 1160742 1195142 1214452 1220190 1204651 1219072 1245222 1205201 1220700 1186181
16159 1186181 1227414 1238959 1248043 1248489 1251780 1261740 1226750 1289857 1278783 1252808 1236779 1327344
16147 1327344 1325834 1241024 1222879 1314302 1287889 1225008 1283262 1325590 1305285 1315968 1231614
16136 1231614 1276420 1331687 1365681 1328697 1296995 1294193 1274571 1296547 1278536 1304163 1337408
16125 1337408 1387161 1297946 1306363 1357245 1346192 1271885 1261015 1357405 1304938 1254187 1305508
16114 1305508 1318147 1302037 1383612 1372287 1359315 1384301 1340865 1357141 1345674 1374179 1396355
$$ packed form
16193A090317K7750j9689k0031j1541L7576J3476Q4997k4954l9293M2671J9803
16182A201082r677n5624o4219L4945M8552o0286J4023m480n7184J7392J2136R0465
16170A167125M5188n1571L4400J9310N738j5539J4421K6150m0021J5499l4519
16159A186181M1233J1545R084M46L291R960l4990O3107j1074k5975j6029R0565
16147A327344j510q4810j8145R1423k6413o2881N8254M2328k0305J0683q4354
16136A231614M4806N5267L3994l6984l1702k802j9622K1976j8011K5627L3245
16125A337408M9753q9215Q417N0882j1053p4307j0870R6390n2467n0751N1321
16114A305508J2639j6110Q1575j1325j2972K4986m3436J6276j1467K8505K2176
$$ plain form
16103 1396355 1321131 1355602 1357099 1324753 1388729 1351821 1279697 1308954 1331535 1279549 1275059 1405044
$$ packed form
16103A396355p5224L4471J497l2346O3976l6908p2124K9257K2581n1986m490J29985
$$ [...]
##END NTUPLES=NMR SPECTRUM
##END=
