##TITLE=1H_EC-3353g2-x
 200.13MHz,CDCl3,
 8 sc
 
 4.8.2025
##JCAMPDX= 6.0         $$ Bruker NMR JCAMP-DX V2.0
##DATA TYPE= NMR SPECTRUM
##DATA CLASS= NTUPLES
##ORIGIN= UXNMR, Bruker Analytische Messtechnik GmbH
##OWNER= pz
$$ XWIN-NMR		Version 3.5
$$ Mon Aug  4 14:58:49 2025 Russian Standard Time (UT+4h)  she@DPX200
##.OBSERVE FREQUENCY= 200.1313
##.OBSERVE NUCLEUS= ^1H
##.ACQUISITION MODE= SIMULTANEOUS
##.ACQUISITION SCHEME= undefined
##.AVERAGES= 8
##.DIGITISER RES= 18
##SPECTROMETER/DATA SYSTEM= spect
##.PULSE SEQUENCE= zg30
##.SOLVENT NAME= CDCl3
##.SHIFT REFERENCE= (INTERNAL, CDCl3, 0, 15.4968)
##AUDIT TRAIL= $$ (NUMBER, WHEN, WHO, WHERE, WHAT)
$$ ##TITLE= Audit trail, XWIN-NMR		Version 3.5
$$ ##JCAMPDX= 5.01
$$ ##ORIGIN= Bruker BioSpin GmbH
$$ ##OWNER= she
$$ F:/spectra/data/she/nmr/H-C/1/pdata/1/auditp.txt
$$ ##AUDIT TRAIL=  $$ (NUMBER, WHEN, WHO, WHERE, WHAT)
(   1,<2025-08-04 14:57:28.45 +0400>,<she>,<DPX200>,
      <created by zg, POWCHK disabled, PULCHK disabled
       configuration hash MD5:
       00 E9 B6 7A A2 85 ED C7 34 08 36 98 17 FE 4E 26
       data hash MD5: 16K
       AA F6 3F E1 3B 14 67 69 5B 26 C8 39 9D 08 D6 DF>)
(   2,<2025-08-04 14:57:30.82 +0400>,<she>,<DPX200>,
      <Start of raw data processing
       efp BC_mod = 2 LB = 0.25 FT_mod = 6 PKNL = 1 PHC0 = -1198.01 PHC1 = 9.592297 SI = 16K 
       data hash MD5: 16K
       5D 22 34 B3 23 26 E5 BD 74 9D 65 09 82 81 0F 57>)
(   3,<2025-08-04 14:57:49.01 +0400>,<she>,<DPX200>,
      <pk PHC0 = -1.896844 PHC1 = 3.6 
       data hash MD5: 16K
       BA 9A D5 7D A2 44 86 6E 3C 79 92 7F 18 A8 35 F5>)
(   4,<2025-08-04 14:57:52.60 +0400>,<she>,<DPX200>,
      <abs ABSG = 5 
       data hash MD5: 16K
       F3 97 83 0A E7 CE E5 79 78 5F DC AF B1 EC 56 02>)
$$ ##END=
$$ 
$$ hash MD5
$$ 06 5E 7E 83 CD 12 7B 46 F4 15 23 82 93 1A 67 14
##$RELAX= 
##$RELAX= 
##$RELAX= 
##$RELAX= 
##$RELAX= 
##$RELAX= 
$$ Bruker specific parameters
$$ --------------------------
##$DU= <F:/spectra>
##$EXPNO= 1
##$NAME= <H-C>
##$PROCNO= 1
##$TYPE= <nmr>
##$USER= <she>
##$AMP= (0..31)
100 100 100 100 100 100 100 100 100 100 100 100 100 100 100 100 100 100 
100 100 100 100 100 100 100 100 100 100 100 100 100 100 
##$AQSEQ= 0
##$AQ_mod= 1
##$AUNM= <au_zg>
##$AUTOPOS= <>
##$BF1= 200.13
##$BF2= 200.13
##$BF3= 200.13
##$BF4= 200.13
##$BF5= 200.13
##$BF6= 200.13
##$BF7= 200.13
##$BF8= 200.13
##$BYTORDA= 1
##$CFDGTYP= 0
##$CFRGTYP= 5
##$CHEMSTR= <none>
##$CNST= (0..31)
1 1 145 1 1 1 1 1 1 1 1 1 1 1 1 1 1 1 1 1 1 1 1 1 1 1 1 1 1 1 1 1 
##$CPDPRG= <>
##$CPDPRG1= <>
##$CPDPRG2= <>
##$CPDPRG3= <>
##$CPDPRG4= <mlev>
##$CPDPRG5= <mlev>
##$CPDPRG6= <mlev>
##$CPDPRG7= <mlev>
##$CPDPRG8= <mlev>
##$CPDPRGB= <>
##$CPDPRGT= <>
##$D= (0..31)
0 0.7 0 0 0 0 0 0 0 0 0 0.03 0 0 0 0 0 0 0 0 0 0 0 0 0 0 0 0 0 0 0 0 
##$DATE= 1754305047
##$DBL= (0..7)
120 120 120 120 120 120 120 120 
##$DBP= (0..7)
150 150 150 150 150 150 150 150 
##$DBP07= 0
##$DBPNAM0= <>
##$DBPNAM1= <>
##$DBPNAM2= <>
##$DBPNAM3= <>
##$DBPNAM4= <>
$$ [...]
##$SUBNAM3= <"">
##$SUBNAM4= <"">
##$SUBNAM5= <"">
##$SUBNAM6= <"">
##$SUBNAM7= <"">
##$SUBNAM8= <"">
##$SUBNAM9= <"">
##$SW= 18.0517328524113
##$SWIBOX= (0..15)
0 0 2 0 0 0 0 0 0 0 0 0 0 0 0 0 
##$SW_h= 3612.71676300578
##$TD= 16384
##$TD0= 1
##$TE= 0
##$TE2= 300
##$TE3= 300
##$TEG= 300
##$TL= (0..7)
0 120 120 120 120 120 120 120 
##$TP= (0..7)
150 150 150 150 150 150 150 150 
##$TP07= 0
##$TPNAME0= <>
##$TPNAME1= <>
##$TPNAME2= <>
##$TPNAME3= <>
##$TPNAME4= <>
##$TPNAME5= <>
##$TPNAME6= <>
##$TPNAME7= <>
##$TPOAL= (0..7)
0.5 0.5 0.5 0.5 0.5 0.5 0.5 0.5 
##$TPOFFS= (0..7)
0 0 0 0 0 0 0 0 
##$TUNHIN= 0
##$TUNHOUT= 0
##$TUNXOUT= 0
##$USERA1= <user>
##$USERA2= <user>
##$USERA3= <user>
##$USERA4= <user>
##$USERA5= <user>
##$V9= 5
##$VALIST= <valist>
##$VCLIST= <CCCCCCCCCCCCCCC>
##$VD= 0
##$VDLIST= <DDDDDDDDDDDDDDD>
##$VPLIST= <PPPPPPPPPPPPPPP>
##$VTLIST= <TTTTTTTTTTTTTTT>
##$WBST= 1024
##$WBSW= 4
##$XGAIN= (0..3)
0 0 0 0 
##$XL= 0
##$YL= 0
##$YMAX_a= 207336
##$YMIN_a= -239132
##$ZGOPTNS= <>
##$ZL1= 120
##$ZL2= 120
##$ZL3= 120
##$ZL4= 120
##$ABSF1= 15.53094
##$ABSF2= -2.520909
##$ABSG= 5
##$ABSL= 3
##$ALPHA= 0
##$AQORDER= 0
##$ASSFAC= 0
##$ASSFACI= 0
##$ASSFACX= 0
##$ASSWID= 0
##$AUNMP= <proc_1d>
##$AZFE= 0.1
##$AZFW= 0.1
##$BCFW= 0
##$BC_mod= 2
##$BYTORDP= 0
##$COROFFS= 0
##$CY= -3
##$DATMOD= 1
##$DC= 0
##$DFILT= <>
##$DTYPP= 0
##$F1P= 0
##$F2P= 0
##$FCOR= 1
##$FTSIZE= 16384
##$FT_mod= 6
##$GAMMA= 0
##$GB= 0
##$INTBC= 1
##$INTSCL= 3.241238e-09
##$ISEN= 128
##$LB= 0.25
##$LEV0= 0
##$LPBIN= 0
##$MAXI= 10000
##$MC2= 0
##$MEAN= 0
##$ME_mod= 0
##$MI= 1.114404
##$NCOEF= 0
##$NC_proc= -7
##$NLEV= 6
##$NOISF1= 3.799351
##$NOISF2= 2.8
##$NSP= 0
##$NTH_PI= 0
##$NZP= 0
##$OFFSET= 15.49678
##$PC= 1
##$PHC0= -1199.907
##$PHC1= 13.1923
##$PH_mod= 1
##$PKNL= yes
##$PPARMOD= 0
##$PSCAL= 0
##$PSIGN= 0
##$REVERSE= no
##$SF= 200.130004987121
##$SI= 16384
##$SIGF1= 3
##$SIGF2= 2
##$SINO= 0.751879
##$SIOLD= 32768
##$SREGLST= <19F.Aceton>
##$SSB= 0
##$STSI= 16384
##$STSR= 0
##$SW_p= 3612.71676300578
##$SYMM= 0
##$S_DEV= 0
##$TDeff= 16384
##$TDoff= 0
##$TI= <>
##$TILT= no
##$TM1= 0
##$TM2= 0
##$TOPLEV= 0
##$USERP1= <user>
##$USERP2= <user>
##$USERP3= <user>
##$USERP4= <user>
##$USERP5= <user>
##$WDW= 1
##$XDIM= 16384
##$YMAX_p= 493440330
##$YMIN_p= -955243
$$ End of Bruker specific parameters
$$ ---------------------------------
##NTUPLES= NMR SPECTRUM
##VAR_NAME=  FREQUENCY,     SPECTRUM/REAL,   SPECTRUM/IMAG
##SYMBOL=    X,             R,               I
##VAR_TYPE=  INDEPENDENT,   DEPENDENT,       DEPENDENT
##VAR_FORM=  AFFN,          ASDF,            ASDF
##VAR_DIM=   16384,         16384,           16384
##UNITS=     HZ,            ARBITRARY UNITS, ARBITRARY UNITS
##FACTOR=    0.220516191357247, 1,           1
##FIRST=     3101.3707378373, 0,             0
##LAST=      -511.346025168483, 0,           0
##MIN=       -511.346025168483, -955243,     0
##MAX=       3101.3707378373, 493440330,     0
$$ Real data points
##PAGE= N=1
##DATA TABLE= (X++(R..R)), XYDATA
$$ [...]
6017D45519o7554J26064o7754j54611O470J70704k79329P4859K44561k21212R9018
6006C76735K6929j04662R6920J56917p3866J55890p6861L2985L75285K4169k17971
5995G72470k14183m8085j37706J44981L9036Q4655K76419p7835j42105j14302
5985E83345J3849j69417J02338L02617N313j9104j68798K74284k60759j63393
5975E00275p4609j74443O4290K43137K37102k7770m74305J6784O6877J97132l1659
5964E42811n2609K02955n0166o9021m9583p4380K02294p622m3188k715j96615
5953D02161J45781j25404j1861L9800P3506k759J50136k21067p4195K62433j71906
5942D66625j20493n4770K18745M8140k3604n918m9487R8288J04431n5191l15848
$$ plain form
6017 445519 377965 504029 436275 281664 288134 458838 179509 254368 498929 277717 376735
6006 376735 403664 299002 395922 552839 478973 634863 558002 590987 966272 990441 772470
5995 772470 558287 510202 372496 517477 556513 641168 917587 839752 697647 583345
5985 583345 597194 427777 530115 832732 838045 818941 650143 924427 663668 500275
5975 500275 425666 251223 315513 558650 795752 767982 293677 310461 377338 574470 542811
5964 542811 490202 693157 642991 573970 524387 450007 652301 644679 601491 598776 402161
5953 402161 547942 422538 410677 450477 523983 521224 671360 450293 376098 638531 466625
5942 466625 346132 291362 510107 558247 534643 528725 479238 577526 681957 626766 310918
5931C10918K6837J25860Q4018l2390k04076J13853m521k33131K4942j74099n0818
5920a2607k8289K16153j03817J72428K39744k18708k58151k84J41985J19325p4272
5909A93507k69098J31979J07857P6119k48121Q9046m8426J11147q7706n4014n068
5898b778L49653m3838j35059p81l7857M4653k16516j82694k5686K78006n4398
5887b7295M5221k1795j856j11934J37355J7805J41336q9079p9389l894J19420
5876A25895k37812R0092R112k11065K13599r4260K7194j9454J36529N952P2661
5865A18443j66691k6526J28072j00729Q2865j16781N8782l586M78504j61941k14446
5854G5966j0121k53679O4204R8455L1765J9910q0197L46066O0821l05292n8750
$$ plain form
5931 310918 337755 463615 547633 515243 311167 425020 420499 187368 212310 38211 -12607
5920 -12607 -40896 175257 71440 243868 483612 264904 6753 6469 148454 267779 193507
5909 193507 -75591 56388 164245 240364 -7757 81289 32863 144010 56304 2290 -2778
5898 -2778 346875 303037 167978 167197 129340 173993 -42523 -225217 -250903 27103 -27295
5887 -27295 17926 -3869 -5725 -117659 19696 37501 178837 89758 10369 6475 125895
5876 125895 -111917 -21825 -12713 -223778 -10179 -104439 -77245 -96699 39830 45782 118443
5865 118443 -48248 -74774 53298 -47431 35434 -81347 -22565 -26151 452353 290412 75966
5854 75966 65845 -187834 -123630 -25175 6590 26500 -53697 292369 353190 47898 -10852
5843a0852j78809M1758J03331m3736M2371K5886k14027K1248N24031j73189l8831
5832I9181R7488r7170Q5265k33685q2811K2692L10210J92468j11679j02125m7306
5821A32528j74306J54564L99288k21874k64362m7255J35583r7695j1080K4315
5811B9706k74972P3134K00022R8485j12215r3328J14984m8205m41907J21088k1039
5800c54247J82739l1179k7553L66825q1972m6053l6576O0177k08692J64679K69705
5789B57853M8685P7762k44934q3846Q5532m267J65043j32503j3801p7149r0892
5778a2517Q5386o437N6847p236k09662J272J52877j17132J29103J44934K37453
5767D54888l94781q6106M20506P8424j59653j62974q6020J54374k74937p4179
$$ plain form
5843 -10852 -189661 -147903 -44572 -88308 -45937 -20051 -234078 -212830 311201 138012 99181
5832 99181 196669 99499 184764 -48921 -131732 -109040 201170 393638 281959 179834 132528
5821 132528 -41778 112786 512074 290200 25838 -21417 114166 16471 5391 29706
5811 29706 -245266 -172132 27890 126375 14160 -79168 35816 -12389 -454296 -333208 -354247
5800 -354247 -171508 -202687 -230240 136585 54613 8560 -28016 32161 -176531 -11852 257853
5789 257853 306538 384300 139366 55520 141052 136785 301828 169325 155524 78375 -12517
5778 -12517 72869 66432 123279 116043 -93619 -92347 60530 -56602 72501 217435 454888
5767 454888 60107 -25999 394507 472931 313278 150304 64284 218658 -56279 -130458
5757a30458J82093K209j53948L13866k17571J10831N413j62391J29583J76043
5747B55670j75417L6254J35883j09875N2100N1837j47534L0620k27345m9851J87595
5736C9937J98605m4470p1795J23939j2279K1509j64737Q216r2316R7557J03632
5725B07798o2908Q8994J10895k58456K7115J97396k25778J6015K32715j48620
5715A85166n6618l68340L11952K47839j90051j41394j05562K07467p1542J73809
5705A92726K86626j11664J24700j04011k58721J30026L4502k54441J81244n5892
5695A65095K0961k12119J68713P5472j17082l2679M4036j22783P2430J53564J66239
5684C81847k46218q968J69997k545k0423k8191j77676R3088K88536j94590m60695
$$ plain form
5757 -130458 51635 53844 -100104 213762 -3809 107022 112435 -49956 79627 255670
5747 255670 80253 116507 252390 142515 194615 246452 98918 129538 -97807 -147658 39937
5736 39937 238542 194072 122277 246216 233937 255446 90709 98925 6609 104166 207798
5725 207798 144890 233884 344779 86323 113438 310834 85056 101071 333786 185166
5715 185166 128548 -239792 72160 319999 129948 -11446 -117008 90459 18917 192726
5705 192726 479352 367688 492388 388377 129656 259682 294184 39743 220987 165095
5695 165095 186056 -26063 142650 218122 101040 68361 112397 -10386 62044 215608 381847
5684 381847 135629 126661 296658 294113 273690 245499 67823 160911 449447 254857 -205838
5673b05838J09859K38171J99846p927j13515k48907K11297K98977j38613k7972
5663C15378j12618k98181L9677K15001J11965J87840j61234J325j52617p722K97871
5652D36685J98263p1329N9498k22245J6233K48347K068j18538J10574M8379k15978
5641D91957k05865K22891j50003r6743J7105K82191K88014j97739j67516R8123
5631E82415o2765P094m6079m098k43894J61644J99436J84622M417j27947K70656
5620I25501m4938J7199J87507n2589L4026r9115j41625Q1972r6237N9177J7421
5609H88299M0910l62832m0575K95811P6272l6088J3129K54485j66758j44649q0793
5598G37211P4581L80301O8613k67265K9670p1009k8495K22504j49993J33683J50082
$$ plain form
5673 -205838 -95979 142192 342038 334111 220596 -28311 182986 481963 343350 315378
5663 315378 202760 -95421 -55744 159257 271222 459062 297828 299153 146536 138814 436685
5652 436685 634948 563619 623117 400872 417105 665452 667520 548982 659556 707935 491957
5641 491957 286092 508983 358980 262237 279342 561533 849547 651808 484292 582415
5631 582415 519650 526744 480665 476567 232673 394317 593753 778375 782792 654845 925501
5620 925501 880563 897762 1085269 1032680 1066706 967591 825966 907938 811701 870878 888299
5609 888299 929209 566377 525802 821613 897885 861797 874926 1129411 962653 818004 737211
5598 737211 811792 1192093 1260706 993441 1023111 952102 923607 1146111 996118 1129801 1279883
5587A279883j04561j87333J06046K22007K23158l49050j31883K71428J8005N9231
5577A406931k4293J29753J2497l8989J04329J34479M2721j20794N7329k51219
5567A452744N1620J22887L30807L6481l22661J16986L941j33692N9325Q7619j20258
5556A685799k75058p2702J50242J2373r6589j39832L62859O9198J7899k4412K2410
5545A712187j94074J75786k2291j7268m2083n2946J072l2003J81838j9700K05506
5534A896024k24166l2713n3859k25483J31907J01360M7793l9426l19063R829n1194
5523A241009J23637J51787J37809n17k23896N737P3502N6918M844R2736j32164
5512A531402P2182L0510l63324k07880L76908R28k0615p3773m3930j88436J76554
$$ plain form
5587 1279883 1175322 987989 1094035 1316042 1539200 1190150 1058267 1329695 1347700 1406931
5577 1406931 1382638 1512391 1524888 1485899 1590228 1724707 1767428 1646634 1703963 1452744
5567 1452744 1504364 1627251 1958058 1994539 1671878 1788864 1792805 1659113 1718438 1806057 1685799
5556 1685799 1410741 1338039 1488281 1500654 1404065 1264233 1627092 1696290 1714189 1689777 1712187
5545 1712187 1518113 1693899 1671608 1654340 1612257 1559311 1560383 1528380 1710218 1690518 1896024
5534 1896024 1671858 1639145 1585286 1359803 1491710 1593070 1640863 1601437 1282374 1292203 1241009
5523 1241009 1364646 1516433 1654242 1653725 1429829 1435566 1509068 1565986 1570830 1663566 1531402
5512 1531402 1603584 1634094 1270770 1062890 1439798 1440726 1420111 1346338 1302408 1113972 1290526
5501A290526J15287k72225L593J49531l392j42009j92105J25473l5526q9848M9851
5490I99156J48478p9880j8362K6533j82745R2051J57557k50062j48207J08230
5480H52749J55957J08055J0885k93520j33392K32476Q6090k9990k60195P2600
5470H01715R5182J32006j46244M6150k8146Q6103Q6363J07111L3663R3281k81198
5459A025986j1198j6608j5507j9316Q0326j78615m7534J61891O6073P159n7642
5448I95015l9662m3955R9174Q6515j37085j59633J38237K66832k61605Q8585l0660
5437A001758J44314j62715M1769K9285K53220L9762k8580J07770K1342J04699
5427A552624j30632p9347n1552q3964M2216k6571k52669Q2692k366j33023M717
$$ plain form
5501 1290526 1405813 1133588 1137181 1286712 1283320 1141311 949206 1074679 1039153 949305 999156
5490 999156 1147634 1067754 1049392 1075925 893180 985231 1142788 892726 744519 852749
5480 852749 1008706 1116761 1127646 834126 700734 933210 1019300 989310 729115 801715
5470 801715 896897 1028903 882659 928809 900663 986766 1073129 1180240 1213903 1307184 1025986
5459 1025986 1014788 998180 982673 963357 1043683 865068 817534 979425 1045498 1052657 995015
5448 995015 955353 911398 1010572 1097087 960002 800369 938606 1205438 943833 1032418 1001758
5437 1001758 1146072 983357 1025126 1054411 1307631 1347393 1318813 1426583 1447925 1552624
5427 1552624 1421992 1342645 1291093 1207129 1249345 1222774 970105 1052797 1050431 917408 922125
5416I22125J86516k61911m0379O1897j41764q7921J03613k18683l7062K54210
5406G40641J48461k7798p9404L9802o5791k02549K41016j36467K46039J3743j37608
5395G80085j30709J00721j20233o9644l54144R5313K19495l089M0022J47412j56053
5384E49176R5477K29989j52200p8371k66995j38462m5288J03747J7080p6733k6214
5373B11206Q7870o2971j79584q5187J90259K62646j64895J23565J36037o2937
5363D56009k51886r7240K55984q2316O1244m936j96416P0861J93294K9472j56090
5352B77980n2521r2034L6468J02310j03691r7978J3994J35955k6370J98419L7098
5341D29630p6879j48250J95608J01252k36444j44862l6847K90034l5757J95246
$$ plain form
5416 922125 1108641 846730 806351 868248 726484 638563 742176 523493 486431 740641
5406 740641 889102 861304 781900 821702 755911 553362 794378 657911 903950 917693 780085
5395 780085 649376 750097 629864 560220 206076 301389 520884 517795 557817 705229 549176
5384 549176 644653 874642 722442 644071 377076 238614 193326 297073 314153 237420 211206
5373 211206 299076 236105 56521 -28666 161593 424239 259344 382909 518946 456009
5363 456009 204123 106883 362867 280551 341795 336859 140443 211304 404598 434070 277980
5352 277980 225459 133425 169893 272203 168512 70534 84528 220483 194113 392532 429630
5341 429630 352751 204501 400109 501361 264917 120055 83208 373242 337485 532731
5331E32731k9948j88802J60780o9208l8139J82561j53105k19527J31799L28501
5321F37643k3916m87805j12862Q135l2830J73059J61324j10588J22983k40937
5311I4206k6643j33998M3251m5842O349O9949K71963j8074K4513o3705l72851
5300a50882J40792Q169J05369J70742M9367N1613j54984k07691K33939J35274
5290C81708j75638J11303J17358m36825K707J90634Q9109m66M7815m5307k3914
5279B58484j50728K1257M07036K4534m24974k38562K47414J9496L6474K81659
5269D82090m21846k76516R8253o9057K88543Q4133o4311J29986j31465j78189
5259e8379L48935n6675j17461K74393l256j50020l00995m3876K64079M9399n5210
$$ plain form
5331 532731 502783 313981 474761 405553 367414 549975 396870 177343 309142 637643
5321 637643 613727 125922 13060 21195 -11635 161424 322748 212160 335143 94206
5311 94206 67563 -66435 -23184 -69026 -62677 7272 279235 261161 285674 221969 -150882
5300 -150882 -10090 -1921 103448 274190 323557 375170 220186 12495 246434 381708
5290 381708 206070 317373 434731 -2094 613 191247 280356 279890 327705 282398 258484
5279 258484 107756 129013 536049 560583 135609 -102953 144461 163957 200431 482090
5269 482090 60244 -216272 -118019 -187076 101467 185600 121289 251275 119810 -58379
5259 -58379 290556 233881 116420 390813 387557 237537 -63458 -107334 156745 206144 150934
5248A50934j03705J7326J90159o7871J59857k16720j43802J10599L7398K76899
5238D11074k04045L69374o4900j77211K3919j79756j35539n8455J32143J6434
5228A33038p6218K11967K2339l4859N1958l4254P7759J56436j06714j17256l8097
5217B46099j13934J79547l59356q7418K16413k9656O1642j20642J79828K08231
5207C80754k73862k93571K77333K18841m7621J10533K32896k59457j52308l15172
5197a21634Q4064L51371J80476K05110j87387J8104n4273O353p353J66867j03002
5186E38696K9170n4414j58364L2841K7321j90258k0195r8962J18342J28502J37146
5175D89825j23712J05492j9978k53829R00J90546J95089m2175o832L2753j09161
$$ plain form
5248 150934 47229 64555 254714 186843 346700 129980 -13822 96777 134175 411074
5238 411074 207029 576403 511503 334292 358211 178455 42916 -15539 116604 133038
5228 133038 56820 268787 291126 256267 308225 273971 351730 508166 401452 284196 246099
5217 246099 132165 311712 -47644 -135062 81351 51695 113337 -7305 172523 380754
5207 380754 106892 -186679 90654 309495 261874 372407 605303 345846 193538 -121634
5197 -121634 -37570 313801 494277 699387 512000 530104 475831 482184 474831 641698 538696
5186 538696 567866 513452 355088 387929 415250 224992 204797 105835 224177 352679 489825
5175 489825 366113 471605 451627 197798 198698 389244 584333 542158 535326 568079 458918
5164D58918K52287q3191p1459n0224j00200J74065j01158P2309k32032m2376J59238
5153D36177q742p1426P983J31911j0304j0847K25927n3085O6832k7452l59274
5142C27700K23007L2508P6730Q5758O0276k06143R126J67638O7696j73443L4511
5131G05364O5180j8581P8991K008j23713j26756J78471l3910K7898P3509K36554
5120A065015J70487j10382l70679J10828J04661k15315j41580K5529K8995M40122
5110A107681J2501k7516j6843j18680J12978n724L5159L35128k93704j79961L2404
5099I93423L6497j8997j16138k4327j7933K35288l7756M8580J10088M87k4123
5088A185089o8984o5656k56469p4940Q7450N8151J17967l9744j21043K44613K33315
$$ plain form
5164 458918 711205 628014 556555 506331 406131 580196 479038 551347 319315 276939 436177
5153 436177 427435 356009 363992 495903 485599 474752 700679 647594 714426 686974 327700
5142 327700 550707 583215 659945 745703 805979 599836 608962 776600 844296 670853 705364
5131 705364 770544 751963 830954 832962 709249 582493 760964 727054 754952 828461 1065015
5120 1065015 1235502 1125120 754441 865269 969930 754615 613035 638564 667559 1107681
5110 1107681 1120182 1092666 1075823 957143 1070121 1064397 1099556 1434684 1140980 961019 993423
5099 993423 1029920 1010923 894785 870458 852525 1087813 1050057 1098637 1208725 1209212 1185089
5088 1185089 1116105 1050449 793980 719040 806490 864641 982608 942864 821821 1066434 1299749
5077A299749k7479j33984k0615K19032q0794K14742O6624o6790j80747m397m5945
5066A239396k45693J95188o0286K5071J20653k0038o3013j15028j8482J71541
5056A229309n0310J45154r7640j25495O4017O4282n4387L3376k44721K2038J81180
5045A166803K9841P1800l17139j48115J54435k4722Q3147k082N5743j36077L302
5034I36936J56914J5162j40295J18082J58809p570k27688q5070J55869l94609
5024F86540K66874J97306p7343j57431L12649k38211o0082K09258j21148j39789
5014H78623R4063M5660J35129j13893k21998L07761l5435k35756j9120K44152
5004A079186J32871n6874j08927j03940M697M4378j48640j72173J29136J41441
$$ plain form
5077 1299749 1272270 1138286 1117671 1336703 1255909 1470651 1537275 1470485 1289738 1285341 1239396
5066 1239396 993703 1188891 1128605 1153676 1274329 1254291 1191278 1076250 1057768 1229309
5056 1229309 1178999 1324153 1226513 1101018 1165035 1229317 1174930 1208306 963585 985623 1166803
5045 1166803 1196644 1268444 951305 803190 957625 932903 1016050 1013968 1069711 933634 936936
5034 936936 1093850 1109012 968717 1086799 1245608 1238038 1010350 925280 1081149 686540
5024 686540 953414 1150720 1073377 915946 1228595 990384 930302 1139560 1018412 878623
5014 878623 972686 1018346 1153475 1039582 817584 1125345 1089910 854154 835034 1079186
5004 1079186 1212057 1155183 1046256 942316 947013 991391 842751 670578 799714 941155
4994I41155K81305n6669k5613k23609k58132L5419j21551L8733M181K08078K45779
4983A069076j22339j5335K86133j30795j78016j00314L9473J41997q8136j61568
4973G40176j45763K5004j41507J63241k9165J48800M4100p2969k20207L59339
4963H71049L8426K45474l2880l97514L5910J94287n0381q5061l130p7009J22716
4952H61887J37234j60427k82818J19224k01143P5661N5096K4114L23904K27955
4942A180687l14787n8955R7416J48375p7345j4479l37676J16007l1005J42242
4932H50480q3054k70906r8458J2136M4128J02656k8564R9711m1459j21276Q7307
4921E52701l4399R0109P6841j92810K4996n1158L7095J39953J19920k17773J3713
$$ plain form
4994 941155 1222460 1165791 1140178 916569 658437 693856 572305 611038 615219 823297 1069076
4983 1069076 946737 931402 1217535 1086740 908724 808410 847883 989880 901744 740176
4973 740176 594413 619417 477910 641151 611986 760786 804886 731917 511710 871049
4963 871049 909475 1154949 1122069 724555 760465 954752 904371 819310 816180 739171 861887
4952 861887 999121 838694 555876 675100 473957 549618 604714 628828 952732 1180687
4942 1180687 865900 806945 904361 1052736 975391 960912 623236 739243 708238 850480
4932 850480 767426 496520 398062 410198 454326 556982 528418 628129 586670 465394 552701
4921 552701 518302 608411 685252 492442 517438 466280 503375 643328 763248 545475 559188
4910E59188L9890J4609L7743k50285N5914O5366J42430j72101k13883K6304K45506
4899E50681N3893L3126O0240Q5261J29757j20800m38293K97437J81586j89510
4889F43378k26970m0999R4584k5530m5605j061J19352O2398o3367o8601J63613
4878F11192J5367k06671k51803k4586K71982K6488k2022j41725o3770l12227K32306
4867A34531L45459j10503K53911k7407p2000k80290j6105J27800j29693J77418
4857D03121N560l9385K9026j40096Q1849J62065k30124m7339L15494l06416J05300
4846C39055J35573l09859M1129k2775k27032Q4947K05956K25333J53642j52130
4836D73839J7194j3271j7793k96441O7103K16547L16001Q1507k76114j78999L7286
$$ plain form
4910 559188 599078 613687 651430 401145 457059 522425 664855 492754 278871 305175 550681
4899 550681 604574 637700 697940 783201 912958 792158 353865 651302 832888 643378
4889 643378 416408 375409 469993 444463 398858 397797 517149 579547 516180 447579 611192
4878 611192 626559 419888 168085 143499 415481 441969 419947 278222 214452 -97775 134531
4867 134531 479990 369487 623398 595991 523991 243701 227596 355396 225703 403121
4857 403121 408681 369296 398322 258226 340075 502140 272016 224677 540171 233755 339055
4846 339055 474628 164769 205898 183123 -43909 41038 246994 472327 625969 473839
4836 473839 491033 477762 459969 163528 230631 447178 763179 844686 568572 389573 426859
4825D26859J38980j31719p4759J02252K1058r530k2151O3949J28750j25617j14232
4814D03840R2004J49924P8417l28693J27422Q7632k0094K4049j24557j0138K0482
4803E00288q1519L1818J69498K95875l81897l24948j72599J12782J36154j35027
4793A50425J3284R4494K49374k22795L21466j21905j90531j02597j332L36971
4783E26854J23220k32898J14268J06263l5721k79222K27767O6326j18424K757
4773E01190r641N7488K9915n1175j58941J41428J89116K6965r0851m3988j76127
4762D15379K8166j2477j48453K50273J88276k90898j52538J80487J10362l6282
4752E32295L42297k96125k42621k10933L23264K69708j73580J34012K9201m7454
$$ plain form
4825 426859 565839 434120 359361 461613 482671 473141 450990 514939 643689 518072 403840
4814 403840 495844 645768 724185 395492 522914 610546 590452 614501 489944 479806 500288
4803 500288 418769 450587 620085 915960 534063 209115 36516 149298 285452 150425
4793 150425 163709 258203 507577 284782 606248 484343 293812 191215 189883 526854
4783 526854 650074 417176 531444 637707 601986 322764 550531 616857 498433 501190
4773 501190 491549 549037 578952 527777 368836 510264 699380 726345 635494 591506 415379
4762 415379 443545 431068 282615 532888 721164 430266 277728 458215 568577 532295
4752 532295 874592 578467 335846 124913 448177 717885 544305 678317 707518 660064
4742F60064j69584j22506k41968J60036j57089J68192R5973o2523k7651q0247
4732B22697J00659J03795J00285P4894K7799J32878j187j94821l0129m4198n5758
4721D36914N5733J80584m1120O5270L5501k38804J57546L28125k96249k67952
4711D15548M4666N3449J38885J29930r5903j38810l464K14043j37145j53775j64082
4700C03342O1358J83585J58544r7662P3301J03348j57133K86338l20512J8745
4690F13254J52388J2774k07753l6723J27593q2127l2240L01677l1491K20179j49563
4679H87968n3677N9122o1848o684k3118q4088q131K39786j93476j80992m9706
4668E25156M07709l1141M8985j3188j14848N6207p6949o7753K36718j44630j63364
$$ plain form
4742 660064 490480 367974 126006 286042 128953 297145 393118 330595 302944 222697
4732 222697 323356 427151 527436 602330 630129 763007 761820 566999 536870 492672 436914
4721 436914 492647 673231 632111 697381 732882 494078 651624 979749 683500 415548
4711 415548 460214 513663 652548 782478 686575 547765 544301 758344 621199 467424 303342
4700 303342 364700 548285 706829 609167 682468 785816 628683 915021 594509 613254
4690 613254 765642 778416 570663 533940 661533 579406 547166 848843 817352 1037531 887968
4679 887968 834291 893413 831565 824881 801763 717675 709544 949330 755854 574862 525156
4668 525156 932865 901724 950709 937521 822673 878880 801931 734178 970896 826266 662902
4657F62902Q7796K29773j73137J53082m4664j84577p0268Q0595n9799J55599j05372
4646G31930m2670K90139j60051Q556K25996K06081k14285J6531P6120k86045N1644
4635I03946N031J14950j13750o1677J18137Q0421n5084J18789J87521L6908j69516
4624A165676o6971R5021J54142o1797l45607M9380K5243K56852l3452j03911m512
4613A130064J3388m3414k57709K91853J44148j57976j1464K60419J39622k10573
4603A298358j50020o5389k14154J21259K09778k39858N3058q8791n6202J42323
4593A010362K49078j52314r316j18309K32442K3433o7652K4222o840q6739J00794
4582A199161k23381J63336N8758O558J663J99249k32252n2058J94199O2029O2895
$$ plain form
4657 662902 750698 980471 807334 960416 915752 731175 660907 741502 681703 837302 731930
4646 731930 689260 979399 819348 827904 1053900 1259981 1045696 1062227 1138347 852302 903946
4635 903946 908977 1023927 910177 848500 966637 1047058 991974 1110763 1298284 1335192 1165676
4624 1165676 1098705 1193726 1347868 1286071 940464 989844 1015087 1271939 1238487 1134576 1130064
4613 1130064 1143452 1100038 842329 1134182 1278330 1120354 1108890 1369309 1508931 1298358
4603 1298358 1148338 1082949 868795 990054 1199832 959974 1013032 924241 868039 1010362
4593 1010362 1259440 1107126 1097810 979501 1211943 1235376 1167724 1191946 1185106 1098367 1199161
4582 1199161 975780 1139116 1197874 1204432 1206095 1405344 1173092 1121034 1315233 1377262 1440157
4571A440157k76851j91083j27950J0657J43874J88061J41140R894Q0075j26253
4561A291721J69285j35937j57261K57438k72667k6109J30492J46029o8102n3095
4551A281794P0799P8894p9647K86719j73017k50497k45567J29153K32999m399
4541A327231l5112M4322J66960k02717j96946J17813L34811k21757J1646K58538
4531A604789j93226J79337o1813n9434o33J90554J07856p3765k73824J79219K11197
4520A810257n3840O4117j76198M5103K6815O1580P481j68852k67012j56892J56820
4509A349379J31878J23251o6974J02525P0718Q3289J76511j40773j78797R5331
4499A746338K35984k05887p4447L46176o1576k3806M9095k4227j34618M0122K03162
$$ plain form
4571 1440157 1163306 972223 844273 854930 998804 1186865 1328005 1337899 1417974 1291721
4561 1291721 1461006 1325069 1167808 1425246 1152579 1126470 1256962 1402991 1334889 1281794
4551 1281794 1352593 1431487 1351840 1638559 1465542 1215045 969478 1098631 1331630 1327231
4541 1327231 1292119 1336441 1503401 1300684 1103738 1221551 1556362 1334605 1346251 1604789
4531 1604789 1411563 1590900 1529087 1469653 1469020 1659574 1767430 1693665 1419841 1599060 1810257
4520 1810257 1756417 1820534 1644336 1689439 1716254 1777834 1785315 1616463 1349451 1192559 1349379
4509 1349379 1481257 1604508 1537534 1640059 1710777 1794066 1970577 1829804 1651007 1746338
4499 1746338 1982322 1776435 1701988 2048164 1986588 1962782 2011877 1987650 1853032 1893154 2096316
4488B096316L6554L5977Q3296k49662l9701o6283K15949r4868K68107J61152n5078
4477B391759J09497k18751m282J57279N8617n91M2055R1116j83202M6730K28159
4466B718386j92241o6886Q11m4188K98837J72750j74940M09986j66770j26504
4456B829241L87276M6442j61520J50739j14643q0064Q8978j6370j20213J64715
4446C174581J0142J0469K35402J46804M5282M9042j06749j20459R2298K94319
4436C831131O6582P2826J40100k0989P7933j8451J20193K05629j88924J43858
4426D429888J67976o2181J83585j41594K35501P0332p786Q9041R4502R904J21202
4415E190370L90306j174r4861Q5919J95548l539j2982n5078J04205L4893J47415
$$ plain form
4488 2096316 2132870 2168847 2252143 2002481 1962780 1896497 2112446 2017578 2285685 2446837 2391759
4477 2391759 2501256 2282505 2278223 2435502 2494119 2493528 2535583 2626699 2443497 2490227 2718386
4466 2718386 2526145 2459259 2460070 2415882 2714719 2887469 2712529 3122515 2955745 2829241
4456 2829241 3216517 3262959 3101439 3252178 3137535 3057471 3146449 3130079 3009866 3174581
4446 3174581 3184723 3195192 3430594 3577398 3622680 3671722 3564973 3444514 3536812 3831131
4436 3831131 3897713 3970539 4110639 4089650 4167583 4149132 4269325 4474954 4286030 4429888
4426 4429888 4597864 4535683 4719268 4577674 4813175 4883507 4875721 4964762 5059264 5069168 5190370
4415 5190370 5580676 5579502 5484641 5570560 5766108 5762569 5749587 5694509 5798714 5833607 5981022
4404E981022R8983K00244R4352k7342k1327m5274L46694K12038k20442K58261
4394F877209L86648J44480Q7020K86396O8560o2104N2512J46718K72306L11563
4384H571308K66057m1107j63035O65792M60605J47598L26008M7563K49158K85975
4374A0815922K31432L79998N25491M86041J29295N58064P72154K59715K29928
4365A4388040P31397O27936N43359P13668P21624P37696P01060P37415O08890
4356B0511085Q15829Q27921R17600Q11476R61144J219832J078670J060739J045813
4347B9250109J010754J047305Q81514J263530J242697J083790J255244J201325
4339C8236268J019068J144789J182241J465926R82246P74329J071027N49013R84064
$$ plain form
4404 5981022 6080005 6280249 6374601 6347259 6325932 6280658 6627352 6839390 6618948 6877209
4394 6877209 7263857 7408337 7495357 7781753 7850313 7788209 7840721 7987439 8259745 8571308
4384 8571308 8837365 8796258 8633223 9299015 9759620 9907218 10233226 10280789 10529947 10815922
4374 10815922 11047354 11427352 11952843 12438884 12568179 13126243 13898397 14158112 14388040
4365 14388040 15119437 15747373 16290732 17004400 17726024 18463720 19164780 19902195 20511085
4356 20511085 21326914 22154835 23072435 23883911 24845055 26064887 27143557 28204296 29250109
4347 29250109 30260863 31308168 32189682 33453212 34695909 35779699 37034943 38236268
4339 38236268 39255336 40400125 41582366 43048292 44030538 44804867 45875894 46424907 47408971
4330D7408971J021873P51364O72973N04473N57079M87362M35044J03445J4196
4321E1956780M71043J83560k64493m08039k85839l66551m79763n99262p12317
4312D9495119l43603p35005j003336j177914r78373j202204q70182j275708j150715
4303D0758079j075488j316667j128695j178760j163794r70188j211891j284847
4295C1427749r20621p78839j279286j199759q02194j034117r13526q30923r40867
4286B2727617p01952r03982m97743n85882p24051n26599n84826p25236n51640
4277A6925706m72884k77017m09015l65937l87314n02511l09272m20758j55682
4268A3625316k76455l798l47692j57687j06189j77356p5146l26914k28228K5839
$$ plain form
4330 47408971 48430844 49182208 49855181 50359654 50916733 51404095 51839139 51942584 51956780
4321 51956780 52427823 52611383 52346890 51938851 51653012 51286461 50806698 50207436 49495119
4312 49495119 49151516 48416511 47413175 46235261 45256888 44054684 43184502 41908794 40758079
4303 40758079 39682591 38365924 37237229 36058469 34894675 33924487 32712596 31427749
4295 31427749 30507128 29728289 28449003 27249244 26447050 25412933 24499407 23668484 22727617
4286 22727617 22025665 21121683 20623940 20038058 19314007 18787408 18202582 17477346 16925706
4277 16925706 16452822 16175805 15766790 15400853 15013539 14511028 14201756 13780998 13625316
4268 13625316 13348861 13345063 12997371 12839684 12733495 12556139 12480993 12154079 11925851 11951690
4258A1951690K5114k23386k93288M0807P8106l289M8082j73413K625J9624n25176
4247A0947496M8328L6074L9508p3958J0805j7449k00194K26433J40945j82620
4237A0975368k37811J43812J53108l5365j22288p0977J89652J24923K41271j92293
4227A1169400o3809j3889K18843j37942p8147J76455J28166K60957p896l1662
4217A1620476l7457O0804J05386m7603J25187j69078K05349m1596j80337J59792
4207A1800923Q0812m94141L80424K66329j39110K15475r2370K7560Q5940r6401
4197A2035441j77462K61192J86005Q5815p8043j6267P4674J61060m2598j37245
4187A2352572R2583n046j8890K50807N4912K408K20167j4462j39392J49419J01798
$$ plain form
4258 11951690 11976804 11753418 11460130 11500937 11579043 11575754 11623836 11450423 11453048 11472672 10947496
4247 10947496 10995824 11031898 11071406 10997448 11008253 10990804 10790610 11017043 11157988 10975368
4237 10975368 10737557 10881369 11034477 10999112 10876824 10805847 10995499 11120422 11361693 11169400
4227 11169400 11105591 11091702 11310545 11172603 11094456 11270911 11399077 11660034 11652138 11620476
4217 11620476 11583019 11643823 11749209 11701606 11826793 11657715 11863064 11821468 11641131 11800923
4207 11800923 11881735 11387594 11768018 12034347 11895237 12110712 12018342 12045902 12131842 12035441
4197 12035441 11857979 12119171 12305176 12390991 12312948 12296681 12371355 12532415 12489817 12352572
4187 12352572 12445155 12440109 12421219 12672026 12726938 12729346 12949513 12935051 12795659 12945078 13046876
4176A3046876J13033M7405j34059j16884J04189P3725Q3523j32108K81507k6873
4166A3340334K40612n2132k01132m3368m3083J27361K4183k8859k7474J62969
4156A3499411o7704j28895k13750J63572M6776k7533N038o4745K6465r7331K1644
4145A3162948j740K5305J4709K08345j0646P1076L4658k33937L8531j0291J19030
4134A3417988m9713R2722K64800P9537J4266R804j55005P5839K62520j02273P1607
4123A3982092r929J51790J32257O6733k14082J08012K27610L4693K28916J03975
4113A4812067k4886J90190K58645J78469K18863J59378M271L90524M12300J23529
4103A6723350O4248J67143M91682J87837K35217P3941J47712P56652M79648L23853
$$ plain form
4176 13046876 13159909 13207314 13073255 12956371 13060560 13134285 13217808 13085700 13367207 13340334
4166 13340334 13580946 13528814 13327682 13284314 13241231 13368592 13392775 13363916 13336442 13499411
4156 13499411 13431707 13302812 13089062 13252634 13299410 13271877 13276915 13212170 13238635 13141304 13162948
4145 13162948 13161208 13186513 13201222 13409567 13398921 13469997 13504655 13270718 13309249 13298958 13417988
4134 13417988 13368275 13460997 13725797 13805334 13819600 13829404 13674399 13750238 14012758 13910485 13982092
4123 13982092 13972163 14123953 14256210 14322943 14108861 14216873 14444483 14479176 14708092 14812067
4113 14812067 14787181 14977371 15236016 15414485 15633348 15792726 15796997 16187521 16599821 16723350
4103 16723350 16787598 16954741 17446423 17634260 17869477 17943418 18091130 18847782 19327430 19651283
4093A9651283M6275N38114M01922L38915N74636M61371M10909M80228P87341N41721
4083B4232715N79600O88634P93191O68247P91615Q06455P01719O75417J279856
4074C1217449J113531Q81600J218026J134311J098336J313263J306019J447207
4066D0729742J729521J582950J583035J629769J845184J887066K094480J916051
4058E4997798K017729K230309K351539K664800K900543K494912K848194K987915
4050G5493739K951425K982707L006133L142789K799111K724220K527193K462992
4042I8090309K447457K243906J813481J521915P94893J124202M07874L66847m4104
4033A08766780l14011o56704r87613j065793j130782j396786j852211k073292
$$ plain form
4093 19651283 19697558 20235672 20637594 20976509 21551145 22012516 22423425 22903653 23690994 24232715
4083 24232715 24812315 25500949 26294140 26962387 27754002 28560457 29262176 29937593 31217449
4074 31217449 32330980 33212580 34430606 35564917 36663253 37976516 39282535 40729742
4066 40729742 42459263 44042213 45625248 47255017 49100201 50987267 53081747 54997798
4058 54997798 57015527 59245836 61597375 64262175 67162718 69657630 72505824 75493739
4050 75493739 78445164 81427871 84434004 87576793 90375904 93100124 95627317 98090309
4042 98090309 100537766 102781672 104595153 106117068 106911961 108036163 108444037 108810884 108766780
4033 108766780 108452769 107796065 106808452 105742659 104611877 103215091 101362880 99289588
4025I9289588k382065k618064k771834k927803k948830l211839l229179l418251
4017G5781723l119504k856941k839094l052928k833748k635816k424086k660580
4009E3359026k420562j868892k100050k262797j794330j474235j521550j570259
4001C8346351j348438j169293j237231q67026r54378r49554j051573q44788r85737
3992B8938333n84002n98955o31259n95575m19640n26032k34506l98296o21088
3983B4328980l32238j68584k82429l23319k51477l18290l70813m5762L0737k31798
3973B2035007k26770J75303j24065J64002j94947k15451L2007Q1151K22511j56793
3963B1791955q9946L88839J21710K10763J62252K27117K55319L36383J26168M16771
$$ plain form
4025 99289588 96907523 94289459 91517625 88589822 85640992 82429153 79199974 75781723
4017 75781723 72662219 69805278 66966184 63913256 61079508 58443692 56019606 53359026
4009 53359026 50938464 49069572 46969522 44706725 42912395 41438160 39916610 38346351
4001 38346351 36997913 35828620 34591389 33724363 32769985 31820431 30768858 29924070 28938333
3992 28938333 28354331 27755376 27124117 26528542 26108902 25582870 25348364 24950068 24328980
3983 24328980 23996742 23828158 23545729 23222410 22970933 22652643 22281830 22236068 22266805 22035007
3973 22035007 21808237 21983540 21859475 22023477 21828530 21613079 21645086 21726237 21948748 21791955
3963 21791955 21702009 22090848 22212558 22423321 22585573 22812690 23068009 23404392 23530560 23947331
3953B3947331O66402J70366M38527N00695L02619N58564M49745N61725O36242
3944B8232216M71169P24554P58571R38852Q02306Q50942O29480Q84732J006798
3935C5299620J079881Q14020J017228J028209O28686R11431J017561O63462M32660
3926D2892758N01219O87649O29884K99723J40919L67807r6642L48884P5993M16111
3916D6264305M90472M02965P31904O62114O83744P23365Q41884J293987J433094
3907E3527834J272917J567419J544198J581966J836208J866661J862936K243503
3899F7303642K237290K164973K884615K999220K793050K847983L378177L803674
3891I0412624L626198L894500M221110M400747M179103M689533M740763M842995
$$ plain form
3953 23947331 24613733 24784099 25222626 25723321 26025940 26584504 27034249 27595974 28232216
3944 28232216 28703385 29427939 30186510 31125362 31927668 32778610 33408090 34292822 35299620
3935 35299620 36379501 37193521 38210749 39238958 39867644 40779075 41796636 42460098 42892758
3926 42892758 43393977 44081626 44711510 45011233 45152152 45519959 45423317 45772201 45848194 46264305
3916 46264305 46754777 47157742 47889646 48551760 49235504 49958869 50800753 52094740 53527834
3907 53527834 54800751 56368170 57912368 59494334 61330542 63197203 65060139 67303642
3899 67303642 69540932 71705905 74590520 77589740 80382790 83230773 86608950 90412624
3891 90412624 94038822 97933322 102154432 106555179 110734282 115423815 120164578 125007573
3883A25007573M812247M937433N001957N150438M574626M540077M308766L638084
3875A61971201L740986L371197K693176K255170J697815R59256P44399L71311
3867A77804511n994l07672p67441j272701j704139j787127j888896k781279l152830
3858A64136432l088529l623631l515106l828890m499161m376170m673153m575687
3850A31956105m558526m537693m864725m790843m838192m522310m421901m807522
3842I4614393l970270l908637l623024l565428l282436l201816k901633k397156
3834F7763993k485517k601001k248671k071536j790076j763898j512956j304435
3826E1985903j604245j276034r99647j123339p25997j057844q79816n99687l88706
$$ plain form
3883 125007573 129819820 134757253 139759210 144909648 149484274 154024351 158333117 161971201
3875 161971201 165712187 169083384 171776560 174031730 175729545 176688801 177433200 177804511
3867 177804511 177798517 177490845 176723404 175450703 173746564 171959437 170070541 167289262 164136432
3858 164136432 161047903 157424272 153909166 150080276 145581115 141204945 136531792 131956105
3850 131956105 127397579 122859886 117995161 113204318 108366126 103843816 99421915 94614393
3842 94614393 90644123 86735486 83112462 79547034 76264598 73062782 70161149 67763993
3834 67763993 65278476 62677475 60428804 58357268 56567192 54803294 53290338 51985903
3826 51985903 50381658 49105624 48105977 46982638 46256641 45198797 44318981 43719294 43330588
3817D3330588q26391p42711k67987j72872j57150k91907l54742m33470k9944k87896
3807C9765518j20505n03637l51840m15338q7924m77434q10362o69802q11645j065845
3797C4451186o82670j081777j075026q91543q83714q86999j066738q91989p46509
3788B6244221p71912p65354q14459q36649n82993o42668n39362k84905p16073
3779B0289846m88798n20999j94606q7787o84085k17615k62552l96114m50989l48444
3769A6637857k28669k20405j28164k69098k04571k28774o8730r3969l47455k45863
3759A4602159k9349j57691K1103o7391j77269j6638j15924J66929k30504j79014
3749A3816411j03944K502N4682j02352k59075j53107j54203r1189l39070J0071
$$ plain form
3817 43330588 42504197 41761486 41493499 41320627 41163477 40871570 40516828 40083358 40053414 39765518
3807 39765518 39645013 39141376 38789536 38374198 38286274 37808840 36998478 36328676 35517031 34451186
3797 34451186 33768516 32686739 31611713 30720170 29836456 28949457 27882719 26990730 26244221
3788 26244221 25472309 24706955 23892496 23055847 22472854 21830186 21290824 21005919 20289846
3779 20289846 19801048 19280049 19085443 18997656 18313571 18095956 17833404 17437290 16986301 16637857
3769 16637857 16409188 16188783 16060619 15791521 15586950 15358176 15289446 15195477 14848022 14602159
3759 14602159 14572810 14415119 14436222 14368831 14191562 14174924 14059000 14225929 13995425 13816411
3749 13816411 13712467 13714969 13769651 13667299 13408224 13255117 13100914 13009725 12670655 12680726
3739A2680726k84482l45345m4741l01464L1201m1067m29757j05142k88439k92716
3729A0578774k11595j16756j14207m13770L3208r4682o6898j64507J93432k14301
3719I408698l629j53204j87363J27442j32204J30667k11503L0719K318k40638
3709H771303K0109Q353J05998j07903K54851J24449j59834j67622m1909L30545
3699I138340j12363J93104j13203K8425J55317M5917M4971j61093j4025K03802
3689I409192J8021j33477o4400j01092K20408K79622N6739J24343N5443m0254
3679I824545J20208K59352K40502K10580L3230q8353J52296J32131K7087L08215
3669A1219793L95489J68297L87677M08624J35658K43022L22068L42648M67588
$$ plain form
3739 12680726 12396244 12050899 12006158 11704694 11735895 11694828 11265071 11159929 10871490 10578774
3729 10578774 10367179 10250423 10136216 9722446 9755654 9660972 9594074 9429567 9622999 9408698
3719 9408698 9405069 9251865 9064502 9191944 9059740 9190407 8978904 9009623 9011941 8771303
3709 8771303 8791412 8799765 8905763 8797860 9052711 9177160 9017326 8849704 8807795 9138340
3699 9138340 9025977 9219081 9105878 9134303 9289620 9335537 9380508 9219415 9205390 9409192
3689 9409192 9427213 9293736 9229336 9128244 9348652 9628274 9685013 9809356 9864799 9824545
3679 9824545 9944753 10204105 10444607 10655187 10688417 10600064 10752360 10884491 10911578 11219793
3669 11219793 11615282 11783579 12171256 12579880 12715538 12958560 13280628 13623276 14090864
3660A4090864L72334L05892L86403J01278L29695O60833O08647N20060M40652
3651A7816658L25321N14206O42359P19089P86545P99952P44495J175216Q76226
3642B4400067P38349J152908Q41628Q09102J323682J033629R64075R75962J239523
3633C3478925Q88943Q98146R66822Q21260P08613N81005N59311M92104J83689
3624C9578818L94133L40439j80968J87305L09401L55789J3879r3302o2411J24334
3614D0967417r2322j70427j72287j17800l58894j48861J30703L69490J61395K56679
3604D0825093L19430O71361O65882O33692O31803J182930J477476J334315J077233
3595D8819215J360988J568224J941804J994162J982844K164558K129630K736262
$$ plain form
3660 14090864 14463198 14769090 15155493 15256771 15586466 16247299 16855946 17376006 17816658
3651 17816658 18141979 18656185 19298544 20017633 20804178 21604130 22348625 23523841 24400067
3642 24400067 25138416 26291324 27132952 27942054 29265736 30299365 31263440 32239402 33478925
3633 33478925 34367868 35266014 36232836 37054096 37762709 38343714 38903025 39395129 39578818
3624 39578818 39972951 40313390 40132422 40319727 40629128 40984917 40998796 40905494 40843083 40967417
3614 40967417 40875095 40704668 40532381 40414581 40055687 39906826 40037529 40407019 40568414 40825093
3604 40825093 41144523 41815884 42481766 43115458 43747261 44930191 46407667 47741982 48819215
3595 48819215 50180203 51748427 53690231 55684393 57667237 59831795 61961425 64697687
3587F4697687K671967K579586K638621L204327L163547L063684L203219L576657
3579H8799295L162071K871534L508565K961028K729130K602634K191573K412102
3571A11237932K104341J380625J163711R04199O52666M58712K93741o0448j22351
3562A18013128m39280n92319p84761j016812j111344j095119j243706j357225
3554A10372562j727573j549148j266404j208146j359379j173838p18973m22931
3546A00946170k57795k22661O03543M22495O57054P47006J143715J373228J492164
3537A06904919J357533J303521J269976J294515J359659P62655P42107R06687
3529A15901572M48415Q1458O9786o94758o79018n48534q74914j188523j348471
$$ plain form
3587 64697687 67369654 69949240 72587861 75792188 78955735 82019419 85222638 88799295
3579 88799295 91961366 94832900 98341465 101302493 104031623 106634257 108825830 111237932
3571 111237932 113342273 114722898 115886609 116790808 117443474 117902186 118195927 118135479 118013128
3562 118013128 117573848 116981529 116196768 115179956 114068612 112973493 111729787 110372562
3554 110372562 108644989 107095841 105829437 104621291 103261912 102088074 101369101 100946170
3546 100946170 100688375 100465714 101069257 101491752 102148806 102895812 104039527 105412755 106904919
3537 106904919 108262452 109565973 110835949 112130464 113490123 114252778 114994885 115901572
3529 115901572 116349987 116431445 116501231 115806473 115127455 114578921 113704007 112515484 111167013
3520A11167013j401197j971592k275395k368761k495570k551779l368585l223400
3512I1510734l095617l705565l674101l596520l153436l139398l213513k895637
3504F5036947k533916k292210k239285j888649j737048j333491j239271j164834
3496E0608243j057895p86653l70017m64819l17771j1237J13431J08580J56203
3487D7978065R8293K17764J82574J64721K76481K69283K04594N61141O0873J58385
3477E0172174L25606M27745J70224Q7980N81127L54821J94575L94684o0881Q9347
3467E2737402J48317L83821q3888m3308j92364J9049l12146o59869n80095p75344
3457E0641575p86745j024980j123533j391317j191956j304184j450847j413711
$$ plain form
3520 111167013 109765816 107794224 105518829 103150068 100654498 98102719 94734134 91510734
3512 91510734 88415117 84709552 81035451 77438931 74285495 71146097 67932584 65036947
3504 65036947 62503031 60210821 57971536 56082887 54345839 53012348 51773077 50608243
3496 50608243 49550348 48763695 48393678 47928859 47611088 47599851 47713282 47821862 47978065
3487 47978065 48076358 48294122 48476696 48641417 48917898 49187181 49391775 49952916 50013789 50172174
3477 50172174 50497780 50925525 51095749 51183729 51764856 52119677 52314252 52708936 52648055 52737402
3467 52737402 52885719 53269540 53185652 53142344 52949980 52969029 52656883 51997014 51416919 50641575
3457 50641575 49854830 48829850 47706317 46315000 45123044 43818860 42368013 40954302
3449D0954302j160368r55965q77547j179752j005277n34502m81478k73085l92972
3440C4093356L812p9959j46571J95435P7581M13353M78746M27615N52506N55346
3430C6571220M62823Q93066P09144J215743R93753R45201J178734J172116J205127
3421D5346927J434699J275495J431224J806060J745114J754259K120955J975098
3413E8889831K157139K357759K637136K715099K725440K769269K830007K961628
3405H0043308K804926K697605K844057K844755K261507K182870K014330J784374
3397I9477732J450127R84623J132404J036813N43701O25381K62435R4864N7353
3388A05665433l46892l97809n84340n58953p53219j445385j708183k076110k437299
$$ plain form
3449 40954302 39793934 38837969 37960422 36780670 35775393 35240891 34759413 34486328 34093356
3440 34093356 34097168 34017209 33870638 34066073 34143654 34557007 35035753 35463368 36015874 36571220
3430 36571220 37034043 37927109 38636253 39851996 40845749 41790950 42969684 44141800 45346927
3421 45346927 46781626 48057121 49488345 51294405 53039519 54793778 56914733 58889831
3413 58889831 61046970 63404729 66041865 68756964 71482404 74251673 77081680 80043308
3405 80043308 82848234 85545839 88389896 91234651 93496158 95679028 97693358 99477732
3397 99477732 100927859 101912482 103044886 104081699 104625400 105250781 105513216 105608080 105665433
3388 105665433 105318541 104920732 104336392 103777439 103024220 101578835 99870652 97794542 95357243
3379I5357243k520125l041800l290229l558905l458439l811114l752517l860567
3371F8063547l772954l647735l550781k841661k856737k758720k790429k521060
3363D3323470k125194j839929j636662j157669j378404j265966j238549j067431
3355C1613666p38273r42092r88194n47302q42904m83678l31398l23866k41075
3346B6174884o94834o49204n41003p34747p46009p11049o78602j60935n27328
3337B0731173k12351k34369j98441j56925K5446m720j00820n7154P7981K73090
3327B0142910N6187q3876k32834k55440j69465l06271l45208n21556o88580m68069
3317A7127798o53497o16055l81166n98167m44337l25576p69422m12002l54666
$$ plain form
3379 95357243 92837118 89795318 86505089 82946184 79487745 75676631 71924114 68063547
3371 68063547 64290593 60642858 57092077 54250416 51393679 48634959 45844530 43323470
3363 43323470 41198276 39358347 37721685 36564016 35185612 33919646 32681097 31613666
3355 31613666 30875393 29933301 28945107 28397805 27554901 27071223 26739825 26415959 26174884
3346 26174884 25480050 24830846 24289843 23555096 22809087 22098038 21419436 21258501 20731173
3337 20731173 20518822 20284453 20086012 19929087 19954533 19949813 19848993 19791839 19869820 20142910
3327 20142910 20199097 20115221 19882387 19626947 19457482 19151211 18806003 18284447 17595867 17127798
3317 17127798 16474301 15858246 15477080 14878913 14434576 14109000 13339578 12927576 12572910
3308A2572910l15500l47332j85757k17012m64417q0783k37396l06020p6974J3411
3298A0355130k03935j50182l27419r3512J12920m9100l18961l29842K5639n9604
3288H961134J5630j26933q2984j79550J03544j33112k32435J34390j2335K20446
3278H667795k08398l76843m5217l0175k26068K4364J78632j94366J97675m0933
3268G946466j70344o9753Q8847Q3324j35523k13665Q3173l283j58002Q5296L9544
3257G576080L8853k15532k863K07399J21372K1104j40899K29836K8432l57685
3247G506097j1767K16840J18019R5511l18708Q7712K65286p0412K50071K37198
3237H375847k13103P7340K1755O7441K98956K6584j34203N5079J35062K45184
$$ plain form
3308 12572910 12257410 11910078 11724321 11507309 11042892 10962109 10724713 10418693 10341719 10355130
3298 10355130 10151195 10001013 9673594 9580082 9693002 9643902 9324941 8995099 9020738 8961134
3288 8961134 8976764 8849831 8766847 8587297 8690841 8557729 8325294 8459684 8447349 8667795
3278 8667795 8459397 8082554 8037337 8007162 7781094 7805458 7984090 7789724 7987399 7946466
3268 7946466 7776122 7706369 7795216 7878540 7743017 7529352 7612525 7609242 7451240 7536536 7576080
3257 7576080 7614933 7399401 7396538 7603937 7725309 7746413 7605514 7835350 7863782 7506097
3247 7506097 7494330 7711170 7829189 7924700 7605992 7693704 7958990 7888578 8138649 8375847
3237 8375847 8162744 8240084 8261839 8329280 8628236 8654820 8520617 8575696 8710758 8955942
3227H955942k1651K12812L31105p0756o8752J38090n7516J0222L37735K05280
3217I972511p7009l1293N026K43769L46625k82081O452L31963K25942q5362J03032
3206A0759575L10143K60300L27K27431J35565L51517K18058K95437J40124J33014
3196A2831491M17633O94353K49974M6324N65246M34370L54767K99493N27836L07284
3186A6728771O43402M20787K70091N43962P88300O27372K29873P59635P91984
3177B1804177Q16675M96255P42866R00507P24479O94906J009448Q77115J159911
3168B9226339J049703Q18276Q39507O54001R45426J019437P21516O15967N74804
3159C6464976O02181O45625P08313N08760M67435P19219P27128J083808J007204
$$ plain form
3227 8955942 8934291 9147103 9478208 9407452 9338700 9476790 9419274 9429496 9767231 9972511
3217 9972511 9895502 9864209 9869235 10113004 10459629 10177548 10184000 10515963 10741905 10656543 10759575
3206 10759575 11069718 11330018 11330345 11557776 11693341 12044858 12262916 12558353 12698477 12831491
3196 12831491 13249124 13943477 14193451 14239775 14805021 15239391 15594158 15893651 16421487 16728771
3186 16728771 17372173 17792960 18063051 18607013 19395313 20022685 20252558 21012193 21804177
3177 21804177 22620852 23117107 23859973 24760480 25484959 26179865 27189313 28066428 29226339
3168 29226339 30276042 31094318 31933825 32587826 33533252 34552689 35274205 35890172 36464976
3159 36464976 37067157 37712782 38421095 38929855 39397290 40116509 40843637 41927445 42934649
3150D2934649J023542J306387J367437J314955J609092J742052J737077K106091
3142E5141282K203352K283717K625337K736808K995428K742399K957215L273718
3134G6959256L689225L620255L860860M058385M278237M411520N216859N125678
3126A11220275N150046N926255N811643O342517O674673P100854P191885P596701
3118A63014849Q527356Q862691R630527J0474520J1184662J2462035J3151448
3111B37308088J4765695J6037194J7017676J8677112J9691491K1199367K2616520
3104C67313143K3510433K4039234K3659477K1627878J7396882J1835300M057983
3097D93440330l981833j1908024j8211512k2961039k5855634k6959091k6950022
$$ plain form
3150 42934649 43958191 45264578 46632015 47946970 49556062 51298114 53035191 55141282
3142 55141282 57344634 59628351 62253688 64990496 67985924 70728323 73685538 76959256
3134 76959256 80648481 84268736 88129596 92187981 96466218 100877738 106094597 111220275
3126 111220275 116370321 122296576 128108219 134450736 141125409 148226263 155418148 163014849
3118 163014849 171542205 180404896 190035423 200509943 211694605 224156640 237308088
3111 237308088 252073783 268110977 285128653 303805765 323497256 344696623 367313143
3104 367313143 390823576 414862810 438522287 460150165 477547047 489382347 493440330
3097 493440330 489458497 477550473 459338961 436377922 410522288 383563197 356613175
3090C56613175k6464495k5370219k3750085k2161504k0712380j8709829j7026364
3083B02418299j5504465j3792076j2584145j1031467j0165904r007388q295270
3076A22037584q004595o704816n922733n777116n226955m591966m277023m100026
3068G7432354l758855l402051l367134l530136l116469k574621k473330k359743
3060E2850015k229841k143977j670214j966459j958831j755166j348842j500709
3052C8275976j221588j392945j041802r44399r00050r74161r34282o95089j064828
3043B9106832o94884q83117j039528o92797q40450q23847o74235j041640n28689
3034B1887645m39113m98022m45298p09850l44786m61736o72555m90158k03110
$$ plain form
3090 356613175 330148680 304778461 281028376 258866872 238154492 219444663 202418299
3083 202418299 186913834 173121758 160537613 149506146 139340242 130332854 122037584
3076 122037584 114032989 107328173 101405440 95628324 90401369 85809403 81532380 77432354
3068 77432354 73673499 70271448 66904314 63374178 60257709 57683088 55209758 52850015
3060 52850015 50620174 48476197 46805983 44839524 42880693 41125527 39776685 38275976
3052 38275976 37054388 35661443 34619641 33675242 32775192 31801031 30866749 30171660 29106832
3043 29106832 28411948 27528831 26489303 25796506 24956056 24132209 23457974 22416334 21887645
3034 21887645 21448532 20950510 20505212 19795362 19450576 18988840 18316285 17826127 17623017
3025A7623017k62074n36039m98676j71784l62055l34819l74295l35862k82271
3016A4465142j79586j82097n42099k77965l02752J5387j66753k31904k62000l80165
3006A1955208J30288j89488m02983l25354j07712k52399k8528j99230l47796p1017
2996A0160989l00693j26689L2333l71346j94128k14310j24645j19821j48374j25949
2986H467367l55495j76886q7956P918J6214j35606j86356j90577k17694p1360
2976G069569q3894j36366l79698q1496K9499q4270N6293k15008k20800j34219
2966E819610p1225P2426j72225k47036m3102p5568n5102l8141n5501O4874o7295
2955E131715j98578j6932K5848j15624j68884k26686j14920k72918L3844J75711
$$ plain form
3025 17623017 17360943 16824904 16326228 16154444 15792389 15457570 15083275 14747413 14465142
3016 14465142 14285556 14103459 13561360 13283395 12980643 12996030 12829277 12597373 12335373 11955208
3006 11955208 12085496 11896008 11493025 11167671 11059959 10807560 10779032 10579802 10232006 10160989
2996 10160989 9860296 9733607 9765940 9394594 9200466 8986156 8861511 8741690 8593316 8467367
2986 8467367 8111872 7934986 7847030 7854948 7871162 7735556 7549200 7358623 7140929 7069569
2976 7069569 6985675 6849309 6469611 6388115 6417614 6333344 6389637 6174629 5953829 5819610
2966 5819610 5748385 5820811 5648586 5401550 5358448 5282880 5227778 5189637 5134136 5199010 5131715
2955 5131715 4933137 4916205 4942053 4826429 4657545 4430859 4315939 4043021 4076865 4252576
2945D252576k997j65749K0890j62237J20948J61509j37646k39050J31711j24037
2935C855918o6154K1993J9407j4417J1119N3850k1093j1897p9398j54878l1749
2924C582701k20352L0606l6133n8876j01646K42115j38441k19802j79823k32269
2914B668080j85618P1965J81125k02339L9008j22266O0684L23122M4431k51482
2904B626710l71120J03303J70758L4294j25456k48896J08648J48011Q6406j04717
2894B427941K45390j70688k48105K42904o9853k68218J73265L104K62448J55639
2884B753827r8394k55972j91230L6783L68167k16220J5729K98133j26477N5157
2874B639503k6773j44922j59609q1297K7088j70138j21692q5401K94882P9382
$$ plain form
2945 4252576 4249579 4083830 4104720 3942483 4063431 4224940 4087294 3848244 3979955 3855918
2935 3855918 3789764 3811757 3831164 3816747 3827866 3881716 3860623 3848726 3769328 3614450 3582701
2924 3582701 3362349 3392955 3356822 3297946 3196300 3438415 3299974 3080172 2900349 2668080
2914 2668080 2482462 2554427 2735552 2533213 2572221 2449955 2510639 2833761 2878192 2626710
2904 2626710 2255590 2358893 2529651 2563945 2438489 2189593 2298241 2446252 2532658 2427941
2894 2427941 2673331 2502643 2254538 2497442 2427589 2159371 2332636 2335740 2598188 2753827
2884 2753827 2655433 2399461 2208231 2245014 2613181 2396961 2412690 2710823 2584346 2639503
2874 2639503 2612730 2467808 2308199 2226902 2253990 2083852 1962160 1876759 2171641 2251023
2864B251023r6561r555J85377k5425k2264l14433j91837K32833k43001K05109
2854A971266j40881J18076K17514k770R7713R477L6082n8181N8939j78839K38695
2843B367091r141q0372R6643J75826j11298r5302j64096J69866J85339L3749J45428
2832B713733Q5829j48228l9461J4646m1508q3320K73491J70107K4237K09282K1449
2821C200257K27623J31084N6330J40849J29940l09387K4676J70824L03461j1338
2811D064319k92741m994l29917l8201j06048k72925j16503k1832j01546n3059
2801B726553j11111j96420p4544N406n4815k7771P4172l59036q6055j84380R1823
2790A803822j60060J66784K28064k18807k19892k0445j50228j94130J09601j8211
$$ plain form
2864 2251023 2154462 2144907 2330284 2304859 2282595 1968162 1776325 2009158 1766157 1971266
2854 1971266 1830385 1948461 2165975 2163205 2260918 2270395 2306477 2248296 2307235 2128396 2367091
2843 2367091 2357950 2277578 2374221 2550047 2438749 2343447 2179351 2349217 2534556 2568305 2713733
2832 2713733 2799562 2651334 2611873 2626519 2585011 2501691 2775182 2945289 2969526 3178808 3200257
2821 3200257 3427880 3558964 3615294 3756143 3886083 3576696 3601372 3772196 4075657 4064319
2811 4064319 3771578 3766584 3436667 3398466 3292418 3019493 2902990 2881158 2779612 2726553
2801 2726553 2615442 2419022 2344478 2349884 2295069 2267298 2341470 1982434 1896379 1711999 1803822
2790 1803822 1643762 1810546 2038610 1819803 1599911 1579466 1429238 1235108 1344709 1326498
2780A326498L2002q5179j51242K81394k16414L0768J08843k74841K37671n8986
2770A230514l2354K00625p7393Q6931R0814j34787j47652L4913n9516K17454n3400
2759A356149l48073P5704M5052O3811J83764m4969l80690L8124L11771l0509k51269
2748A018865K45738j13780o9817K66171j78976k70233r7763J36477m4174r938
2738H82570j05444J3273j25903N0511P0241M3329j74792M2024J55591P3127M8653
2727I73180l65278r0590M2523K33463j0375j13137k5071j10459P6032j8663m437
2716E87188J39050k34388L9464k571P9604J76414j29889K3817J27084r6304j80539
2705E28930l1219l3942K31604J27732o7681l8354j96187J4837j34064J64592N60057
$$ plain form
2780 1326498 1358500 1273321 1122079 1403473 1187059 1217827 1326670 1051829 1289500 1230514
2770 1230514 1198160 1398785 1321392 1408323 1499137 1364350 1216698 1251611 1192095 1409549 1356149
2759 1356149 1008076 1083780 1128832 1192643 1376407 1331438 950748 988872 1300643 1270134 1018865
2748 1018865 1264603 1150823 1081006 1347177 1168201 897968 800205 936682 892508 882570
2738 882570 777126 790399 664496 715007 785248 828577 653785 695809 851400 924527 973180
2727 973180 607902 517312 559835 793298 782923 669786 644715 534256 610288 591625 587188
2716 587188 726238 491850 531314 528743 608347 784761 654872 678689 805773 709469 528930
2705 528930 497711 463769 695373 823105 755424 717070 520883 535720 401656 566248 1126305
2694A126305j48838j54162l7269M8314j68076j12218J3478R6842k257J19810J0736
2683G92665o4397P2780N7212j79146j59518Q001J02103R4745l03421j23108J69528
2672D67444K15914R0700r5350j89454J40476p4253N2529r04p1510J0137J10147
2661F55876m1036J70237R3200k89144j54320M7337k7436k050R748j41859J51241
2650D71794J60610J11498O817k53467j46718j90263J71244J77391k6324J55970
2640F38552j21371r7287K2212j77742p1814k3086j24188N5105J72894J52888J22730
2629E48893J1929o6951J14271k71520n7491o0590J33840j69043j07474K95430
2619C71294M4825j07230j29628J61678M2880J87078k15929r6402J32419k14284
$$ plain form
2694 1126305 977467 823305 786036 834350 666274 554056 567534 664376 662119 781929 792665
2683 792665 728268 801048 858260 679114 519596 527597 629700 724445 421024 297916 467444
2672 467444 683358 774058 678708 489254 629730 555477 608006 607102 535592 545729 655876
2661 655876 614840 785077 878277 589133 434813 482150 454714 452664 462412 320553 471794
2650 471794 632404 743902 750719 497252 350534 160271 331515 508906 482582 638552
2640 638552 517181 419894 442106 264364 192550 169464 45276 100381 273275 426163 548893
2629 548893 560822 493871 608142 336622 279131 218541 352381 183338 75864 371294
2619 371294 416119 308889 179261 340939 383819 570897 354968 258566 390985 176701
2609A76701m2054L90025l03789M6135L36489k00365j71864J18252r0805R7469
2599C56194J44995O5168j30691J25003j382m544k87596J24208K41585k85947j3684
2588C33309K37667J74244n5942M0691K6976m4862j48256k66901j0418J89826J93551
2577F69885q4337j13809J82016l17203j82738L54478O7842n2367J46054j10288
2567E59533J72566j03364l77072m17647J58952P9364k6509R470R2680K3018o6664
2556A04327j1127J23812P9910k38121J0620P5428L0856O0662J8271K14783m3176
2545D26245j68689k1486L4874k5082j54786J33588q5119m0243J4947p097J61366
2534B68518j09926J68677m3473j81168J8417N228J61253p1384J04362j27124k21694
$$ plain form
2609 176701 134647 524672 220883 267018 603507 403142 231278 349530 258725 356194
2599 356194 501189 566357 435666 560669 559287 554743 267147 391355 632940 346993 333309
2588 333309 570976 745220 689278 729969 756945 712083 563827 296926 286508 476334 669885
2577 669885 585548 471739 653755 336552 153814 508292 576134 523767 669821 559533
2567 559533 732099 628735 251663 -165984 -7032 72332 45823 55293 147973 170991 104327
2556 104327 93200 217012 296922 58801 69421 144849 175705 236367 254638 469421 426245
2545 426245 257556 236070 270944 245862 91076 224664 139545 99302 114249 107152 268518
2534 268518 158592 327269 283796 102628 121045 126273 287526 216142 320504 193380 -28314
2523b8314k10333J69002M03710j35056J9399K79300J12857j10392j79194n4205
2513B66774j72767j15814L33420J33098j09610M920j2349l8639O5296Q5226J79398
2502F18953j98394Q8398j17541l7798k62691j19176R5739J59375R4204j2071n344
2491C03654j78597r7524J68722j29804L5310P5119P3598j17070K8413O0345r0628
2480A31538K1591J32134j77783M0722Q81J65734K30980l26319p4434l7484m5028
2469F2532r2871M8820J47546J2301n3351k4590J46911J76466j87852k7108Q1121
2458B89925J57976q8077J04535q7815J19896l4727j34457n3303J01408j10482
2448B64879J31718O8402k27992n7119J59221M3838r2768q6706j16281K7320J21223
$$ plain form
2523 -28314 -238647 -69645 334065 199009 218408 497708 610565 500173 320979 266774
2513 266774 94007 -21807 311613 444711 335101 340021 327672 289033 354329 439555 618953
2502 618953 420559 508957 391416 353618 90927 -28249 67490 226865 321069 308998 303654
2491 303654 125057 27533 196255 66451 101761 176880 250478 133408 161821 222166 131538
2480 131538 153129 285263 107480 148202 149083 314817 545797 219478 145044 107560 62532
2469 62532 -30339 18481 166027 178328 124977 100387 247298 423764 235912 208804 289925
2458 289925 447901 359824 464359 376544 496440 461713 327256 273953 375361 264879
2448 264879 396597 464999 237007 179888 339109 382947 290179 203473 87192 114512 235735
2437B35735K8560O3156k64627o908L14600K90818k64271j73760O1741K05845J7828
2426E08717k46329K6922j98225J21540j7967K26813N0066j50531K00466j11637
2416D09835K79393o3358k59672m7906O3929P4464J23291j91856Q6666J16596j29357
2405D62025J85623n3570N1899Q548p0636K37842J27968j10833j01236o2517L4068
2394G09181L1132K04093O1502r7593J88717j19753J25102n0389J13501J68480
2384A333973j18928Q5084Q8064K27825K9236J4662k6292k8668P4745J00881o71
2373A779911J32751o2502K21107K74837J0969K04448K26693o6030K48095J66893
2363C137172K2107L81189J94746K44834K78596K32703L55499K07340M45362N08135
$$ plain form
2437 235735 264295 327451 62824 55916 370516 661334 397063 223303 285044 490889 508717
2426 508717 262388 289310 91085 212625 194658 421471 471537 321006 521472 409835
2416 409835 689228 625870 366198 318292 382221 456685 579976 388120 474786 591382 462025
2405 462025 647648 594078 645977 654525 583889 821731 949699 838866 737630 675113 709181
2394 709181 740313 944406 1005908 908315 1097032 977279 1102381 1051992 1165493 1333973
2384 1333973 1215045 1300129 1388193 1616018 1645254 1659916 1633624 1604956 1679701 1780582 1779911
2373 1779911 1912662 1850160 2071267 2346104 2357073 2561521 2788214 2722184 2970279 3137172
2363 3137172 3159279 3540468 3735214 3980048 4258644 4491347 4846846 5054186 5499548 6007683
2353F007683K02590M29593K75743L38879N34556P90741O80951O21491Q14044N16157
2343A1212428M66852P56717P96913O82057N52769R67356J052727J132066J310177
2334A8930062J050909J304980J405866J639754K080118J981805J951568K683353
2326C3028415L689987N150785N933637P430997R423737R507382M249094l81529
2318G8032505n101414r624203r360514p194502o312329m903139m457625m125212
2310B6953567l285804k776052k258516j880340j408564j147931j130765j301744
2302A1763851r82072r41842n78204p46966p43446n46614k80320k80424l40664
2293F323299m77388l28190j54960l63270m61343k37958j34740m8743j35053l17029
$$ plain form
2353 6007683 6210273 6639866 6915609 7254488 7789044 8579785 9260736 9882227 10696271 11212428
2343 11212428 11679280 12435997 13232910 13914967 14467736 15435092 16487819 17619885 18930062
2334 18930062 19980971 21285951 22691817 24331571 26411689 28393494 30345062 33028415
2326 33028415 36718402 41869187 47802824 55233821 64657558 74164940 78414034 78032505
2318 78032505 72931091 63306888 53946374 46751872 40439543 35536404 31078779 26953567
2310 26953567 23667763 20891711 18633195 16752855 15344291 14196360 13065595 11763851
2302 11763851 10781779 9839937 9261733 8514767 7771321 7224707 6944387 6663963 6323299
2293 6323299 5845911 5517721 5362761 4999491 4538148 4300190 4165450 4116707 3981654 3664625
2283C664625l35642m42781j8126p1644j10010K7751k78781m68482J41144J96932
2273B304986J6861j42279J78171j50564k31745m6429j21659m6976k4904k52610
2263A482852k21959J80464Q6187J93755l52531o9001J13602L1394o9338j15038
2253A260387Q9221J49624k12360j28079l74060L9432J76581k30233k57570R794
2243E22737K31989R2891j92691K70936m1973k15714J40080N1765k12849j6723
2233F30448J77002P5195k17913j31073L64963Q1884P60l2794n1050N1431p6863
2222H71990k12612j67252J60j49854j04421J60006L01979k15204o2955M7317j28678
2211C40476M7878K68484j393j83465J03616j53099j89910J50529J65933j61033
$$ plain form
2283 3664625 3328983 2886202 2868076 2796432 2686422 2714173 2435392 1966910 2108054 2304986
2273 2304986 2321847 2179568 2357739 2207175 1975430 1929001 1807342 1760366 1735462 1482852
2263 1482852 1260893 1441357 1527544 1721299 1368768 1299767 1413369 1444763 1375425 1260387
2253 1260387 1349608 1499232 1286872 1158793 784733 824165 1000746 770513 512943 522737
2243 522737 754726 847617 654926 925862 883889 668175 808255 860020 647171 630448
2233 630448 807450 882645 664732 533659 898622 980506 981266 948472 897422 948853 871990
2222 871990 659378 492126 492286 342432 238011 398017 699996 484792 421837 469154 340476
2211 340476 388354 656838 655445 471980 575596 422497 232587 383116 549049 388016
2201C88016q1730l9399j44054K70550p7660j9098L9639o0227N4872N141m6086
2190B89964J4172k0754O7065P3133j54406M1643J37448k29520J42844p6578l7566
2179B47445K4385o2532J25024p1785m7801J32613L36234k58282l52700l8359L65050
2168C99292k02205o3924j68242J48998m9876j82548M07561K25544j43653p4604
2158B96343j60340q9993o585m3496l2217K03592p8600L9142N2641j11252K21879
2147B91114Q8085k90781o4251L5728P1707K27677j782j78089l13643K04690M7683
2136A18138j21478J33904j3502l39320J62473n5451k57572K61814j5263J02973
2126b3284j02432J59358J42498J7319q621k7203R530K8525K8499L5947k97484
$$ plain form
2201 388016 306286 266887 122833 393383 315723 296625 336264 276037 330909 336050 289964
2190 289964 304136 283382 350447 423580 269174 310817 448265 218745 361589 285011 247445
2179 247445 271830 209298 334322 262537 214736 347349 683583 425301 72601 34242 399292
2168 399292 197087 133163 -35079 113919 64043 -118505 289056 514600 370947 296343
2158 296343 136003 46010 39425 -4071 -36288 167304 88704 127846 180487 69235 291114
2147 291114 379199 88418 24167 59895 131602 359279 357497 179408 -134235 70455 118138
2136 118138 -3340 130564 117062 -222258 -59785 -115236 -372808 -110994 -126257 -23284
2126 -23284 -125716 33642 176140 193459 184838 157635 167165 195690 224189 260136 -37348
2115c7348J6198K328N8265M1631j77960K1348j81596L37239M3933N3021R9257
2104B76316j81336l0174J72036j45610N0068J0424k13153M0042M0200L3473J83468
2093B35754k28813r9309M8612o327n9848K8974j14793l0076K45226j35422K00415
2082H4393J7856o0695j55323j2393K52411K10917m72402P6859K35000o2760L13152
2071D27015j02649j63149q6524j21333k3107O917K17773K72550j68233N1522R86
2060C11768K8267n1496K8361m730j24477j18143P1477o3384j9555j72125n7622
2049a71659M12267K01038j81329q2594M0619Q5127j74616L4099m2596m1987l9942
2038C8427j63744K18739k8131J16394j57550K7183K10970j19019o6658J31738
$$ plain form
2115 -37348 -21150 -18822 39443 81074 -96886 -75538 -257134 80105 124038 177059 276316
2104 276316 94980 64806 236842 91232 141300 151724 -61429 -21387 18813 52286 235754
2093 235754 6941 -92368 -43756 -50083 -109931 -80957 -195750 -225826 19400 -116022 84393
2082 84393 102249 41554 -113769 -126162 126249 337166 -135236 -58377 176623 113863 427015
2071 427015 324366 161217 74693 -46640 -69747 -62830 154943 427493 259260 310782 311768
2060 311768 340035 288539 316900 312170 187693 69550 141027 77643 58088 -114037 -171659
2049 -171659 240608 441646 260317 177723 218342 303469 128853 162952 120356 78369 38427
2038 38427 -125317 93422 65291 181685 24135 51318 262288 143269 76611 208349
2028B08349j80569J02915j82876o6324O5678n4087q1467J17748Q8867j44517m0593
2017a66876P0474l8396j25881n9473j19641L19133Q9622R5776M7508O896j98855
2006g9713m7230k068J0900J59740J4273j67250J25441q8786k33922K1808q7043
1995c73850l6334J77542J18658N294r6640L8681M5044P1291o7012n6000j73046
1984c46372J15181j86400P1557K44928m1739K04988o5752j50801j08690L9021
1974b24079J22542j614r3590J12680p9161n7246L0424o4085J12853K27049M4466
1963A30239j21736q0455j2733J01255O3506k02063q8009p1649L74493p8371r8430
1952h3953K6459P7906r9458m6262k8855P7979j4472O188J43898k23322l0064l19436
$$ plain form
2028 208349 27780 130695 -52181 -118505 -52827 -106914 -188381 -70633 18234 -126283 -166876
2017 -166876 -96402 -134798 -260679 -320152 -439793 -120660 -31038 64738 112246 119142 -79713
2006 -79713 -126943 -129011 -118111 41629 55902 -111348 14093 -74693 -308615 -286807 -373850
1995 -373850 -410184 -232642 -113984 -108690 -205330 -166649 -121605 -50314 -117326 -173326 -346372
1984 -346372 -231191 -417591 -346034 -101106 -142845 62143 -3609 -154410 -263100 -224079
1974 -224079 -101537 -103151 -196741 -84061 -163222 -220468 -190044 -254129 -141276 85773 130239
1963 130239 8503 -71952 -84685 16570 80076 -121987 -209996 -281645 92848 14477 -83953
1952 -83953 -57494 20412 -79046 -125308 -154163 -76184 -90656 -84468 59430 -163892 -193956 -513392
1940e13392j95201L96030r4091J87752l6673M4573r5691m8845K35597j30289R6896
1929a53334P4912j5934J90069p8233k48244M4067j56696J19533p5351K85912K315
1918a0984j26655j23147m7696O3570P7211L39192j70419j29454J03107j23594
1908a48869k8111J83642L0494M8329O0250o7713l37767j26314K71335J74018k513
1897E6781j20203J52962L1455P220q6254j09757j52368K27981J36899P7664k57660
1886c5280m9531M5098l7150J06847N7851k17912j00432L2638J986J03721J20243
1875B8079N7632j21317k1623p987J11124l22229M09441j59269j63927J84115k31974
1864b37935K8113m4938N6466m5076R8252L2725r5654j68234K61335J57005l01944
$$ plain form
1940 -513392 -708593 -312563 -406654 -218902 -255575 -211002 -306693 -355538 -119941 -250230 -153334
1929 -153334 -78422 -94356 95713 17480 -230764 -186697 -343393 -223860 -299211 -13299 -10984
1918 -10984 -137639 -260786 -308482 -244912 -167701 171491 1072 -128382 -25275 -148869
1908 -148869 -176980 6662 37156 85485 145735 78022 -259745 -386059 -114724 59294 56781
1897 56781 -63422 89540 120995 128215 41961 -67796 -220164 7817 144716 222380 -35280
1886 -35280 -84811 -39713 -76863 29984 87835 -130077 -230509 -197871 -195885 -92164 28079
1875 28079 85711 -35606 -57229 -65216 45908 -276321 133120 -26149 -190076 -5961 -237935
1864 -237935 -209822 -254760 -198294 -243370 -145118 -112393 -208047 -376281 -114946 42059 -259885
1853b59885j2703r0190j7466J13879Q7145M3197N4549N3200J20452k57992j98327
1842c64141N0734L21758k08509Q9315P2905j82107J37667j64334l6016J13182
1832a69546J18962J15757o1608J20730j5420j52431N0096j76392j26078J6310
1822b79620k5913j58342j52203P4802L05917L7318l06976Q531K75624j05878J73949
1811a52791R9040j61984Q0087N5310j59444o3202K11455J04661R2247L590L6849
1800A45818K37953k29423l24826L16101p8076j07911R9172j00160O2206o3936
1790d3082j9721J81251K3461r4419R1006J6851o9021J57842k22582n5006J36413
1779A02993k32669K5110K65215j43143l2143k35875K06345R6335m36881l1730
$$ plain form
1853 -259885 -272588 -362778 -380244 -266365 -179220 -136023 -81474 -28274 92178 -165814 -364141
1842 -364141 -313407 8351 -200158 -110843 -37938 -220045 -82378 -246712 -282728 -169546
1832 -169546 -50584 65173 3565 124295 108875 -43556 6540 -169852 -295930 -279620
1822 -279620 -305533 -463875 -616078 -541276 -235359 -198041 -505017 -496486 -220862 -326740 -152791
1811 -152791 -53751 -215735 -135648 -80338 -239782 -302984 -91529 13132 105379 108969 145818
1800 145818 383771 154348 -170478 145623 67547 -40364 58808 -41352 20854 -43082
1790 -43082 -62803 118448 141909 47490 138496 155347 86326 244168 21586 -33420 102993
1779 102993 -129676 -104566 160649 17506 -14637 -250512 -44167 52168 -384713 -416443
1769d16443J1684Q7496J33329J43956P7114P9068n5124j8568J30475N2767k67671
1758d1917J17256p6072K28555l7992o1958k7575q0317M7653O649o7769J9183k22656
1746a96960r6807j6528J54427J74041L4702J752j69105N0857J66756k1994j89333
1735a08192J02733K821O3108J17294o8406K9095r0275j29189j96136Q3284J75659
1724a8204j14331j95230J26608R8656j10000N6217J31819k4918j31580j0660l2894
1713b24517j53797r8515r8228J28241K33672J0150m5165J537K14525K7908J54321
1702A50132l33534m8490J1728l3993J10220N7324m9107J87640p97j88748M4402
1691i3223k0681R2004J1266J61306r315l8754l74690O1822K5766J53448r723r7880
$$ plain form
1769 -416443 -404759 -317263 -183934 -39978 37136 116204 61080 42512 172987 225754 -41917
1758 -41917 75339 -733 227822 189830 127872 100297 19980 67633 74282 6513 25696 -196960
1746 -196960 -293767 -310295 -155868 18173 52875 54627 -114478 -63621 103135 81141 -108192
1735 -108192 -5459 -2638 60470 177764 109358 138453 48178 -81011 -277147 -193863 -18204
1724 -18204 -132535 -327765 -201157 -102501 -212501 -156284 -24465 -49383 -180963 -191623 -224517
1713 -224517 -378314 -476829 -575057 -446816 -213144 -202994 -248159 -246622 -32097 -4189 150132
1702 150132 -183402 -231892 -220164 -254157 -143937 -86613 -135720 51920 51123 -137625 -93223
1691 -93223 -113904 -21900 -10634 150672 141357 102603 -272087 -210265 -184499 -31051 -40774 -138654
1679a38654K86166j67287M9824o3675M1348O387L75142k27509j31726j63587J40754
1668G183k1988M3465l8286j37284K54664m5094o5864q0205K8335j06243l5849
1657a97166p8850r698L18831j22876q3931k63586J86010J25499j38321J93983
1647g0105j13525J2412j39435J4834p6983q7502N4901K27279o1990j5078L42104
1636H6912p1765J58809j42527j00099R3113q0774J59190m6133k23546j31240M9188
1625b48872l5061L0572J34615J36640p5143o2686k59039K9776K68067L8755K5217
1614a7159j17629m6463o9399k81546K80876j66527M558J3659l7728j0729M47794
1603b93P947l1837n8729k24026o9478J12362N2076n5261J07415l8700l127J11720
$$ plain form
1679 -138654 147512 -19775 30049 -33626 7722 14109 389251 161742 30016 -133571 7183
1668 7183 -14805 28660 -9626 -146910 107754 62660 -3204 -83409 -55074 -161317 -197166
1657 -197166 -276016 -285714 33117 -89759 -173690 -437276 -251266 -125767 -264088 -70105
1647 -70105 -183630 -171218 -310653 -295819 -372802 -460304 -405403 -178124 -240114 -255192 86912
1636 86912 15147 173956 31429 -68670 24443 -56331 102859 56726 -166820 -298060 -248872
1625 -248872 -283933 -253361 -118746 17894 -57249 -119935 -378974 -349198 -81131 -42376 -17159
1614 -17159 -134788 -181251 -250650 -532196 -251320 -417847 -413289 -399630 -437358 -448087 -293
1603 -293 7654 -24183 -82912 -306938 -376416 -264054 -211978 -267239 -159824 -198524 -201651 -89931
1591h9931J93220k29604M1606N6363r5664N191l9034J22238k37906K67779O8512
1580F2770j59015l6885k6208L3348j33622J07059M5334K07736N3913L552k6783
1569A31199j83448l80506K08378k3707k03112J17255O183l9040K6788J65533K11722
1558C7245J02591j96748l16506Q7952q1088J34864Q6621J27915O2257M5964n8107
1547C2960k3469k90534k27101L78821J25593k09227k14402J93178N5685J44511
1537c3985P5362k05294K36533Q0095k5826n063L9358j76629k65883j20224K3046
1526c78510k45150j35416K52416J90121K73044J25260k15688j51391k03011r646
1516d97971K12432J33266L2506J18730j35035o7244J68956L31267Q8259k59337
$$ plain form
1591 -89931 103289 -126315 -84709 -28346 -124010 -118819 -157853 -35615 -273521 -5742 62770
1580 62770 -96245 -133130 -159338 -125990 -259612 -152553 -107219 100517 154430 157982 131199
1569 131199 -52249 -432755 -224377 -248084 -451196 -333941 -327758 -366798 -340010 -174477 37245
1558 37245 139836 -56912 -373418 -285466 -366554 -231690 -145069 -17154 45103 91067 32960
1547 32960 9491 -281043 -508144 -129323 -3730 -212957 -427359 -234181 -178496 -33985
1537 -33985 41377 -163917 72616 152711 126885 121822 161180 -15449 -281332 -401556 -378510
1526 -378510 -623660 -759076 -506660 -316539 -43495 81765 -133923 -285314 -488325 -497971
1516 -497971 -285539 -152273 -119767 -1037 -136072 -203316 -34360 296907 385166 125829
1506A25829o2457J05616J02900l09277K44812n0443k32571l7425p2376J03945
1496h1447k371M7969k85048K27356N66654k46060l0433k0901j74685k11105J46016
1485f4055j52479J47821L6450n6991k47M8771j32112J49070J81378j71037P2212
1474E8781k3745K655k71032j13998K77067j26783L4608N4906m6146L8297J91837
1463G6447j80537j14967R0541j0600j9856j22359P6414K08854N2272l63205R2609
1452b14387j30937J65469j57935J46112J07209j36997k54722J09799M4891J86097
1442a35401K64675o4020P9995j33427J77845j38991o7353K2851n3363P9148m3273
1431a1314J36933J82149k36109l14625O2712K44421j55985J38436J56091r6666
$$ plain form
1506 125829 63372 168988 271888 -37389 207423 156980 -75591 -113016 -185392 -81447
1496 -81447 -83818 -35849 -320897 -93541 473113 227053 196620 175719 1034 -210071 -64055
1485 -64055 -216534 -68713 -32263 -89254 -89501 -40730 -172842 -23772 157606 -13431 58781
1474 58781 35036 37691 -233341 -347339 -70272 -197055 -162447 -107541 -153687 -115390 76447
1463 76447 -104090 -219057 -128516 -139116 -158972 -281331 -204917 3937 56209 -306996 -214387
1452 -214387 -345324 -179855 -337790 -191678 -84469 -221466 -476188 -366389 -321498 -135401
1442 -135401 129274 65254 145249 11822 189667 50676 -16677 6174 -47189 31959 -11314
1431 -11314 125619 307768 71659 -242966 -180254 64167 -91818 46618 202709 106043
1421A06043K77936k20829m09238p9893K4674k09758q1886J85438J56935Q0803
1411a69775J41190n8850k12086K73409J45800j93763o4071J75668Q1012l93041
1401b74507j2920J0905p9658J77627k06065K37236J5289j33333K7324K1865J54576
1390f1661J47964k96428r9803J00245q4891J84343K74109R9066j59853k66239
1380a63148k87006J53392J65674K19767K0382k1514K37367m43488k18239L81168
1370D4355Q5383j05376Q5686k09499j85491j5822J34515J71161J26023o7691k00886
1359a37642R4446j61154r8416K6762J13474Q1734k66L2123R3359j50510R057m1919
1347a38952q5320J56847J2515M4058L1318l706m9703k8567K4974j25564O7595
$$ plain form
1421 106043 383979 163150 -246088 -325981 -301307 -511065 -592951 -407513 -250578 -169775
1411 -169775 -28585 -87435 -299521 -26112 119688 -74075 -138146 37522 118534 -274507
1401 -274507 -287427 -276522 -356180 -178553 -384618 -147382 -132093 -265426 -238102 -216237 -61661
1390 -61661 86303 -210125 -309928 -209683 -294574 -110231 163878 262944 103091 -163148
1380 -163148 -450154 -296762 -131088 88679 109061 87547 324914 -118574 -336813 44355
1370 44355 129738 24362 110048 -99451 -284942 -300764 -166249 4912 130935 63244 -137642
1359 -137642 -43196 -204350 -302766 -276004 -162530 -80796 -81062 -48939 44420 -106090 -97033 -138952
1347 -138952 -224272 -67425 -54910 -10852 20466 16760 -32943 -61510 -36536 -162100 -94505
1336i4505j8293p7913r2313J21750K42864j13280J85726J28362r4132j37221o0054
1325i009k5160L2149m9689M8752J09228R536q0149J41336j26319k15372O7194
1314i7503Q6762K8695j07098R5308j37271Q0518K10818j77453j44615Q1474k17409
1303b97774O5697K02222l55794J74975K72814m8506k17085J37698n3236j78424
1293b97413r137J71K96584J84349p8892J49411l15810o7113J21607n5160p3656
1282a45059m642Q4024l9237P8964j88067K055j15032K81080J56485l67547k84819
1271e41795o8943J14450K51058j36524o9546J64580K60500J1807r4490k19741
1261c28644J50391J62632j45601N4655O1607K29141K6784j95373k60809l5621
$$ plain form
1336 -94505 -112798 -190711 -283024 -161274 81590 -31690 154036 282398 188266 51045 -9009
1325 -9009 -34169 -2020 -51709 -2957 106271 115807 35658 176994 50675 -164697 -97503
1314 -97503 -10741 17954 -89144 6164 -131107 -50589 160229 -17224 -161839 -80365 -297774
1303 -297774 -232077 -29855 -385649 -210674 62140 13634 -203451 -65753 -118989 -297413
1293 -297413 -306550 -306379 -9795 174554 95662 245073 -70737 -137850 -16243 -71403 -145059
1282 -145059 -149701 -65677 -104914 -25950 -214017 -211962 -326994 -45914 110571 -256976 -541795
1271 -541795 -610738 -496288 -245230 -381754 -451300 -286720 -26220 -14413 -108903 -328644
1261 -328644 -178253 -15621 -161222 -106567 -44960 184181 210965 15592 -245217 -280838
1251b80838R1030j9909L5274o863P2530n8942p9530j7803J99670J9858J6121m6405
1239g5807k38963J28490J87871o2802j87878J94786J6775m6974K0671n5929j00784
1228b20544J68386J43613J885j7035k01458J83279L5494N0285M7831k81034j4869
1217a04167n2712j84197K97728J04528k94219J36956J85629j62920K58391L60129
1207E45146m1520k84336j17356K0192j90600N4013J934M1438l43156j90072K6062
1196d78255K22949j46985O2604M15715M8885l92228Q4375J79731P4549Q1078k67844
1185a15426L4022L0366Q4389j73061K2001j94168J12551Q9132M0693L6214P8912
1174D5625N8937j32958J70267j2930k59085K38333m3915j46088M8031K20420j1937
$$ plain form
1251 -280838 -189808 -209717 -174443 -181306 -108776 -167718 -247248 -265051 -65381 -45523 -29402 -75807
1239 -75807 -314770 -186280 1591 -61211 -249089 -54303 -37528 -84502 -63831 -119760 -220544
1228 -220544 -52158 91455 93340 76305 -125153 58126 93620 143905 191736 -89298 -104167
1217 -104167 -156879 -341076 -43348 61180 -233039 -96083 89546 -73374 185017 545146
1207 545146 503626 219290 101934 122126 -68474 -14461 -12527 28911 -314245 -504317 -478255
1196 -478255 -255306 -402291 -339687 76028 124913 -267315 -182940 -3209 71340 152418 -115426
1185 -115426 -81404 -51038 33351 -139710 -117709 -311877 -199326 -110194 -69501 -33287 45625
1174 45625 104562 -28396 141871 128941 -130144 108189 64274 -81814 -33783 186637 174700
1163A74700k471k41421k61766L59481j24134j9392l07331r886M99467J48493m51505
1152b35765N4099K70560K4353k6876J72891k76675k28802K97314R4110j34741
1142A0468K7884J34885k16470j14807K51546j36652J67525j85758q1291o8266
1132b10936k76177R6103R6536N9419k0607J62429K23449m396K7752m0464k52790
1121a39682k17790P2991L10612j53398j05904L07404O3537l17973K43763J76485
1111B40045p5252J36790j06870k07158n2175l012J73320k01960k8162q4183P574
1100b01043K07217k0811n1398K06073l7921j1529j27595j50100J65235J53656
1090A31784k01443L4488l4823J00863q2350p5933N2634m5729K3246J74514J02294
$$ plain form
1163 174700 172229 -69192 -330958 28523 -95611 -115003 -422334 -432220 67247 215740 -235765
1152 -235765 -181666 88894 113247 86371 259262 -17413 -246215 51099 145209 10468
1142 10468 38352 173237 -43233 -158040 93506 -43146 124379 -61379 -142670 -210936
1132 -210936 -487113 -391010 -294474 -235055 -255662 -93233 130216 125820 153572 113108 -139682
1121 -139682 -357472 -284481 26131 -127267 -233171 74233 137770 -180203 63560 240045
1111 240045 164793 301583 194713 -12445 -64620 -67632 105688 -96272 -124434 -208617 -201043
1100 -201043 6174 -14637 -66035 140038 102117 90588 -37007 -187107 -21872 131784
1090 131784 -69659 -35171 -69994 30869 -51481 -127414 -74780 -120509 -97263 77251 179545
1079A79545n3961M7637K3068m4570n8478q3519J8923K07324k84627l9811q0843
1068a69312j24845K56345j46773l3246L27871k52442L5597J80190j67965O3692
1058c0888K83948k67292o6942Q3941m6347p877k2284r6107l8255N3955l2413m2794
1046b29355N567J64454j17755J79141J3093J1844j52873L0802K74922m146j58401
1035A7293r509r456K4778Q3845j64512N8120Q3086o3160M6947j60549j26107J46883
1023g2341J85251K3910m7207j14592J74865K87469j69083k65089j30352k14182
1013c41351M3459K31238k3207q8809j18948L1362Q7115L28843k7006n9890k22913
1002a60107N3157L4504j35141K19007M8239M5971Q403l0649J48170r6408P3526
$$ plain form
1079 179545 125584 173221 196289 151719 93241 9722 28645 235969 -48658 -88469 -169312
1068 -169312 -294157 -37812 -184585 -217831 110040 -142402 -106805 73385 -94580 -30888
1058 -30888 253060 -14232 -81174 2767 -43580 -51457 -73741 -169848 -208103 -154148 -186561 -229355
1046 -229355 -223788 -59334 -177089 2052 15145 26989 -125884 -95082 179840 175694 17293
1035 17293 7784 -1672 23106 106951 -57561 559 83645 20485 67432 -93117 -219224 -72341
1023 -72341 112910 136820 89613 -24979 149886 437355 268272 3183 -127169 -341351
1013 -341351 -297892 -66654 -89861 -178670 -297618 -266256 -179141 149702 122696 62806 -160107
1002 -160107 -106950 -72446 -207587 11420 59659 105630 114033 83384 231554 135146 208672
991B08672j16317j75515n6459J54979J5487l7639J15630j18257o652M5910N5986
980H5825n1055j75003J63877k19005j92384K31799J30060J14787n7272m319O5773
969I3083k43955n4618K02201l0541K5886K97424k2844R1197j88843Q1814N113
958B55917k82722m7236J87072l3529n4991J25553j14661M006j83489J09896P1667
947C7483j34989j45270K99957P6027j31340r2370j40350l652J10897K34406L7560
936A48359m7910k34400K79611J73904l15555r1029K19160Q136L7392K23547k59698
925A41517k09343L6661N6074q4969k80986q2512J99847n419J22112j4383Q8354
914c3047J27599P4385M2580p7261p1068r9196k6505O80j33812O5750J92793j25836
$$ plain form
991 208672 92355 -83160 -139619 15360 30847 -6792 108838 -9419 -16071 29839 85825
980 85825 34770 -140233 23644 -195361 -387745 -155946 -25886 88901 31629 27310 93083
969 93083 -150872 -205490 -3289 -33830 -7944 289480 266636 357833 168990 250804 255917
958 255917 -26805 -74041 113031 79502 24511 150064 35403 39409 -144080 -34184 37483
947 37483 -97506 -242776 57181 133208 1868 -90502 -230852 -234504 -123607 110799 148359
936 148359 100449 -133951 145660 319564 4009 -87020 132140 140276 177668 401215 141517
925 141517 -67826 -31165 24909 -60060 -341046 -423558 -223711 -229130 -107018 -121401 -33047
914 -33047 94552 168937 211517 134256 63188 -36008 -62513 -61833 -195645 -129895 62898 -62938
902f2938j25481J44215p9677J54418J22574j26810J16368J7296l38816N7974n520
891a26397L8539L0038j81723M4772L69261l17473J09383Q1749j46995j46592q4607
880c30045J43893K61075j193j0347N1493l59491k3851J55555J12753N5395K99428
869C54665K05071r2332j96517l61879n8389l2759o5217j2729J47503O1996J36
858e0451Q4686j4206j76092K3949m3756Q687L3745k3200P7844n8154K24108q4987
846B173k9906J37498K26272k67858K2078m5775J85943J77766o134M8134j48816
835C01375p9134q1508J80594Q2371k14044o3904j23580K97363j12272l21205J02717
824c1227P1107J8046j73829j7132j84208K11618R7249j99156K9919K17554j0587
$$ plain form
902 -62938 -188419 -44204 -123881 30537 153111 26301 142669 159965 -178851 -120877 -126397
891 -126397 -87858 -57820 -239543 -194771 174490 -142983 -33600 48149 -98846 -245438 -330045
880 -330045 -186152 74923 73730 63383 114876 -244615 -268466 -112911 -158 55237 354665
869 354665 559736 467404 270887 -90992 -149381 -182140 -247357 -260086 -112583 -50587 -50451
858 -50451 34235 20029 -156063 -132114 -175870 -167183 -133438 -156638 -78794 -136948 87160 2173
846 2173 -27733 109765 336037 68179 90257 44482 230425 408191 402057 450191 301375
835 301375 222241 140733 321327 403698 189654 125750 2170 299533 187261 -133944 -31227
824 -31227 39880 57926 -115903 -133035 -317243 -105625 -8376 -207532 -177613 39941 29354
813B9354r0550J34064j10063j41740J72642K51713k48930j45852R7190K16831
803A64659l21163J38247J94050j04634M989j6185m2771J93398J04280r289j03414
792B02167j0923K0439J9540r5285J22614j2159q9776j31146j97409K64699n8190
781C4571L6673P4384k36759r2217k2151M189J36153J01516K7439K4639o2765j74081
769a48409r4240J07424K52190Q3528j49197k3356q6594j04897J81025j75924j2670
758a71120K57361K608j6956p8293l5598r0344j25573K87547J17537K0047J7469
747A84685q0669m2183j86017J05184n1611P9825K62611p3723q3964j37848P3308
736D9598j97439L9354P8932J22679k60098O7416K42733J1509m0607n7611j26664
$$ plain form
813 29354 -61196 72868 -37195 -178935 -6293 245420 -3510 -149362 -52172 164659
803 164659 -156504 -18257 175793 71159 76148 59963 17192 210590 314870 305581 202167
792 202167 191244 211683 231223 135938 258552 246393 156617 25471 -171938 92761 34571
781 34571 71244 145628 -91131 -183348 -205499 -201310 -65157 36359 63798 88437 25672 -148409
769 -148409 -242649 -135225 116965 200493 51296 27940 -58654 -163551 17474 -158450 -171120
758 -171120 86241 88849 71893 -6400 -41998 -132342 -257915 29632 147169 167216 184685
747 184685 104016 61833 -124184 -19000 -70611 9214 271825 198102 114138 -23710 49598
736 49598 -147841 -108487 -29555 93124 -166974 -99558 143175 154684 114077 56466 -70198
725g0198k30385K02619J59099j16659J64616l1424j40385L4464k6994J74359K1824
714A40936j49634N1153j52872l9954M1691J56812p1844k60666K65858J19652l2362
703F8770J09064O9168j55860j251M3193J19899j94875j53452K38200J11300j72858
692H1298l0101j57884J57302J42123O0764j59304Q8381M479j38791p4179j50568
681a76480R9008K67903O0726J79779l289j25673j94772l77496K58683J93141l1124
670A50406r7869Q0610l13945K10648O5590l8995K7555R6457j20998J16900m0845
659A35514J13488j87280j07514J06291J19473o5689j18807p973P9828P0358l7858
648I9831j34267K06678K34846l43885o7962J21829j98957r9763Q6207J7309J23666
$$ plain form
725 -70198 -300583 -97964 61135 -55524 109092 77668 -62717 -28253 -55247 119112 140936
714 140936 -8698 42455 -110417 -150371 -108680 48132 -23712 -284378 -18520 101132 68770
703 68770 177834 247002 91142 89891 133084 252983 58108 -95344 142856 254156 81298
692 81298 51197 -106687 50615 192738 253502 94198 182579 187058 48267 -25912 -176480
681 -176480 -77472 190431 251157 430936 427647 301974 107202 -270294 -11611 181530 150406
670 150406 52537 133147 -180798 29850 95440 56445 84000 180457 59459 176359 135514
659 135514 249002 61722 -45792 60499 179972 114283 -4524 -12497 67331 137689 99831
648 99831 -34436 172242 407088 63203 -4759 117070 -81887 -181650 -95443 -78134 45532
637D5532q5724q4774J06407J8007K66647r3051j48919j31913k3605J61846P608
626C8061K06957q5386r896k35454K73000K15240j18536k32688J29379K2183k22603
615a9743Q7625J34498O8959p7571k00101l7950L13010N0049m04962o374k19320
604c11880J55746q88J95780j05619J1289k2415K05261l5793q0091K15473l3325
593A93538k06448M2959j12280j60032R6786Q4887J89317n6582j14331R2626J90624
582B41064j08928k7615o7541m0382N0894l6625k22002J08158K91211j13382J64806
571B39658M7846j27683j88740o7434P8968k0967r3233K09314J39799l9034O8384
560B46878k9302k8217j02055J78011j2906p5755j09068Q2408M0391k9456j66229
$$ plain form
637 45532 -40192 -124966 -18559 -552 266095 173044 24125 -107788 -131393 30453 38061
626 38061 245018 159632 149736 -85718 187282 402522 283986 51298 180677 202860 -19743
615 -19743 67882 202380 271339 193768 -6333 -44283 268727 318776 -86186 -92560 -311880
604 -311880 -156134 -157022 38758 -66861 -55572 -77987 127274 91481 11390 226863 193538
593 193538 -12910 30049 -82231 -242263 -145477 -60590 128727 72145 -42186 50440 241064
582 241064 132136 104521 36980 -3402 47492 10867 -211135 -102977 188234 74852 239658
571 239658 287504 159821 -28919 -96353 -17385 -38352 -131585 77729 217528 178494 246878
560 246878 217576 189359 87304 265315 252409 176654 67586 149994 190385 160929 -5300
549e300R0316j0815J66235K5854K3224M694k30043q1616K247n7910k14906K52220
537c5800K44252q7375k59267J05870J25156J10267j26405j13451L8214K11650
527B13111K0448j10171n9388J48969k3774l72190J57844L3741J23548M9965l4131
516A47972l6542J17603m0557J11536r5284n4545l14734P3338L08222l7420P547
505A87136K6507J39151k91845j33227M4156r199L31536p3968k8505l6496n2534
494A02712k52022J30592J83685j45654K22368m3814l5263Q6282p6859R994R1563
483B73584k63036j1494J44770q4681J61186J92380k5184l8499k13058j18660p6067
472e8759K14104K1650j64257r4P321l5767r4624J17550k7620L6592L0010m819
$$ plain form
549 -5300 85016 74201 240436 266290 289514 294208 64165 -17451 -15204 -73114 -288020 -35800
537 -35800 208452 121077 -138190 -32320 92836 203103 76698 -36753 1461 213111
527 213111 233559 123388 64000 212969 189195 -182995 -25151 8590 132138 182103 147972
516 147972 111430 229033 188476 300012 204728 150183 -164551 -91213 217009 179589 187136
505 187136 213643 352794 60949 -72278 -28122 -37321 294215 220247 191742 155246 102712
494 102712 -149310 -18718 164967 19313 241681 197867 162604 248886 172027 182021 273584
483 273584 10548 -946 143824 59143 220329 412709 387525 349026 135968 17308 -58759
472 -58759 155345 176995 12738 12644 19965 -15802 -110426 7124 -20496 16096 46106 41287
460D1287M1523J49278P1200l12774l58085K85670J39528J87293K1861j8468o5050
449A83263m3887L0352k68217L6043K130O8200J46569j66739J45663J82895k6709
438B89563L2773k81513j8853k06660N3521K04714J75904O9199j42507q8305P5334
427A63170k28120j20840J53327J20212J38027k91733K11508J72513j00476j0699
417B06889J38693j35356j19443k29461l2346R0898n4240J76298J44986O737l5263
406A58392n1073n9020K20149J90004k00885Q662k9087l61857R56L41501J71609
395C89351k52712J44005j14848k8274p4914R9596R5258K5591k18520q1555J01209
384H4187K9248q1859J0978L4675J44081q8556N3911k79861p2664K31052L0526
$$ plain form
460 41287 82810 232088 303288 -9486 -367571 -81901 57627 244920 266781 248313 183263
449 183263 139376 169728 -98489 -62446 -60316 7884 154453 -12286 133377 316272 289563
438 289563 322336 40823 21970 -184690 -131169 73545 249449 318648 176141 87836 163170
427 163170 -64950 -185790 -32463 87749 225776 -65957 145551 318064 217588 206889
417 206889 345582 210226 90783 -138678 -171024 -80126 -134366 41932 186918 193655 158392
406 158392 107319 48299 268448 458452 257567 266229 237142 -124715 -123759 217742 389351
395 389351 136639 280644 165796 137522 62608 162204 257462 283053 64533 -17022 84187
384 84187 113435 31576 42554 77229 221310 132754 186665 -93196 -165860 65192 95718
373I5718J7285M737P8159J79215J56656o1464P1652j30782p8542J27050j31871
362C27813j61711j83544Q35J19050J72234M0488j52074q7351N3501M6870J42155
351C18266o8865J4100p1196J56846q0509n0014M1241P6506M6950j60867Q547q6537
339A44468K45094k11048O1141J02941k84204j93312K07219K21820O0285j16545
329B37859o6012j51629K56553j04919k16063M1825J38395j59700P5179K65741
319C17229j6266k14391L7553O5720q5909L0573J56140J55813k2253j48648j34559
308A41002m7567j4741l889L8533j0628j63648M3994J94132j42562K58750J40450
297D33826l04091N2044n6597Q7031Q1843K4132O575L5916m3503r1410j13618j57880
$$ plain form
373 95718 113003 117740 195899 375114 531770 470306 541958 411176 332634 459684 327813
362 327813 166102 -17442 -16607 102443 274677 315165 163091 75740 129241 176111 318266
351 318266 249401 263501 192305 349151 268642 218628 259869 336375 383325 222458 231005 144468
339 144468 389562 178514 239655 342596 58392 -134920 72299 294119 354404 237859
329 237859 171847 20218 276771 171852 -44211 -2386 136009 -23691 51488 317229
319 317229 300963 86572 124125 189845 103936 134509 290649 446462 424209 275561 141002
308 141002 93435 78694 74805 113338 102710 -60938 -16944 177188 34626 293376 433826
297 433826 129735 181779 125182 212213 294056 318188 324763 360679 317176 225766 112148 -45732
285d5732K88173l0796m73209k81025M63298K98788J17588k49524j41219K02405
275A48747J08492L2834k0461j6610o7183o845n7292J75778j4681r9970J34195
264C17004l17153K3748J0534o2302J24429K45677M2042M8805K022m5699j59401
253B29706J08360L7077k41461J13485P5811k89024r4276J54243K25023Q8046k73289
242A33701J90172n1157J67696j44277n2392j09582n0856m5679n8883K33126R7889
231C09758J75505j09102o2047r782j23420o6121J14428j61723M6944o8318N7893
220A04015M3953L3468J39535n3980P0417j74293K31244k02546J10279j28066j866
209A72160k3245J75342K8168j92100k09348P2960q23P7672J69060n522N5263n9915
$$ plain form
285 -45732 242441 211645 -261564 -542589 -79291 219497 337085 87561 -53658 148747
275 148747 257239 290073 269612 253002 185819 178974 121682 297460 282779 182809 317004
264 317004 -149 23599 34133 -28169 96260 341937 383979 432784 434806 389107 229706
253 229706 338066 375143 133682 247167 322978 33954 -60322 93921 318944 406990 133701
242 133701 323873 272716 440412 296135 243743 134161 83305 37626 -21257 211869 309758
231 309758 485263 376161 314114 304332 180912 114791 229219 67496 114440 46122 104015
220 104015 147968 181436 320971 266991 337408 163115 394359 191813 302092 174026 172160
209 172160 148915 324257 352425 160325 -49023 23937 23114 100786 269846 264324 319587 259672
197B59672P3924m7073j48902J30098j34455p1731K96586L8689O1513j29443k71160
186E7718q2903N9557K37391q3219N8684J68302l11980L20928k0678K0281J15620
175E39701n9122m006l53918Q7429m8502K03722M8722r6172j8327O0567n5147L7679
163C42626l3235j91949j57302O2995O4661L6770L5534J14982J99624l64966J43921
152B53661o1826r2674M2618m8017O9456k5988r7155K23593n9802o0281K3829R5203
140B62617r2109r4321O9539J0947N204O3198M5796J11296p4905p0262L1871j61929
128A06942j46306j16032K80856L63209j27423M4686P550l2650J43823l56066j40684
117B7905K96294q3119J5839j7976M8014K2735l3555J466Q1323j29516n6584J04345
$$ plain form
197 259672 333596 286523 137621 267719 133264 61533 358119 396808 458321 328878 57718
186 57718 -25185 34372 271763 188544 247228 415530 103550 424478 403800 424081 539701
175 539701 480579 476573 122655 210084 161582 365304 414026 317854 299527 360094 304947 342626
163 342626 309391 117442 -39860 23135 87796 124566 160100 275082 474706 109740 253661
152 253661 191835 99161 141779 93762 163218 137230 40075 263668 203866 143585 167414 262617
140 262617 170508 76187 145726 156673 161877 225075 270871 382167 307262 237000 268871 106942
128 106942 -39364 -155396 125460 488669 361246 405932 413482 380832 524655 168589 27905
117 27905 324199 241080 256919 238943 286957 309692 276137 277603 358926 229410 172826 277171
105B77171l78708N7671R2439j58549K23720J16672p5874j71879J37851O8328L70850
94E59692j6764o6461q7278j11293N6284j3609n0115M2587m8825M3296q7990l559
82B15965K54936j15613j52936l1782Q4272j18126n1325j65653o8108J36459J73311
71A61400N2390J80255j38624J3092p1779k5295K28321j37600M9141j07570l1311
60A72420q9434K55981q0645j97245J80913q1603K30600j4502J7843o144r2449
49B95735j32395J17899O0965L2223k77471O9338J81863K7099j58872J80427m8993
38C47818k46655J75857j10314J48968n2535J21230J86778j81197j09041q1973
28A98936J01427K229N5204j74556K08692m3130m9508J21405r0466r3900l2374
$$ plain form
105 277171 -101537 -43866 48573 -109976 113744 230416 154542 -17337 120514 188842 559692
94 559692 542928 476467 389189 277896 334180 320571 270456 313043 264218 307514 219524 215965
82 215965 470901 355288 202352 170570 254842 136716 85391 -80262 -148370 -11911 161400
71 161400 213790 394045 255421 268513 196734 171439 399760 262160 311301 203731 172420
60 172420 82986 338967 258322 61077 241990 160387 390987 376485 394328 388184 295735
49 295735 163340 281239 342204 374427 96956 166294 348157 375256 216384 396811 347818
38 347818 101163 277020 166706 315674 263139 384369 571147 389950 280909 198936
28 198936 300363 302592 357796 183240 391932 348802 299294 420699 330233 236333 203959
17B03959m6444l6610m4343L4708J14850R3873J8897j50188n1507j1140R856q6181
5D9730J45862J16444Q71P8835l8433
0C53309
$$ plain form
17 203959 157515 120905 76562 111270 226120 319993 338890 188702 137195 126055 135911 49730
5 49730 195592 312036 312907 391742 353309
0 353309
$$ Imaginary data points
##PAGE= N=2
##DATA TABLE= (X++(I..I)), XYDATA
16383b166679j2972K8790J37651R8704j90468M000N0975m3523p33q3108O0353
$$ plain form
16383 -2166679 -2179651 -2150861 -2013210 -1914506 -2104974 -2100974 -2049999 -2093522 -2094255 -2177363 -2117010
$$ [...]
##END NTUPLES=NMR SPECTRUM
##END=
