##TITLE=1H_EC-3344(22)
 200.13MHz, CDCl3,
 8 sc
 
 6.3.2025
##JCAMPDX= 6.0         $$ Bruker NMR JCAMP-DX V2.0
##DATA TYPE= NMR SPECTRUM
##DATA CLASS= NTUPLES
##ORIGIN= UXNMR, Bruker Analytische Messtechnik GmbH
##OWNER= pz
$$ XWIN-NMR		Version 3.5
$$ Thu Mar  6 13:59:45 2025 Russian Standard Time (UT+4h)  she@DPX200
##.OBSERVE FREQUENCY= 200.1313
##.OBSERVE NUCLEUS= ^1H
##.ACQUISITION MODE= SIMULTANEOUS
##.ACQUISITION SCHEME= undefined
##.AVERAGES= 8
##.DIGITISER RES= 18
##SPECTROMETER/DATA SYSTEM= spect
##.PULSE SEQUENCE= zg30
##.SOLVENT NAME= CDCl3
##.SHIFT REFERENCE= (INTERNAL, CDCl3, 0, 15.4913)
##AUDIT TRAIL= $$ (NUMBER, WHEN, WHO, WHERE, WHAT)
$$ ##TITLE= Audit trail, XWIN-NMR		Version 3.5
$$ ##JCAMPDX= 5.01
$$ ##ORIGIN= Bruker BioSpin GmbH
$$ ##OWNER= she
$$ F:/spectra/data/she/nmr/H-C/1/pdata/1/auditp.txt
$$ ##AUDIT TRAIL=  $$ (NUMBER, WHEN, WHO, WHERE, WHAT)
(   1,<2025-03-06 13:58:29.43 +0400>,<she>,<DPX200>,
      <created by zg, POWCHK disabled, PULCHK disabled
       configuration hash MD5:
       00 E9 B6 7A A2 85 ED C7 34 08 36 98 17 FE 4E 26
       data hash MD5: 16K
       3C E1 18 65 FF 0A 73 F5 F5 FE D2 E1 3D 4D AC 79>)
(   2,<2025-03-06 13:58:31.62 +0400>,<she>,<DPX200>,
      <Start of raw data processing
       efp BC_mod = 2 LB = 0.25 FT_mod = 6 PKNL = 1 PHC0 = -467.2267 PHC1 = 15.39222 SI = 16K 
       data hash MD5: 16K
       3D 22 00 00 32 45 2B 93 81 46 91 64 F2 80 57 3B>)
(   3,<2025-03-06 13:59:00.17 +0400>,<she>,<DPX200>,
      <pk PHC0 = 3.312392 PHC1 = -5.400001 
       data hash MD5: 16K
       89 17 D3 9E 1D 23 86 59 52 DA 0C 16 1C 18 4B 21>)
(   4,<2025-03-06 13:59:04.04 +0400>,<she>,<DPX200>,
      <abs ABSG = 5 
       data hash MD5: 16K
       BA E5 89 21 DF 1D 65 11 C8 2D 23 91 44 28 D6 D6>)
$$ ##END=
$$ 
$$ hash MD5
$$ 54 B3 35 1C 3A D2 CE 93 9A A6 66 74 D7 92 4B DD
##$RELAX= 
##$RELAX= 
##$RELAX= 
##$RELAX= 
##$RELAX= 
##$RELAX= 
$$ Bruker specific parameters
$$ --------------------------
##$DU= <F:/spectra>
##$EXPNO= 1
##$NAME= <H-C>
##$PROCNO= 1
##$TYPE= <nmr>
##$USER= <she>
##$AMP= (0..31)
100 100 100 100 100 100 100 100 100 100 100 100 100 100 100 100 100 100 
100 100 100 100 100 100 100 100 100 100 100 100 100 100 
##$AQSEQ= 0
##$AQ_mod= 1
##$AUNM= <au_zg>
##$AUTOPOS= <>
##$BF1= 200.13
##$BF2= 200.13
##$BF3= 200.13
##$BF4= 200.13
##$BF5= 200.13
##$BF6= 200.13
##$BF7= 200.13
##$BF8= 200.13
##$BYTORDA= 1
##$CFDGTYP= 0
##$CFRGTYP= 5
##$CHEMSTR= <none>
##$CNST= (0..31)
1 1 145 1 1 1 1 1 1 1 1 1 1 1 1 1 1 1 1 1 1 1 1 1 1 1 1 1 1 1 1 1 
##$CPDPRG= <>
##$CPDPRG1= <>
##$CPDPRG2= <>
##$CPDPRG3= <>
##$CPDPRG4= <mlev>
##$CPDPRG5= <mlev>
##$CPDPRG6= <mlev>
##$CPDPRG7= <mlev>
##$CPDPRG8= <mlev>
##$CPDPRGB= <>
##$CPDPRGT= <>
##$D= (0..31)
0 0.7 0 0 0 0 0 0 0 0 0 0.03 0 0 0 0 0 0 0 0 0 0 0 0 0 0 0 0 0 0 0 0 
##$DATE= 1741255108
##$DBL= (0..7)
120 120 120 120 120 120 120 120 
##$DBP= (0..7)
150 150 150 150 150 150 150 150 
##$DBP07= 0
##$DBPNAM0= <>
##$DBPNAM1= <>
##$DBPNAM2= <>
##$DBPNAM3= <>
##$DBPNAM4= <>
$$ [...]
##$SUBNAM3= <"">
##$SUBNAM4= <"">
##$SUBNAM5= <"">
##$SUBNAM6= <"">
##$SUBNAM7= <"">
##$SUBNAM8= <"">
##$SUBNAM9= <"">
##$SW= 18.0517328524113
##$SWIBOX= (0..15)
0 0 2 0 0 0 0 0 0 0 0 0 0 0 0 0 
##$SW_h= 3612.71676300578
##$TD= 16384
##$TD0= 1
##$TE= 0
##$TE2= 300
##$TE3= 300
##$TEG= 300
##$TL= (0..7)
0 120 120 120 120 120 120 120 
##$TP= (0..7)
150 150 150 150 150 150 150 150 
##$TP07= 0
##$TPNAME0= <>
##$TPNAME1= <>
##$TPNAME2= <>
##$TPNAME3= <>
##$TPNAME4= <>
##$TPNAME5= <>
##$TPNAME6= <>
##$TPNAME7= <>
##$TPOAL= (0..7)
0.5 0.5 0.5 0.5 0.5 0.5 0.5 0.5 
##$TPOFFS= (0..7)
0 0 0 0 0 0 0 0 
##$TUNHIN= 0
##$TUNHOUT= 0
##$TUNXOUT= 0
##$USERA1= <user>
##$USERA2= <user>
##$USERA3= <user>
##$USERA4= <user>
##$USERA5= <user>
##$V9= 5
##$VALIST= <valist>
##$VCLIST= <CCCCCCCCCCCCCCC>
##$VD= 0
##$VDLIST= <DDDDDDDDDDDDDDD>
##$VPLIST= <PPPPPPPPPPPPPPP>
##$VTLIST= <TTTTTTTTTTTTTTT>
##$WBST= 1024
##$WBSW= 4
##$XGAIN= (0..3)
0 0 0 0 
##$XL= 0
##$YL= 0
##$YMAX_a= 146318
##$YMIN_a= -264956
##$ZGOPTNS= <>
##$ZL1= 120
##$ZL2= 120
##$ZL3= 120
##$ZL4= 120
##$ABSF1= 15.48025
##$ABSF2= -2.571599
##$ABSG= 5
##$ABSL= 3
##$ALPHA= 0
##$AQORDER= 0
##$ASSFAC= 0
##$ASSFACI= 0
##$ASSFACX= 0
##$ASSWID= 0
##$AUNMP= <proc_1d>
##$AZFE= 0.1
##$AZFW= 0.1
##$BCFW= 0
##$BC_mod= 2
##$BYTORDP= 0
##$COROFFS= 0
##$CY= -3
##$DATMOD= 1
##$DC= 0
##$DFILT= <>
##$DTYPP= 0
##$F1P= 0
##$F2P= 0
##$FCOR= 1
##$FTSIZE= 16384
##$FT_mod= 6
##$GAMMA= 0
##$GB= 0
##$INTBC= 1
##$INTSCL= 3.241238e-09
##$ISEN= 128
##$LB= 0.25
##$LEV0= 0
##$LPBIN= 0
##$MAXI= 10000
##$MC2= 0
##$MEAN= 0
##$ME_mod= 0
##$MI= 1.114404
##$NCOEF= 0
##$NC_proc= -8
##$NLEV= 6
##$NOISF1= 3.799351
##$NOISF2= 2.8
##$NSP= 0
##$NTH_PI= 0
##$NZP= 0
##$OFFSET= 15.49127
##$PC= 1
##$PHC0= -463.9143
##$PHC1= 9.992218
##$PH_mod= 1
##$PKNL= yes
##$PPARMOD= 0
##$PSCAL= 0
##$PSIGN= 0
##$REVERSE= no
##$SF= 200.130006089331
##$SI= 16384
##$SIGF1= 3
##$SIGF2= 2
##$SINO= 0.751879
##$SIOLD= 32768
##$SREGLST= <19F.Aceton>
##$SSB= 0
##$STSI= 16384
##$STSR= 0
##$SW_p= 3612.71676300578
##$SYMM= 0
##$S_DEV= 0
##$TDeff= 16384
##$TDoff= 0
##$TI= <>
##$TILT= no
##$TM1= 0
##$TM2= 0
##$TOPLEV= 0
##$USERP1= <user>
##$USERP2= <user>
##$USERP3= <user>
##$USERP4= <user>
##$USERP5= <user>
##$WDW= 1
##$XDIM= 16384
##$YMAX_p= 390274144
##$YMIN_p= -1427075
$$ End of Bruker specific parameters
$$ ---------------------------------
##NTUPLES= NMR SPECTRUM
##VAR_NAME=  FREQUENCY,     SPECTRUM/REAL,   SPECTRUM/IMAG
##SYMBOL=    X,             R,               I
##VAR_TYPE=  INDEPENDENT,   DEPENDENT,       DEPENDENT
##VAR_FORM=  AFFN,          ASDF,            ASDF
##VAR_DIM=   16384,         16384,           16384
##UNITS=     HZ,            ARBITRARY UNITS, ARBITRARY UNITS
##FACTOR=    0.220516191357247, 1,           1
##FIRST=     3100.26797250148, 0,            0
##LAST=      -512.448790504296, 0,           0
##MIN=       -512.448790504296, -1427075,    0
##MAX=       3100.26797250148, 390274144,    0
$$ Real data points
##PAGE= N=1
##DATA TABLE= (X++(R..R)), XYDATA
$$ [...]
11836b26037l52008J84270r8272L41789l50638l26984O8298K43893M12383o3391
11826a66697m6047l12082R2596j33374J20307L5545l30959O06529J77271p4030
11816c0941p31463l5374O36500m26724K75604M46742M3706n75095p5386K79371
11806a93060J76468J57561j90489k76289K16893n21005M21240M75622M08434J5949
11796F91324r9o01888n79994M35364j26951N17643L43440l70509j53911l3061
11786A21358j693P4013q4641L63107l34248q23615P45171K16216j037003j39232
11776i00567K38715K09047P7159l0467r4727J02156N93702o6657p8487Q2177j47235
11765a5184l2415j29298k11408J46061K11788J07467j72184L65511n40369n6192
$$ y = [-226037, -578045, -393775, -492047, -150258, -500896, -827880, -759582, -515689, -103306, -166697, -212744, -524826, -432230, -565604, -445297, -409752, -740711, -134182, 43089, -30941, -762404, -797778, -161278, -588002, -312398, 134344, 178050, -397045, -472431, -193060, -16592, 140969, -49520, -325809, -108916, -629921, -208681, 266941, 675375, 691324, 691225, 89337, -490657, -55293, -182244, 335399, 678839, 308330, 154419, 121358, 119665, 193678, 109037, 472144, 137896, -685719, 59452, 275668, -761335, -900567, -661852, -452805, -375646, -406113, -500840, -398684, 195018, 128361, 49874, 132051, -15184, -47599, -176897, -388305, -242244, -30456, 77011, -95173, 270338, -270031, -326223]
11755c26223M17716J62204J89392l3564n03245L6755l93712L6977O17810N99404
11745H03514P3567p33363k95226L733M56419L54240j32989N1720l95492O9616
11735B55739j97163j17500k27658K48117J36799K6473j34948J63522J78452p2918
11725B58915L87728k66429l21850M27833q383k94639k2540O5991j70739k43924
11715a88037n46127j03013R39553j32691M74916j22736o8456L9035m60117l95199
11705e62872o1739J06181L75643k71900o2782n7752R4286R6860Q46999j90856
11695C12068n11156M57773J60063n70339M68134Q1638o93178m65560L00812M80059
11685B0314L80635k79396J17784J63140o77510K05624k59256n62270j37017J32071
$$ y = [-326223, 91493, 253697, 443089, 409525, -93720, -56965, -450677, -413700, 204110, 803514, 877081, 143718, -151508, -147775, 308644, 662884, 529895, 581615, 186123, 255739, 58576, -58924, -286582, -38465, 98334, 124807, -10141, 153381, 331833, 258915, 646643, 380214, 58364, 486197, 477814, 183175, 160635, 226626, 55887, -188037, -734164, -837177, 102376, -30315, 444601, 321865, 253409, 292444, -167673, -562872, -624611, -518430, -142787, -414687, -477469, -535221, -440935, -344075, 502924, 312068, -199088, 258685, 418748, -151591, 316543, 398181, -294997, -760557, -459745, 20314, 400949, 121553, 239337, 402477, -275033, -69409, -328665, -890935, -1027952, -895881]
11675h95881N3214K62669n5064M55914N37098j2737j11387L2746j1605j65772
11665H9195L78174O1987M8435K70104m41864j99746N74045k47926p40012j07171
11655c14779O82482o32196J72560N55878n18921n6904p5514J82496m61387K87274
11645a79011K16015J96911K4179K98088k53896k58206j30528m57873O84625R0352
11635B30656k87132K6044k4482o28852K10586L85728K4685L44894r2890K8993
11625B18230l81290o666j13070O284L16922l98611j03387J53623P85619l1645
11615D46009o15365k04939N33367N56701k70846n74694j84522K66689n5523j57560
11605b60683j99526k68656O75302K08657Q6395m32872J3890M20986l48827J69559
$$ y = [-895881, -842667, -579998, -635062, -179148, 357950, 345213, 233826, 266572, 254967, 89195, 467369, 529356, 577791, 847895, 406031, 206285, 780330, 532404, -207608, -314779, 367703, -264493, -91933, 463945, -54976, -111880, -187394, -4898, -466285, -179011, 37004, 233915, 258094, 556182, 302286, 44080, -86448, -544321, 140304, 230656, -56476, -30432, -54914, -683766, -473180, -87452, -62767, 282127, 189237, 218230, -163060, -169726, -282796, -276512, 40410, -358201, -461588, -307965, 477654, 446009, -169356, -374295, 159072, 715773, 444927, -129767, -314289, -47600, -103123, -260683, -460209, -728865, -53563, 155094, 241489, -191383, -177493, 243493, -105334, 64225]
11595F4225M44346l43303J75570r7026O7127j02414K2924l26900M6072J65921
11585A16542n03140Q39381J74475m87879K3168L12390j36052J13269k70601N6054
11575B37607j2056l39100L22805K46393k11040J25359j95960l05731J99362K5876
11565I3515J38037l39403k14886O20008k15747j12402K61533k82346N4836L94994
11555C98139m5726o3018j06941n41392R5123L7288l49064K96789Q4086K55783
11545F1067K19555L61880K36387j84000J57698K75716r59514J89430K5567n53096
11535a69310K0537M15266K07524N37259p2496j41226N53247L82376j02056M60546
11525B091667J06895M6822k34248m66321J2555k30725k63166J51106j10028k87905
$$ y = [64225, 508571, 165268, 340838, 243812, 310939, 208525, 231449, -95451, -49379, 116542, -386598, 452783, 627258, 139379, 162547, 474937, 338885, 452154, 181553, 237607, 225551, -113549, 209256, 455649, 244609, 369968, 174008, -131723, 67639, 93515, 231552, -107851, -322737, 297271, 81524, -30878, 230655, -51691, 3145, 398139, 352413, 289395, 182454, -358938, -263815, -226527, -575591, -278802, -194716, 61067, 280622, 642502, 878889, 694889, 852587, 1128303, 168789, 358219, 383786, -169310, -148773, 266493, 474017, 1011276, 938780, 797554, 1350801, 1733177, 1631121, 2091667, 2198562, 2245384, 2011136, 1544815, 1557370, 1326645, 1063479, 1214585, 1104557, 816652]
11515H16652P3398L04452J10261j10221n33036L11353L46592L02031j48177l06933
11505A166372m0437k2659m86474j24446n03548J82958L58658L97821Q0873o24525
11495C84593j31813O6787J81427J18828M87270m57770J09707k42735J1083k48253
11485B79124r1245K2320k67816l22838M53265P5382p6763q9482J71741O6254J65805
11474C85747M00314N8783n25028K32378j61397J00042J59387k73833L4929p0452
11464C40870J15584L1062j43725m67970N1991K31765k86546l7494k84644j20738
11454e69845q4024K48192J52267Q7200k18994R3215L72471k85481j5397M86480
11444B66084l89666j61435L20414j46899K17050j88809j8512J16305m62901K55543
$$ y = [816652, 890050, 1194502, 1304763, 1194542, 661506, 972859, 1319451, 1621482, 1473305, 1166372, 1125935, 1103276, 616802, 492356, -11192, 171766, 530424, 928245, 1009118, 384593, 252780, 319567, 500994, 619822, 1107092, 649322, 759029, 516294, 527377, 279124, 187879, 210199, -57617, -380455, 72810, 148192, 71429, -18053, 153688, 219942, 385747, 786061, 844844, 319816, 552194, 390797, 490839, 650226, 376393, 411322, 340870, 456454, 487516, 343791, -124179, -72188, 159577, -126969, -164463, -449107, -569845, -653869, -405677, -253410, -166210, -385204, -291989, 80482, -204999, -220396, 266084, -123582, -285017, 35397, -111502, 105548, -83261, -101773, 14532, -448369, -192826]
11434a92826O90748K9497n20987j1114P47843k37709m41180o43225M43365O07255
11424D71667m49681n2719j38331J39851m47205L26253o9102O0311r0776l81958
11414f31690L64529M16642J62351l1056j49983N31314m29317p9733N71963m91966
11404B33054m58374l93130L53937K72533m16053k6246J44059K4873L3263L60926
11394A28842j07382K65395L61377m44804L653k84202j77228M8303K252L83725
11384A79931m8540p71523L7920K02662r541R7624N3843j78029L8559j81081O0609
11373e17566K5444l4579L9115L48284m8347M65067j29692l98501K26227Q2758
11363E8210r5511j97591p7324N90873J55338l58256K06942M53043n1145l52513
$$ y = [-192826, 497922, 527419, 6432, -4682, 743161, 505452, 64272, -578953, -135588, 471667, 21986, -30733, -169064, -29213, -476418, -150165, -219267, -158956, -249732, -631690, -267161, 149481, 311832, 280776, 130793, 662107, 232790, 153057, 725020, 233054, -225320, -618450, -264513, 8020, -408033, -434279, -290220, -265347, -232084, 128842, 21460, 286855, 648232, 203428, 207081, -77121, -254349, -206046, -203794, 179931, 131391, -640132, -602212, -399550, -409091, -311467, -257624, -435653, -397094, -578175, -517566, -492122, -526701, -487586, -139302, -187649, 277418, 147726, -250775, -24548, 58210, -37301, -234892, -312216, 278657, 433995, 75739, 282681, 735724, 684579, 332066]
11353C32066k05854K33856n7610k08342k53853M60149L19757j23191K66205R340
11343G72523J98791l43469j81735k39544j4845K1218k09567J31365J6270K91366
11333D42373l40498k67150l59324j88682N4665J24966L58146J72779M68069j10940
11323C54404K42671k07209j00067j93824J81700J12381m51643n1578J0806j45642
11313b48001J7499M86160L83111o306n50614N9972j5989k96086j81548Q1067J26920
11302a43815K02104l12535N07980J58813k64344R2529O2558O1175J09576j39027
11292C35014j65200j78440K13419r8717R9571K86577R8518J61846K03795k81948
11282F74435m61918l65378n3990K18064J85318K63026o15680p37090L59534L5882
$$ y = [332066, 126212, 360068, 302458, 94116, -159737, 300412, 620169, 496978, 763183, 772523, 971314, 627845, 446110, 206566, 191721, 212939, 3372, 134737, 151007, 442373, 101875, -165275, -524599, -713281, -658616, -533650, -175504, -2725, 465344, 354404, 597075, 389866, 289799, 95975, 277675, 390056, -61587, -113165, -102359, -248001, -230502, 255658, 638769, 632463, 81849, 141821, 125832, -170254, -351802, -270735, -143815, 58289, -254246, 253734, 412547, 148203, 240732, 303290, 364465, 474041, 335014, 169814, -8626, 204793, 106076, 205647, 492224, 590742, 752588, 956383, 674435, 212517, -152861, -206851, 11213, 196531, 459557, -156123, -893213, -533679, -497797]
11272d97797M33232M31725o21487k44655K54376J95854J45126K28643k91665j63715
11262a30363Q8303K19569j41507n09136J90733M06462m6324L29631k83597l5473
11252H8298m08227n11823M85136L41783j40241L98414q3104Q8673k37924J39757
11242A60742L62232r6554j0762l88349l8489l37833n95994L93755L71536l4256
11232b13972k2370k22029N38068p9334J88979L29913L03443k04053o00367J62883
11222A81161L5726L72594n25655L61100j53859l37466l84480M80193r7115k62268
11212c30069K56408j38009M05213L0728m94840K40887N0232j66308l330j07856
11202b56944O0741L21749J98196r4203K38417k22404P5835J80090m35303n8295
$$ y = [-497797, -64565, 367160, -254327, -498982, -244606, -48752, 96374, 325017, 33352, -130363, -42060, 177509, 36002, -473134, -282401, 124061, 77737, 407368, 123771, 88298, -319929, -831752, -346616, -4833, -145074, 253340, 170236, 258909, 20985, 160742, 522974, 426420, 415658, 27309, -11180, -349013, -945007, -551252, -179716, -213972, -236342, -458371, 79697, 363, 189342, 519255, 822698, 618645, 18278, 181161, 216887, 589481, 63826, 424926, 271067, -66399, -450879, 29314, -67801, -330069, -73661, -211670, 193543, 224271, -270569, -29682, 20550, -145758, -149088, -256944, -196203, 125546, 323742, 229539, 467956, 245552, 321387, 501477, 66174, 7879]
11192G879K90767l84900Q9700M10346k87153j48565k59468J13454L3131L33303
11182A98494n1928k79373N13213p17175j54988J82140L21019L91830k13789Q0564
11172B70007k57251p1900l04265L50245k09542n50489N85415L83928k3074k3550
11162A49524L47510N2821m40382k1816N20527k82308M9626j56382l24234l5238
11152a40352K12386M70097o136k20508p9012n13659K93485K56557J53687K7995
11142D54540P2363k7730M3945j67617n01664m8757l87173k6092K26528K92689
11132f8968k23518K88533M34579k44446k11837N10253J85893j95601J05409l69361
11122B10936K17935k10410P58895k98258J39284r8183k18947K2419l47773K34835
$$ y = [7879, 298646, -86254, 3446, 413792, 126639, -21926, -281394, -167940, -134809, 198494, 146566, -132807, 380406, -336769, -491757, -309617, 11402, 403232, 189443, 270007, 12756, -59144, -363409, -13164, -222706, -773195, -187780, 196148, 173074, 149524, 497034, 549855, 109473, 87657, 608184, 325876, 375502, 219120, -105114, -140352, 72034, 542131, 535995, 315487, 236475, -277184, 16301, 272858, 426545, 454540, 526903, 499173, 543118, 375501, -126163, -174920, -562093, -588185, -361657, -68968, -292486, -3953, 430626, 186180, -25657, 484596, 670489, 474888, 580297, 210936, 428871, 218461, 977356, 679098, 818382, 720199, 501252, 523671, 175898, 410733]
11112D10733n9424J02182l22527k87706M36738K27402Q7585R9702l27759j78297
11102A88629m71416j8244L92182K83358m24514k76791M0119J50392k9863M48934
11092B82786M89272q7087P2129m5137K42396m11905j81554l08141J98782K48767
11082E00308j46141L7518k40688J74398k13201O1260M79689n41836J99611K68979
11072E79897o95742J36980K19684j27384J75958Q421n4196M95441L68945k04706
11062I03298J3102J52121k18778j01723q9701n6781l3802J17257j03380j03122
11052D78491k60946J85097k53537j86017k9998k1934q3911p0285j03341J42059
11042b04322K27271k7308N32403O06939k10163p11107j09964m2670o8082k40718
$$ y = [410733, 351309, 453491, 130964, -156742, 279996, 507398, 594983, 694685, 366926, 188629, -282787, -301031, 91151, 374509, -50005, -326796, -286677, -136285, -166148, 282786, 772058, 684971, 757100, 711963, 954359, 542454, 360900, 52759, 251541, 500308, 354167, 391685, 150997, 325395, 112194, 173454, 653143, 111307, 310918, 579897, -115845, 21135, 240819, 113435, 289393, 297814, 243618, 739059, 1108004, 903298, 916400, 1068521, 849743, 748020, 658319, 601538, 567736, 684993, 581613, 478491, 217545, 402642, 149105, -36912, -66910, -88844, -172755, -243040, -346381, -204322, 22949, -4359, 528044, 1134983, 924820, 213713, 103749, 61079, -7003, -247721]
11032b47721L1146l8626J64052J33463j62278L58116k34014k78404K04649L16429
11022B46812o25149j78293P74788K29061l09492O6870K97577j2653l50080m68356
11012c28915M11755L88539k14835Q2916k08745q6129K14108m41876o9658N8369
11002a94471L44107J9629j03204p9035K68852K75805j89275J79352o79076P766
10992a49550p1357L66209J49093j39789L61924n3644R2523K14914k51155j60665
10982C58503m44084L6829j86724m218R30361l16844l04572j20463k33612L21751
10972C6927K34219k57381k65246J45798J84377J37952j40331K81500J70872m93067
10962C5620q7602K08038J4949j16580R5544n32812L47089j567p7574J55362P932
$$ y = [-247721, -216575, -255201, -91149, 42314, -119964, 238152, 4138, -274266, -69617, 246812, -378337, -556630, 218158, 447219, 137727, 204597, 502174, 489521, 139441, -328915, 82840, 471379, 256544, 339460, 130715, 44586, 258694, -183182, -252840, -194471, 149636, 169265, 66061, -12974, 255878, 531683, 342408, 521760, -157316, -149550, -220907, 145302, 294395, 154606, 516530, 462886, 555409, 770323, 519168, 358503, -85581, -48752, -235476, -239694, 690667, 373823, 69251, -51212, -284824, 36927, 271146, 13765, -251481, -105683, 78694, 216646, 76315, 357815, 528687, 35620, -51982, 156056, 171005, 54425, 149969, -382843, -35754, -37321, -114895, 40467, 48399]
10951D8399J20286j26953J03898k22220O39862K38093m66860K34779m3015M07402
10941I33671N1311j92872m97041l41046k7558J01173L09543J15212k39536k70624
10931e7767k56510M92458J36688k77290j09451Q9402j77582p2464L22144N9779
10921A49407Q9411j47026N4333L37562J45278p63189l2546j70377L40946J61319
10911A65118J58978K13285n05187k48686K73796j38850j91096J02979L59210L3691
10901B23238k3816M36800k18888r8770m51491M7697J92082J5567Q9624j93639
10891A8404j07732k61128J9130J42993J72478Q8164N99906R5361m54477O7075
10881C80174J04717j46579J47203j4444j10696j92392j73975k24514k18203k1599
$$ y = [48399, 168685, 41732, 145630, -76590, 563272, 801365, 334505, 569284, 526269, 933671, 984982, 792110, 295069, -45977, -73535, 27638, 337181, 452393, 212857, -57767, -314277, 178181, 314869, 37579, -71872, 17530, -160052, -232516, 89628, 149407, 238818, 91792, 146125, 483687, 628965, -134224, -166770, -337147, 3799, 165118, 324096, 537381, 32194, -216492, 57304, -81546, -272642, -169663, 189547, 223238, 199422, 636222, 417334, 318564, -132927, -85230, 106852, 122419, 212043, 18404, -89328, -350456, -331326, -188333, -15855, 72309, 672215, 767576, 313099, 380174, 484891, 338312, 485515, 471071, 360375, 167983, -5992, -230506, -448709, -470308]
10871d70308J80101K38144J41092K5371Q6896k2332l65776j22581K14759r3806
10861a88440r1233Q47534m46272n96915L08901K52343j97115l46908J79413r059
10851b87751P2627N74871K94759m09992n76020m85068J90365R5637J5791M0293
10841d74488K01703J28276K83842J8336j87475J58917n13325l69370k6834N83475
10831a96943J66912L25521K123J84292l84272o2086K08682M419m29904P0199q9081
10820b00138N9941l04382O8405O05727J02659J49742j25513L28769P3873l37919
10810D21164k94358k22665j44344J8444j49723N5572K16132j92599N05291J71782
10800C84696J89619j27566o13733l07471K65373M03057j20378j67933j85543K65885
$$ y = [-470308, -290207, -52063, 89029, 114400, 201296, 178964, -186812, -309393, -94634, -188440, -279673, 567861, 121589, -475326, -166425, 85918, -111197, -458105, -278692, -287751, -215124, 359747, 654506, 244514, -331506, -816574, -626209, -530572, -514781, -474488, -272785, -144509, 139333, 157669, -29806, 129111, -384214, -753584, -780418, -196943, -30031, 295490, 297613, 481905, 97633, 35547, 244229, 248648, -181256, -111057, -200138, -140197, -444579, -376174, 229553, 332212, 481954, 356441, 685210, 759083, 421164, 126806, -95859, -240203, -221759, -371482, -315910, -99778, -292377, 212914, 384696, 574315, 446749, -166984, -474455, -209082, 193975, 73597, -94336, -279879, -13994]
10790a3994k5468J5035R305l61820J37098K13574j42088k88763N8124L22521q526
10779h5002M26496j91791q3782l74544N15540N57004j27693m96413L193L55900
10769D98908k46269j2213j77555o16689K67924O02259l33096m10743J34104L57629
10759F4259K86484N4131R3682k68016l05397P44579j61896o10280k46931l98469
10749g47854k1526M40983P8513q656j13068k07115J25075R7598n0644j43951N41234
10738i411N7289K54768n50690n03809M83122L14869J18503R0791m76588J57025
10728f4131Q3418L75712j75730o2914K14190R5927l34886p3145o2180j82366L46647
10717A60542J06678m37839n98P87600J6540o21505m07238J64186J71766k30816
$$ y = [-13994, -39462, -24427, -15122, -376942, -239844, -26270, -168358, -457121, -398997, -76476, -85002, 341494, 149703, 65921, -308623, 206917, 763921, 636228, 139815, 143008, 498908, 252639, 240426, 62871, -553818, -285894, 316365, -16731, -427474, -293370, 64259, 350743, 404874, 498556, 230540, -74857, 669722, 507826, -102454, -349385, -747854, -769380, -328397, -249884, -258540, -371608, -578723, -453648, -356050, -406694, -550645, -9411, 47878, 302646, -248044, -751853, -268731, 46138, 164641, 255432, -221156, -64131, 19287, 394999, 219269, 156355, 370545, 466472, 131586, 58441, -3739, -186105, 160542, 267220, -170619, -171217, 616383, 632923, 11418, -395820, -231634, -59868, -290684]
10707b90684K34235L50104L68941l55547l99410r1619L09215l63431J75351j67423
10697b30268l00882L28977N3413R3917m78351L17070L38533J12241J23568j44288
10687B13930M1801m43683l56544K081J97488K95634L00568L0901k36262l356R0411
10676A32969J72226k98008J40358Q9749K85701m24413M2405k29399M39826j88667
10666A62747O14418L5575l41346l05543K39217j96860m04560k6701O18963O0946
10656D56856q8485J37880j93795q20406L45329N31375l75769L30023j95838L6654
10646A63824n04973J77941M39073P4954j34682m20651K50226J83593O87963l31812
10636E85456l13061m75588l93066L48044J53011M02773O8965l12825l41491P0683
$$ y = [-290684, -56449, 293655, 662596, 307049, -92361, -183980, 125235, -238196, -62845, -230268, -531150, -202173, -148760, -54843, -533194, -216124, 122409, 234650, 358218, 213930, 255731, -187952, -544496, -542415, -344927, -49293, 251275, 282176, 45914, 42558, 132969, 305195, 7187, 147545, 237294, 522995, 98582, 140987, -88412, 351414, 162747, 777165, 812740, 471394, 165851, 405068, 208208, -196352, -223053, 395910, 456856, 368371, 506251, 312456, -507950, -162621, 368754, -7015, 323008, 127170, 163824, -341149, -163208, 275865, 350819, 216137, -204514, 45712, 229305, 917268, 585456, 272395, -203193, -596259, -248215, -95204, 307569, 376534, 63709, -277782, -207099]
10626b07099N71113p2689k96073K10728l01790J47749q8202k88545O47481K02516
10616E25189j46250J43471k83710j58422n6928J13881M99512k05524l18811L33056
10606D45464k41452k12966k48805l9232J37589P8461K03241k53475K3599K44462
10596A36886K50025l61612q01103N22187N67145L29365j49190P9425l8413j54853
10586C79862j41446n31400O3769K01739J09745j09308J62318j84951q17080J6550
10576h50202K59019M79462J72386j65263o8634j34368k86325J50607o6039J77899
10566c31458j39369L88262L3877l05304m7540K70450J41082l3808R3825p6631
10556f614q10302M07797N56911l6054q2557j24114j18167O14481k855j77962j80836
$$ y = [-207099, 364014, 291325, -4748, 205980, -95810, 51939, -36263, -324808, 322673, 525189, 378939, 522410, 238700, 80278, 23350, 137231, 636743, 431219, 112408, 445464, 204012, -8954, -257759, -296991, -159402, -80941, 122300, -131175, -107576, 136886, 386911, 25299, -775804, -253617, 313528, 642893, 493703, 573128, 534715, 379862, 238416, -292984, -229215, -27476, 82269, -27039, 135279, -49672, -866752, -850202, -591183, -111721, 60665, -104598, -173232, -307600, -593925, -443318, -509357, -331458, -470827, -82565, -48688, -353992, -401532, -131082, 10000, -23808, 70017, -6614, -816916, -409119, 147792, 111738, 29181, -94933, -213100, 401381, 398526, 220564, 39728]
10545C9728J96199J84543m88351M66819j36878r5036L02688l97070J14699N46658
10535G33999n35532Q0197l73377K38849N02751l57030n21676J75775k24413j6583
10525b97040j7207L0027J37750j70524N8532R8645l0725R2399L22616m46855R171
10514b13211l73247k24518J0645J99124M62473l01674r5777n3762K50803O18070
10504B78926n3019P5037j15360p9863J7738K32184L04998L46679O3428k53565
10494H17183j20621l30877l76907K73278N7666j3690P7839n7718l29629k5400
10484b8876L56199J18446J06388j80911k00102l47263K43125J66444k64183m6414
10474g7147L39547k88085j20528L25037l90k117l31575j42086j68704J39740O31893
$$ y = [39728, 235927, 420470, -67881, 398938, 262060, 167024, 469712, 72642, 187341, 733999, 198467, 278664, -94713, 144136, 646887, 289857, -231819, -56044, -280457, -297040, -314247, -284220, -146470, -316994, -258462, -159817, -190542, -98143, 224473, -222382, -213211, -586458, -810976, -800331, -601207, -138734, -440408, -536185, -589947, -339144, 278926, 225907, 300944, 185584, 105721, 123459, 355643, 660641, 1007320, 1070748, 817183, 696562, 365685, -11222, 262056, 319722, 306032, 383871, 326153, -3476, -28876, 327323, 445769, 552157, 371246, 171144, -176119, 67006, 233450, -30733, -77147, 262400, -25685, -146213, 178824, 178434, 176317, -155258, -297344, -466048, -326308, 305585]
10463C05585K53752K07341k86138n72117l26762p4343l95310Q4940M60274L90806
10453D8028o0789k55621J65646J67616m97370O80570l1342p02375l1390M03336
10443a13691r4087l58503l8566L89971K94336k28786n08786M08262J94830J21961
10433F6941O40132o21706J53243J44238j65236k94336N21J29187M9695P8509J03030
10422B84218J11796l34262n767q8625k30095K27099J72048L0489N7792m24976
10412b00283m2000j79066L84560k10986N18904m21395K82626r3528n22568M6791
10402d36945L7171O4065L08897J47201n60272J71275K52002J83797K70099K34555
10392F71845j08202o07648k6411P1033Q5220P21495K5762J68869j99994l60678
$$ y = [305585, 559337, 766678, 480540, -91577, -418339, -492682, -887992, -803052, -342778, 48028, -12761, -268382, -102736, 64880, -432490, 248080, 216738, -485637, -517027, -113691, -207778, -566281, -604847, -214876, 79460, -149326, -658112, -249850, -55020, 66941, 707073, 85367, 238610, 382848, 217612, -76724, -76203, 52984, 102679, 181188, 284218, 396014, 61752, 55985, -32640, -262735, -35636, 136412, 166901, 224693, -200283, -242283, -421349, -36789, -247775, 271129, -150266, 132360, 38832, -483736, -436945, -399774, -335709, -26812, 120389, -439883, -268608, -16606, 167191, 437290, 671845, 563643, -44005, -70416, 617, 85837, 807332, 833094, 1001963, 801969, 441291]
10382D41291m65871J16768J82567J36912k33902J65486K51438L8391K37043l76075
10372D94048l56886K58693n59647j32833k64428K57543O32735K63004L97529L29093
10362A318851m86435j41028j70437R1176J88284M113m13897k5958l15446l24434
10352b75211J23826J34969L01767k7827J11713M87305l20739J44722P9223o6289
10342F93459j01549k36904J59540j49585m77691J4741J79497J49581K25625K97954
10332G54668L10856j73633J43217j95503j40264L52314L87236l50684k42297L4171
10322H80081k96560N25638L24231r5181n35051k61651j32660l4245k39227Q52259
10312I87634K49653j49273n3871R1440j68524J34680N99541l03794j74218r2416
$$ y = [441291, -24580, 92188, 274755, 411667, 177765, 343251, 594689, 633080, 870123, 494048, 137162, 395855, -163792, -296625, -561053, -303510, 329225, 592229, 989758, 1318851, 832416, 691388, 520951, 612127, 800411, 804524, 390627, 364669, 49223, -275211, -151385, -16416, 285351, 257524, 369237, 856542, 535803, 680525, 759748, 693459, 591910, 355006, 514546, 364961, -112730, -97989, 81508, 231089, 456714, 754668, 1065524, 891891, 1035108, 839605, 699341, 1051655, 1438891, 1088207, 845910, 880081, 583521, 1109159, 1433390, 1338209, 803158, 541507, 408847, 374602, 135375, 987634, 1237287, 1088014, 1034143, 1125583, 957059, 1091739, 1691280, 1387486, 1213268, 1120852]
10302A120852K09909K56035k29663L13989J07828j48124k28178L79472K85528
10293B067648k07536J51934m02892P15748j88167Q0754P2412L67175L7504N6025
10283B750605m73213k9377j51960K47898k13986l05365k09590K15327j27652n05365
10273A197322k46319L0519J0838P5259N51480j26033n17360J5930K69686q48015
10263D13307R7878L10160N07979K67056j83477k49501k82121L32976m33609o5986
10253G14662j1008O1031j93752K43462r0884j43527l19073Q3625K1185K58343
10243F24064L65795k09628m25396l4059N93542k71223p5680l9248L41471J18716
10233I88354k11949n0972j61826Q3463m3193k21438l26980m107j16924J08494
$$ y = [1120852, 1330761, 1586796, 1357133, 1671122, 1778950, 1630826, 1402648, 1782120, 2067648, 1860112, 2012046, 1609154, 2324902, 2136735, 2217489, 2289901, 2657076, 2694580, 2750605, 2277392, 2248015, 2096055, 2343953, 2129967, 1824602, 1615012, 1830339, 1702687, 1197322, 951003, 981522, 992360, 1067619, 1619099, 1493066, 975706, 991636, 1261322, 413307, 511185, 821345, 1329324, 1596380, 1412903, 1163402, 881281, 1214257, 780648, 714662, 703654, 764685, 570933, 814395, 723511, 579984, 260911, 344536, 365721, 624064, 989859, 780231, 354835, 320776, 914318, 643095, 567415, 528167, 869638, 988354, 776405, 725433, 563607, 647070, 603877, 382439, 55459, 51352, -65572, 42922]
10223D2922J99873J13795J23056R9397j44571m15858M25507O5117J81657K2423
10213G13318j43027j65785N3982j42097p9331N4656j38805o7808L1113q2273K79171
10202C13114k5528J348m20634K70259l15000J18359M47065N04209k77848m08750
10192B06594L18762N4836L6742j79529J95640q8712k95379k65378J19754j74757
10182g1427M55127k62740m34621K79392N0091N52829K68297j83088J13974n96437
10172A71397m5082J76843m81309M04293O0336j92338L68172L02347l05595K73408
10162G32472l18422k43609J63626N4582j4549M16260j1851l63089o7558M1421
10152C89283L2245q8929j40140O3767K09579J64375o5180k11812j16466m84180
$$ y = [42922, 242795, 356590, 479646, 579043, 434472, 18614, 444121, 509238, 690895, 713318, 570291, 404506, 458488, 316391, 237060, 291716, 152911, 85103, 116216, 33943, 313114, 287586, 288934, -131700, 138559, -176441, -58082, 388983, 893192, 615344, 206594, 525356, 580192, 616934, 437405, 633045, 544333, 248954, -16424, 103330, -71427, 383700, 120960, -313661, -34269, 15822, 568651, 836948, 653860, 767834, 171397, 126315, 303158, -178151, 226142, 286478, 94140, 462312, 764659, 459064, 732472, 414050, 170441, 334067, 388649, 374100, 790360, 778509, 415420, 347862, 389283, 421528, 332599, 192459, 256226, 465805, 630180, 565000, 353188, 236722, -247458]
10142b47458N69884j9490K29371P3876j54340p18148K14927J86776R7617K7816
10132B60831l6561k33361m47262K39780O79705L99856l54503o43847j59075K96038
10122A601J00341J6572k13835K96765M89166J93837m34361k78050m52723M0142
10112b40545K51680O12414m38026P4111J81611J67883k56897k63578N76963k51753
10102D13863n36709N69361J92405J43061N7529m51846k78978m06101j19666K17159
10092a99922l93173L52297J79323j30206P18112k54224k22014j5423K98257p9156
10082B53871J49543O67036k64679l69296J40187J44977J37381n89762O74344j90208
10072G53394m28577k22037O561O73591M49954q15419N9573L94150P7963m52109
$$ y = [-247458, 322426, 302936, 532307, 606183, 451843, -266305, -51378, 135398, 233015, 260831, 224270, -9091, -456353, -216573, 463132, 862988, 508485, -135362, -294437, 1601, 101942, 118514, -95321, 201444, 690610, 884447, 450086, 172036, -280687, -240545, 11135, 623549, 185523, 259634, 441245, 609128, 352231, 88653, 665616, 413863, -122846, 446515, 638920, 781981, 839510, 387664, 108686, -297415, -417081, -199922, -593095, -240798, -61475, -191681, 526431, 272207, 50193, 34770, 333027, 253871, 403414, 1070450, 805771, 436475, 576662, 721639, 859020, 269258, 943602, 753394, 324817, 102780, 109341, 782932, 1232886, 417467, 477040, 871190, 949153, 497044]
10062D97044l00157K68409m95370k15980M16343J31918N8261k45761l95778N74981
10052B93910o3371l39006l51025J19759L13524L10202L65677M239k29361J20555
10042E45103l57518K13825L7500l08706m09740K57943K20204J40638j19063K20591
10032D40777Q6493j90841K942m25552N46858k14995l69839L11767J80497M41273
10022H09380j00175l04880l06359K26620J78436k6272k1749n80980o2063M42016
10012B53974M2714m52395M40150j33201L55578J9430j12039o2350j07017J7522
10002B62366L75993l11173n71000r2357J12333L81241l46165j38022J21042J89902
9992a5840O03048L60540n73651J17032J26978l07192k99764L20530k29375q5389
$$ y = [497044, 196887, 465296, -30074, -246054, 170289, 302207, 360468, 114707, -281071, 293910, 230539, -108467, -459492, -339733, -26209, 283993, 649670, 653909, 424548, 545103, 187585, 401410, 438910, 130204, -279536, -21593, 198611, 339249, 220186, 440777, 527270, 336429, 339371, -86181, 460677, 245682, -124157, 187610, 368107, 809380, 709205, 404325, 97966, 324586, 503022, 476750, 455001, -125979, -188042, 253974, 296688, -155707, 284443, 151242, 506820, 526250, 414211, 351861, 244844, 262366, 638359, 327186, -243814, -336171, -223838, 157403, -188762, -326784, -205742, -15840, 587208, 947748, 374097, 491129, 618107, 310915, 11151, 331681, 102306, 16917]
9982A6917P07588l2351n3902k85859o08702J95044N0171J91368M86555k40587
9972D26242O28899k64424l88998J69438K50160o6314q33239M6062K95198k8206
9962B34818K68128J08676n62850j48933N1957J72639k03453R4845R4291M44143
9952E54261j8271j86433J1792k92888O48453R0210n55408k1757M6735k68500j7635
9941i441L82363l97524K42087K48583Q8880o53840j34870j12968M1832K58410
9931d6488q95O20039M25887K02772l58717r9581J69322n04482m08950K05104J06811
9920C10822P2346m504m2334R2668Q3080l14815l20591k67101M53413k19125q1150
9909b37291K14458L74387j6864L5139M86491q3590j172245j173K08866j58960
$$ y = [16917, 724505, 692154, 638252, 352393, -256309, -61265, -11094, 180274, 666829, 426242, 1055141, 790717, 401719, 571157, 821317, 755003, -78236, -32174, 263024, 234818, 502946, 611622, 48772, -100161, -48204, 124435, -79018, 15827, 110118, 554261, 535990, 349557, 361349, 68461, 716914, 807124, 251716, 229959, 276694, 8194, -9441, 372922, -24602, 217485, 466068, 554948, -98892, -233762, -346730, -304898, -46488, -47383, 572656, 998543, 1201315, 842598, 743017, 912339, 407857, -1093, 204011, 310822, 383168, 378664, 336330, 428998, 512078, 197263, -123328, -390429, 62984, -156141, -237291, -22833, 351554, 334690, 369829, 856320, 772730, -399515, -400688, -191822, -350782]
9899c50782P60388J76131R2731J1128J12586n88439J44082J5874J69650K4964
9889E68313j92812K88588k54344K47686l08541J30293K38970n1119l65708j25833
9879A75493J72629J88236k57516R1811K85863l24296k90933N4160r9421M3145
9869C9171O23178J90334J30073J23372l74964m24165P0011R79l67801o0428M54278
9858D04038J79993l23708J6010k5170l47821M15711L73194K36825j94774r7461
9848F36837k54800O9056M02168k23103L0398j52218l45479J40968N2828q8083
9838B68572K7145q9352K25158R1741R9137m1490K89005n90229J02873k8195J01114
9827D55479k3849p64208J213833J5976m75453m42387J04113L48318j4703k43499
$$ y = [-350782, 409606, 585737, 678468, 689596, 802182, 213743, 357825, 373699, 543349, 568313, 375501, 664089, 409745, 657431, 348890, 479183, 718153, 667034, 301326, 175493, 348122, 536358, 278842, 370653, 656516, 332220, 41287, 95447, -3974, 39171, 662349, 852683, 982756, 1106128, 731164, 306999, 377010, 377989, 10188, -50240, 404038, 584031, 260323, 276333, 251163, -96658, 319053, 692247, 929072, 734298, 636837, 382037, 451093, 853261, 630158, 660556, 508338, 162859, 303827, 356655, 268572, 295717, 206365, 431523, 523264, 622401, 580911, 869916, 279687, 382560, 354365, 455479, 431630, -332578, 881255, 897231, 421778, -20609, 83504, 431822, 417119, 173620]
9817A73620J28996J17913K0554l1090l6517K16871j21967n8910j13327P76074
9807A072217m51109o0092J83066r6233M32945l78574Q9542j27647N68024o4971
9797A167168n90538k60822J70258J95540n05640L61335K58996k92789l43085K34446
9787C94869L73471k15163m4913K67714j62756k7793k3657j62697q4243L29419
9777F44251m56394J97737L96113j23047K69772p4034l082m79726k26375j548Q07123
9766I50790Q48j37055j93667L00411P84803n49407m78467O1245k20651l74263
9756A44587K79353M48564p18845L48724O37656n5355m13250k26605J79483k17882
9746D06430K20604l38086J97299M00161m46820m5970m02513J17585P85568K55171
$$ y = [173620, 302616, 420529, 441083, 409993, 373476, 590347, 468380, 409470, 296143, 1072217, 621108, 561016, 744082, 647849, 1080794, 702220, 791762, 664115, 1232139, 1167168, 576630, 315808, 486066, 681606, 175966, 537301, 796297, 503508, 160423, 394869, 768340, 553177, 508264, 775978, 613222, 585429, 561772, 399075, 314832, 644251, 187857, 385594, 781707, 658660, 928432, 854398, 851316, 371590, 145215, 143667, 950790, 951638, 814583, 620916, 921327, 1706130, 1156723, 678256, 739501, 518850, 144587, 423940, 872504, 153659, 502383, 1140039, 1084684, 671434, 444829, 624312, 406430, 627034, 288948, 486247, 886408, 439588, 393618, -8895, 108690, 894258, 1149429]
9736A149429k00364l79982K29637j68452J47635k00570l9596L794L36600K33531
9726A111662k53940l67579n10186N45594q1156j27197L38754O65298k61296j35875
9716I24079p3366l91824R5791Q6406J12831M47343J23762p01979l9240P7345M72575
9705A133723M11073k97948k08507j30336m9575j74929p51321J01308K79072K89404
9695F01964L87740L15674l8474l92823k42106K49029J47514m431K25663k60328
9685I89422K07225N21392m1431o76440K06685m6704Q8994K75692J29741J24411
9675A778987k87826k62401K04355J16524m60606j91234j37267N00709K21647j34512
9665A348376L6842K31177q99886K0050n21286N31375N51143O307K2880p2754L1045
$$ y = [1149429, 949065, 569083, 798720, 630268, 777903, 577333, 537737, 541531, 878131, 1111662, 857722, 490143, -20043, 525551, 444395, 317198, 655952, 1321250, 1059954, 924079, 850713, 458889, 554680, 641086, 753917, 1201260, 1325022, 623043, 583803, 661148, 1133723, 1544796, 1246848, 1038341, 908005, 858430, 683501, -67820, 33488, 312560, 601964, 989704, 1305378, 1266904, 874081, 631975, 881004, 1028518, 1024087, 1249750, 989422, 1196647, 1718039, 1676608, 1000168, 1206853, 1160149, 1249143, 1524835, 1654576, 1778987, 1491161, 1228760, 1433115, 1549639, 1089033, 897799, 760532, 1261241, 1482888, 1348376, 1385218, 1616395, 716509, 736559, 215273, 746648, 1297791, 1304098, 1326978, 1254224, 1285269]
9654A285269K08022l1587l66785M47135j3984l02849j59684J51909N51556L03653
9644B072655o25847m53469O5452L55143o8807n85045L33395Q3788L48128k48320
9634A277073l23647j12615J21409O86152m65390K90037M46359l91800o48688K41612
9624A120502P14182j4647p787j53386n36613j70171K13712L47192j65245p0444
9614A277295l88077K65315p4022L53923L69037q6789l98053K27591j14046K3764
9604A455938Q0219K99612J04522K1011j17074J58157K82014Q506m4545K38211
9594B486571M20735k4703n85826K35997O1211l9841m27048K0926j07850j52458
9584A887714K74546o0491p8667k81456l77915L20779J85288k41733J89676o0995
$$ y = [1285269, 1493291, 1461704, 1094919, 1542054, 1528070, 1225221, 1065537, 1217446, 1769002, 2072655, 1446808, 993339, 1058791, 1413934, 1345127, 760082, 1093477, 1177265, 1525393, 1277073, 953426, 840811, 962220, 1648372, 1182982, 1473019, 1919378, 1527578, 878890, 1120502, 1834684, 1820037, 1812250, 1658864, 1122251, 952080, 1165792, 1512984, 1347739, 1277295, 889218, 1154533, 1080511, 1434434, 1803471, 1716682, 1318629, 1546220, 1432174, 1455938, 1536157, 1835769, 1940291, 1961302, 1844228, 2002385, 2284399, 2292905, 2248360, 2486571, 2907306, 2882603, 2296777, 2532774, 2593985, 2554144, 2127096, 2148022, 2040172, 1887714, 2162260, 2101769, 2023102, 1741646, 1363731, 1684510, 1869798, 1628065, 1817741, 1756746]
9574A756746m9799K4065N15728j11791l00894m68666L67942k128J86417m02448
9564A515172l19056M16688K4412l42923l55983O67977K07266l2025K14617j83051
9554A813094l95830m03232j85491J35489J39561L95528K77563n23022R5378O48825
9544A997863l61215j94698j47731P2810O12760j41107j91104L7007j67633j58392
9534A358560j66098K27738M81827O413j03539K81186M76058n51199l66320l7835
9524A606791N39007K63113o25542K1745O04847k20148P5510m54135K62760j46089
9514A927859k42869o0947k96449J10913O16702n1073j30896N5577k16067p0316
9504A642434J42173l86557o6379j90457N2230M30600k04014J2554j48124k87167
$$ y = [1756746, 1706947, 1731012, 2246740, 2134949, 1834055, 1365389, 1733331, 1731203, 1917620, 1515172, 1196116, 1612804, 1637216, 1294293, 938310, 1606287, 1813553, 1781528, 1996145, 1813094, 1417264, 1014032, 828541, 964030, 1103591, 1499119, 1776682, 1253660, 1349038, 1997863, 1636648, 1441950, 1294219, 1367029, 1979789, 1838682, 1647578, 1684585, 1516952, 1358560, 1192462, 1420200, 1902027, 1908440, 1804901, 2086087, 2562145, 2010946, 1644626, 1606791, 2145798, 2408911, 1783369, 1805114, 2409961, 2189813, 2265323, 1811188, 2073948, 1927859, 1684990, 1624043, 1327594, 1438507, 2055209, 2004136, 1873240, 1928817, 1712750, 1642434, 1784607, 1398050, 1331671, 1141214, 1193444, 1624044, 1420030, 1432584, 1284460, 997293]
9494I97293J68418J89837K84964J36660j6594j73276l37169K86423K35409K8998
9484A800963j36028J10316K61189j9270M9115j08848o4533n9563J69767j19366
9474A883742j60587K65375J14696N47050l44132k74783j03861m00408J07797j56056
9464A478833N04823K83323j07001J02069j8716k44544n14836K40771j4592J82783
9454A892913k36460R0859k05050n335j67927K98317L8168K60911j43254K53294
9444B076436l56095j24431K94433o2034k61391L34194j53263j91830J1210J33893
9434A701122M34883R2532N9485l0191m68598J29120J73020l87795k53288J84330
9424A634620R56933m42744l06846K71366M55991m69668l7122N9103j22848O9934
$$ y = [997293, 1165711, 1355548, 1640512, 1777172, 1760578, 1587302, 1250133, 1536556, 1771965, 1800963, 1664935, 1775251, 2036440, 2017170, 2066285, 1957437, 1892904, 1833341, 2003108, 1883742, 1723155, 1988530, 2103226, 2650276, 2306144, 2031361, 1927500, 1527092, 1634889, 1478833, 1983656, 2266979, 2159978, 2262047, 2243331, 1998787, 1483951, 1724722, 1710130, 1892913, 1656453, 1747312, 1542262, 1536927, 1369000, 1667317, 1705485, 1966396, 1823142, 2076436, 1720341, 1595910, 1890343, 1828309, 1566918, 1901112, 1747849, 1556019, 1567229, 1701122, 2136005, 2228537, 2288022, 2257831, 1789233, 1918353, 2091373, 1703578, 1450290, 1634620, 2591553, 2148809, 1841963, 2113329, 2569320, 2099652, 2062530, 2121633, 1998785, 2068719]
9414B068719K70204k65340J66870M88202K25853n0530k80491P7119J30531O7769
9404B898906P49178m55414m755N70651o1098J60743O0577K37769j72126k47246
9394C737185k17483M4030j48452m79888k97152L77470L10877l50503o51482J81195
9384B505797K50402j5160P1409l9883p3154k12047p0363L02551M23954k19674
9374B923832n8840o37003J56799O35769K4141j23735K28780J60182Q6835J79555
9364C576315M0119J76570k80679m5266N9569q9670k90988K22834k23075q5796
9354C059933P7174j00307P5972l1341J12757L67774K19685m6798l16830K73439
9344C691458M11197j09856J17672L4311J04813n1899p5179m09030o22076P07360
$$ y = [2068719, 2338923, 2073583, 2240453, 2728655, 2954508, 2903978, 2623487, 2700606, 2831137, 2898906, 3648084, 3192670, 3187915, 3758566, 3697468, 3858211, 3918788, 4156557, 3984431, 3737185, 3519702, 3563732, 3415280, 2935392, 2638240, 3015710, 3326587, 2976084, 2324602, 2505797, 2756199, 2741039, 2812448, 2772565, 2699411, 2487364, 2417001, 2719552, 3143506, 2923832, 2864992, 2227989, 2384788, 3020557, 3044698, 2920963, 3149743, 3309925, 3396760, 3576315, 3616434, 3793004, 3512325, 3467059, 3526628, 3436958, 3145970, 3368804, 3145729, 3059933, 3137107, 3036800, 3112772, 3081431, 3194188, 3561962, 3781647, 3734849, 3418019, 3691458, 4102655, 3992799, 4110471, 4144782, 4249595, 4197696, 4122517, 3713487, 3091411, 3798771]
9334C798771J24026k37111l3907N1711L37353K0028K04179j82893M66336l19848
9324D228645p54786P14526J5378L16385K05619n04368J99900j1876n4399l02566
9314D052458j84281N97246l67447M5635L82083j96875K64067m82J12837K41420
9304D946661J695l48931M48122m04843n96801J51456K45915Q14957k28992m42249
9294D586990L3408J55375J2371n30209J00824M0547J22747l39463j93231L82323
9284D371682J18709n31069M86998O5159O4033N2185L55151o59765j44663N63595
9274D742015Q0409j46895J83066L04475n0012K468n21481k26577n20286P54528
9264D601710P2726K65683l422M01234k89793k07020m287o5300K37661j539M46211
$$ y = [3798771, 3922797, 3685686, 3651779, 3703490, 4040843, 4060871, 4265050, 4082157, 4548493, 4228645, 3473859, 4188385, 4203763, 4520148, 4725767, 4221399, 4421299, 4409423, 4355024, 4052458, 3868177, 4465423, 4097976, 4143611, 4525694, 4328819, 4592886, 4592404, 4705241, 4946661, 4948356, 4599425, 5047547, 4642704, 4045903, 4197359, 4443274, 5258231, 5029239, 4586990, 4620398, 4775773, 4788144, 4257935, 4358759, 4399306, 4522053, 4182590, 3989359, 4371682, 4490391, 3959322, 4446320, 4511479, 4575512, 4627697, 4982848, 4323083, 4178420, 4742015, 4822424, 4675529, 4858595, 5163070, 5113058, 5115526, 4594045, 4367468, 3847182, 4601710, 4674436, 4940119, 4936697, 5337931, 5048138, 4841118, 4836831, 4771531, 5009192, 5007653, 5453864]
9253E453864R4887m44068o51283p6493L01106J69018J27357j38220N04861L37067
9243E678096J20393M47421o64622P3591Q2423k30807K02370j55047L39174O53944
9233F546936k54846j20446L12391L8606l11196k61860j09570k7355j87899L96372
9223F021133K97919j40501k70138J4497K3010j39700L63979l40728m3600n5464
9213E730407K71191l8533N50059q1611m07625j05913j1701N66737J45330L33285
9203F951626J9338m26450O26042K55243L2669M28606k01787q93019J30037J68001
9193G090306L36651k44837m005R50756l88595N0343M78729L08269K20410L9403
9183H837430K06245l23829o75138K38810J7715L29385k95203l65350J36190L59091
$$ y = [5453864, 5548751, 5104683, 4453400, 4376907, 4678013, 4847031, 4974388, 4836168, 5341029, 5678096, 5798489, 6245910, 5581288, 5654879, 5737302, 5506495, 5708865, 5553818, 5892992, 6546936, 6292090, 6171644, 6484035, 6522641, 6211445, 5949585, 5840015, 5812660, 5624761, 6021133, 6319052, 6178551, 5908413, 5922910, 5945920, 5806220, 6170199, 5829471, 5785871, 5730407, 6001598, 5963065, 6513124, 6431513, 6023888, 5917975, 5906274, 6473011, 6618341, 6951626, 6970964, 6544514, 7170556, 7425799, 7458468, 7887074, 7685287, 6792268, 6922305, 7090306, 7426957, 7182120, 7178115, 8128871, 7740276, 7790619, 8269348, 8577617, 8798027, 8837430, 9043675, 8719846, 8044708, 8283518, 8301233, 8630618, 8335415, 7970065, 8106255, 8465346]
9173H465346k50439N06690m20169o6784p8109L47216k03460K70109M58159l0519
9163H998040n83346R679J53723M7171N48966l08905L01479l69027N20460L19696
9153I637936L83574l24878j36660M31219M05680k87914J61630m3754R447L29654
9143A0565934R6545j58914q5862j60144n44360J07827L47471k36669Q30754k91567
9133A0471015k30372J22778j95731K73954M00766M09724k9289j67793k81542M14953
9123A1188463J8654l83722k26964r4649M58277K15165J15995N05827J86233l09089
9113A1674190j70130n70498J00940P39365j44523j3056L06304J36986K65432Q525
9103A2333535L68634k5942J54263L06225L52632j64235k36842J90264N27255m77068
$$ y = [8465346, 8214907, 8721597, 8301428, 8234644, 8156535, 8503751, 8300291, 8570400, 9028559, 8998040, 8414694, 8424373, 8578096, 8625267, 9174233, 8865328, 9166807, 8797780, 9318240, 9637936, 10021510, 9696632, 9559972, 9991191, 10396871, 10108957, 10270587, 10226833, 10236280, 10565934, 10662479, 10503565, 10417703, 10257559, 9713199, 9821026, 10168497, 9931828, 10762582, 10471015, 10240643, 10363421, 10167690, 10441644, 10842410, 11252134, 11222845, 11055052, 10773510, 11188463, 11207117, 10823395, 10596431, 10501782, 10960059, 11175224, 11291219, 11797046, 11983279, 11674190, 11504060, 10933562, 11034502, 11773867, 11629344, 11616288, 11922592, 12059578, 12325010, 12333535, 12702169, 12676227, 12830490, 13136715, 13489347, 13325112, 13088270, 13278534, 13805789, 13328721]
9093A3328721j8108Q16761k81091j01318p49620J27385k59847l06214J36306M07944
9083A3100919l26888K35468N415K6673R1863L65101K39181L91316l97973M46791
9073A4177866K13454k82293R8351O81476K88686K13766q534K63113J25177K17207
9063A5988269o2720O8855N64991M62870K57364P66677p5034N543J069786O07918
9053A9654519K73868O37037J253299o2411P50908o7869M70847R22334K64112P66595
9043B4863239N40966M13744P22897J24903J76770M2145P94338J65719m61945R176
9033B7391952L78701O7003L57758O40825L89388M86079P84199P43518L90117P79384
9023C2408924R89144J93148J020021J326562J274393J095863J036053M36271q9684
$$ y = [13328721, 13310613, 14127374, 13846283, 13744965, 12995345, 13122730, 12862883, 12556669, 12692975, 13100919, 12774031, 13009499, 13014914, 13041587, 13133450, 13498551, 13737732, 14129048, 13731075, 14177866, 14391320, 14109027, 14207378, 14888854, 15177540, 15391306, 15382772, 15645885, 15771062, 15988269, 15925549, 15994404, 16559395, 17022265, 17279629, 18046306, 17971272, 17976815, 19046601, 19654519, 19928387, 20565424, 21818723, 21756312, 22507220, 22439351, 22910198, 23832532, 24096644, 24863239, 25404205, 25817949, 26540846, 26665749, 26842519, 26884664, 27679002, 27844721, 27382776, 27391952, 27770653, 27837656, 28195414, 28836239, 29225627, 29711706, 30495905, 31239423, 31629540, 32408924, 33398068, 33591216, 34611237, 35937799, 37212192, 38308055, 39344108, 39780379, 39690695]
9014C9690695L69340J0641q94578l45129J69104k81614J73520l1964O24126Q42624
9004D0326765j13010M91299L65931J186788J310519M43417P89283J882503J297110
8995D7980605K9640j83495l23745o95409j172969j135766l97076p52553k7044
8986D3322188K50083j05535P19795J344030J367378J171478J307330Q70680R75306
8977E1222733N98265K13432o29694q36230r39508p18558n58158o67702j93596
8968D7490984J192193L19246L05558N36942J242866J871419J917324K513920L165639
8959F0556091L097197K791062L260845K314620R83206j030909j533068l69087
8951G0069957m2319J11178Q14599J244827K195992J744092J844324K863985L117346
$$ y = [39690695, 40060035, 40070676, 39176098, 38830969, 39000073, 38718459, 38891979, 38860015, 39484141, 40326765, 40213755, 40705054, 41070985, 42257773, 43568292, 44011709, 44800992, 46683495, 47980605, 48010245, 47826750, 47503005, 46807596, 45634627, 44498861, 44101785, 43349232, 43322188, 43572271, 43466736, 44186531, 45530561, 46897939, 48069417, 49376747, 50247427, 51222733, 51820998, 52034430, 51404736, 50568506, 49628998, 48910440, 48352282, 47684580, 47490984, 48683177, 49002423, 49307981, 49844923, 51087789, 52959208, 54876532, 57390452, 60556091, 63653288, 66444350, 69705195, 72019815, 73003021, 71972112, 70439044, 70069957, 70027638, 70138816, 70953415, 72198242, 74394234, 76138326, 77982650, 80846635, 83963981]
8942H3963981L905266M316435M742482N114252N115036M367226N776618O448991
8934A23750287P545704R545293J0109692J3445245J7787157K5545160L0393841
8927B38122379L6750174M7869615M2813388K1450266L268322k0980912l5425288
8920C33867944m3190338m1913692l0270015k3235545j6475888j3018943j2723876
8913A53039647j4202089j1408724r696793o980419o404045n761884n180647l472446
8905H9932600l246852k987265j934600j702433j533118p88016p66035Q3026M58862
8896G7516169M30965N49205O25452J178863Q52277k16314m30699J1238o91038
8887G9826118q37806n13309k30974q01299o40111m98965n53102l08534m77564
$$ y = [83963981, 87869247, 92185682, 96928164, 102042416, 107157452, 111524678, 117301296, 123750287, 131295991, 140841284, 150950976, 164396221, 182183378, 207728538, 238122379, 274872553, 322742168, 365555556, 387005822, 390274144, 369293232, 333867944, 290677606, 248763914, 218493899, 195258354, 178782466, 165763523, 153039647, 138837558, 127428834, 117732041, 110751622, 104347577, 98585693, 93405046, 89932600, 86685748, 83698483, 81763883, 80061450, 78528332, 77740316, 76974281, 77057307, 77516169, 77947134, 78496339, 79121791, 80300654, 81152931, 80936617, 80505918, 80517156, 79826118, 78988312, 78475003, 78244029, 77442730, 76802619, 76303654, 75750552, 75442018, 74964454]
8878G4964454n57187J53878m76086q66853L12547M33029k58047l72106p56641
8869G2576988j457724o91514j64155l8320K40254N03863j06380K1525M10038k6905
8859G1267670p63232m64269K2877l63526n46380l60864p88068j169100j270215
8850F5564893j407924j507801r37793o32588j45048j87611J55129K0632J2409
8841F0934298p0016j266831j263944j180993j065121j410389j104328q35199j548930
8832E1188547j260672k87739n30478J59342r142P92580P22079L49936M13368N87455
8822E2125276L78063J44264j145023k77534j03271r79796q95409p98333K01553
8813D8649790J70406Q23518L39266P68464K95244Q31416J253463O67870R52339
$$ y = [74964454, 74407267, 74561145, 74085059, 73218206, 73530753, 73963782, 73705735, 73333629, 72576988, 71119264, 70427750, 70263595, 70225275, 70465529, 70969392, 70863012, 70884537, 71294575, 71267670, 70504438, 70040169, 70063046, 69699520, 69153140, 68792276, 68004208, 66835108, 65564893, 64156969, 62649168, 61711375, 61078787, 60933739, 60746128, 60901257, 60921889, 60934298, 60864282, 59597451, 58333507, 57152514, 56087393, 54677004, 53572676, 52737477, 51188547, 49927875, 49640136, 49109658, 49269000, 49259858, 50052438, 50774517, 51124453, 51537821, 52125276, 52503339, 52647603, 51502580, 51225046, 51121775, 50141979, 49246570, 48448237, 48649790, 48820196, 49643714, 49982980, 50751444, 51046688, 51878104, 53131567, 53799437, 54751776]
8804E4751776J147901l98090J73179k4071j32420J86672J04536R25141J023831
8795E7758455P91024N30854K00094j39649l4318n41188M94545O7172N82368J411538
8785F1120895J436306O80210J448719J595553J353884J332572R96253P62005O86991
8776G1413388J149517J412427J411372K162292J877244J955820J683268K022568
8768H5087896J603281Q11715J097995J741919J372933K218309J765954J695653
8760I7395655J493912k33200j043331k800634l848252l093806k160448k310821
8752H3399075k691994j877804r87521p28321m59797L04526K52129K53247P09378
8743G8172918R54653J162603J753094L514589L920030L608633L151097K832589
$$ y = [54751776, 55899677, 55501587, 55674766, 55650695, 55518275, 55704947, 55809483, 56734624, 57758455, 58549479, 59080333, 59280427, 59140778, 59106460, 58565272, 59059817, 59126989, 59709357, 61120895, 62557201, 63237411, 64686130, 66281683, 67635567, 68968139, 69964392, 70726397, 71413388, 72562905, 73975332, 75386704, 77548996, 79426240, 81382060, 83065328, 85087896, 86691177, 87502892, 88600887, 90342806, 91715739, 93934048, 95700002, 97395655, 98889567, 98656367, 97613036, 94812402, 90964150, 87870344, 85709896, 83399075, 80707081, 78829277, 77841756, 77113435, 76653638, 76958164, 77210293, 77463540, 78172918, 79127571, 80290174, 82043268, 85557857, 89477887, 93086520, 96237617, 99070206]
8735I9070206J281324J95519j274817k657881l067686k531663l121041j181532
8727H6712429j142809k057024j558452j769202j737622k057543j765172j261667
8719G3362938j152275l09319m27204n3773q27347j054622j602696j289856p92328
8710F5853518j066567q76736m22324j63318l77560L10684j2064m59018k18043
8701F2568572j106817j324470j321668j625372j068090j488870j057139o91155
8693E2884991o19159o18034J94820J58093j37995l04133o22650L93495m33917
8684E0895511q01835k68058J68983N40879M35843m39850l2474J042260M09722
8675E1950981O52881P27623R74535P35324K53481M77047N49606O81640M85860
$$ y = [99070206, 100351530, 100547049, 99272232, 96614351, 93546665, 91015002, 87893961, 86712429, 85569620, 83512596, 81954144, 80184942, 78447320, 76389777, 74624605, 73362938, 72210663, 71901344, 71474140, 71420367, 70593020, 69538398, 67935702, 66645846, 65853518, 64786951, 63910215, 63487891, 63324573, 62947013, 63257697, 63245633, 62786615, 62568572, 61461755, 60137285, 58815617, 57190245, 56122155, 54633285, 53576146, 52884991, 52265832, 51647798, 51842618, 52000711, 51862716, 51558583, 50935933, 51329428, 50895511, 50093676, 49825618, 49994601, 50535480, 50971323, 50531473, 50498999, 51541259, 51950981, 52603862, 53331485, 54306020, 55041344, 55294825, 55771872, 56321478, 57003118, 57488978]
8666E7488978J135365J894268J796221J662308J434125M00937n00576Q4222n55636
8657F4840212p23548k41418o29075j89025Q74053J212542J403763J130635J088537
8648F8766676O5907r0117k798o07295r76600j617595j776907j861989j729627
8639F0169655k129751j130069q20023m02822n29932l33816J29368N7451O60243
8630E5670304L67845R67530O69856J112602P27481M95441n222J71205R76788K2181
8620F1176011j31130o4050m80487j386573q83374K925N841m7067L5449O78781
8610E8906326M44540q04546j173649j051370j151187j365878j533881j654208
8602E0616147j068209j265118r99595j138856j95669k32099l23036k48625K24863
$$ y = [57488978, 58624343, 60518611, 62314832, 63977140, 65411265, 65812202, 65311626, 65395848, 64840212, 64116664, 63875246, 63246171, 63057146, 63931199, 65143741, 66547504, 67678139, 68766676, 68832583, 68742466, 68739668, 68132373, 67155773, 65538178, 63761271, 61899282, 60169655, 58039904, 56909835, 56089812, 55686990, 55157058, 54823242, 54952610, 55010061, 55670304, 56038149, 57005679, 57675535, 58788137, 59515618, 60011059, 60005837, 60177042, 61153830, 61176011, 61044881, 60980831, 60500344, 59113771, 58230397, 58233322, 58239163, 58192096, 58227545, 58906326, 59350866, 58546320, 57372671, 56321301, 55170114, 53804236, 52270355, 50616147, 49547938, 48282820, 47283225, 46144369, 45948700, 45716601, 45393565, 45144940, 45369803]
8593D5369803R4011j85970o7179P32496K66475L33755J469672L34352M56908k7407
8583D8776916p8589p82153L00436L04216n5483K80601M52698J408073J535865
8574E2142580J777384K000808J297358J245783J49685l71220k78629j138457q71659
8565E5953633l85884q33493L2857O40990P68367k60991q3244q88825j375621j270687
8555E2297102q27146o25110j276152k47411o81562r38024j92654q63187m22945
8546D6222911j88999k80050J90939J92462j60575N45138J389168J370243J570188
8537E0851425J488713Q71847J071543R83987j99409j18356L24377R41716Q98099
8528E7113942O17223J099832J296204M39728O7488k49102l42697o82925r60273
$$ y = [45369803, 45463814, 45277844, 45210665, 45943161, 46209636, 46543391, 48013063, 48347415, 48804323, 48776916, 48698327, 47916174, 48216610, 48520826, 48465343, 48745944, 49198642, 50606715, 52142580, 53919964, 55920772, 57218130, 58463913, 58613598, 58242378, 57963749, 56825292, 55953633, 55567749, 54734256, 54767113, 55408103, 56176470, 55915479, 55832235, 54943410, 53567789, 52297102, 51469956, 50844846, 49568694, 49321283, 48639721, 47701697, 47509043, 46645856, 46222911, 46033912, 45753862, 45944801, 46137263, 45976688, 46521826, 47910994, 49281237, 50851425, 52340138, 53211985, 54283528, 55267515, 55068106, 54949750, 55274127, 56215843, 57113942, 57731165, 58830997, 60127201, 60566929, 60634417, 60385315, 60042618, 59359693, 58399420]
8519E8399420l39560n71287n14403l64889j154179n38318j151878j434826j725154
8510E0604926j259586j041535n10956l42239j275147j766932q64770n72690j79838
8501D2791233r09329n29700k16069o6300j44436l53674k06114k12724P54831L45018
8491D1252736J13677M14832L03363K98186K30K36273P20082J36280K49104J7079
8481D3741842L79356P99714O21739L58979k36394K50786n07188j53611k58810
8472D4996413p07882l09473K11494q9553J16911P17997Q91237J170559M93403
8463D7491106R25719O43159O98249J11190r12785j842711k448856k327692j574398
8454D0762981k009237j233897r27766j294355j303240j221757o91125q42532o71390
$$ y = [58399420, 58059860, 57488573, 56974170, 56609281, 55455102, 54916784, 53764906, 52330080, 50604926, 49345340, 48303805, 47792849, 47450610, 46175463, 44408531, 43543761, 42971071, 42791233, 41881904, 41352204, 41136135, 41069835, 40925399, 40571725, 40365611, 40152887, 40907718, 41252736, 41366413, 41781245, 42084608, 42382794, 42383024, 42619297, 43339379, 43475659, 43724763, 43741842, 44121198, 44920912, 45542651, 45901630, 45665236, 45916022, 45408834, 45255223, 44996413, 44288531, 43979058, 44190552, 44100999, 44217910, 44935907, 45827144, 46997703, 47491106, 48416825, 49059984, 49758233, 49869423, 48956638, 47113927, 44665071, 42337379, 40762981, 38753744, 37519847, 36592081, 35297726, 33994486, 32772729, 32081604, 31239072, 30567682]
8445C0567682q07306q02597m81737m01320p61927j9429L55336R6618j3436k68085
8435B7463799n31499o77459o5336n62409q82971l49482j63629q13886k73627o92315
8425B2451186l04530K42857m7484l17547r65446j230191l51844l92448o35529
8416A8449024o45976j062128n4355k05881r71402p94713o11913L14040K13770
8407A4630466N6405m63157p10328M35709k11605J47300k19439q6030M63317J21885
8397A4164523J15088k5754j74205L14652J34025l5055m54149j39373o16459k86943
8387A2996350L43226j73074o59702J01104K44052n25814J67442m40936p03660
8378A1348988l40971J37990J7375L51798l93157l75826l74510n49372n94576n43574
$$ y = [30567682, 29760376, 28957779, 28476042, 28074722, 27312795, 27293366, 27648702, 27745320, 27731884, 27463799, 26932300, 26254841, 26189505, 25627096, 24744125, 24394643, 24231014, 23417128, 23143501, 22451186, 22146656, 22389513, 22342029, 22024482, 21059036, 19828845, 19477001, 19084553, 18449024, 17803048, 16740920, 16686565, 16480684, 15509282, 14714569, 14102656, 14416696, 14630466, 14686871, 14223714, 13513386, 13949095, 13737490, 13884790, 13665351, 13579321, 14042638, 14164523, 14279611, 14253857, 14079652, 14394304, 14528329, 14493274, 14039125, 13899752, 13283293, 12996350, 13339576, 13166502, 12506800, 12607904, 12851956, 12326142, 12493584, 12052648, 11348988, 11008017, 11146007, 11163382, 11515180, 11122023, 10746197, 10371687, 9822315, 9227739, 8684165]
8368H684165M67887J05585K40552L20120m84821m58376k10903K50738m49218J19243
8358H584972n9273L44766K2259n62535J87651N773j77650j91943O2472K44834
8348H461326L55085J28797j80133k00841j86118k94851K234l44818Q5214L38627
8338H164522L4906O6393O8407j87670j51811O4481k24244m08945L7821K94416
8328G758276n97168R81322K35495n51999P94219q65271m19265J09272O07832k31544
8318G821169l46133r8532M91614j29409m08007K22485K9123N30484J42561O9858
8308H325213J02511k57727k70235L69653L3234n54036K31274R6357m3372m69484
8298G563388o0625k59077l67506L34440k52505o6147J08582l66783k80587l1767
$$ y = [8684165, 9152052, 9257637, 9498189, 9818309, 9333488, 8875112, 8664209, 8914947, 8465729, 8584972, 8525699, 8870465, 8892724, 8330189, 8517840, 8523613, 8345963, 8154020, 8216492, 8461326, 8816411, 8945208, 8765075, 8564234, 8378116, 8083265, 8085499, 7740681, 7825895, 8164522, 8199428, 8265821, 8334228, 8146558, 7994747, 8059228, 7834984, 7426039, 7463860, 7758276, 7161108, 8142430, 8377925, 7825926, 8620145, 7754874, 7335609, 7444881, 8052713, 7821169, 7475036, 7376504, 7868118, 7738709, 7330702, 7553187, 7582310, 8112794, 8255355, 8325213, 8427724, 8169997, 7899762, 8269415, 8302649, 7748613, 7979887, 8076244, 8032872, 7563388, 7502763, 7243686, 6876180, 7210620, 6958115, 6891968, 7000550, 6633767, 6353180, 6321413]
8288F321413J2154K1596R776M17531l37206j11180m0275K18681j37827n49853
8278E824810N14306L14864K72057p37238m98191k22638o74862O31729K89179P1882
8268E785898J35206K64035K52301j46891R2691k74166J0752o7351J6310N48364
8258F617149R1636k7805L02512k82261k05973J1014q6150k107P5202K0094K80397
8247F793708P2190l57127j42111j47112j29415L35474j23279m88181K91763J98399
8237F304309J20423m76375K01657j67912O66201N9363m12767J75288K11037k61154
8227F420070J35086j7217o94247M33667J98972j36540L87793N20250L9617j97250
8217G090201N06886L26304n4615l29538m9385J32936M37780l29952o22154O9386
$$ y = [6321413, 6333567, 6355163, 6364939, 6782470, 6445264, 6334084, 6293809, 6512490, 6374663, 5824810, 6339116, 6653980, 6926037, 6188799, 5690608, 5467970, 4793108, 5424837, 5714016, 5785898, 5921104, 6185139, 6437440, 6290549, 6383240, 6109074, 6119826, 6052475, 6068785, 6617149, 6708785, 6680980, 6983492, 6701231, 6495258, 6506272, 6420122, 6418015, 6493217, 6513311, 6793708, 6865898, 6508771, 6366660, 6219548, 6090133, 6425607, 6302328, 5814147, 6105910, 6304309, 6424732, 5948357, 6150014, 5982102, 6648303, 6707666, 6294899, 6470187, 6681224, 6420070, 6555156, 6537939, 5843692, 6277359, 6476331, 6339791, 6727584, 7247834, 7287451, 7090201, 7597087, 7923391, 7868776, 7539238, 7489853, 7622789, 8060569, 7730617, 7108463, 7177849]
8207G177849k20673Q29801o93399p80494o2167M63983j12882l4727r1298K83108
8197F759101P9098N6053p62224J11858n26432L274377J818911j972650N8757J8334
8187H915183M10003K35661P41985r74195M26011l17992m02751j26783K32928J83081
8177I323131L80710k28590m8616K3703k37278L82689K62436M57412M67391M92344
8167A1275332O15983O71221M54846Q21168K26620p15936r9484k49003n33242l69675
8157A2097830q28670j94743L36267m46931m62371J9992p58262m54939K43462L85419
8147I937054k34047n33941k97284o4150Q3785N15635L47302M32815N78133M27165
8137A1192467l3986K80537Q94784O80009n0326p09359K43382J19089m56100q28656
$$ y = [7177849, 6957176, 7786977, 7093578, 6313084, 6250917, 6714900, 6602018, 6567291, 6475993, 6759101, 6838199, 6894252, 6132028, 6243886, 5717454, 8991831, 10810742, 8838092, 8896849, 8915183, 9325186, 9560847, 10302832, 9328637, 9754648, 9436656, 9033905, 8907122, 9140050, 9323131, 9703841, 9475251, 9426635, 9450338, 9213060, 9595749, 9858185, 10315597, 10782988, 11275332, 11891315, 12562536, 13017382, 13838550, 14065170, 13349234, 13249750, 13000747, 12467505, 12097830, 11269160, 11074417, 11410684, 10963753, 10501382, 10521374, 9763112, 9308173, 9551635, 9937054, 9703007, 9169066, 8871782, 8807632, 8891417, 9407052, 9754354, 10187169, 10765302, 11192467, 11158481, 11439018, 12333802, 13013811, 12963485, 12254126, 12497508, 12616597, 12160497, 11331841]
8127A1331841m48509m04026n57161l31328M1178j227l47070j63760j042554n629
8117H071755l83885n62072m12685o74106K02141K45206L40264k7000k36374L00292
8107F863536L09986j06096J12859J26210K34531n129l36166l55887l39211k55802
8097F248831O6807k49919k88657M42140j71154l10435R3649r33143O6866K72544
8087E237529k457N01450o59431K55590L93933l53311j52976r19146p61901O44230
8077D183510O74579L30349o01824J81067L24221j29672R7138j42331M70180j22789
8067E264428j40415n3067m32823M23489L06703L20736J54840k33876J28412R1740
8057E830167P80759K94686J91298N402k60460K9886K88801M76345K66041M5003
$$ y = [11331841, 10883332, 10479306, 9922145, 9590817, 9631995, 9630768, 9283698, 9119938, 8077384, 8071755, 7687870, 7125798, 6713113, 6039007, 6241148, 6486354, 6826618, 6799618, 6563244, 6863536, 7173522, 7067426, 7180285, 7306495, 7541026, 7535897, 7199731, 6843844, 6504633, 6248831, 6315638, 6065719, 5777062, 6219202, 6048048, 5737613, 5831262, 4898119, 4964985, 5237529, 5235072, 5736522, 5077091, 5332681, 5726614, 5373303, 5220327, 4301181, 3539280, 4183510, 4858089, 5188438, 4586614, 4767681, 5091902, 4962230, 5059368, 4917037, 5387217, 5264428, 5124013, 5070946, 4638123, 5061612, 5368315, 5689051, 5843891, 5610015, 5738427, 5830167, 6610926, 6905612, 7096910, 7102312, 6841852, 6871738, 7160539, 7636884, 7902925, 7947928]
8047G947928l46651K60752M21347k38016k9086J63403J25162J0342k5767J24132
8037H413546J77q3225O90354k77738J84905Q7452L15789J009374M59421N46925
8027A1346980J04459N64672Q58116R23966Q86979R17921J754565K045694J941729
8018B1345081J928606K847165L743499L787552K894408K561032O97060j378375
8010C8426028j954086l009018l316318l644090k967824k613080j704985j768004
8002A7448623k054512j716047j004276j030682n10142p05774j182454n76141l62525
7993H306070m73401k7022o31057L46673l5780q74979k37307k12252p74984m91665
7983D894296K49658J00759m40716J57738K16248k32471l27726l68553l51389j01738
$$ y = [7947928, 7601277, 7862029, 8283376, 8045360, 8016274, 8179677, 8304839, 8315181, 8289414, 8413546, 8413723, 8330498, 9020852, 8743114, 8928019, 9015471, 9331260, 10340634, 10800055, 11346980, 11451439, 12016111, 12874227, 13798193, 14685172, 15603093, 17357658, 19403352, 21345081, 23273687, 26120852, 29864351, 33651903, 36546311, 39107343, 39804403, 38426028, 36471942, 33462924, 30146606, 26502516, 23534692, 20921612, 19216627, 17448623, 15394111, 13678064, 12673788, 11643106, 11132964, 10427190, 9244736, 8668595, 8306070, 7832669, 7805647, 7174590, 7521263, 7485483, 6610504, 6373197, 6160945, 5385961, 4894296, 5143954, 5244713, 4803997, 4961735, 5177983, 4945512, 4617786, 4249233, 3897844, 3796106]
7973C796106L45222j47437r0968M3328k29110j24870j81659K15789L3169J1076
7963C670646o0878J05500M37016R8766j63488r3415l32440m12685L40425m0737
7953C548710k0646Q7920J89364l96015l60128m77343M34601l91428M06085Q1886
7943C103006o33493J82143M17641l97763J7092O50668L61553p8303j76116n18945
7933B927483p5649m6628j9526M74366L60700j44288k09066k74133l49309m3708
7923B600242J72333M11461K22785k26622p2148j20763j11519j11034N0679n02195
7913B313219L7611M15693j70241L69784k35100j67812L7200L94318p844j19125
7903B867703L9973j70813k71330j03693Q1756k73j9662K4716J57942M86961j43586
$$ y = [3796106, 4141328, 3993891, 3902923, 3946251, 3717141, 3592271, 3410612, 3626401, 3659570, 3670646, 3609768, 3715268, 4152284, 4251050, 4087562, 3994147, 3661707, 3249022, 3589447, 3548710, 3528064, 3615984, 3805348, 3409333, 3049205, 2571862, 3006463, 2615035, 3021120, 3103006, 2469513, 2651656, 3069297, 2671534, 2688626, 3339294, 3700847, 3622544, 3446428, 2927483, 2851834, 2805206, 2785680, 3260046, 3620746, 3476458, 3267392, 2993259, 2643950, 2600242, 2772575, 3184036, 3406821, 3180199, 3108051, 2987288, 2875769, 2764735, 2815414, 2313219, 2350830, 2766523, 2596282, 2966066, 2730966, 2563154, 2600354, 2994672, 2986828, 2867703, 2907676, 2736863, 2465533, 2361840, 2443596, 2443323, 2423661, 2448377, 2606319, 3093280, 2949694]
7892B949694n57073j32498O93051J93050k99537Q0675j21588l47169R800M65189
7882B933594j20127K31615j30793n28211j5947j24523J57334R3013J24671N0178
7872B670804k90904K67868K29424k8090j1589j16968j50023l19890j45375J10005
7862B215262k74776J12824Q27670k99603J83571M9852l1031j59237K29852K26598
7852C080982r5556J99101P7604k79574l45035o61949K93425N57464j71059p49528
7842A905875L79767J45519L01732o1410k96438k69819K38240N62284J94475p7407
7832C022818M2566M26741l13135m43736k06863J1180k05979j73896N03136K63216
7822B926048J95175m1942k74733J99812J19827l66681Q4564j77134k85304P8902
$$ y = [2949694, 2392621, 2260123, 2953174, 3146224, 2846687, 2927362, 2805774, 2458605, 2468405, 2933594, 2813467, 3045082, 2914289, 2386078, 2370131, 2245608, 2402942, 2495955, 2620626, 2670804, 2379900, 2647768, 2877192, 2849102, 2837513, 2720545, 2570522, 2250632, 2105257, 2215262, 1940486, 2053310, 2880980, 2581377, 2764948, 2814800, 2783769, 2624532, 2854384, 3080982, 2985426, 3184527, 3262131, 2982557, 2637522, 1975573, 2268998, 2826462, 2655403, 1905875, 2285642, 2431161, 2732893, 2671483, 2375045, 2105226, 2343466, 2905750, 3100225, 3022818, 3065384, 3492125, 3178990, 2735254, 2528391, 2539571, 2333592, 2159696, 2662832, 2926048, 3121223, 3079281, 2804548, 3004360, 3124187, 2757506, 2842070, 2664936, 2379632, 2458534]
7812B458534K78717n7414k10844L16435o68189n039K52765M18809P8313L70304
7802C232391P66415j94428q62063j65616r0703M94825m84279l32854L90261J03242
7792B857191m01116l3415M73095r0772l50817k9616m08249K60997L64903k06124
7782B436077M77999m84812j09045O15525l84211m13688n0149P71611Q3939J89376
7772C132622N56181m33067o31280J73409l01085K9763j36435l70279J2331R9280
7762B131440P9914J74230k00523J02989P7764k55134M00090r8800P63636l27813
7752B847793m14651L45645k09470K37385j94085m12537J11844L39394L1365M39082
7742C121765r067j02721n80580m5656j23736k16206N13435m7585j90153K59894
$$ y = [2458534, 2737251, 2679837, 2468993, 2785428, 2117239, 2112200, 2364965, 2783774, 2862087, 3232391, 3998806, 3804378, 2942315, 2776699, 2685996, 3180821, 2696542, 2363688, 2753949, 2857191, 2456075, 2422660, 2895755, 2804983, 2454166, 2424550, 2016301, 2277298, 2642201, 2436077, 2914076, 2429264, 2320219, 2935744, 2551533, 2137845, 2087696, 2859307, 2943246, 3132622, 3688803, 3255736, 2624456, 2797865, 2496780, 2526543, 2390108, 2019829, 2032160, 2131440, 2211354, 2385584, 2185061, 2288050, 2365814, 2110680, 2510770, 2411970, 3175606, 2847793, 2433142, 2778787, 2569317, 2806702, 2612617, 2200080, 2311924, 2651318, 2682683, 3121765, 3112698, 3009977, 2429397, 2383741, 2260005, 2043799, 2557234, 2509649, 2319496, 2579390]
7732B579390j71904K99357L79758k60620l04096J00993k40585J41564J6448l01659
7722B238646R12975k14420J0969k88459m01995k22821N47080K28600p6570M3604
7712B777609k69603K16315K94017k01396l6141K75579j73009l2889j15675p2417
7702B662390j86173j00850M12316l15880m4858k8310J67147K47715N46439o51023
7692B708913k24611L27066K98161j73367m16647J06063k55842j91734j15286J21372
7682B184088P37568N37739K04742n4402o57082j064283M44248N18607j79741k96238
7672B375246j02964L6711r0289P06908m2034P2325n35539l0669M96018j09233
7662B776480j13982j24578J01786n73755N39165J63570O74754p4308m75849J70511
$$ y = [2579390, 2407486, 2706843, 3086601, 2825981, 2521885, 2622878, 2382293, 2523857, 2540305, 2238646, 3151621, 2937201, 2948170, 2659711, 2257716, 2034895, 2581975, 2810575, 2734005, 2777609, 2508006, 2724321, 3018338, 2816942, 2780801, 3056380, 2883371, 2850482, 2734807, 2662390, 2476217, 2375367, 2787683, 2471803, 2426945, 2398635, 2565782, 2813497, 3359936, 2708913, 2484302, 2811368, 3109529, 2936162, 2519515, 2625578, 2369736, 2178002, 2062716, 2184088, 2921656, 3459395, 3664137, 3609735, 2952653, 1888370, 2332618, 2851225, 2671484, 2375246, 2272282, 2308993, 2218704, 2925612, 2883578, 2955903, 2420364, 2389695, 2885713, 2776480, 2662498, 2537920, 2639706, 2065951, 2605116, 2768686, 3443440, 3369132, 2893283, 3063794]
7652C063794R2547J42068l56173k44603K26232n1399q0768j8584L05600J57625
7642C236339o92000J36100L14339J21463l80229L740q5796m95369L22956O69939
7632C151482k16890R5720k57636l0721n8358K2075l04461J57421J6035K91744
7622B866411m19234J926M58892O16829k68799j75430j20129M1432n2506j10904
7612B838488P21412j25619l55335j47803L55824J07928Q4163l55557M01763K30955
7602C756219o35036J37169K73894l97131P011L48968M13618J3077k79552j25441
7592C512796j84544L55450k16842K43863M06689O905J82113j0600m394Q863k77320
7581D022979J15673K24520J34827J92368j65351N8481m27864M89231O94795J75835
$$ y = [3063794, 3156341, 3298409, 2942236, 2697633, 2923865, 2872466, 2791698, 2773114, 3078714, 3236339, 2544339, 2680439, 2994778, 3116241, 2736012, 2739752, 2653956, 2158587, 2481543, 3151482, 2934592, 3030312, 2772676, 2741955, 2683597, 2705672, 2401211, 2558632, 2574667, 2866411, 2447177, 2449103, 2907995, 3524824, 3256025, 3080595, 2960466, 3001898, 2949392, 2838488, 3559900, 3434281, 3078946, 2931143, 3286967, 3394895, 3479058, 3123501, 3525264, 3756219, 3121183, 3258352, 3532246, 3135115, 3142126, 3491094, 3904712, 3917789, 3638237, 3512796, 3328252, 3683702, 3466860, 3710723, 4117412, 4124317, 4306430, 4295830, 4291436, 4300299, 4022979, 4138652, 4363172, 4497999, 4690367, 4525016, 4583497, 4155633, 4644864, 5339659, 5515494]
7571E515494K21568N85737P6683L04910N72166L19771k68300k77313k22422P9925
7561F908219p09391j13832j63049n36920o15054l85440J88146K15589J89927j87073
7551D791122l64882J88866j13617m24128J99301K3751O1960L7702N30879J57522
7541E088476k1977J28105j51952K2150n04599m40784L26556m81487m09664l60381
7531C194443J48369K47359j160j53697L99046r0427o3857N9219k11457j70598
7521C357240R911j74616j07895K50856N69600m09917l67763l8917J65139N05498
7511C759136p00441R9385K7741k4675k68334O0525O13600r713n32089N83951L17403
7500C926489p45484R9426N9755M01031l87340l22224L75069l1721O7329m4233
$$ y = [5515494, 5737062, 6322799, 6399482, 6704392, 7276558, 7596329, 7328029, 7050716, 6828294, 6908219, 6198828, 6084996, 5921947, 5385027, 4769973, 4384533, 4572679, 4788268, 4978195, 4791122, 4426240, 4615106, 4501489, 4077361, 4276662, 4300413, 4362373, 4400075, 4930954, 5088476, 5066499, 5194604, 5042652, 5064802, 4560203, 4119419, 4445975, 3964488, 3554824, 3194443, 3342812, 3590171, 3589011, 3435314, 3834360, 3743933, 3680076, 3739295, 3527838, 3357240, 3367151, 3192535, 3084640, 3335496, 3905096, 3495179, 3127416, 3088499, 3253638, 3759136, 3058695, 3158080, 3185821, 3161146, 2892812, 2953337, 3566937, 3557224, 3025135, 3609086, 3926489, 3181005, 3280431, 3340186, 3741217, 3353877, 3031653, 3406722, 3375001, 3442330, 3398097]
7490C398097j57099O5382j63287k31787K40461M64703m0454m6096L80753j06041
7480C804632j45520J76534l06146k4373j45926K17598J58565n45522M6340K6172
7470C262354j33325M56149l82686l4597J56289j33153J88095J70591M95265K47058
7460D292040m20097K2582K0959J99757R6912o22761L96137K36708k13334L19960
7450D328863k13300N854K52031m4197Q23733o87159L13186L66077j57235o8684
7440D919169l68635l04694L81469m4338Q7787L40225N71462l39407o6020k37968
7430D939050r6297L03016L33014L12976j04130j49038o94326Q5305J26516O19516
7420E675602k84745p15205L26983M57166N9851L9042m21399K86734L22m86449
$$ y = [3398097, 3240998, 3306380, 3143093, 2911306, 3151767, 3616470, 3576016, 3529920, 3910673, 3804632, 3659112, 3835646, 3529500, 3505127, 3359201, 3576799, 3735364, 3189842, 3236182, 3262354, 3129029, 3585178, 3202492, 3167895, 3324184, 3191031, 3379126, 3549717, 4044982, 4292040, 3871943, 3894525, 3915484, 4115241, 4212153, 3589392, 3985529, 4222237, 4008903, 4328863, 4115563, 4121417, 4373448, 4329251, 5152984, 4465825, 4779011, 5145088, 4987853, 4919169, 4550534, 4245840, 4627309, 4582971, 4670758, 5010983, 5582445, 5243038, 5177018, 4939050, 4842753, 5145769, 5478783, 5791759, 5687629, 5538591, 4844265, 4929570, 5056086, 5675602, 5390857, 4675652, 5002635, 5459801, 5519652, 5558694, 5137295, 5424029, 5424351, 4937902]
7410D937902J08547J21323m6442l72273l37324L76614O02777K2318o85960J34121
7400D861603k4859M53899N78750p89642q4192J87591k97089K83165M06268K77346
7390E852840k82386j92632l85605n33413K12904J18228J71122L16819k32723m50899
7380D594255l713k63417K82008j55115k2855k33235J48150N81155K37799K15092
7370E380124l47723q41251k67869M51919J681n4022k13848L49936R829q8011k35313
7359D145452m8861j59322p5861L78515K66936L256l65891K83861j77497K43283
7349D493871k6627k6567l61175j3157L81997o10439j09751K86913L19878m33013
7339C901930K87061P50190p30047k61172l00871j61783K48070N66007M10874k30109
$$ y = [4937902, 5046449, 5167772, 5121330, 4749057, 4411733, 4788347, 5391124, 5413442, 4727482, 4861603, 4836744, 5290643, 5869393, 5079751, 4995559, 5183150, 4886061, 5169226, 5575494, 5852840, 5570454, 5377822, 4992217, 4458804, 4671708, 4789936, 4961058, 5277877, 5045154, 4594255, 4590542, 4327125, 4609133, 4454018, 4431163, 4197928, 4346078, 4927233, 5165032, 5380124, 5032401, 4191150, 3923281, 4375200, 4376881, 4322859, 4109011, 4458947, 4468776, 4380765, 4145452, 4096591, 3937269, 3861408, 4239923, 4506859, 4510115, 4144224, 4428085, 4250588, 4493871, 4467244, 4440677, 4079502, 4066345, 4448342, 3837903, 3728152, 4015065, 4334943, 3901930, 4188991, 4939181, 4209134, 3947962, 3647091, 3485308, 3733378, 4299385, 4710259, 4480150]
7329D480150Q7756k5095p7922l66897K53137k65574K69370J65637N12662l26290
7319D706934j46323N35798q7608k80621N73010m26418k4028L73239r4279L92478
7309E522182m25258q0673l06254O3070L01511k01894N2064K26410M43588l09328
7299E285418j26820L49282k94831M45800J33808K52387Q2929J0578m79084K41503
7289E900970O60060J41286K14925M08686K1963j19417J48041n43268O32285j75234
7279G290297K25706M06036K03082p8848L81893M42675M35485L15251K67844O38900
7269A0528321Q7923M25254m2824Q6959r7773N1734N57899J57200M35422J01087
7259A2291202J80259O76405J12814O11866N63943O74452J1589P37614K25933R47857
$$ y = [4480150, 4567906, 4542811, 4464889, 4097992, 4351129, 4085555, 4354925, 4520562, 5033224, 4706934, 4560611, 5096409, 5008801, 4728180, 5301190, 4874772, 4850744, 5223983, 5129704, 5522182, 5096924, 5016251, 4709997, 4773067, 5074578, 4872684, 4924748, 5151158, 5594746, 5285418, 5158598, 5507880, 5213049, 5658849, 5792657, 6045044, 6127973, 6138551, 5659467, 5900970, 6561030, 6702316, 6917241, 7325927, 7347890, 7228473, 7376514, 6833246, 7465531, 7290297, 7516003, 7922039, 8125121, 8046273, 8428166, 8870841, 9306326, 9621577, 9889421, 10528321, 10616244, 11041498, 10998674, 11085633, 10987860, 11039594, 11597493, 11754693, 12190115, 12291202, 12471461, 13147866, 13260680, 13872546, 14436489, 15110941, 15122530, 15860144, 16086077, 17033934]
7249A7033934Q31921N19716N85879P38165J253302J044678J148808J042397J057481
7240B5256281J299221J090991J172970L85761J76043K52530l80152j388230j225375
7231B6640040j196576j918274j173463j221527o10807j024051j791339o79431
7223A7024572l76017j014398p25412k57581m28399k01918o03619m17681J05929
7214A3105476m42132K24026K79273j97418j51445l03697M88085J35322o71776
7205A2465714m17393n24410J81782M35695K07678J18441j38548K83643L7454P4140
7195A2724196j77452J08335L30222k67741J42515L93982k88667N37894K53837
7186A3757121J51321P53157M87514m7402L15750R97083O16692P37762J097673
$$ y = [17033934, 17865855, 18385571, 18971450, 19709615, 20962917, 22007595, 23156403, 24198800, 25256281, 26555502, 27646493, 28819463, 29205224, 29381267, 29633797, 29253645, 27865415, 26640040, 25443464, 23525190, 22351727, 21130200, 20519393, 19495342, 17704003, 17024572, 16648555, 15634157, 14908745, 14651164, 14222765, 14020847, 13417228, 12999547, 13105476, 12663344, 12887370, 13166643, 12969225, 12817780, 12514083, 13002168, 13137490, 12465714, 12048321, 11523911, 11705693, 12141388, 12349066, 12467507, 12328959, 12612602, 12650056, 12724196, 12546744, 12655079, 12985301, 12717560, 12860075, 13254057, 12965390, 13503284, 13757121, 13908442, 14661599, 15149113, 15101711, 15417461, 16414544, 17031236, 17768998, 18866671]
7177A8866671P97130N56178O76774J155066J280176J072379P52562Q31678J721962
7168B7710576M09603L85918Q33815J207747L70654J143723J166793R91092Q59022
7159C5078943Q20227P92683R71376J795504J505169J677002J810314J740047K143380
7150D8334645K778843L492982L036293L768203M996368N439614N966466N590178
7142H3403592N613758N118696L577809K190332l2387j901145l534763m376995
7134I0058897l672266m070134m337022l371047k856958k581072k486469k246543
7126F4437386j596858j155225j154275r46995M30184m65110n01954L75752N59030
7117E9981935N51955R63887J149094J552761J835412K047311K386464K165943
$$ y = [18866671, 19663801, 20219979, 20896753, 22051819, 23331995, 24404374, 25156936, 25988614, 27710576, 28120179, 28506097, 29339912, 30547659, 30918313, 32062036, 33228829, 34219921, 35078943, 35899170, 36691853, 37663229, 39458733, 40963902, 42640904, 44451218, 46191265, 48334645, 51113488, 54606470, 57642763, 61410966, 66407334, 71846948, 77813414, 83403592, 89017350, 94136046, 97713855, 99904187, 99871800, 97970655, 94435892, 90058897, 86386631, 82316497, 77979475, 74608428, 71751470, 69170398, 66683929, 64437386, 62840528, 61685303, 60531028, 59584033, 60014217, 59549107, 59047153, 59422905, 59981935, 60533890, 61497777, 62646871, 64199632, 66035044, 68082355, 70468819, 72634762]
7109G2634762K957655L412340L427063L207762K868432K312590J809027N68233
7101I3197864p43213j990981l261445l861831m555314m631642m544121m943387
7093F4665930l635842l489182l454772l443291k952168k386711k040298k029301
7085D1234365k040843j665511j366262j929966j508976j454961j269404r82626
7077B9015816o91803l83971q53866j177007j028549p02641m5752k65418p32493
7068B3134316o92446j288597m49241k03327p89280o25265k94125J06872L41485
7059A9240392j077279l76145m75417n54817l9966k01556m23683m0765k57858k18769
7049A5574137k44829q43137J92510J23989o51885q8739k86223N5695l65895l50138
$$ y = [72634762, 75592417, 79004757, 82431820, 85639582, 88508014, 90820604, 92629631, 93197864, 92454651, 90463670, 87202225, 83340394, 78785080, 74153438, 69609317, 64665930, 61030088, 57540906, 54086134, 50642843, 47690675, 45303964, 43263666, 41234365, 39193522, 37528011, 36161749, 34231783, 32722807, 31267846, 29998442, 29015816, 28324013, 27940042, 27086176, 25909169, 24880620, 24177979, 24132227, 23866809, 23134316, 22441870, 21153273, 20704032, 20500705, 19711425, 19086160, 18792035, 18898907, 19240392, 18163113, 17786968, 17311551, 16756734, 16716768, 16515212, 16091529, 16050764, 15792906, 15574137, 15329308, 14486171, 14678681, 14802670, 14150785, 14062046, 13775823, 13831518, 13465623, 13115485]
7039A3115485M77271K12759j46376o35079o47571k14682L11519N57568k33199
7030A2797695n18665j35422L72511m91667L0759M5099l04351J38310J00810k67556
7020A1767523l8879p1950m45867j40007J79682j0920k69988k04922j62014N17995
7010A1120653k13231m90179J64150l7616P8363K947K73054j30564j19949r2966
7000A0554662k09556K26858j28218j12774N6133K35172n43261l28869M29499K72472
6990A0452118j03228l83715K49425j00896k79817J68118J20806k38495k78232
6981I606084m215J42707J76946p8430j64029J91678N9384j78100K36928J45849
6971A0134802k82347O28303m64357l68568K37949k81164r4181L00664l32135p5162
$$ y = [13115485, 13592756, 13805515, 13659139, 13024060, 12376489, 12161807, 12473326, 13030894, 12797695, 12279030, 12143608, 12516119, 12024452, 12055211, 12100310, 11795959, 11934269, 12035079, 11767523, 11728644, 11656694, 11210827, 11070820, 11250502, 11239582, 10969594, 10764672, 10602658, 11120653, 10907422, 10417243, 10581393, 10543777, 10622140, 10625087, 10898141, 10767577, 10647628, 10554662, 10345106, 10571964, 10443746, 10330972, 10387105, 10622277, 10079016, 9750147, 10179646, 10452118, 10348890, 9965175, 10214600, 10113704, 9833887, 10002005, 10122811, 9884316, 9606084, 9601869, 9744576, 9921522, 9843092, 9679063, 9870741, 9930125, 9752025, 9988953, 10134802, 9852455, 10480758, 10016401, 9647833, 9885782, 9604618, 9510437, 9811101, 9478966, 9403804]
6961I403804k05714k05355O61280j64387N07116J53128M7710o25514P16307K26765
6951A0515140P2656L03415k70258m63703K87392L93161j29584l74862k6364L40521
6941A0647514P14071M85593k68558K76422l30502l08760Q53173j28809N28382
6932A2468526P80504L51339M30156K89607Q55697O23442M74269R56242J163967
6923A8393749R49574J420648J497940J384338R73154J006215J577363J281011
6915B8483992J460259J462119Q5554P1421j036078k121945k109640k372960k354916
6906B1567806j492737j095305j773687j072821n17419q49574j025247p74991k36573
6897A2729452q09862p73408M70600k93140p30652o46476j18342k08165l36754
$$ y = [9403804, 9198090, 8992735, 9654015, 9489628, 9996744, 10149872, 10197582, 9572068, 10288375, 10515140, 10587796, 10891211, 10620953, 10157250, 10444642, 10837803, 10708219, 10333357, 10306993, 10647514, 11361585, 11847178, 11578620, 11855042, 11524540, 11215780, 12068953, 11940144, 12468526, 13249030, 13600369, 14030525, 14320132, 15175829, 15799271, 16273540, 17229782, 18393749, 19343323, 20763971, 22261911, 23646249, 24619403, 25625618, 27202981, 28483992, 29944251, 31406370, 31491924, 31563345, 30527267, 28405322, 26295682, 23922722, 21567806, 20075069, 18979764, 17206077, 16133256, 15615837, 14766263, 13741016, 12966025, 12729452, 11919590, 11146182, 11616782, 11323642, 10592990, 9946514, 9828172, 9620007, 9283253]
6888I283253K30299n17246k60147j30037M6851O9161o58216n40808J19481j06724
6878G535867L16611L95966k24834k03803j95475o86848k26813L06398P4665M6192
6868G137926j65386j91344J62978k03351l39843l30630O7653J49812q520N94539
6858F873834n78124l39736M75294K03124K37848K5494k83962L37870p8366m55312
6848F417964K12649J92813k67232M19917J52365q2983j28359L88874k05150k33744
6838F867114M97637K50035K32921m28441R5288O5859O2087L79057J47034K44309
6828H412900N4137l22905k92281Q8001j91102p68470M83156K04319k46746O9516
6818G490525M62853l89849k39414J31458j47855O1050K77978j12428N5872k40546
$$ y = [9283253, 9513552, 8996306, 8736159, 8606122, 8652973, 8722134, 8063918, 7523110, 7642591, 7535867, 7852478, 8248444, 8023610, 7819807, 7624332, 6937484, 6710671, 7017069, 7091734, 7137926, 6972540, 6781196, 6944174, 6740823, 6400980, 6070350, 6138003, 6287815, 6279295, 6873834, 6295710, 5955974, 6431268, 6634392, 6872240, 6897734, 6613772, 6951642, 6873276, 6417964, 6630613, 6823426, 6556194, 6976111, 7128476, 7045493, 6917134, 7306008, 7100858, 6867114, 7364751, 7614786, 7847707, 7419266, 7514554, 7580413, 7642500, 8021557, 8168591, 8412900, 8467037, 8144132, 7851851, 7939852, 7748750, 6980280, 7463436, 7667755, 7421009, 7490525, 7953378, 7563529, 7324115, 7455573, 7307718, 7368768, 7646746, 7534318, 7590190, 7349644]
6808G349644m29378K365K93431L12681K89989k69762l48367O04035J72629J88981
6798H166248l5322l92107j39727k82701P12720M0581M10502l98996n08249j17384
6788G455565N25658O52158J68591m55000k21957O09834k74079k50276M90801m5056
6778H656239k47660K01750N0174j45552n40619k91582P61880K71625r9816J424
6768H617863m20064K03033p64378K58604m12227J51320L93001j83690l43490L73791
6758G873763L01506o91981K40406k12269m23006m23486L87884K62337O9088k04828
6748G179414j06054l47265m04952R1105J81078J81917n87538M0279o5949l0776
6738F131259n4789K93966R5650L83205l30910k44636L41051O7913r8047j54104
$$ y = [7349644, 6920266, 6922631, 7216062, 7528743, 7818732, 7548970, 7200603, 7804638, 7977267, 8166248, 8130926, 7738819, 7599092, 7316391, 8029111, 8069692, 8480194, 8081198, 7572949, 7455565, 7981223, 8633381, 8801972, 8346972, 8125015, 8734849, 8460770, 8210494, 8701295, 8656239, 8408579, 8610329, 8660503, 8514951, 7974332, 7682750, 8444630, 8716255, 8616439, 8617863, 8197799, 8400832, 7636454, 7895058, 7482831, 7634151, 8027152, 7843462, 7499972, 7873763, 8175269, 7483288, 7723694, 7511425, 7088419, 6664933, 7052817, 7315154, 7384242, 7179414, 7073360, 6726095, 6321143, 6412248, 6593326, 6775243, 6187705, 6227984, 6162035, 6131259, 6076470, 6370436, 6466086, 6849291, 6518381, 6273745, 6614796, 6682709, 6584662, 6430558]
6728F430558k41337l13723l4496l6533j15139m97488k30032j18677M92815M32076
6718E768024l42013q6872l558O97814l49567j64686P6624j26965K79931l27203
6708E421529J17001m67469o382J00244m06399M54442K33375R0184m89285J66756
6698E213996J84068o8372O8564J63023L61488o43832k3113J12687J02000n3035
6688E417474J4355k31002K08907Q2158J08732j1111M83840r7830n04854Q3920
6678E554589j11760M83426K46943L40546j64649l34429l34968K14124j06757L14070
6668F101135k37808J05103l22295L65751L82814o90038M71113J83699k36423m03390
6658E719661M54870L16044m3617L67361o57672k87896k1201J19605N05348R04177
$$ y = [6430558, 6189221, 5875498, 5841002, 5804469, 5689330, 5191842, 4961810, 4843133, 5335948, 5768024, 5426011, 5339139, 5335581, 6033395, 5683828, 5519142, 5595766, 5468801, 5748732, 5421529, 5538530, 5071061, 5064679, 5164923, 4758524, 5212966, 5446341, 5536525, 5047240, 5213996, 5398064, 5329692, 5398256, 5561279, 5922767, 5278935, 5255822, 5368509, 5470509, 5417474, 5431829, 5200827, 5409734, 5491892, 5600624, 5589513, 6073353, 5975523, 5470669, 5554589, 5442829, 5926255, 6173198, 6513744, 6349095, 6014666, 5679698, 5893822, 5787065, 6101135, 5863327, 5968430, 5646135, 6011886, 6394700, 5704662, 6175775, 6359474, 6123051, 5719661, 6174531, 6490575, 6446958, 6814319, 6156647, 5868751, 5847550, 5967155, 6472503, 7376680]
6648G376680j92996J3725K42608k82522L32251l6678m740K31490O29585K6826
6638H336229R2919l18870k10622l46535k48583J4630K5052n1788j60041k18999
6628F913392n97965j04330O05101n57570l52057K82383K66192l36052k37484K13466
6618F095076L26838N2472J40309L39720n41414k78802K34736l08289J24200P69959
6608F954805J53812p75796Q433K88337J06060j61053K94125j86977m80834K23430
6598F424342Q7286J41868k7363l57105L48143J68638j60553J94879j25670J3598
6588F708063l339J88659k58845K07319K26567O03950l77359o3497P72881j67793
6578G836606J94510k89534J78969K50876O72143M40380k841L55356k22614l58410
$$ y = [7376680, 7183684, 7197409, 7440017, 7157495, 7489746, 7453068, 7448328, 7679818, 8309403, 8336229, 8429148, 8110278, 7899656, 7553121, 7304538, 7319168, 7344220, 7292432, 7132391, 6913392, 6315427, 6211097, 6816198, 6258628, 5906571, 6188954, 6455146, 6119094, 5881610, 6095076, 6421914, 6474386, 6614695, 6954415, 6413001, 6134199, 6368935, 6060646, 6184846, 6954805, 7108617, 6332821, 6341254, 6629591, 6735651, 6574598, 6868723, 6681746, 6200912, 6424342, 6511628, 6653496, 6626133, 6269028, 6617171, 6785809, 6625256, 6820135, 6694465, 6708063, 6704724, 6893383, 6634538, 6841857, 7068424, 7672374, 7295015, 7231518, 8004399, 7836606, 8031116, 7741582, 7920551, 8171427, 8843570, 9283950, 9281109, 9636465, 9413851, 9055441]
6568I055441l26201j87213R2844K0555L32886o18250L87230J68817J53391N78102
6558I657602L99096m62445J29319l29889r4416j38433j13842K09978j76594J05104
6548I185480K51147K52008p10665r538L27978J16215Q931l5346l96112j4564L41086
6537I316620N52134p06390L23393L53714j36403L27859j34233q35979K57396l1745
6527I286366k78499L83997J10542p90981K06544K8154j01665k2326J40646J75883
6517I138661M9414p40723m35640K3888N777k8326n5254M17704L40735K86281p32814
6506H269703J66620m35177k57587K62012K35749p8678j25665L74881J149M49469
6496H862476j57529K68043m00506k58587k14372k86600L6760K51396K30390l66214
$$ y = [9055441, 8729240, 8542027, 8634871, 8655426, 8988312, 8370062, 8757292, 8926109, 9079500, 9657602, 10056698, 9594253, 9723572, 9393683, 9299267, 9160834, 9046992, 9256970, 9080376, 9185480, 9436627, 9688635, 8977970, 8968432, 9296410, 9412625, 9421556, 9386210, 8990098, 8975534, 9316620, 9868754, 9162364, 9485757, 9839471, 9703068, 10030927, 9896694, 9060715, 9318111, 9286366, 9007867, 9391864, 9502406, 8711425, 8917969, 8946123, 8844458, 8822132, 8962778, 9138661, 9188075, 8447352, 8011712, 8035600, 8041377, 8013051, 7957797, 8375501, 8716236, 9002517, 8269703, 8436323, 8001146, 7743559, 8005571, 8241320, 8162642, 8036977, 8411858, 8413007, 8862476, 8704947, 8972990, 8572484, 8313897, 8099525, 7812925, 7849685, 8101081, 8331471, 7965257]
6486G965257k4674M93552J43833k49140L39711K192k5200K8713k95470K72732
6476H651506k09335J26047K93329m78132m07288M68442N41124k5856o95751l42218
6466G921868P56914M55121J57867j25072P0337L12113k20881o02138P9938J39884
6456H945951q8103K25043n60981R007R6916k9201J05192m7372p1971j12667M95295
6445H967109J85408J88564l49195N47006j8672K42429J37619L89312J97550n79010
6435I908120l521K07231L18069L55259j90583K69714j8361k23496N45582K6681
6425A1194695l96437M38870J88059r0561P1881J40154L02969j41498k28412L33659
6415A1813379K14205o1081r2540M17788O8984j27727K2649J5065O5650J79k03272
$$ y = [7965257, 7940583, 8434135, 8577968, 8328828, 8668539, 8670731, 8645531, 8674244, 8378774, 8651506, 8442171, 8568218, 8861547, 8383415, 7976127, 8444569, 8985693, 8959837, 8264086, 7921868, 8678782, 9133903, 9291770, 9166698, 9237035, 9549148, 9328267, 8726129, 8806067, 8945951, 8857848, 9082891, 8521910, 8530917, 8627833, 8598632, 8703824, 8656452, 8584481, 8471814, 8967109, 9152517, 9341081, 8991886, 9538892, 9520220, 9762649, 9900268, 10289580, 10487130, 9908120, 9904599, 10111830, 10429899, 10785158, 10594575, 10864289, 10845928, 10622432, 11168014, 11194695, 10798258, 11237128, 11425187, 11334626, 11406507, 11546661, 11849630, 11708132, 11479720, 11813379, 12027584, 11966503, 11873963, 12291751, 12360735, 12233008, 12255657, 12270722, 12336372, 12336551, 12133279]
6404A2133279K1738m7343l68684K44990L85641j54126K27336L36255J22108P1052
6394A2972246k01559j74033K80903K75014k0238L63441l39178K66004M0945Q3707
6384A3547252m52763j85050J44737j19326J77120j88488L12468J77199j2204O103
6374A3407048J62420N56375J63554M05019J30049j10300K38856j66969K38034
6365A5024086N75812m22578P598K8321L01574J69677R4012L26300l8036J32838
6355A6199604O94186N43889n54157j26915N49655K7539j26014O56952L19564M66772
6345A8651075K25654L22380J1920K4848K95420L71190M03479N34091M87763j01729
6335B1226091N31665L70398K5965r7568P96337J87461m85027M40761O0071K41437
$$ y = [12133279, 12155017, 12107674, 11738990, 11983980, 12369621, 12215495, 12442831, 12779086, 12901194, 12972246, 12770687, 12596654, 12877557, 13152571, 13132333, 13495774, 13156596, 13422600, 13463545, 13547252, 13094489, 12909439, 13054176, 12934850, 13111970, 12923482, 13235950, 13413149, 13400945, 13407048, 13569468, 14125843, 14289397, 14694416, 14824465, 14714165, 14953021, 14786052, 15024086, 15599898, 15177320, 15184918, 15213239, 15514813, 15684490, 15778502, 16104802, 16066766, 16199604, 16893790, 17437679, 16883522, 16756607, 17306262, 17333801, 17207787, 17864739, 18184303, 18651075, 18876729, 19199109, 19211029, 19235877, 19531297, 19902487, 20305966, 20840057, 21327820, 21226091, 21757756, 22128154, 22154119, 22056551, 22852888, 23040349, 22555322, 22996083, 23056154, 23297591]
6325B3297591J48852M43253N91626J1845K38974N87394J32347J27556O92483j6923
6315B6254998N81089O05959L41713N65234L76046L41828K11292N30684M89335
6306C0298178M54352j31989P05905N251L24672M51339R12984P53714J28291q4188
6296C3818509J68750O18764N70109J07539L68259R49773R09128N52082r0054J148920
6286C9121779J91238K8817P20762R48865L90568O27429J09511R56507N60027j44571
6276D3510932J30584J068562J181016L15046R32935R49917O45358J261092J155735
6267E1151177J418016J564521J116967J435007J384467R36867O39388J459781
6259F1106191J987584J121184J219192R95371J009214J245798N55266N81265P59704
$$ y = [23297591, 23446443, 23889696, 24481322, 24493167, 24732141, 25319535, 25451882, 25579438, 26271921, 26254998, 26836087, 27442046, 27783759, 28348993, 28725039, 29066867, 29278159, 29808843, 30298178, 30752530, 30620541, 31326446, 31331697, 31656369, 32107708, 33020692, 33774406, 33902697, 33818509, 33987259, 34606023, 35176132, 35283671, 35651930, 36601703, 37510831, 38062913, 37972859, 39121779, 39313017, 39341834, 40062596, 41011461, 41402029, 42029458, 42138969, 43095476, 43655503, 43510932, 43641516, 44710078, 45891094, 46206140, 47139075, 48088992, 48734350, 49995442, 51151177, 52569193, 54133714, 55250681, 56685688, 58070155, 59007022, 59646410, 61106191, 63093775, 64214959, 65434151, 66429522, 67438736, 68684534, 69239800, 69821065, 70580769]
6250G0580769J391241J176407J68592k73318K63353P80009j11471P63977J398605
6241G6138164L49786Q28718J492703K064704J434590J177360J397589K51060J01978
6232H5236652Q89256J212343L57757K29073K26771J022368O7862m62157q45083
6223H7934842r83720j614699j860416k069291k212212j025526j302686m61775
6215G6404517l84560k21256o53892k01824N1566M10626J36270j26750p02798O0654
6205G4772553N15453j134818r03364r64113j669590j455963j343240k028315j104920
6196F4683683j379858j305885j452586j013746r57544j558955o49796p13147q01800
6187E4850366j269632r5840l96880k60796l85571o25358o87406K05049J56392
$$ y = [70580769, 71972010, 73148417, 73317009, 73043691, 73307044, 74087053, 73975582, 74739559, 76138164, 76487950, 77316668, 78809371, 80874075, 82308665, 83486025, 84883614, 85134674, 85236652, 86125908, 87338251, 87696008, 87925081, 88151852, 89174220, 89242082, 88779925, 87934842, 86951122, 85336423, 83476007, 81406716, 79194504, 78168978, 76866292, 76404517, 76019957, 75798701, 75144809, 74942985, 74994551, 75405177, 75541447, 75414697, 74711899, 74772553, 75288006, 74153188, 73249824, 72285711, 70616121, 69160158, 67816918, 65788603, 64683683, 63303825, 61997940, 60545354, 59531608, 58574064, 57015109, 56365313, 55652166, 54850366, 53580734, 53484894, 53088014, 52827218, 52441647, 51816289, 51128883, 51333932, 51490324]
6178E1490324O2732p55531Q2087j19243n34253k06986K36543P463j71046j3856
6168E0078234j37774L24534J76344L92830P4939L51740N25576P89284P07544M98932
6158E3782183M30543Q21381J171471L93447Q16339J019284M34018M98534O81178
6149F0048378N50389N14793K59304m43350L57994Q8583M2184k7111q51171n07796
6139F0032197L0415J92463L49966n4709P85109L81170L06231O39309J374531R59200
6129F4995882J004604J445404J401785Q97012M1069r23566o23210o97440p62161
6120F6779379j754431j866722j750501j808778j687240j503102j666277j638710
6112E3103618q80470j284757o7567p77891o5789L31271O560l21844j23917j39428
$$ y = [51490324, 51553056, 50797525, 50879612, 50760369, 50226116, 50019130, 50255673, 50263136, 50092090, 50078234, 49940460, 50264994, 50441338, 50834168, 50909107, 51260847, 51786423, 52575707, 53283251, 53782183, 54212726, 55034107, 56205578, 56599025, 57415364, 58434648, 58868666, 59367200, 60048378, 60598767, 61113560, 61372864, 60929514, 61287508, 61376091, 61418275, 61391164, 60539993, 60032197, 60062612, 60255075, 60605041, 60550332, 61335441, 61716611, 62022842, 62662151, 64036682, 64995882, 66000486, 67445890, 68847675, 69744687, 69785756, 68862190, 68238980, 67541540, 66779379, 65024948, 63158226, 61407725, 59598947, 57911707, 56408605, 54742328, 53103618, 52223148, 50938391, 50870824, 50092933, 50027144, 50358415, 50364975, 50043131, 49919214, 49779786]
$$ [...]
##END NTUPLES=NMR SPECTRUM
##END=
