##TITLE=1H_EC-3344(21)
 200.13MHz, CDCl3,
 8 sc
 
 6.3.2025
##JCAMPDX= 6.0         $$ Bruker NMR JCAMP-DX V2.0
##DATA TYPE= NMR SPECTRUM
##DATA CLASS= NTUPLES
##ORIGIN= UXNMR, Bruker Analytische Messtechnik GmbH
##OWNER= pz
$$ XWIN-NMR		Version 3.5
$$ Thu Mar  6 13:56:01 2025 Russian Standard Time (UT+4h)  she@DPX200
##.OBSERVE FREQUENCY= 200.1313
##.OBSERVE NUCLEUS= ^1H
##.ACQUISITION MODE= SIMULTANEOUS
##.ACQUISITION SCHEME= undefined
##.AVERAGES= 8
##.DIGITISER RES= 18
##SPECTROMETER/DATA SYSTEM= spect
##.PULSE SEQUENCE= zg30
##.SOLVENT NAME= CDCl3
##.SHIFT REFERENCE= (INTERNAL, CDCl3, 0, 15.4803)
##AUDIT TRAIL= $$ (NUMBER, WHEN, WHO, WHERE, WHAT)
$$ ##TITLE= Audit trail, XWIN-NMR		Version 3.5
$$ ##JCAMPDX= 5.01
$$ ##ORIGIN= Bruker BioSpin GmbH
$$ ##OWNER= she
$$ F:/spectra/data/she/nmr/H-C/1/pdata/1/auditp.txt
$$ ##AUDIT TRAIL=  $$ (NUMBER, WHEN, WHO, WHERE, WHAT)
(   1,<2025-03-06 13:53:02.98 +0400>,<she>,<DPX200>,
      <created by zg, POWCHK disabled, PULCHK disabled
       configuration hash MD5:
       00 E9 B6 7A A2 85 ED C7 34 08 36 98 17 FE 4E 26
       data hash MD5: 16K
       98 99 C9 C1 58 79 AD 4D 4F 2D 30 E3 AC 6E F7 C7>)
(   2,<2025-03-06 13:53:05.20 +0400>,<she>,<DPX200>,
      <Start of raw data processing
       efp BC_mod = 2 LB = 0.25 FT_mod = 6 PKNL = 1 PHC0 = -468.3897 PHC1 = 16.79222 SI = 16K 
       data hash MD5: 16K
       23 48 3A 63 8F 6F 1B 02 D4 92 24 8C 2E 32 26 FC>)
(   3,<2025-03-06 13:53:31.18 +0400>,<she>,<DPX200>,
      <pk PHC0 = 1.162989 PHC1 = -1.4 
       data hash MD5: 16K
       F8 B5 22 6A D4 4B B7 9B 27 92 F2 9C 13 1C BE 17>)
(   4,<2025-03-06 13:53:34.82 +0400>,<she>,<DPX200>,
      <abs ABSG = 5 
       data hash MD5: 16K
       5F 2A 37 38 54 2A 6A 6C 56 09 A5 AC 59 A4 A2 19>)
$$ ##END=
$$ 
$$ hash MD5
$$ 7F AD 09 A5 9E 24 4E 5C CD E7 00 78 3B 61 7D 47
##$RELAX= 
##$RELAX= 
##$RELAX= 
##$RELAX= 
##$RELAX= 
##$RELAX= 
$$ Bruker specific parameters
$$ --------------------------
##$DU= <F:/spectra>
##$EXPNO= 1
##$NAME= <H-C>
##$PROCNO= 1
##$TYPE= <nmr>
##$USER= <she>
##$AMP= (0..31)
100 100 100 100 100 100 100 100 100 100 100 100 100 100 100 100 100 100 
100 100 100 100 100 100 100 100 100 100 100 100 100 100 
##$AQSEQ= 0
##$AQ_mod= 1
##$AUNM= <au_zg>
##$AUTOPOS= <>
##$BF1= 200.13
##$BF2= 200.13
##$BF3= 200.13
##$BF4= 200.13
##$BF5= 200.13
##$BF6= 200.13
##$BF7= 200.13
##$BF8= 200.13
##$BYTORDA= 1
##$CFDGTYP= 0
##$CFRGTYP= 5
##$CHEMSTR= <none>
##$CNST= (0..31)
1 1 145 1 1 1 1 1 1 1 1 1 1 1 1 1 1 1 1 1 1 1 1 1 1 1 1 1 1 1 1 1 
##$CPDPRG= <>
##$CPDPRG1= <>
##$CPDPRG2= <>
##$CPDPRG3= <>
##$CPDPRG4= <mlev>
##$CPDPRG5= <mlev>
##$CPDPRG6= <mlev>
##$CPDPRG7= <mlev>
##$CPDPRG8= <mlev>
##$CPDPRGB= <>
##$CPDPRGT= <>
##$D= (0..31)
0 0.7 0 0 0 0 0 0 0 0 0 0.03 0 0 0 0 0 0 0 0 0 0 0 0 0 0 0 0 0 0 0 0 
##$DATE= 1741254782
##$DBL= (0..7)
120 120 120 120 120 120 120 120 
##$DBP= (0..7)
150 150 150 150 150 150 150 150 
##$DBP07= 0
##$DBPNAM0= <>
##$DBPNAM1= <>
##$DBPNAM2= <>
##$DBPNAM3= <>
##$DBPNAM4= <>
$$ [...]
##$SUBNAM3= <"">
##$SUBNAM4= <"">
##$SUBNAM5= <"">
##$SUBNAM6= <"">
##$SUBNAM7= <"">
##$SUBNAM8= <"">
##$SUBNAM9= <"">
##$SW= 18.0517328524113
##$SWIBOX= (0..15)
0 0 2 0 0 0 0 0 0 0 0 0 0 0 0 0 
##$SW_h= 3612.71676300578
##$TD= 16384
##$TD0= 1
##$TE= 0
##$TE2= 300
##$TE3= 300
##$TEG= 300
##$TL= (0..7)
0 120 120 120 120 120 120 120 
##$TP= (0..7)
150 150 150 150 150 150 150 150 
##$TP07= 0
##$TPNAME0= <>
##$TPNAME1= <>
##$TPNAME2= <>
##$TPNAME3= <>
##$TPNAME4= <>
##$TPNAME5= <>
##$TPNAME6= <>
##$TPNAME7= <>
##$TPOAL= (0..7)
0.5 0.5 0.5 0.5 0.5 0.5 0.5 0.5 
##$TPOFFS= (0..7)
0 0 0 0 0 0 0 0 
##$TUNHIN= 0
##$TUNHOUT= 0
##$TUNXOUT= 0
##$USERA1= <user>
##$USERA2= <user>
##$USERA3= <user>
##$USERA4= <user>
##$USERA5= <user>
##$V9= 5
##$VALIST= <valist>
##$VCLIST= <CCCCCCCCCCCCCCC>
##$VD= 0
##$VDLIST= <DDDDDDDDDDDDDDD>
##$VPLIST= <PPPPPPPPPPPPPPP>
##$VTLIST= <TTTTTTTTTTTTTTT>
##$WBST= 1024
##$WBSW= 4
##$XGAIN= (0..3)
0 0 0 0 
##$XL= 0
##$YL= 0
##$YMAX_a= 241331
##$YMIN_a= -428429
##$ZGOPTNS= <>
##$ZL1= 120
##$ZL2= 120
##$ZL3= 120
##$ZL4= 120
##$ABSF1= 15.46059
##$ABSF2= -2.591259
##$ABSG= 5
##$ABSL= 3
##$ALPHA= 0
##$AQORDER= 0
##$ASSFAC= 0
##$ASSFACI= 0
##$ASSFACX= 0
##$ASSWID= 0
##$AUNMP= <proc_1d>
##$AZFE= 0.1
##$AZFW= 0.1
##$BCFW= 0
##$BC_mod= 2
##$BYTORDP= 0
##$COROFFS= 0
##$CY= -3
##$DATMOD= 1
##$DC= 0
##$DFILT= <>
##$DTYPP= 0
##$F1P= 0
##$F2P= 0
##$FCOR= 1
##$FTSIZE= 16384
##$FT_mod= 6
##$GAMMA= 0
##$GB= 0
##$INTBC= 1
##$INTSCL= 3.241238e-09
##$ISEN= 128
##$LB= 0.25
##$LEV0= 0
##$LPBIN= 0
##$MAXI= 10000
##$MC2= 0
##$MEAN= 0
##$ME_mod= 0
##$MI= 1.114404
##$NCOEF= 0
##$NC_proc= -7
##$NLEV= 6
##$NOISF1= 3.799351
##$NOISF2= 2.8
##$NSP= 0
##$NTH_PI= 0
##$NZP= 0
##$OFFSET= 15.48025
##$PC= 1
##$PHC0= -467.2267
##$PHC1= 15.39222
##$PH_mod= 1
##$PKNL= yes
##$PPARMOD= 0
##$PSCAL= 0
##$PSIGN= 0
##$REVERSE= no
##$SF= 200.130008295112
##$SI= 16384
##$SIGF1= 3
##$SIGF2= 2
##$SINO= 0.751879
##$SIOLD= 32768
##$SREGLST= <19F.Aceton>
##$SSB= 0
##$STSI= 16384
##$STSR= 0
##$SW_p= 3612.71676300578
##$SYMM= 0
##$S_DEV= 0
##$TDeff= 16384
##$TDoff= 0
##$TI= <>
##$TILT= no
##$TM1= 0
##$TM2= 0
##$TOPLEV= 0
##$USERP1= <user>
##$USERP2= <user>
##$USERP3= <user>
##$USERP4= <user>
##$USERP5= <user>
##$WDW= 1
##$XDIM= 16384
##$YMAX_p= 361977935
##$YMIN_p= -635306
$$ End of Bruker specific parameters
$$ ---------------------------------
##NTUPLES= NMR SPECTRUM
##VAR_NAME=  FREQUENCY,     SPECTRUM/REAL,   SPECTRUM/IMAG
##SYMBOL=    X,             R,               I
##VAR_TYPE=  INDEPENDENT,   DEPENDENT,       DEPENDENT
##VAR_FORM=  AFFN,          ASDF,            ASDF
##VAR_DIM=   16384,         16384,           16384
##UNITS=     HZ,            ARBITRARY UNITS, ARBITRARY UNITS
##FACTOR=    0.220516191357247, 1,           1
##FIRST=     3098.06263267333, 0,            0
##LAST=      -514.654130332446, 0,           0
##MIN=       -514.654130332446, -635306,     0
##MAX=       3098.06263267333, 361977935,    0
$$ Real data points
##PAGE= N=1
##DATA TABLE= (X++(R..R)), XYDATA
$$ [...]
9922E7297j6511J55961Q1597j37538q4066L3214J37430j75548R4251O3098P8444
$$ 57297 40786 196747 278344 140806 56740 89954 227384 51836 146087 209185 287629
9911B87629k17620J11041n228j10624J24288j05973L7262n2472m6661K30991J9541
$$ 287629 70009 181050 175822 65198 189486 83513 120775 68303 21642 252633 272174
9900B72174O0253N0171J06376j36030l83535M7994J16207l0101o6589p1274J08975
$$ 272174 332427 382598 488974 352944 -30591 17403 133610 103509 36920 -34354 74621
9889G4621p5706O6774K74689J1075M3826n8180k33078k01298K6286J25712J34710
$$ 74621 -1085 65689 340378 351453 395279 337099 104021 -97277 -70991 54721 189431
9878A89431o0281j883R9957M2645r6836p2719J43593K18252j36397N4558m0960
$$ 189431 129150 127267 227224 269869 173033 100314 243907 462159 325762 380320 339360
9867C39360K1100N2216J13584k71321L2529o855J62035O9832L8420p1101K0454
$$ 339360 360460 412676 526260 254939 287468 280613 442648 512480 550900 479799 500253
9856E00253K0269j3556j63581O986J82292k73464o2698k14142J64746J10835q2653
$$ 500253 520522 506966 343385 350371 532663 259199 196501 -17641 147105 257940 175287
9845A75287J29216J98330N1037k40796k24713J43733J74625l7739n8054o7980
$$ 175287 304503 502833 553870 313074 88361 232094 406719 368980 310926 242946
9835B42946O3241j67934l2035j70831J90348J38707j00877k6006J76814J15301
$$ 242946 306187 138253 106218 -64613 125735 264442 163565 137559 314373 429674
9825D29674M7505J00381k66198j7760j65432r4380R5499L20659n7796N2132Q9289
$$ 429674 477179 577560 311362 293602 128170 33790 129289 449948 392152 444284 533573
9814E33573J47058j92308q9560J80679k63012r4510M5631l8235R1201J70964j00084
$$ 533573 680631 488323 398763 579442 316430 221920 267551 229316 320517 491481 391397
9803C91397k8284N2286L9459J07423j47158k08416l2150K2036j42509r0481K37082
$$ 391397 363113 415399 454858 562281 415123 206707 174557 196593 54084 -36397 200685
9792B00685J25508j32915J03625J29737M1151K5526k0248j70104j40369J03225
$$ 200685 326193 193278 296903 426640 467791 493317 473069 302965 162596 265821
9782B65821p5388r8777K01623L1039l66849J5269k212P0744J55469J2483k53593
$$ 265821 190433 91656 293279 324318 -42531 -27262 -29474 41270 196739 209222 -44371
9771d4371r49L73784q8943j64554N9649r4419J64698K13526r9712N0208M4573
$$ -44371 -45320 328464 239521 74967 134616 40197 204895 418421 318709 368917 413490
9760D13490J9732j32360Q300L2705q2627j51531K07884r2004M2415k52695J34417
$$ 413490 433222 300862 309162 341867 259240 107709 315593 223589 266004 13309 147726
9749A47726L12290j54309J1281j3219j63245J00909M9523Q8516J63070q2667o2474
$$ 147726 460016 305707 316988 303769 140524 241433 290956 379472 542542 459875 397401
9738C97401j21766O7918J68716l3901j54152L9885P7157j53231l0767k6869j394
$$ 397401 275635 343553 512269 478368 324216 364101 441258 288027 257260 230391 228997
9727B28997J2345J96211r6779m938j06591J40076R5691q4205p6701m2548k6947
$$ 228997 241342 437553 340774 335836 229245 369321 465012 380807 304106 261558 234611
9716B34611J00145K25797j52602q8574R2315J27396j76876q1531K09436R9226
$$ 234611 334756 560553 407951 319377 411692 539088 362212 280681 490117 589343
9706E89343j2200j3860k9616O1501k4533k18541n5734M88956j17237l21734o9636
$$ 589343 577143 563283 533667 595168 570635 352094 296360 785316 668079 346345 276709
9695B76709j3562M14990K97768j18753p7967k23258P2813m1668j90204LN6240
$$ 276709 263147 678137 975905 857152 779185 555927 628740 587072 396868 396871 453111
9684D53111j6298m0566K6800K00504J05082k28600k173L35768k05001j85448P4413
$$ 453111 436813 396247 423047 623551 728633 500033 497860 833628 628627 443179 517592
9673E17592k5365L2368j27678k74719J53009J41503O6374J14165J26613j14259
$$ 517592 492227 524595 396917 122198 275207 416710 483084 597249 723862 609603
9663F09603J48074R4916k0738j93694q6745j62921j49227J52331J72975l8502
$$ 609603 757677 852593 831855 638161 551416 388495 239268 391599 564574 526072
9653E26072J72689j8631p5677J36154q5135j66523J845l7156j16642K14793l7417
$$ 526072 698761 680130 604453 740607 655472 488949 490794 453638 336996 551789 514372
9642E14372K42855K94825M8887l54093k68550N18871L7454j57339j79929k11924
$$ 514372 757227 1052052 1100939 746846 478296 997167 1034621 877282 697353 485429
9632D85429J32530m0165Q3616K4038m3034L07986k93830p7524J73700J4852K749
$$ 485429 617959 577794 661410 685448 642414 950400 656570 579046 752746 767598 770347
9621G70347j46162j23038o0706J82918J22287J13092j12380j32923k58227K24108
$$ 770347 624185 501147 440441 623359 745646 858738 746358 613435 355208 579316
9611E79316J28198j24760J23563K32430J27691j55321n7550K3144J31872l35369
$$ 579316 707514 582754 706317 938747 1066438 911117 853567 876711 1008583 673214
9601F73214k1986N5830J384J15525k26258O536k44375L05112K03459J68547k13197
$$ 673214 651228 707058 708442 823967 597709 604245 359870 664982 868441 1036988 823791
9590H23791J56703K49530r4116k02338K9517m0342K35399M3424k95082K66631
$$ 823791 980494 1230024 1135908 933570 963087 922745 1158144 1201568 906486 1173117
9580A173117j38762p2712P3168J7394k06713l5512R7945q4151p4802k53085n4877
$$ 1173117 1034355 961643 1034811 1052205 845492 809980 907925 823774 748972 495887 441010
9569D41010K18289k30268P8581K86805q523L7203Q5946j25777j01082K88419K03815
$$ 441010 659299 429031 507612 794417 785894 823097 909043 783266 682184 970603 1174418
9558A174418j28139L6381q0983o0783Q9531J22128R9613l0518k13823k09282k01421
$$ 1174418 1046279 1082660 1001677 940894 1030425 1152553 1252166 1221648 1007825 798543 597122
9547E97122N9135J785k02245K85831K40531J71544n55j18600k47114j41102j75057
$$ 597122 656257 658042 455797 741628 982159 1153703 1153148 1034548 787434 646332 471275
9536D71275L442N54933j12281k09009L71578l290k08572j23317J67947J27076
$$ 471275 474717 1029650 917369 708360 1079938 1076648 868076 744759 912706 1039782
9526A039782j45136j74775r38R0247r8249k8098J11645L1603l413K38677R466
$$ 1039782 894646 719871 718933 809180 710931 682833 794478 826081 822668 1061345 1070811
9515A070811j60583j93853j83312J37638j1702L0070P3135J43492J2698o2901
$$ 1070811 910228 716375 533063 670701 658999 689069 762204 905696 918394 855493
9505H55493l38318m3104L37331J57537K2856M5621M7356j41919k98600R9294P0489
$$ 855493 517175 474071 811402 968939 991795 1037416 1084772 942853 644253 743547 814036
9494H14036j41833O6623J20588M9067k22317L955N7836J34908j93480J95306q3756
$$ 814036 672203 738826 859414 908481 686164 690119 747955 882863 689383 884689 800933
9483H00933j98900K51298J47849j25249j36315q0406J55027L21545j25292n0196
$$ 800933 602033 853331 1001180 875931 739616 659210 814237 1135782 1010490 960294
9473I60294m9723j12149n4509J72979L37635k09080M2870P858J1056k45306N9566
$$ 960294 910571 798422 743913 916892 1254527 1045447 1088317 1096175 1107231 861925 921491
9462I21491K99540R2460k0869q8624N1276l69700P5880k19312J51400J89676k7529
$$ 921491 1221031 1313491 1292622 1203998 1255274 885574 961454 742142 893542 1083218 1055689
9451A055689J98248k10883k07913l7873K51260J46349j31098O0618j32292n3660
$$ 1055689 1253937 1043054 835141 797268 1048528 1194877 1063779 1124397 992105 938445
9441I38445L8321j38070J18376J15500j66282q722M70901j4850j8459j95252J3291
$$ 938445 976766 838696 957072 1072572 906290 897568 1368469 1353619 1335160 1139908 1153199
9430A153199j25303j30367J31801p5261m5536k3997L457J989K05757J34169K26846
$$ 1153199 1027896 897529 1029330 954069 908533 884536 887993 889982 1095739 1229908 1456754
9419A456754q0350M8202k24416r0357J32853M2092R6071J63470N2588O3124k44318
$$ 1456754 1376404 1424606 1200190 1109833 1242686 1284778 1380849 1544319 1596907 1660031 1415713
9408A415713J68215M03637m2570j02553k06802k7082m8265R7712K88463J03224
$$ 1415713 1583928 1987565 1944995 1842442 1635640 1608558 1560293 1658005 1946468 2049692
9398B049692J39765K71784J36696p6900l0587m8275m09111j21295k6817L7129
$$ 2049692 2189457 2461241 2597937 2521037 2490450 2442175 2033064 1911769 1884952 1922081
9388A922081J65044m9006j18666N7168k30017k46557j27317k646J29643l7761
$$ 1922081 2087125 2038119 1919453 1976621 1746604 1500047 1372730 1370084 1499727 1461966
9378A461966N2498R051J93423m5661j32545J53645L1837k26705L3211M70712j195
$$ 1461966 1514464 1523515 1716938 1671277 1538732 1692377 1724214 1497509 1530720 2001432 2000237
9367B000237j68665j70879L19914j81699L7908J62543J3147K9412J75292J20364
$$ 2000237 1831572 1660693 1980607 1798908 1836816 1999359 2012506 2041918 2217210 2337574
9357B337574J29869k4950k0840J72630m1036M6925k57039L01286L34987m052j23744
$$ 2337574 2467443 2442493 2421653 2594283 2553247 2600172 2343133 2644419 2979406 2975354 2851610
9346B851610R7239N4984k6914k60949j07622j15592m4339J87319M5987M3811J30578
$$ 2851610 2948849 3003833 2976919 2715970 2608348 2492756 2448417 2635736 2681723 2725534 2856112
9335B856112K83882K91841j31495J3162J27319j18882Q9507Q1914l08684M3888
$$ 2856112 3139994 3431835 3300340 3313502 3440821 3321939 3411446 3493360 3184676 3228564
9325C228564k2295q8105k3780J1140J1996j03718J31453J0157j62533n9667J16932
$$ 3228564 3206269 3118164 3094384 3105524 3117520 3013802 3145255 3155412 2992879 2933212 3050144
9314C050144k466K46640K34395R8558N224k6181L69482k08695k61665J93911o1525
$$ 3050144 3047678 3294318 3528713 3627271 3632495 3606314 3975796 3767101 3505436 3699347 3637822
9303C637822j22042j82822L7230j19283J69673p4814K09592K30706J2318M7221
$$ 3637822 3515780 3332958 3370188 3250905 3420578 3345764 3555356 3786062 3798380 3845601
9293C845601q4075J09624j58660J76249L9426j87712J19296j06779m02764J10177
$$ 3845601 3761526 3871150 3712490 3888739 3928165 3740453 3859749 3752970 3350206 3460383
9283C460383J20070q6538j34961j17620m1070j19139K66387q1918K7761Q9019
$$ 3460383 3580453 3493915 3358954 3241334 3200264 3081125 3347512 3265594 3293355 3382374
9273C382374k94304J52514j49700l4369R3494M6896J60997k02455K5583J80584
$$ 3382374 3088070 3240584 3090884 3056515 3150009 3196905 3357902 3155447 3181030 3361614
9263C361614k60217M2135p7391n7189j68038J14653j42229N1124M1153o1620k12958
$$ 3361614 3101397 3143532 3066141 3008952 2840914 2955567 2813338 2864462 2905615 2843995 2631037
9252B631037J84697K53535l40183p2904K49603K2805p4382l7938j6374J57496
$$ 2631037 2815734 3069269 2729086 2656182 2905785 2928590 2854208 2816270 2799896 2957392
9242B957392p8344j60516J28888O1914k34338O3771L0855M26921l6820l0782J6764
$$ 2957392 2879048 2718532 2847420 2909334 2674996 2738767 2769622 3196543 3159723 3128941 3145705
9231C145705k42099J79988J702k34109Q1784k22248r079J04642J45564K06435
$$ 3145705 2903606 3083594 3085296 2851187 2932971 2710723 2701644 2806286 2951850 3158285
9221C158285n5603l9360J41039p9624j21610k40686K44716K35295j46741J39070
$$ 3158285 3102682 3063322 3204361 3124737 3003127 2762441 3007157 3242452 3095711 3234781
9211C234781J97640k05930J08052j35617O0660n7347J23835K07954r1375q8771
$$ 3234781 3432421 3226491 3334543 3198926 3259586 3202239 3326074 3534028 3442653 3353882
9201C353882l83536o2044K72919L01444M5418J8056j30162K36645k6556Q3852
$$ 3353882 2970346 2908302 3181221 3482665 3528083 3546139 3415977 3652622 3626066 3709918
9191C709918P8512K03095k01033J0104K6428J56605J47971K9457j6162j90836
$$ 3709918 3788430 3991525 3790492 3800596 3827024 3983629 4131600 4161057 4144895 3954059
9181C954059O7657k34425J60143J32472J39453J49247J43138N45J67619M0229
$$ 3954059 4021716 3787291 3947434 4079906 4219359 4368606 4511744 4512289 4679908 4720137
9171D720137N0348j67614J09911K21886L6159J82719l5128r0998l236K06600j15400
$$ 4720137 4770485 4602871 4712782 4934668 4970827 5153546 5118418 5027420 5024184 5230784 5115384
9160E115384k32818R5895K87240P3668p2124K96576R440J56552J73711O7761K23350
$$ 5115384 4882566 4978461 5265701 5339369 5267245 5563821 5573261 5729813 5903524 5971285 6194635
9149F194635L09285L13707J46141K31996K55879n9434J82085M64972M44199L44507
$$ 6194635 6503920 6817627 6963768 7195764 7451643 7392209 7574294 8039266 8483465 8827972
9139H827972L45641M08722O3273k0539P0882k83391k26498n55721m65693k23811
$$ 8827972 9173613 9582335 9645608 9625069 9695951 9412560 9186062 8630341 8164648 7940837
9129G940837o1288j989l00900o931k06006j10761j59986J17625K084l36032k40254
$$ 7940837 7879549 7877560 7576660 7569729 7363723 7252962 7092976 7210601 7212685 6876653 6636399
9118F636399R7589k25770l1829L9959J86873J49487K5545J47680J69353n3645
$$ 6636399 6733988 6508218 6476389 6516348 6703221 6852708 6878253 7025933 7195286 7141641
9108G141641J59711O732J55893J8935J69109K37263J33280J09676M0098m85793
$$ 7141641 7301352 7308084 7463977 7482912 7652021 7889284 8022564 8132240 8172338 7686545
9098G686545j78043J2235J5433J84022N6867j94069j25113m3577L1696N7870j02125
$$ 7686545 7508502 7520737 7536170 7720192 7777059 7582990 7457877 7414300 7445996 7503866 7401741
9087G401741J53223O1785J65228j45003m5712k49520j56663j28389k6190N5626
$$ 7401741 7554964 7616749 7781977 7636974 7591262 7341742 7185079 7056690 7030500 7086126
9077G086126m686j18923R7602K05273J03746j52721k2038J25459o2250m9613R5602
$$ 7086126 7081440 6962517 7060119 7265392 7369138 7216417 7194379 7319838 7257588 7207975 7303577
9066G303577K489j24895M05915J87463P003j90769J77392K37853j75752M6726
$$ 7303577 7306066 7181171 7587086 7774549 7781552 7590783 7768175 8006028 7830276 7877002
9056G877002r8907P4012O0616J48123J8329K39376L76615J07896K82542L12084
$$ 7877002 7778095 7852107 7912723 8060846 8079175 8318551 8695166 8803062 9085604 9397688
9046I397688n6520O2800K30895K87594k5045K30512L20456M08819O6710p3515
$$ 9397688 9341168 9403968 9634863 9922457 9897412 10127924 10448380 10857199 10923909 10850394
9036A0850394O67639N43024M03722M58937M51716N09735N30657Q05425O67444
$$ 10850394 11518033 12061057 12464779 12923716 13375432 13885167 14415824 15221249 15888693
9027A5888693M22765M18172K15465O0811j8890k65726m26345j30110k23172J80592
$$ 15888693 16311458 16729630 16945095 17005906 16987016 16721290 16294945 16164835 15941663 16122255
9017A6122255R4072K9418M00807J55060L27117J74973L70642N18179L62013M44956
$$ 16122255 16216327 16245745 16646552 16801612 17128729 17303702 17674344 18192523 18554536 18999492
9007A8999492O10314N94898N18397L08655L2240J82254k97048l30909l1940l63019
$$ 18999492 19609806 20204704 20723101 21031756 21063996 21246250 20949202 20618293 20586353 20223334
8997B0223334j80295J67048p8543K54186K99208M59309O98902L34960M08927K43205
$$ 20223334 20043039 20210087 20131544 20385730 20684938 21144247 21843149 22178109 22587036 22830241
8987B2830241o521j37340m0137k70484n08334m48945j9619k45920k825k13287
$$ 22830241 22823720 22686380 22646243 22375759 21867425 21418480 21398861 21152941 21150116 20936829
8977B0936829J76007L66265K40807P33518R90227O69969R23487Q63993Q27766
$$ 20936829 21112836 21479101 21719908 22453426 23443653 24113622 25037109 25901102 26728868
8968B6728868J031627N59773O27466L20453O70518L59359M84411M52752Q21521
$$ 26728868 27760495 28320268 28947734 29268187 29938705 30298064 30782475 31235227 32056748
8959C2056748J088675J259090Q17310J66646p7347K82022L02253M42527M92881
$$ 32056748 33145423 34404513 35221823 35388469 35311122 35593144 35895397 36337924 36830805
8950C6830805Q32111J060096J011957J353901J737829J595988J712661K270952
$$ 36830805 37662916 38723012 39734969 41088870 42826699 44422687 46135348 48406300
8942D8406300K217977K202205J952472K719828L061962L067146L560426M356201
$$ 48406300 50624277 52826482 54778954 57498782 60560744 63627890 67188316 71544517
8934G1544517N455899O388721O706224Q080409R733464J2469188J7277024K0893754
$$ 71544517 77000416 83389137 90095361 98175770 107909234 120378422 137655446 158549200
8926A58549200K3307085K7813662K3826062R392683p970250k2468445k9521581
$$ 158549200 181856285 209669947 233496009 242888692 234918442 212449997 182928416
8919A82928416k7916062k0539218j4796104j0950254q332239q915800j0022191
$$ 182928416 155012354 134473136 119677032 108726778 100394539 91478739 81456548
8912H1456548p708849n771119m669576l880809k847948k408976k126083j646773
$$ 81456548 73747699 67976580 63307004 59426195 56578247 54169271 52043188 50396415
8904E0396415j287882r73516r36690p04996k05540k28763l23686n67448o63469
$$ 50396415 49108533 48135017 47198327 46493331 46287791 46059028 45735342 45167894 44504425
8895D4504425n27566p42983j003043k77682j5082j00387o283L03270N32310O12214
$$ 44504425 43976859 43233876 42230833 41953151 41938069 41837682 41831399 42134669 42666979 43279193
8885D3279193O67846M60838M26162N28015L91900M05423K76781M59318L49028
$$ 43279193 43947039 44407877 44834039 45362054 45753954 46159377 46436158 46895476 47244504
8876D7244504J58336J41940l17351n8492r5025p1223J97550J33584M64947L94606
$$ 47244504 47402840 47544780 47227429 47168937 47073912 47002689 47200239 47333823 47798770 48193376
8866D8193376K91946R95893R38916J286925J338783J389584J786315J632097J875246
$$ 48193376 48485322 49481215 50420131 51707056 53045839 54435423 56221738 57853835 59729081
8857E9729081K059373J845622K012646K471467L533014L563585M029786L714287
$$ 59729081 61788454 63634076 65646722 68118189 71651203 75214788 79244574 82958861
8849H2958861K519103P41672j202759k717373l512835l553713k987851k223404
$$ 82958861 85477964 86219636 85016877 82299504 78786669 75232956 72245105 70021701
8841G0021701j650602j203904p28173J58064M74653J100261J967838K774545L580805
$$ 70021701 68371099 67167195 66439022 66597086 67071739 68172000 70139838 72914383 76495188
8832G6495188M171363M111201L421280J953549j98858k334178l596163m002686
$$ 76495188 80666551 84777752 88199032 90152581 89953723 87619545 84023382 80020696
8824H0020696l500312k579186j274087o78335m68939L40469P99450J246270K044279
$$ 80020696 76520384 73941198 72667111 71988776 71519837 71860306 72659756 73906026 75950305
8815G5950305K718375L582367M192024M836775N418130M998400L149146P96711
$$ 75950305 78668680 82251047 86443071 91279846 96697976 101696376 104845522 105642233
8807A05642233j674797l685769m240672m288495l964398l089743j997495j072076
$$ 105642233 103967436 100281667 96040995 91752500 87788102 84698359 82700864 81628788
8799H1628788n26538k6864P50286J756481K978822M079528M907937N077905M766541
$$ 81628788 81102250 81075386 81825672 83582153 86560975 90640503 95548440 100626345 105392886
8790A05392886L648463J826143m83876k793510l807049l991292l839879k610133
$$ 105392886 109041349 110867492 110383616 107590106 103783057 99791765 95951886 93341753
8782I3341753j635916j364718o59838O3944P39044J285416K068662L478751M268668
$$ 93341753 91705837 90341119 89681281 89745225 90484269 91769685 93838347 97317098 101585766
8773A01585766M822206M492242L421298J726404k05306k463992l079535k483912
$$ 101585766 106407972 110900214 114321512 116047916 115842610 113378618 110299083 107815171
8765A07815171j481800J05364J142932K234582K591544J441213m24368k471641
$$ 107815171 106333371 106438735 107581667 109816249 112407793 113849006 113424638 110952997
8757A10952997l797755m674011n062824m262023k891381k145193j634525j458678
$$ 110952997 107155242 102481231 97418407 93156384 90265003 88119810 86485285 85026607
8749H5026607j580602k263188k563384k229574k373417j636226j143523o81091
$$ 85026607 83446005 81182817 78619433 76389859 74016442 72380216 71236693 70555602
8741G0555602n19942L62611L60523O05230Q22564J281859J797056K212260K758919
$$ 70555602 70035660 70398271 70758794 71364024 72186588 73468447 75265503 77477763 80236682
8732H0236682L352724M710467N200023M863842L626680K167788L3858k246578
$$ 80236682 83589406 88299873 93499896 98363738 101990418 104158206 104192064 101945486
8724A01945486k945312k824488j889006n53977P83794J851855J877165J184630
$$ 101945486 99000174 96175686 94286680 93732703 94516497 96368352 98245517 99430147
8716I9430147j93119k356200m278909n476114o110695n811602m691983l872223
$$ 99430147 99237028 96880828 92601919 87125805 81015110 75203508 70511525 66639302
8708F6639302l236913l138409k657086k109859j887178j312129r46870p96379
$$ 66639302 63402389 60263980 57606894 55497035 53609857 52297728 51350858 50554479
8700E0554479l06369n8233M8184k91722o6663j65082l23300j84151p7933K74624
$$ 50554479 50248110 50189877 50238061 49946339 49879676 49714594 49391294 49207143 49129210 49403834
8690D9403834l431N83428O57393N72446O57080J185688J161111J558263J461278
$$ 49403834 49400403 49983831 50641224 51213670 51870750 53056438 54217549 55775812 57237090
8681E7237090J513045J798272K064299K255971K992047L472724L931749M544030
$$ 57237090 58750135 60548407 62612706 64868677 67860724 71333448 75265197 79809227
8673G9809227M977114O202973P459980Q791643J0425863J2246585J4335754J6338819
$$ 79809227 84786341 90989314 98449294 107240937 117666800 129913385 144249139 160587958
8665A60587958J6577359J5463850J2490779O562247j098746q588097j4646451
$$ 160587958 177165317 192629167 205119946 211682193 210583447 201995350 187348899
8658A87348899j7447941j8099016j7119041j4870691j3057086j1126367r651699
$$ 187348899 169900958 151801942 134682901 119812210 106755124 95628757 85977058
8651H5977058q858170p255641o341967n420008m555599l842517l016815k826199
$$ 85977058 77118888 69863247 63521280 58101272 53545673 49703156 46686341 43860142
8643D3860142k238606j453979j824349j767494j050617r09342j030579o05379
$$ 43860142 41621536 40167557 38343208 36575714 35525097 34615755 33585176 32979797
8635C2979797n81823p47915k86241k09711j39514j18655m01796n80307j95535
$$ 32979797 32397974 31650059 31363818 31154107 31014593 30895938 30494142 29913835 29718300
8626B9718300k06374m73284k88477n09576m33146L9094L02168n4686j74280l96837
$$ 29718300 29511926 29038642 28750165 28240589 27807443 27846537 28148705 28094019 27919739 27522902
8616B7522902m15311q07058n22086p58844o66645o91473n40779o14078p13804
$$ 27522902 27107591 26300533 25778447 25019603 24352958 23661485 23120706 22506628 21792824
8607B1792824j79180m82099m3684k38648k55648J34574j31044q8549j70490j30876
$$ 21792824 21613644 21131545 21087861 20849213 20593565 20728139 20597095 20508546 20338056 20207180
8597B0207180K14472R1906K17207N38508K20340j58946N08651L74581O31291L83772
$$ 20207180 20421652 20513558 20730765 21269273 21489613 21330667 21839318 22213899 22845190 23228962
8587B3228962K48950L57862Q41329J94154J074132J024013O76669J026548L28091
$$ 23228962 23477912 23835774 24677103 24871257 25945389 26969402 27646071 28672619 29000710
8578B9000710K45243J19797k43984k49163j34693o659k7748L03010L89963K31198
$$ 29000710 29245953 29365750 29121766 28872603 28737910 28731251 28703503 29006513 29396476 29627674
8568B9627674L04948k9348k95032j01794j46662k95892J4527J52549J77595M79003
$$ 29627674 29932622 29903274 29608242 29506448 29359786 29063894 29078421 29230970 29408565 29887568
8558B9887568J22209O700J3752J83191J74975J50541O30840O08052N53277P00779
$$ 29887568 30009777 30016477 30030229 30213420 30388395 30538936 31169776 31777828 32331105 33031884
8548C3031884R33963J063118J211779J585328J488620J273538J419815J079848
$$ 33031884 33965847 35028965 36240744 37826072 39314692 40588230 42008045 43087893
8540D3087893J296452J926325K534250K786896L743532L833807L525219L216664
$$ 43087893 44384345 46310670 48844920 51631816 55375348 59209155 62734374 65951038
8532F5951038J598429p19j274521j576737p60798m14717j54543O84691J470167
$$ 65951038 67549467 67548748 66274227 64697490 63936692 63521975 63367432 64052123 65522290
8523F5522290R50363O36819m57952j092502k336456k903082k699951k704713j953205
$$ 65522290 66472653 67109472 66651520 65559018 63222562 60319480 57619529 54914816 52961611
8514E2961611j773281j546776j271080j131699j110468r12372l23905r8926K68495
$$ 52961611 51188330 49641554 48370474 47238775 46128307 45215935 44892030 44793104 45061599
8505D5061599M98314Q71017R24548J382620J499550J567050K460942L028187L824567
$$ 45061599 45559913 46430930 47355478 48738098 50237648 51804698 54265640 57293827 61118394
8496F1118394M248609M844734N115867M478124L502214J799316p3435j364827
$$ 61118394 65367003 70211737 75327604 79805728 83307942 85107258 85033823 83668996
8488H3668996k429733k472699j791544n43206O33628J240052J225903M56047n92654
$$ 83668996 81239263 78766564 76975020 76431814 77065442 78305494 79531397 79987444 79394790
8479G9394790k032106l833987m846652n272155n095740m298269l626806l204996
$$ 79394790 77362684 73528697 68682045 63409890 58314150 54015881 50389075 47184079
8471D7184079k922574k505755k622138j693271j296723j231749j015649n60605
$$ 47184079 44261505 41755750 39133612 37440341 36143618 34911869 33896220 33335615
8463C3335615o22853k80264j20118O1706J76215M58897Q24389J026292J450461
$$ 33335615 32712762 32432498 32312380 32374086 32550301 33009198 33833587 34859879 36310340
8454C6310340J702901K211402K221235J752975J66792q44169j596646j758287
$$ 36310340 38013241 40224643 42445878 44198853 44365645 43521476 41924830 40166543
8446D0166543j536177r84643l65566j80786K57111N08191R1153l94409j440111
$$ 40166543 38630366 37645723 37280157 37099371 37356482 37864673 37955826 37561417 36121306
8437C6121306k426021k689171k709639k779128k153430j777500j636890j221154
$$ 36121306 33695285 31006114 28296475 25517347 23363917 21586417 19949527 18728373
8429A8728373j022242j258026j092197p75325n99618n72742m43121k85815p46411
$$ 18728373 17706131 16448105 15355908 14580583 13980965 13408223 12965102 12679287 11932876
8420A1932876n53321o9118k61396o51914l87782l55576j89784k25114k42174k62265
$$ 11932876 11379555 11310437 11049041 10397127 10009345 9653769 9463985 9238871 8996697 8734432
8410H734432m42732k04636L1481J63391l590j03383j24247J56306j44059m82611
$$ 8734432 8291700 8087064 8118545 8281936 8278346 8174963 8050716 8207022 8062963 7580352
8400G580352j55361R7656q0202j61695k26111k13185p9701K41272l16129J89784
$$ 7580352 7424991 7522647 7442445 7280750 7054639 6841454 6761753 7003025 6686896 6876680
8390F876680p7276j74434k80115q4546k41128j04295J69889Q8458m30329j7327
$$ 6876680 6799404 6624970 6344855 6260309 6019181 5914886 6084775 6173233 5742904 5725577
8380E725577K35952j7289J35081m15985r3321K9231j25801p6534k79834j45057
$$ 5725577 5961529 5944240 6079321 5663336 5570015 5599246 5473445 5396911 5117077 4972020
8370D972020R5609K15233L7377K456j18328n8357J59430j63824K37577J68752
$$ 4972020 5067629 5282862 5320239 5322695 5204367 5146010 5305440 5141616 5379193 5547945
8360E547945R5442p5970p8180n9256k21367O8056J9672l13341K24562N1797J85805
$$ 5547945 5643387 5567417 5489237 5429981 5208614 5276670 5296342 4983001 5207563 5259360 5445165
8349E445165J73517j5170R2655k7123j30653l8057P141O8763o9915J27606n0750
$$ 5445165 5618682 5603512 5696167 5669044 5538391 5500334 5507475 5576238 5506323 5633929 5583179
8338E583179q1399J3201k82042j42502J23949j3940o4765k78592K2942Q8441N4329
$$ 5583179 5501780 5514981 5232939 5090437 5214386 5200446 5135681 4857089 4880031 4968472 5022801
8327E022801l6636j39871J4741j69562k00188J54051J31783q2728J65380k8924
$$ 5022801 4986165 4846294 4861035 4691473 4491285 4645336 4777119 4694391 4859771 4830847
8317D830847j36345k5575j95801L8856j3250J79322k00105j81112p5852K33037
$$ 4830847 4694502 4668927 4473126 4511982 4498732 4678054 4477949 4296837 4220985 4454022
8307D454022n4775j00442j8262k25558o1243j8100K85251P5938l8530j43131J08040
$$ 4454022 4399247 4298805 4280543 4054985 3993742 3975642 4260893 4336831 4298301 4155170 4263210
8296D263210k11660p48j12130N4796L03978l22872J3118j3220k05798q3471R5679
$$ 4263210 4051550 4050802 3938672 3993468 4297446 3974574 3987692 3974472 3768674 3685203 3780882
8285C780882k38348N4189K63020J9682J13960j47178Q8048k06172j47674J38651
$$ 3780882 3542534 3596723 3859743 3879425 3993385 3846207 3934255 3728083 3580409 3719060
8275C719060o0339J73546j337k78490q0528Q3798j76588k27697J06724K37672
$$ 3719060 3658721 3832267 3830930 3552440 3471912 3555710 3379122 3151425 3258149 3495821
8265C495821J01957r5848J61605L343k6408J32931k0359k19986p8305M4628L12600
$$ 3495821 3597778 3501930 3663535 3666878 3640470 3773401 3753042 3533056 3454751 3499379 3811979
8254C811979J13282m55558J64678M6018j74016J60838n1001j3715J08680K3293
$$ 3811979 3925261 3469703 3634381 3680399 3506383 3667221 3616220 3602505 3711185 3734478
8244C734478q7174L22627m7725j49539n7261p6299j29435P639J12247K10649K36212
$$ 3734478 3647304 3969931 3922206 3772667 3715406 3639107 3509672 3517311 3629558 3840207 4076419
8233D076419k1757l55525M2933K58392j2473J78298L7150K20645Q0295J54674
$$ 4076419 4054662 3699137 3742070 4000462 3987989 4166287 4203437 4424082 4504377 4659051
8223D659051n2397J26645M2280j44522J55390q2241M1514K23862M7910j31006
$$ 4659051 4606654 4733299 4775579 4631057 4786447 4704206 4745720 4969582 5017492 4886486
8213D886486J09035m6627n5757j04975O658j9204j14546l5304k95126M3655O6038
$$ 4886486 4995521 4948894 4893137 4788162 4794820 4775616 4661070 4625766 4330640 4374295 4440333
8202D440333n2669k75494L8047K03877j35254l0264k6507J37396k24759O91724
$$ 4440333 4387664 4112170 4150217 4354094 4218840 4188576 4162069 4299465 4074706 4766430
8192D766430J50709r78297L080j33070J59332J01353j3231j23769j16563q7066
$$ 4766430 4917139 3938842 3941922 3808852 3968184 4069537 4056306 3932537 3815974 3728908
8182C728908q8235J21847R0806K3851m6903M7970M7282r7121j44227N4412p1412
$$ 3728908 3640673 3762520 3853326 3877177 3830274 3878244 3925526 3828405 3684178 3738590 3667178
8171C667178j44061J80j04164l6326O0318m7744J43222j95559o3756J105o6094
$$ 3667178 3523117 3523297 3419133 3382807 3443125 3395381 3538603 3343044 3279288 3280393 3214299
8160C214299m7746j61037K8733L09599j99392k32609p9400K16452q9385j79522
$$ 3214299 3166553 3005516 3034249 3343848 3144456 2911847 2832447 3048899 2959514 2779992
8150B779992j8188r1610M3938K18864M4054J5077k43242k15511q0939j74819m660
$$ 2779992 2761804 2670194 2714132 2932996 2977050 2992127 2748885 2533374 2452435 2277616 2272956
8139B272956M1119M94256N2219k26202J910O4603k7623l1566J55892J63421p9468
$$ 2272956 2314075 2808331 2860550 2634348 2636258 2700861 2673238 2641672 2797564 2960985 2881517
8128B881517j42214p0096p5602J1086Q2526J19969j43143j16341K25914p0287
$$ 2881517 2739303 2669207 2593605 2604691 2687217 2807186 2664043 2547702 2773616 2703329
8118B703329o621J62716K20833J11470j52809l01668L3916K87691r6937q2302
$$ 2703329 2696708 2859424 3080257 3191727 3038918 2737250 2771166 3058857 2961920 2879618
8108B879618j4607J48935k50468j05368J78274o5343P3508J06575m801p331J6344
$$ 2879618 2865011 3013946 2763478 2658110 2836384 2771041 2844549 2951124 2946323 2938992 2955336
8097B955336k82402K903Q0031k96904k7352J98900k76934p5990J02794J74090
$$ 2955336 2672934 2675837 2755868 2458964 2431612 2630512 2353578 2277588 2380382 2554472
8087B554472l8644j2492P4669P5356q7811m0999J74203n606J78105K8300j75656
$$ 2554472 2515828 2503336 2578005 2653361 2565550 2524551 2698754 2693148 2871253 2899553 2723897
8076B723897R8358K93722l5393j76094r779R3924K44423k62801j30457m0580Q6562
$$ 2723897 2822255 3115977 3080584 2904490 2894711 2988635 3233058 2970257 2839800 2799220 2885782
8065B885782J20350J77602k60456p0370K43074J7001P9493L36312J83692j56301
$$ 2885782 3006132 3183734 2923278 2852908 3095982 3112983 3192476 3528788 3712480 3556179
8055C556179R6119J70061j27365m3191J82694j35466K11190O2400O2228L67171
$$ 3556179 3652298 3822359 3694994 3651803 3834497 3699031 3910221 3972621 4034849 4402020
8045D402020J51777P1316Q1758K43114J62127K44412K27423K92774L53902M51206
$$ 4402020 4553797 4625113 4706871 4949985 5112112 5356524 5583947 5876721 6230623 6681829
8035F681829M91727N70312O53116R88464J066049J260607J426111J356395J439470
$$ 6681829 7173556 7743868 8396984 9385448 10451497 11712104 13138215 14494610 15934080
8026A5934080J203587O53158K1869n52683j252462j740681j498994j450038j398043
$$ 15934080 17137667 17790825 17812694 17260011 16007549 14266868 12767874 11317836 9919793
8017I919793j181336q69842q71134p03600m26460o15060n27663k06929m21915
$$ 9919793 8738457 7868615 6997481 6293881 5867421 5252361 4724698 4517769 4095854
8008D095854o30400k27512j59341R6668L268k54352j73864k4792k49361M5077
$$ 4095854 3465454 3237942 3078601 3175269 3178537 2924185 2750321 2725529 2476168 2521245
7998B521245K30436j73258K3057j92207j82460l9940q1505J22262j03660J17619
$$ 2521245 2751681 2578423 2601480 2409273 2226813 2186873 2105368 2227630 2123970 2241589
7988B241589k11535l2662J51090J80754l07226j00886j14663L00663j2027j62284
$$ 2241589 2030054 1997392 2148482 2329236 2022010 1921124 1806461 2107124 2095097 1932813
7978A932813o6057l77372K55324J77435j07307O6295r079m1214K039j39563j29374
$$ 1932813 1866756 1489384 1744708 1922143 1814836 1881131 1872052 1830838 1832877 1693314 1563940
7967A563940L80810M2736L0802j90109k92954P7485Q1066j7076j99000m181J22171
$$ 1563940 1944750 1987486 2018288 1828179 1535225 1612710 1693776 1676700 1477700 1473519 1595690
7956A595690n4055j05090j56342l3434n2457J37051J80368m5106j70647J55497
$$ 1595690 1541635 1436545 1280203 1246769 1194312 1331363 1511731 1466625 1295978 1451475
7946A451475Q8238q0986q705j26680j02087R0392j087n0890k64178J25007L05057
$$ 1451475 1539713 1458727 1450022 1323342 1221255 1311647 1310560 1259670 995492 1120499 1425556
7935A425556k06050Q4314o6356l5625P9459Q7302j15672Q5163j16962m0215N1706
$$ 1425556 1219506 1303820 1237464 1201839 1281298 1368600 1252928 1338091 1221129 1180914 1232620
7924A232620N0862J097l08213j01512J75964J8179K6180m081k63364j62476K80201
$$ 1232620 1283482 1284579 976366 874854 1050818 1068997 1095177 1091096 827732 665256 945457
7913I45457K8391J27922J4382j11376m4587p231r7468K8542K1343J81451N2012
$$ 945457 973848 1101770 1116152 1004776 960189 952958 855490 884032 905375 1086826 1138838
7902A138838J7428R0838n1742j36325j27020k28477K15001J84110m8397J12893
$$ 1138838 1156266 1247104 1195362 1059037 932017 703540 918541 1102651 1054254 1167147
7892A167147j29634l4214k9925K25568K69691j86899L1276l3532j44691J44718
$$ 1167147 1037513 1003299 973374 1198942 1468633 1281734 1313010 1279478 1134787 1279505
7882A279505Q9930J8534o3173q2522J65436j16288j61763Q1710J07849p3719P0964
$$ 1279505 1369435 1387969 1324796 1242274 1407710 1291422 1129659 1211369 1319218 1245499 1316463
7871A316463r2947j72595M35274K36125J12895j31040o1449j03197j95766M477
$$ 1316463 1223516 1050921 1486195 1722320 1835215 1704175 1642726 1539529 1343763 1348240
7861A348240l9321R499j19617N45173q3665l218J26541m7369M10236K4999j34059
$$ 1348240 1308919 1318418 1198801 1743974 1660309 1657091 1783632 1736263 2146499 2171498 2037439
7850B037439J74554J5862K3758j47463j7611K22694k35144J72l920J68080N6713
$$ 2037439 2211993 2227855 2251613 2104150 2086539 2309233 2074089 2074261 2070341 2238421 2295134
7839B295134j46517q4713j09836j73055j05000r6561J86905J9132J4324M8084
$$ 2295134 2148617 2063904 1954068 1781013 1676013 1579452 1766357 1785489 1799813 1847897
7829A847897m9101J63067J22880k75360K08437j06727j69637n0834j43813K887
$$ 1847897 1798796 1961863 2084743 1809383 2017820 1911093 1741456 1690622 1546809 1549696
7819A549696J17013J66489j09751J32518Q7389J70549P8066m1817j28896J6586
$$ 1549696 1666709 1833198 1723447 1855965 1943354 2113903 2191969 2150152 2021256 2037842
7809B037842Q6705J75934J36042o2873j26812p6014N6009K81770N9341q14033
$$ 2037842 2124547 2300481 2436523 2373650 2246838 2170824 2226833 2508603 2567944 1753911
7799A753911J3647N05596k53154k87501p2276N3988K3816l2698n7798j72748k0184
$$ 1753911 1767558 2273154 2020000 1732499 1660223 1714211 1738027 1705329 1647531 1474783 1454599
7788A454599m7671J07456J3466l05200J64889k5695m13362j8977J67286K34734
$$ 1454599 1406928 1514384 1527850 1222650 1387539 1361844 948482 929505 1096791 1331525
7778A331525o7591j91740K5950L65089J41242l53926p7945N2351n0398L21452
$$ 1331525 1263934 1072194 1098144 1463233 1604475 1250549 1172604 1224955 1174557 1496009
7768A496009J14589k38726P9600J33960k02336l82834K05863L8175K09424J23335
$$ 1496009 1610598 1371872 1451472 1585432 1383096 1000262 1206125 1244300 1453724 1577059
7758A577059m8719n0962K7684l0637k52312o1960j01178K19569R7793p8090j36880
$$ 1577059 1528340 1477378 1505062 1474425 1222113 1160153 1058975 1278544 1376337 1298247 1161367
7747A161367j15242J81173K83292j3553j11479k74879L79976k43048p2954J05981
$$ 1161367 1046125 1227298 1510590 1497037 1385558 1110679 1490655 1247607 1174653 1280634
7737A280634K63249J4342j62304j22095l4493J8540j11809K13514k55997Q4965
$$ 1280634 1543883 1558225 1395921 1273826 1239333 1257873 1146064 1359578 1103581 1188546
7727A188546r5433j07350L5400N02331N5840k28228Q5264p3174J14836L3996k08886
$$ 1188546 1093113 985763 1021163 1523494 1579334 1351106 1436370 1363196 1478032 1512028 1303142
7716A303142K9083j35140l5742K34488P1883L1516j81608N2370L094n5121j7305
$$ 1303142 1332225 1197085 1161343 1395831 1467714 1499230 1317622 1369992 1373086 1317965 1300660
7705A300660J6792q6577j86967K10040K56616j80600P4720J74888j04356j9134
$$ 1300660 1317452 1230875 1043908 1253948 1510564 1329964 1404684 1579572 1475216 1456082
7695A456082j81069m7564J80619j85958r9999P7145K07540j63403K16254N7379
$$ 1456082 1275013 1227449 1408068 1222110 1122111 1199256 1406796 1243393 1459647 1517026
7685A517026j87899L02371J7916m6049j78489J26446j42064k44916J80613K03212
$$ 1517026 1329127 1631498 1649414 1603365 1424876 1551322 1409258 1164342 1344955 1548167
7675A548167o1910j66531k77720K24955o869j44746J42549K73566j88596J07720
$$ 1548167 1486257 1319726 1042006 1266961 1260092 1115346 1257895 1531461 1342865 1450585
7665A450585R4965k40627J00117l1464O2413J72159o387n6035J18509J02797m6178
$$ 1450585 1545550 1304923 1405040 1373576 1435989 1608148 1601761 1545726 1664235 1767032 1720854
7654A720854j79597j602j7014o0549R6286L1184j13337N8224J91491j57956N7346
$$ 1720854 1541257 1539655 1522641 1462092 1558378 1589562 1476225 1534449 1725940 1567984 1625330
7643A625330K55935o7483K5555k8078j18956l8037m2414K00807n4017j10654k5150
$$ 1625330 1881265 1813782 1839337 1811259 1692303 1654266 1611852 1812659 1758642 1647988 1622838
7632A622838k3319j39095K22874K78075j9701k38089J07670Q5259Q1247j7027
$$ 1622838 1599519 1460424 1683298 1961373 1941672 1703583 1811253 1896512 1977759 1960732
7622A960732J92387K12011q3568j65732J38275J70657K79110K4967l9254M6654
$$ 1960732 2153119 2365130 2281562 2115830 2254105 2424762 2703872 2728839 2689585 2736239
7612B736239j83216J9561k4053k04029P8281J816j40125M66855k12747l36991
$$ 2736239 2553023 2572584 2548531 2344502 2422783 2424599 2284474 2751329 2538582 2201591
7602B201591j8515K01682o6713j01066K02058q5192j56597M12102o49J03614Q9777
$$ 2201591 2183076 2384758 2318045 2216979 2419037 2333845 2177248 2589350 2588701 2692315 2782092
7591B782092j26294j94302O3433J76098k86449j08372M05580K01121j01188o3035
$$ 2782092 2655798 2461496 2524929 2701027 2414578 2306206 2711786 2912907 2811719 2748684
7581B748684p5337K07132J07921l07873O9195Q9193R9314O6103j28791J7518K19649
$$ 2748684 2673347 2880479 2988400 2680527 2749722 2838915 2938229 3004332 2875541 2893059 3112708
7570C112708J51245L85140K97973j99770l06490J49952L12303q717j72372M8884
$$ 3112708 3263953 3649093 3947066 3747296 3440806 3590758 3903061 3894344 3721972 3770856
7560C770856J13524J22269L87154R7430L63080O20187l62L37832N09982O36661
$$ 3770856 3884380 4006649 4393803 4491233 4854313 5474500 5474138 5811970 6321952 6958613
7550F958613N09212P56174M18242K88861J33306m64118l69608l55565p53066o90171
$$ 6958613 7467825 8223999 8642241 8931102 9064408 8600290 8230682 7875117 7122051 6431880
7540F431880j53472m47639m84152m54132l39722l46538m06899k33466j76953l16082
$$ 6431880 6278408 5830769 5346617 4892485 4552763 4206225 3799326 3565860 3388907 3072825
7530C072825o0833J43384r5108j15606J48912k29832q0407Q1006r6010n33066
$$ 3072825 3011992 3155376 3060268 2944662 3093574 2863742 2783335 2864341 2768331 2235265
7520B235265M8812J60397P5080J26120m65755j48595r197k14588j67116j21002
$$ 2235265 2284077 2444474 2519554 2645674 2179919 2031324 2022127 1807539 1640423 1519421
7510A519421L60571J52161l6984j28519j13178J1009q4495o612P0985l03172K38528
$$ 1519421 1879992 2032153 1995169 1866650 1753472 1764481 1679986 1673374 1744359 1441187 1679715
7499A679715K63539k32068j02081j88385j40321J66889p177r7748J31495K8458
$$ 1679715 1943254 1711186 1609105 1420720 1280399 1447288 1440111 1342363 1473858 1502316
7489A502316Q8747n5785J84583j99331K53028J21011j08098J19832J6641k25915
$$ 1502316 1591063 1535278 1719861 1520530 1773558 1894569 1786471 1906303 1922944 1697029
7479A697029j39121j99605O2813j80260J29761K19940O5695M08545j4606O7522
$$ 1697029 1557908 1358303 1421116 1240856 1370617 1590557 1656252 2064797 2050191 2117713
7469B117713r3310k29180J27899J4134j29184L44306m3313k17319J6321o7093
$$ 2117713 2024403 1795223 1923122 1937256 1808072 2152378 2109065 1891746 1908067 1840974
7459A840974P7386M33655N2716q8214J72759J1680K44091N2361k3307m4894J84372
$$ 1840974 1918360 2352015 2404731 2316517 2489276 2500956 2745047 2797408 2774101 2729207 2913579
7448B913579k7095p3176K656k61572K73624l5047k13610j52470M4641J81019O0818
$$ 2913579 2886484 2813308 2815964 2554392 2828016 2792969 2579359 2426889 2471530 2652549 2713367
7437B713367k57780J05258j3702J63019m4598L0864o7076J35940l6038J73283
$$ 2713367 2455587 2560845 2547143 2710162 2665564 2696428 2629352 2765292 2729254 2902537
7427B902537J56460N7478K91290m115q5495R2402m6650J29434M09802J20226k29367
$$ 2902537 3058997 3116475 3407765 3403650 3318155 3410557 3363907 3493341 3903143 4023369 3794002
7416C794002K24270M4300m0213K83494k06855J21847l86007l85781K74321L3831
$$ 3794002 4018272 4062572 4022359 4305853 4098998 4220845 3834838 3449057 3723378 3757209
7406C757209l75472l5117M8236M1265k26468k33160j04134r9309k8041L1378J76188
$$ 3757209 3381737 3346620 3394856 3436121 3209653 2976493 2872359 2773050 2745009 2776387 2952575
7395B952575K66867k43726l18067O6016p2702k44772J37945R1055j22462K5275
$$ 2952575 3219442 2975716 2657649 2723665 2650963 2406191 2544136 2635191 2512729 2538004
7385B538004J04586L5359J8179j32767o9428K5734N4570m4894J38415K3343K04847
$$ 2538004 2642590 2677949 2696128 2563361 2493933 2519667 2574237 2529343 2667758 2691101 2895948
7374B895948k167K6259P2997M504j018o7486M8560J08494J86354K37502r9434
$$ 2895948 2893781 2920040 2993037 2997541 2996523 2929037 2977597 3086091 3272445 3509947 3410513
7363C410513p2784j05745l7542N9377R2419Q2389j88514m02941n008J17528K48573
$$ 3410513 3337729 3231984 3194442 3253819 3346238 3428627 3240113 2837172 2832164 2949692 3198265
7352C198265J22180l94574k4804j11667Q5375k79791k24420J50339J5009j16945
$$ 3198265 3320445 2925871 2901067 2789400 2874775 2594984 2370564 2520903 2535912 2418967
7342B418967J27855J47j04789K60830j03880M4051r0529M7376K61467k0218o2016
$$ 2418967 2546822 2546969 2442180 2703010 2599130 2643181 2552652 2600028 2861495 2841277 2779261
7331B779261J16811l4539l23703M6943K1299k7886K02123j44491k54204J50082
$$ 2779261 2896072 2861533 2537830 2584773 2606072 2578186 2780309 2635818 2381614 2531696
7321B531696L38427J17053j98234r89r6251k6061J17941J07019l7845K8834k13341
$$ 2531696 2870123 2987176 2788942 2787953 2691702 2665641 2783582 2890601 2852756 2881590 2668249
7310B668249K91951k7739R0559j1952k65701k38064J60469N4491P3440q0474l9514
$$ 2668249 2960200 2932461 3023020 3011068 2745367 2507303 2667772 2722263 2795703 2715229 2675715
7299B675715K07498M0831m4390o5999j8051Q6501K15266J4748M02992j30402k43635
$$ 2675715 2883213 2924044 2879654 2813655 2795604 2882105 3097371 3112119 3515111 3384709 3141074
7288C141074N1121J39136M1145J88721J19162k0523L32105J97503j8657j24448
$$ 3141074 3192195 3331331 3372476 3561197 3680359 3659836 3991941 4189444 4170787 4046339
7278D046339k93518J50284O009J50245K2528M6061n9667j63121j20491N7672l7513
$$ 4046339 3752821 3903105 3909114 4059359 4081887 4127948 4068281 3905160 3784669 3842341 3804828
7267C804828L2279J12139J6097O0727P6866Q8234J53048J23004j07951n4552J41366
$$ 3804828 3837107 3949246 3965343 4026070 4102936 4191170 4344218 4467222 4359271 4304719 4446085
7256D446085J81920J8512o8258P4321L60842L22733K42745m85m0503K5185L54083
$$ 4446085 4628005 4646517 4578259 4652580 5013422 5336155 5578900 5578415 5537912 5563097 5917180
7245E917180l8729k15321n1457K67361J89671k06151l10827j43694J41180L21636
$$ 5917180 5878451 5663130 5611673 5879034 6068705 5862554 5551727 5408033 5549213 5870849
7235E870849K40560l90297K40303l95796J9323K56353j17029K56048M6268J7363
$$ 5870849 6111409 5721112 5961415 5565619 5584942 5841295 5724266 5980314 6026582 6043945
7225F043945K77319J86318k33365N1656K70974M5697q3260J31373n5579J26965
$$ 6043945 6321264 6507582 6274217 6325873 6596847 6642544 6559284 6690657 6635078 6762043
7215F762043k04875K56457J09710m6060J54279l3552J96645l8275J63747q732
$$ 6762043 6557168 6813625 6923335 6877275 7031554 6998002 7194647 7156372 7320119 7311387
7205G311387J53269L65171P1446j51126P1814L84788N12681J64774r636L24623
$$ 7311387 7464656 7829827 7901273 7750147 7821961 8206749 8719430 8884204 8874568 9199191
7195I199191L73879J28717J66644j36580N22801K45837J49186M60723R9276J18358
$$ 9199191 9573070 9701787 9868431 9731851 10254652 10500489 10649675 11110398 11209674 11328032
7185A1328032K90685N41639J18305M76451M09378L44574M69923O72332J99298
$$ 11328032 11618717 12160356 12278661 12755112 13164490 13509064 13978987 14651319 14850617
7176A4850617P57555Q61008P40550O29017P16187P60435R70256Q38092R55533
$$ 14850617 15608172 16469180 17209730 17838747 18554934 19315369 20285625 21123717 22079250
7167B2079250J123910P10778Q94215J048464J247258J070877J061150J121963
$$ 22079250 23203160 23913938 24808153 25856617 27103875 28174752 29235902 30357865
7159C0357865J092392R36598P71771R33784Q37742N90292O55260R54496J033222
$$ 30357865 31450257 32386855 33158626 34092410 34930152 35520444 36175704 37130200 38163422
7150C8163422J094371J400493J678980K145182K060282K380539K873347L625135
$$ 38163422 39257793 40658286 42337266 44482448 46542730 48923269 51796616 55421751
7142E5421751L607193L724248L925690L750770L526024K648326J813632Q08098
$$ 55421751 59028944 62753192 66678882 70429652 73955676 76604002 78417634 79225732
7134G9225732j3139l16242j20690k36073j41304j04330M21590O59530J199424
$$ 79225732 79212593 78896351 78775661 78539588 78398284 78293954 78715544 79375074 80574498
7125H0574498J553536J848354K218014K947065L451124L786304M371810M661503
$$ 80574498 82128034 83976388 86194402 89141467 92592591 96378895 100750705 105412208
7117A05412208N063393N638710O342345P103534Q319023R227876J0621548J2219053
$$ 105412208 110475601 116114311 122456656 129560190 137879213 147107089 157728637 169947690
7109A69947690J4324617J6547514J9242120K1945733K4977168K6240245K5787005
$$ 169947690 184272307 200819821 220061941 242007674 266984842 293225087 319012092
7102C19012092K2018128J4966483N981232n049858j4951492k2418162k6597776
$$ 319012092 341030220 355996703 361977935 356928077 341976585 319558423 292960647
7095B92960647k7253318k5861146k3565565k1218129j8849989j6747947j5264702
$$ 292960647 265707329 239846183 216280618 195062489 176212500 159464553 144199851
7088A44199851j4068126j2222015j0477541r471179p849118p279752o428765n934148
$$ 144199851 130131725 117909710 107432169 97960990 90111872 82832120 76403355 70469207
7080G0469207m700851m047354m090462l719552l240363k662623k392638k388787
$$ 70469207 65768356 61721002 57630540 53910988 50670625 48008002 45615364 43226577
7072D3226577k300245j727896j715566j630329j602259j310812j415252j298422
$$ 43226577 40926332 39198436 37482870 35852541 34250282 32939470 31524218 30225796
7064C0225796j182725r79035j252364j171176q84727p07511r53964n45230o79360
$$ 30225796 29043071 28064036 26811672 25640496 24755769 24048258 23094294 22549064 21869704
7055B1869704m11715n31369m09873k84909p59012n11197k27095n26504l43649
$$ 21869704 21457989 20926620 20516747 20231838 19472826 18961629 18734534 18208030 17864381
7046A7864381l54601q74947l63898j40666m82478j30614m55191n93751k86585
$$ 17864381 17509780 16634833 16270935 16130269 15647791 15517177 15061986 14468235 14181650
7037A4181650l85984l32082l15773j35541k86782k08722m05472l16835Q5832q3237
$$ 14181650 13795666 13463584 13147811 13012270 12725488 12516766 12111294 11794459 11880291 11797054
7027A1797054l73353k19375k75797k56296l80655j7002k9383J04506j8300j63546
$$ 11797054 11423701 11204326 10928529 10672233 10291578 10274576 10245193 10349699 10331399 10167853
7017A0167853j97293l12329l44891K29041Q0483o38752k08545j45196o5188n531
$$ 10167853 9970560 9658231 9313340 9542381 9622864 8984112 8775567 8630371 8565183 8559652
7007H559652N1925r9853n2390j28578j31987r7377j59778l5055k99004Q6672m9043
$$ 8559652 8611577 8511724 8459334 8330756 8198769 8101392 7941614 7906559 7607555 7694227 7645184
6996G645184p2045l37304R7268k042n3152j12674j58191m90422j137q9942j87591
$$ 7645184 7573139 7235835 7333103 7331061 7277909 7165235 7007044 6516622 6515485 6425543 6237952
6985F237952J67310j05882J71436L3474j88773j92862j60414J11250L01830j19028
$$ 6237952 6405262 6299380 6470816 6504290 6315517 6122655 5962241 6073491 6375321 6256293
6975F256293l06466k62148K06803J29622j82075q9514J25177k1746L03850j77892
$$ 6256293 5949827 5687679 5894482 6024104 5842029 5752515 5877692 5855946 6159796 5981904
6965E981904j09885J738n9796p0495l6257L12826M1225k75208q2214J08200j00216
$$ 5981904 5872019 5873757 5813961 5743466 5707209 6020035 6061260 5786052 5703838 5812038 5711822
6954E711822K28605Q1099q4917q3123Q4138q7341o1170O8628j7086j47866J24044
$$ 5711822 5940427 6021526 5936609 5853486 5937624 5850283 5789113 5857741 5840655 5692789 5816833
6943E816833p3938k36017j57689j86897K20235k15468j01001J47566J17561O3738
$$ 5816833 5742895 5506878 5349189 5162292 5382527 5167059 5066058 5213624 5331185 5394923
6933E394923l4077m8828J47108K90538K19092k47123l36935j04117l56586m1571
$$ 5394923 5360846 5312018 5459126 5749664 5968756 5721633 5384698 5280581 4923995 4882424
6923D882424j37921L717J5066k38041M693o5588j21403O39P7842k91725O4841
$$ 4882424 4744503 4748220 4763286 4525245 4529938 4464350 4342947 4343586 4421428 4129703 4194544
6912D194544k81757q5393P5237J49121m43j86374j2307l495J43451m8349K04961
$$ 4194544 3912787 3827394 3902631 4051752 4051309 3864935 3852628 3849133 3992584 3944235 4149196
6901D149196r0847l54978l79518j11487K15940M9361l1016k51973p154j28957
$$ 4149196 4058349 3703371 3323853 3212366 3428306 3477667 3446651 3194678 3187524 3058567
6891C058567p7250P9417J10967l7576m6337k13541k10504J495K34136L0639K1609
$$ 3058567 2981317 3060734 3171701 3134125 3087788 2874247 2663743 2665238 2899374 2930013 2951622
6880B951622O466j61663Q494Q5857K16647L5578k2795k6303J57882J13382P4137
$$ 2951622 2958088 2796425 2804919 2890776 3107423 3143001 3120206 3093903 3251785 3365167 3439304
6869C439304j7922j03647k56111j7877L41053K71256L0129J12917k88749P2K97857
$$ 3439304 3421382 3317735 3061624 3043747 3384800 3656056 3686185 3799102 3510353 3510425 3808282
6858C808282K10787j20476K3158m1116j20724k80002R783M9331j36785J28184
$$ 3808282 4019069 3898593 3921751 3880635 3759911 3479909 3489692 3539023 3402238 3530422
6848C530422J83470r3687k35818J3191R2034l7501K49810o8055k77669R5505K22366
$$ 3530422 3713892 3620205 3384387 3397578 3489612 3452111 3701921 3633866 3356197 3451702 3674068
6837C674068K8055k63J57203j38664R0299J6544n9447j00445Q7228R6449K69131
$$ 3674068 3702123 3701860 3859063 3720399 3810698 3827242 3767795 3667350 3754578 3851027 4120158
6826D120158p3898j77446O2288l7415k0857K94972N9337J54886L18349L18509
$$ 4120158 4046260 3868814 3931102 3893687 3872830 4167802 4227139 4382025 4700374 5018883
6816E018883K96410k4626j52860K9778K99569L81574L15820K49814N9590K87055
$$ 5018883 5315293 5290667 5137807 5167585 5467154 5848728 6164548 6414362 6473952 6761007
6806F761007M15958N9713j5565k17850m12466j36796m38802k86416q5268j3633
$$ 6761007 7176965 7236678 7221113 7003263 6590797 6454001 6015199 5728783 5643515 5629882
6796E629882q6379p2152j96860l49369P0793j28309k4440L72131j00872J0563
$$ 5629882 5543503 5471351 5274491 4925122 4995915 4867606 4843166 5215297 5114425 5124988
6786E124988K3454o4777J20080k70234j38250J04513j71287J17518j15436k43665
$$ 5124988 5148442 5083665 5203745 4933511 4795261 4899774 4728487 4846005 4730569 4486904
6776D486904M7067l88646l95674q8359O7753J365Q51l09282o8333Q4813O0665
$$ 4486904 4533971 4145325 3749651 3661292 3729045 3730410 3731261 3421979 3353646 3438459 3499124
6765C499124j54201j24397j83802j76010n8649J09445J98662J18837k25960k41472
$$ 3499124 3344923 3220526 3036724 2860714 2802065 2911510 3110172 3229009 3003049 2761577
6755B761577K06528j73328R6822k4679J5756K51911k02052J9518n0537J33355
$$ 2761577 2968105 2794777 2891599 2866920 2882676 3134587 2932535 2952053 2901516 3034871
6745C034871j51959J47913N6501L079j9468Q713N9650K85709M7025m435j93209
$$ 3034871 2882912 3030825 3087326 3090405 3070937 3079650 3139300 3425009 3472034 3467599 3274390
6734C274390J72103j26578m8169J40357l28173j24622j73633J86895R8503r5650
$$ 3274390 3446493 3319915 3271746 3412103 3083930 2959308 2785675 2972570 3071073 2975423
6724B975423o4512p0662k76764O979M3475M7665j25716j69971J26682n319j61631
$$ 2975423 2910911 2840249 2563485 2570464 2613939 2661604 2535888 2365917 2492599 2487280 2325649
6713B325649K84716Q9465j18371j12022K6333K8007K2796m5184N8121N0671o7071
$$ 2325649 2610365 2699830 2581459 2469437 2495770 2523777 2546573 2501389 2559510 2610181 2543110
6702B543110J176j50784k3874L16789O5339J68698j13279l9840j90710m8219Q6568
$$ 2543110 2544286 2393502 2369628 2686417 2751756 2920454 2807175 2767335 2576625 2528406 2614974
6691B614974L16766P0603R2601O4140J44992k08140k19583j82614O5052K58477
$$ 2614974 2931740 3002343 3094944 3159084 3304076 3095936 2876353 2693739 2758791 3017268
6681C017268m4973Q6920J35691j9629k56864k27388p2630L28988L8959r6776J75361
$$ 3017268 2972295 3059215 3194906 3175277 2918413 2691025 2618395 2947383 2986342 2889566 3064927
6670C064927L2312j78412n6923R1310P0304q8259N3161j47030K78088j16607J21344
$$ 3064927 3097239 2918827 2861904 2953214 3023518 2935259 2988420 2841390 3119478 3002871 3124215
6659C124215j03239J40434q0446j14139k19642J12566P4876J6756J29064j89021
$$ 3124215 3020976 3161410 3080964 2966825 2747183 2859749 2934625 2951381 3080445 2891424
6649B891424J68236J03635J78470L2830j55131m57N6J26551L31680m3340k43014
$$ 2891424 3059660 3163295 3341765 3374595 3219464 3219007 3219063 3345614 3677294 3633954 3390940
6638C390940M7560N1041M603j33827J01261N7587n3258m9175j31584J55230L3283
$$ 3390940 3438500 3489541 3494144 3360317 3461578 3519165 3465907 3416732 3285148 3440378 3473661
6627C473661j30581J08328j56342J04455J99184P6961m7412p3798J8954q1315
$$ 3473661 3343080 3451408 3295066 3399521 3598705 3675666 3628254 3554456 3573410 3492095
6617C492095J82666l81607Q2049K60727j82933l3400J43259P509L403k2999l08247
$$ 3492095 3674761 3293154 3375203 3635930 3452997 3419597 3562856 3570365 3573768 3550769 3242522
6606C242522m242J07717j9231J73844R1315k13155k47425J48015r3284P1054q1231
$$ 3242522 3238280 3345997 3326766 3500610 3591925 3378770 3131345 3279360 3186076 3257130 3175899
6595C175899N8976l370n9207l27309J26175l996J70869L64075O4565L9419N6325
$$ 3175899 3234875 3231505 3172298 2844989 2971164 2967168 3138037 3502112 3566677 3606096 3662421
6584C662421j52453Q8871r2525P4014j30445j58081J88397J59458j8244M1725
$$ 3662421 3509968 3598839 3506314 3580328 3449883 3291802 3480199 3639657 3621413 3663138
6574C663138Q3592K97040j39252j77981J11460n6343j78527J38622j59455j3292
$$ 3663138 3746730 4043770 3904518 3726537 3837997 3781654 3603127 3741749 3582294 3569002
6564C569002J36592j90718k72561J36000P7943m14118K18269j77329K2731J72243
$$ 3569002 3705594 3514876 3242315 3378315 3456258 3042140 3260409 3083080 3105811 3278054
6554C278054O9658l7868J22307j16303K52804k43799q4343K59719o6885J9765
$$ 3278054 3347712 3309844 3432151 3315848 3568652 3324853 3240510 3500229 3433344 3453109
6544C453109K89034j7456j02664J75075K71837r6885J1538j60696k07297p2610
$$ 3453109 3742143 3724687 3622023 3797098 4068935 3972050 3983588 3822892 3615595 3542985
6534C542985j11072K20956j07046k67307K23046j88558k52680M3433J79486K1699
$$ 3542985 3431913 3652869 3545823 3278516 3501562 3313004 3060324 3103757 3283243 3304942
6524C304942Q371K15328L6306l25828K29768j4355j13428O0747J0242K9501L3776
$$ 3304942 3313313 3528641 3564947 3239119 3468887 3454532 3341104 3401851 3412093 3441594 3475370
6513C475370k21962J49313R3828J49373k48147L40089K3206j20255R2823j73712
$$ 3475370 3253408 3402721 3496549 3645922 3397775 3737864 3761070 3640815 3733638 3559926
6503C559926L73619j51729n01L9266p5671J29155J91317L4249J4448Q6202K27284
$$ 3559926 3933545 3781816 3781315 3820581 3744910 3874065 4065382 4099631 4114079 4200281 4427565
6492D427565J79554Q2423P6044K32119O6792K4777J49507k31733M4851K09679
$$ 4427565 4607119 4689542 4765586 4997705 5064497 5089274 5238781 5007048 5051899 5261578
6482E261578k30375l85646q0322k81571o0922q6289l52251J71313p1789J65455
$$ 5261578 5031203 4645557 4565235 4283664 4222742 4136453 3784202 3955515 3883726 4049181
6472D049181M5773N953O0001l0104j64126l8307K34445m9969J05492M666j16129
$$ 4049181 4094954 4100907 4160908 4130804 3966678 3928371 4162816 4112847 4218339 4223005 4106876
6461D106876J24198j17814J25196J00991Q8433l38578M3606R378Q5022m7845Q7272
$$ 4106876 4231074 4113260 4238456 4339447 4427880 4089302 4132908 4142286 4227308 4179463 4266735
6450D266735k40914K03039m8349N7160j83323K62538K46432n358o4514J17534
$$ 4266735 4025821 4228860 4180511 4237671 4054348 4316886 4563318 4557960 4493446 4610980
6440D610980J63534l5749K2173k86073k60505K41184L37526j74211J74332j45462
$$ 4610980 4774514 4738765 4760938 4474865 4214360 4455544 4793070 4618859 4793191 4647729
6430D647729k88265J96955J91422n3607m7038q8468J5901J69372J8201k13374
$$ 4647729 4359464 4556419 4747841 4694234 4647196 4558728 4574629 4744001 4762202 4548828
6420D548828L45167R5597k16944J10176L15232l26881k93106l9938L12355J12522
$$ 4548828 4893995 4989592 4772648 4882824 5198056 4871175 4578069 4538131 4850486 4963008
6410D963008J3639j0596J6294R8616o4174k58385J3498l263L9847P6571L8085
$$ 4963008 4976647 4966051 4982345 5080961 5016787 4758402 4771900 4768637 4808484 4885055 4923140
6399D923140m4959L7163r0687j59289O2007l11157J47234J67760k7434p9369k99181
$$ 4923140 4878181 4915344 4824657 4665368 4727375 4416218 4563452 4731212 4703778 4624409 4325228
6388D325228J96845L52365N9956P0099j608q2472j67222K3245K07907l9248K41145
$$ 4325228 4522073 4874438 4934394 5004493 5002885 4920413 4753191 4776436 4984343 4945095 5186240
6377E186240J45792M9742Q5594P1925j57084J64850o6919K01387J34432r7075
$$ 5186240 5332032 5381774 5467368 5539293 5382209 5547059 5480140 5681527 5815959 5718884
6367E718884m2600j13221L15098R1888J25906J39069J73014P0597K27764M31520
$$ 5718884 5676284 5563063 5878161 5970049 6095955 6235024 6408038 6478635 6706399 7137919
6357G137919O5417l40133n1401J20250O7590j44278J15034J02671K1627m6103
$$ 7137919 7203336 6863203 6811802 6932052 6999642 6855364 6970398 7073069 7094696 7048593
6347G048593M2957M5335j05184K89876n1896P1063K06946l0222j8265L24460K54650
$$ 7048593 7091550 7136885 7031701 7321577 7269681 7340744 7547690 7517468 7499203 7823663 8078313
6336H078313j86250P3808L10439l0625N1619O0750K9601J98308q2295k8794J99970
$$ 8078313 7892063 7965871 8276310 8245685 8297304 8358054 8387655 8585963 8503668 8474874 8674844
6325H674844P0763O5170J14601j89695k42947K49027K17066k20095m5864L31576
$$ 8674844 8745607 8810777 8925378 8735683 8492736 8741763 8958829 8738734 8692870 9024446
6315I024446K44096K77171j69069K88152k5123p0743J71301P7796L74851L36002
$$ 9024446 9268542 9545713 9376644 9664796 9639673 9568930 9740231 9818027 10192878 10528880
6305A0528880M18027J82892K08668K29217M6958K21530J65667M6861N0226K56838
$$ 10528880 10946907 11129799 11338467 11567684 11614642 11836172 12001839 12048700 12098926 12355764
6295A2355764L78811r2809j78495J5283L14007Q1899l371M06484N58309J31286
$$ 12355764 12734575 12641766 12463271 12478554 12792561 12874460 12871089 13277573 13835882 13967168
6285A3967168k26195M43766O48089M02537L48762N38795L40457l9052M55076N14884
$$ 13967168 13740973 14184739 14832828 15235365 15584127 16122922 16463379 16424327 16879403 17394287
6275A7394287M48200n9704J96688M04956M79433K12181L56009K73101M35090K72780
$$ 17394287 17842487 17782783 17979471 18384427 18863860 19076041 19432050 19705151 20140241 20413021
6265B0413021K4279J73714K77551N13310Q33052M41308N88696O42397O51147P32874
$$ 20413021 20437300 20611014 20888565 21401875 22234927 22676235 23264931 23907328 24558475 25291349
6255B5291349O73598O36703K68235L45261N22399N00531K51057K94828N20760
$$ 25291349 25964947 26601650 26869885 27215146 27737545 28238076 28489133 28783961 29304721
6246B9304721L99777M43093L16737J41757L63481N08376L80552K20302L42375
$$ 29304721 29704498 30147591 30464328 30606085 30969566 31477942 31858494 32078796 32421171
6237C2421171O69150O81462N10076Q65352O52702M60006j41985k6235L52189K24195
$$ 32421171 33090321 33771783 34281859 35147211 35799913 36259919 36117934 36091699 36443888 36668083
6227C6668083J04390K87053L65432N41862L37073K38650K99614r2024l92578j11269
$$ 36668083 36772473 37059526 37424958 37966820 38303893 38542543 38842157 38750133 38357555 38246286
6217C8246286l68377o77928j50628k49924m04704j15896O4823j2153o8596j02583
$$ 38246286 37877909 37199981 37049353 36799429 36394725 36278829 36343652 36331499 36262903 36160320
6207C6160320M2779N0588n4182J18306j63764l23216Q1328L67764J84054R8981
$$ 36160320 36203099 36253687 36199505 36317811 36154047 35830831 35912159 36279923 36463977 36562958
6197C6562958m626k69469k94415j12105n65092j48182j73795k36455l43322l31127
$$ 36562958 36558332 36288863 35994448 35882343 35317251 35169069 34995274 34758819 34415497 34084370
6187C4084370j74736j76825m3272K05624K0531K02462M81207k9235L35893N34623
$$ 34084370 33909634 33732809 33689537 33895161 33915692 34118154 34599361 34570126 34906019 35440642
6177C5440642N80748O88808L60978O50070Q61422N18683P83312N52780M76457
$$ 35440642 36021390 36710198 37071176 37721246 38582668 39101351 39884663 40437443 40913900
6168D0913900P81836P49515Q32891R51290Q65775J223056J405999J542633J449858
$$ 40913900 41695736 42445251 43278142 44229432 45095207 46318263 47724262 49266895 50716753
6159E0716753J706229J836559K408983K498833K663893K739280L204480L761311
$$ 50716753 52422982 54259541 56668524 59167357 61831250 64570530 67775010 71536321
6151G1536321M041131M691792N262473N391462N896730O219081O214239N996137
$$ 71536321 75577452 80269244 85531717 90923179 96819909 103038990 109253229 115249366
6143A15249366M627980L535328J936024J57281j795660k311035k528954k459433
$$ 115249366 119877346 123412674 125348698 125505979 123710319 121399284 118870330 116410897
6135A16410897j485568j095229l08924M49085J405440K359547L148315M274658
$$ 116410897 114925329 113830100 113521176 113970261 115375701 117735248 120883563 125158221
6127A25158221N252666O640566P853012R140126R578353R823053Q749816O248923
$$ 125158221 130410887 137051453 144904465 154044591 163622944 173445997 182195813 188444736
6119A88444736L114874l97344l672677o438184q191681r453061j0057649r550540
$$ 188444736 191559610 191162266 187489589 181051405 172859724 163406663 153349014 143798474
6111A43798474q526066p720220o020162n180857m109343k799711j717555r23577
$$ 143798474 135272408 127552188 121532026 116351169 112241826 109442115 107724560 106800983
6103A06800983J77513J391275K689431L313165L035928L224297K572429J191755
$$ 106800983 106978496 108369771 111059202 114372367 117408295 120632592 123205021 124396776
6095A24396776j286041l893295n823014p240999p891858p555828p271171o590923
$$ 124396776 123110735 119217440 113394426 106153427 98261569 90705741 83434570 76843647
6087G6843647n738318n317828m882424m497163m245206l452773k891973k604968
$$ 76843647 71105329 65787501 60905077 56407914 52162708 48709935 45817962 43212994
6079D3212994k297574k142120j666688j568860j458751j113910q48584p91689
$$ 43212994 40915420 38773300 37106612 35537752 34079001 32965091 32116507 31324818
6071C1324818p34616n74925m28603n56991n74779l96944k29049K2201k03006j35415
$$ 31324818 30590202 30015277 29586674 29029683 28454904 28057960 27828911 27851112 27648106 27512691
6061B7512691j51455j20870J3967K09526k03425j51685l14690p76244n09694o25803
$$ 27512691 27361236 27240366 27254333 27463859 27260434 27108749 26794059 26017815 25508121 24882318
6051B4882318k8219k06408l59435k37812M7827R6506k58939J31766L46157M70292
$$ 24882318 24854099 24647691 24288256 24050444 24098271 24194777 23935838 24067604 24413761 24884053
6041B4884053O00485L12922N85226K45582L88186O7929J03845J76870l59461p34498
$$ 24884053 25484538 25797460 26382686 26628268 27016454 27084383 27188228 27365098 27005637 26271139
6031B6271139p47160q15342r53438r12149p64834o58194o88060o59466o62337
$$ 26271139 25523979 24708637 23755199 22843050 22078216 21420022 20731962 20072496 19410159
6022A9410159r132k45373m6245m793J27517j03435k03443K04193K94086K6255
$$ 19410159 19401027 19155654 19109409 19104616 19232133 19128698 18925255 19129448 19423534 19449789
6012A9449789o8093q7412m29772m41007o78853p66828n16798o35453l98887p27196
$$ 19449789 19381696 19294284 18864512 18423505 17744652 16977824 16461026 15825573 15426686 14699490
6002A4699490n93862k70855o31063j88404l96169l37290j56720k66750k82477
$$ 14699490 14105628 13834773 13203710 13015306 12619137 12281847 12125127 11858377 11575900
5993A1575900j14579l65980m49272k22028J02898m1633m50080j91272k50848j54862
$$ 11575900 11461321 11095341 10646069 10424041 10526939 10485306 10035226 9843954 9593106 9438244
5983I438244l16946k86861k56900o6741k5178k42275q9300m12051l89645j88581
$$ 9438244 9121298 8834437 8577537 8510796 8485618 8243343 8154043 7741992 7352347 7163766
5973G163766j18621j9796R5702q3228J534N7224r89l4877k47421o0080j05523
$$ 7163766 7045145 7025349 7121051 7037823 7039357 7096581 7095592 7060715 6813294 6753214 6647691
5962F647691Q2015J47908l69444Q7208M7371k17878O0163p9425m68120J29983
$$ 6647691 6729706 6877614 6508170 6595378 6642749 6424871 6485034 6405609 5937489 6067472
5952F067472o8988k06227L22473k90528j87073J38909q4907k67636J26820J39935
$$ 6067472 5998484 5792257 6114730 5824202 5637129 5776038 5691131 5423495 5550315 5690250
5942E690250j94430q3200J62846M0507R9871l24711K05268L62008k54599j68989
$$ 5690250 5495820 5412620 5575466 5615973 5715844 5391133 5596401 5958409 5703810 5534821
5932E534821J88765L22275p0606p7420L987j61553q0671r4670J52036j0707P5031
$$ 5534821 5723586 6045861 5975255 5897835 5901822 5740269 5659598 5564928 5716964 5706257 5781288
5921E781288p2793J19382J52189o304J08933k9134J27332k14985m3021M2605j29871
$$ 5781288 5708495 5827877 5980066 5973762 6082695 6053561 6180893 5965908 5922887 5965492 5835621
5910E835621m4846q690N4841M13086K38566k53532O9570o8231J19745R2893k10116
$$ 5835621 5790775 5782085 5836926 6250012 6488578 6235046 6304616 6236385 6356130 6449023 6238907
5899F238907K02117K53432k68939J73414O2879j30383J55692K87119Q6978r2787
$$ 6238907 6441024 6694456 6425517 6598931 6661810 6531427 6687119 6974238 7061216 6968429
5889F968429n6348o7713K04033R8157o9668R0304L66744l5124p3330L78784Q7466
$$ 6968429 6912081 6844368 7048401 7146558 7076890 7167194 7533938 7498814 7425484 7804268 7891734
5878G891734k54942J33995K72922J88016R647K67451J66862j16876O9386R1161
$$ 7891734 7636792 7770787 8043709 8231725 8241372 8508823 8675685 8558809 8628195 8719356
5868H719356m4375J66382J51420l5187k50778J15176J77Q2801l9699L1234J58940
$$ 8719356 8674981 8841363 8992783 8957596 8706818 8821994 8822171 8904972 8865273 8896507 9055447
5857I055447l89781k33793j07397k3535J45838k25225q1440L5914k34177k79213
$$ 9055447 8665666 8431873 8324476 8300941 8446779 8221554 8140114 8176028 7941851 7662638
5847G662638k8459j21695J5750j97057J36530o7026r997j94861o6390L55782j42222
$$ 7662638 7634179 7512484 7528234 7331177 7467707 7400681 7390684 7195823 7129433 7485215 7342993
5836G342993o2065J06709m1003Q6841l6781K57200j54784L0614K78545k26246
$$ 7342993 7280928 7387637 7346634 7433475 7396694 7653894 7499110 7529724 7808269 7582023
5826G582023j26509K12674J21958j284j72470P3568j51983q0141J53028j18111
$$ 7582023 7455514 7668188 7790146 7788862 7616392 7689960 7537977 7457836 7610864 7492753
5816G492753J21603k65325J14600j9073K14011M053l06029j70381K96396O1457
$$ 7492753 7614356 7349031 7463631 7444558 7658569 7662622 7356593 7186212 7482608 7544065
5806G544065j147j13082J49389J77815J23872L04160Q5444k12588L39026L795
$$ 7544065 7542918 7429836 7579225 7757040 7880912 8185072 8270516 8057928 8396954 8400749
5796H400749n8692P1481L4499l01372J01093K09492k9943J08050j61698k70376
$$ 8400749 8342057 8413538 8448037 8146665 8247758 8457250 8427307 8535357 8373659 8103283
5786H103283J16537p3155K07413K41989j91409m6456J4015k32010J39243N27649
$$ 8103283 8219820 8146665 8354078 8596067 8404658 8358202 8372217 8140207 8279450 8807099
5776H807099R3651J61205K19865J13506Q9680J83829K21410P7072R9221L4949
$$ 8807099 8900750 9061955 9281820 9395326 9485006 9668835 9890245 9967317 10066538 10101487
5766A0101487K5560J03703l0715p4518p7346o9338m1932N0447k1090o8123K04603
$$ 10101487 10127047 10230750 10200035 10125517 10048171 9978833 9936901 9987348 9966258 9898135 10102738
5755A0102738Q5745j02043L41923o1553L37799J54273K19655J30615J67008K22753
$$ 10102738 10188483 10086440 10428363 10366810 10704609 10858882 11078537 11209152 11376160 11598913
5745A1598913J38702K33916K5380Q102J76298j36778n9729r7462o3678J00124
$$ 11598913 11737615 11971531 11996911 12005013 12181311 12044533 11984804 11887342 11823664 11923788
5735A1923788r168O8594K32776m6528P9081M8696J80479O12950Q2645O0121M83422
$$ 11923788 11914620 11983214 12215990 12169462 12248543 12297239 12477718 13090668 13173313 13233434 13716856
5724A3716856L64342J14860J41023K31734L66678J83246K15630q1360j5586Q67514
$$ 13716856 14081198 14196058 14337081 14568815 14935493 15118739 15334369 15253009 15237423 16104937
5714A6104937L20977P9452J37013J96477K25022K3444J40167R8086L28984L59800
$$ 16104937 16425914 16505366 16642379 16838856 17063878 17087322 17227489 17325575 17654559 18014359
5704A8014359J11157L19788M49730J13254M74256N6297M38513L78989N35867M74476
$$ 18014359 18125516 18445304 18895034 19008288 19482544 19538841 19977354 20356343 20892210 21366686
5694B1366686M56993P58454N91116M72829K93060L76448M76355N72940M23230
$$ 21366686 21823679 22582133 23173249 23646078 23939138 24315586 24791941 25364881 25788111
5685B5788111M63929K96086M17938J96730K54327M30256K36776K28138J99752
$$ 25788111 26252040 26548126 26966064 27162794 27417121 27847377 28084153 28312291 28512043
5676B8512043J75046p8936O74334M21527N00347K11501L86039M40674N19062N64910
$$ 28512043 28687089 28608153 29282487 29704014 30204361 30415862 30801901 31242575 31761637 32326547
5666C2326547M75640O40065K38178N21356K82738M41900K71165L66069K69826
$$ 32326547 32802187 33442252 33680430 34201786 34484524 34926424 35197589 35563658 35833484
5657C5833484J6556K9301P8185R8245J95255J60989J00608J04995N29345K86923
$$ 35833484 35850040 35879341 35957526 36055771 36251026 36412015 36512623 36617618 37146963 37433886
5647C7433886L64434M93252L56274L60617L62092M31620O83452N90829M46145
$$ 37433886 37798320 38291572 38647846 39008463 39370555 39802175 40485627 41076456 41522601
5638D1522601O10819O03150O10979L76094P07487Q21179M28357J36189L94297
$$ 41522601 42133420 42736570 43347549 43723643 44431130 45252309 45680666 45816855 46211152
5629D6211152O40143M99548N44961M23875O34710O33329J112220J307028J099132
$$ 46211152 46851295 47350843 47895804 48319679 48954389 49587718 50699938 52006966 53106098
5620E3106098J412715J664241J281745J587045J726351J871436K169696K513482
$$ 53106098 54518813 56183054 57464799 59051844 60778195 62649631 64819327 67332809
5612F7332809K376011K610820K882974L314131L525062L973816M397269M472563
$$ 67332809 69708820 72319640 75202614 78516745 82041807 86015623 90412892 94885455
5604I4885455N508346N631778O404652P299769P951117P755231P049610N436558
$$ 94885455 100393801 106025579 112430231 119730000 127681117 135436348 142485958 147922516
5596A47922516L421837J401852j199972k547636l352472l313210k864385j552701
$$ 147922516 151344353 152746205 151546233 148998597 145646125 142332915 139468530 137915829
5588A37915829j389790q24916K66066O52008J937416K857953L949177N332565
$$ 137915829 136526039 135701123 135967189 136619197 138556613 141414566 145363743 150696308
5580A50696308O637415P792371R244252R177611R057474P976458N453254K516978
$$ 150696308 157333723 165126094 174370346 183547957 192605431 200581889 206035143 208552121
5572B08552121m59934l969018o560725q883217r647503r541842q781022q066295
$$ 208552121 208092187 204123169 197562444 188679227 179031724 169489882 160708860 152642565
5564A52642565p362822o708484n583446m760590m074303k852133k079008j031961
$$ 152642565 145279743 138571259 132987813 128227223 124152920 121300787 119221779 118189818
5556A18189818J67074J293783J708498J948236J581034Q09142m73988j979685
$$ 118189818 118356892 119650675 121359173 123307409 124888443 125697585 125223597 123243912
5548A23243912l289943n441522o358354o459040o049655n595376n561664m967352
$$ 123243912 119953969 114512447 108154093 101695053 95645398 90050022 84488358 79521006
5540G9521006m887084m422449l927550l777723l740546k878090k823522k666073
$$ 79521006 74633922 70211473 66283923 62506200 58765654 55887564 53064042 50397969
5532E0397969k463323j923462j936908j768705j573878j341507r21838r62635
$$ 50397969 47934646 46011184 44074276 42305571 40731693 39390186 38468348 37505713
5524C7505713r28498n87296n23023o43116k83694r3822J37182m5163j16975r1389
$$ 37505713 36577215 35989919 35466896 34823780 34540086 34446264 34583446 34538283 34421308 34329919
5514C4329919l5642p7500l39126m47906n57591p41349p14529q35654r36238o71430
$$ 34329919 34294277 34216777 33877651 33429745 32872154 32130805 31416276 30580622 29644384 28972954
5504B8972954m71456j56182n05807j94482L8568j0892K16018q513P3582Q56614
$$ 28972954 28501498 28345316 27839509 27645027 27683595 27672703 27888721 27880208 27953790 28810404
5494B8810404M66117M44248O50017N44455J73619R8658l53739r26336o58651r99081
$$ 28810404 29276521 29720769 30370786 30915241 31088860 31187518 30833779 29907443 29248792 28249711
5484B8249711r17945p93234o70564p62183o23132m54970l39980m73650k33487
$$ 28249711 27331766 26538532 25867968 25105785 24482653 24027683 23687703 23214053 22980566
5475B2980566p4615l9537k02294j89450N3390n1635j55332M1871k09966k15423
$$ 22980566 22905951 22866414 22664120 22474670 22528060 22476425 22321093 22362964 22152998 21937575
5465B1937575o48641m78051l49630p69284o55844o55122m11176o94001n75613
$$ 21937575 21288934 20810883 20461253 19691969 19036125 18381003 17969827 17275826 16700213
5456A6700213O7088n10713p28984j86484J27976k1498m11935k37577n0025J27208
$$ 16700213 16767301 16256588 15527604 15341120 15469096 15447598 15035663 14798086 14748061 14875269
5446A4875269j7N4579L68416j19598K62897M29411K86937M47651R0901l35447
$$ 14875269 14875252 14929831 15298247 15178649 15441546 15870957 16157894 16605545 16696446 16360999
5436A6360999l39522k41172l62434o20569o29254o91300n14068k51927K2067l58390
$$ 16360999 16021477 15780305 15417871 14797302 14168048 13476748 12962680 12710753 12732820 12374430
5426A2374430l79129M6943l58799k83513M0940q0982l24651M7728k94756k50648
$$ 12374430 11995301 12042244 11683445 11399932 11440872 11359890 11035239 11082967 10788211 10537563
5416A0537563k68613l07181J70140j57155j28815j30554k66974K14734J6314j51763
$$ 10537563 10268950 9961769 10131909 9974754 9845939 9715385 9448411 9663145 9679459 9527696
5406I527696j59102m7784J84734K4315q3243J19207n8714J72988K0423j59808
$$ 9527696 9368594 9320810 9505544 9529859 9446616 9565823 9507109 9680097 9700520 9540712
5396I540712Q9473O64k06350J5007j1873L00822R7383J50456Q2333J84464K30913
$$ 9540712 9630185 9630849 9424499 9439506 9427633 9728455 9825838 9976294 10058627 10243091 10474004
5385A0474004l32355j380K67821L52816K65998J43609K40784N44680M05200N68259
$$ 10474004 10141649 10140269 10408090 10760906 11026904 11170513 11411297 11955977 12361177 12929436
5375A2929436N79053P20206R38093N30839L74603K52943k84230m51574o61600
$$ 12929436 13508489 14228695 15166788 15697627 16072230 16325173 16040943 15589369 14927769
5366A4927769p83766n28295q14314m33796q3510l97100p81926p06833l38047n6206
$$ 14927769 14144003 13615708 12801394 12367598 12284088 11886988 11105062 10398229 10060182 10003976
5356A0003976l07188k74786k6631j2365m9347j34110k21051m88420J99388L2409
$$ 10003976 9696788 9422002 9395371 9383006 9333659 9199549 8978498 8490078 8689466 8721875
5346H721875k42760m0933m16962q6955P794j51805k50931R551L8662K70268K0152
$$ 8721875 8479115 8438182 8021220 7934265 7942059 7790254 7539323 7548874 7587536 7857804 7877956
5335G877956j33450p3980l10334P6105J77558N8294q4578R0684j09860l2113j97216
$$ 7877956 7744506 7670526 7360192 7436297 7613855 7672149 7587571 7678255 7568395 7536282 7339066
5324G339066m7748q3508j62222k03009k00913L5427J75920n6169j28223Q8664
$$ 7339066 7291318 7207810 7045588 6842579 6641666 6677093 6853013 6796844 6668621 6757285
5314F757285J12947j58253N8528K15787r4540j79538M2605L8690j606p2083k0289
$$ 6757285 6870232 6711979 6770507 6986294 6891754 6712216 6754821 6793511 6791905 6719822 6699533
5303F699533J70638J51352k81773R5970l26677n6965N3627j43181R0516j29531
$$ 6699533 6870171 7021523 6739750 6835720 6509043 6452078 6505705 6362524 6453040 6323509
5293F323509j28154J31301J0501k28515j53933q4073R7872J07924J69050J4701
$$ 6323509 6195355 6326656 6337157 6108642 5954709 5870636 5968508 6076432 6245482 6260183
5283F260183J99468q3098M057k13627L4969J80720J7733k1963J53264k07543q8062
$$ 6260183 6459651 6376553 6380610 6166983 6201952 6382672 6400405 6378442 6531706 6324163 6236101
5272F236101J46592q1066q1929j85856n7092J26321J70560J03047J9181k8171
$$ 6236101 6382693 6301627 6219698 6033842 5976750 6103071 6273631 6376678 6395859 6367688
5262F367688Q6273k7418J0286J05882K87970J07420k73720k61822m4020N1566
$$ 6367688 6453961 6426543 6436829 6542711 6830681 6938101 6664381 6402559 6358539 6410105
5252F410105l7957j1600q9867N11L95233O2819J91704r1700p3641J47695k2831
$$ 6410105 6372148 6360548 6270681 6271192 6666425 6729244 6920948 6829248 6755607 6903302 6880471
5241F880471r4433J13899Q9994p4770J64916j44254N9480J91900r0469M6436m5398
$$ 6880471 6786038 6899937 6989931 6915161 7080077 6935823 6995303 7187203 7096734 7143170 7097772
5230G097772k9181J81326J97194J3890K04510K02837J36178M66697J84354K13763
$$ 7097772 7068591 7249917 7447111 7461001 7665511 7868348 8004526 8471223 8655577 8869340
5220H869340J76608L04668L91824N15071L66579N31908M53942P68437P34863N38384
$$ 8869340 9045948 9350616 9742440 10257511 10624090 11155998 11609940 12378377 13113240 13651624
5210A3651624L04790L33533j49216l93468o25715n25680n15330m70302p35776
$$ 13651624 13956414 14289947 14140731 13747263 13121548 12595868 12080538 11610236 10874460
5201A0874460o37604l99931n62348n28316j93124j77159k22985j47934k77963
$$ 10874460 10236856 9836925 9274577 8746261 8553137 8375978 8152993 8005059 7727096
5192G727096k05963k10379n1880k61761n2412k61610J46128j33686j05002r4463
$$ 7727096 7521133 7310754 7258874 6997113 6944701 6683091 6829219 6695533 6590531 6496068
5182F496068k2716j45971R7529L8959k10056j9891O1897j5245j3601K6799J33024
$$ 6496068 6473352 6327381 6424910 6463869 6253813 6233922 6295819 6280574 6266973 6293772 6426796
5171F426796K38773Q441m8087j57562j20979J3764J16761L76718j2877N9903k8551
$$ 6426796 6665569 6674010 6625923 6468361 6347382 6361146 6477907 6854625 6841748 6901651 6873100
5160F873100J33247L28727l6617p179K83227K02818J53198L56499j51063J50171
$$ 6873100 7006347 7335074 7298457 7291278 7574505 7777323 7930521 8287020 8135957 8286128
5150H286128M25613J21078M82627L64688K96046K21702J19457o2933J03221J33627
$$ 8286128 8711741 8832819 9315446 9680134 9976180 10197882 10317339 10254406 10357627 10491254
5140A0491254k05279q4646k51085m38545o96055r9326l44042k07713m30193l31450
$$ 10491254 10285975 10201329 9950244 9511699 8815644 8716318 8372276 8164563 7734370 7402920
5130G402920l82368k31697K1716j47185j78631j32422k65838j93665J44863j05667
$$ 7402920 7020552 6788855 6810571 6663386 6484755 6352333 6086495 5892830 6037693 5932026
5120E932026J73530o8629J84083L5703j35832k20512J92694K84904k0857j94223
$$ 5932026 6105556 6036927 6221010 6256713 6120881 5900369 6093063 6377967 6357110 6162887
5110F162887J22907N7941j76297K33448K277j27448o0781p0608j63629J26054
$$ 6162887 6285794 6343735 6167438 6400886 6403163 6275715 6214934 6144326 5980697 6106751
5100F106751L1302J61864J25332j5300p296k427q2877j20639j7789j14431L1340
$$ 6106751 6138053 6299917 6425249 6409949 6402653 6400226 6317349 6196710 6178921 6064490 6095830
5089F095830k0792p7865L31383K50269r5921j48245N078j10272K27772L4014q9968
$$ 6095830 6075038 5997173 6328556 6578825 6482904 6334659 6339737 6229465 6457237 6491251 6401283
5078F401283j11118R4742O2867j36055J22597Q1029j0813Q9522M3968r8926j32353
$$ 6401283 6290165 6384907 6447774 6311719 6434316 6515345 6504532 6594054 6638022 6539096 6406743
5067F406743M8522N478Q6383K54211j95485N7569J04472P3948J62434N3717J44004
$$ 6406743 6455265 6460743 6547126 6801337 6605852 6663421 6767893 6841841 7004275 7057992 7201996
5056G201996k2998L090N2896q6009n6682J69360K79072M1242J61809L3430k88157
$$ 7201996 7178998 7182088 7234984 7148975 7092293 7261653 7540725 7581967 7743776 7777206 7489049
5045G489049J64825M10845n7799O6824k29008J13499n2895N8323M059J98357K94623
$$ 7489049 7653874 8064719 8006920 8073744 7844736 7958235 7905340 7963663 7967722 8166079 8460702
5034H460702J95026J47834R4764K8488K17695m12464K94303K65345R1169J74150
$$ 8460702 8655728 8803562 8898326 8926814 9144509 8732045 9026348 9291693 9382862 9557012
5024I557012J1580J64683J57023K15092j85472J05913K15198L45024J99127K74407
$$ 9557012 9568592 9733275 9890298 10105390 9919918 10025831 10241029 10586053 10785180 11059587
5014A1059587R4400J35277j083K18968J45835O5169K86881K53387j04597q5989
$$ 11059587 11153987 11289264 11288181 11507149 11652984 11718153 12005034 12258421 12153824 12067835
5004A2067835R0901M59261J20024J04513J65808l1674q5151Q3199m5604K79351
$$ 12067835 12158736 12617997 12738021 12842534 13008342 12976668 12891517 12974716 12929112 13208463
4994A3208463J47736J50002L49237J18336J74764J98209K23612J50820J48404
$$ 13208463 13356199 13506201 13855438 13973774 14148538 14346747 14570359 14721179 14869583
4985A4869583j6550J46320K50865p3274j864P1856k24892k05060J13335O500M2554
$$ 14869583 14853033 14999353 15250218 15176944 15175080 15246936 15022044 14816984 14930319 14936819 14979373
4974A4979373j08505j64024J84078J49136J27266o5115K4948L02516P6965K93474
$$ 14979373 14870868 14706844 14890922 15040058 15167324 15102209 15127157 15429673 15506638 15800112
4964A5800112P9226J57184J21142P8827K57138q2709P2489N9110K09184R3106
$$ 15800112 15879338 16036522 16157664 16236491 16493629 16410920 16483409 16542519 16751703 16844809
4954A6844809j03613K57699K52600m9627J29726q0471J09340p6485J36230K19176
$$ 16844809 16741196 16998895 17251495 17201868 17331594 17251123 17360463 17283978 17420208 17639384
4944A7639384K04986K14554K23692j47069j0231K20765J76348M81335K13512J21291
$$ 17639384 17844370 18058924 18282616 18135547 18125316 18346081 18522429 19003764 19217276 19338567
4934A9338567K91879M51580K00656J55697N55747K04289j8536K72206J58491L04120
$$ 19338567 19630446 20082026 20282682 20438379 20994126 21198415 21179879 21452085 21610576 21914696
4924B1914696L18717K58236K60994M21125L67768P24902L55531N83122N03105
$$ 21914696 22233413 22491649 22752643 23173768 23541536 24266438 24621969 25205091 25708196
4915B5708196P53838N18339N57689M96359P39504Q67737Q56767J040991J075991
$$ 25708196 26462034 26980373 27538062 28034421 28773925 29641662 30498429 31539420 32615411
4906C2615411R86834R02148J084809R83681J056038J438234J481327J418930J540467
$$ 32615411 33602245 34504393 35589202 36572883 37628921 39067155 40548482 41967412 43507879
4897D3507879J493131J700532J619376J933721J994499K503707K338291K669947
$$ 43507879 45001010 46701542 48320918 50254639 52249138 54752845 57091136 59761083
4889E9761083K850429K868970L341055L645990L747101M040319M362795M322645
$$ 59761083 62611512 65480482 68821537 72467527 76214628 80254947 84617742 88940387
4881H8940387M320753M495915M366279M073766M444274M219465L511916L296448
$$ 88940387 93261140 97757055 102123334 106197100 110641374 114860839 118372755 121669203
4873A21669203K749144K657641K126863J595582J288541J372442J181219J135909
$$ 121669203 124418347 127075988 129202851 130798433 132086974 133459416 134640635 135776544
4865A35776544J323908J474401J950608K233200K771810L080702L732119M319268
$$ 135776544 137100452 138574853 140525461 142758661 145530471 148611173 152343292 156662560
4857A56662560M600134M965906N159046N311661N227243N075540M698313L919817
$$ 156662560 161262694 166228600 171387646 176699307 181926550 187002090 191700403 195620220
4849A95620220L028455J939899K97226j094338k132478l430795l933903m388729
$$ 195620220 198648675 200588574 200885800 199791462 197658984 194228189 190294286 185905557
4841A85905557m992643m921935m914221n162803n006912m741751m202141l626627
$$ 185905557 180912914 175990979 171076758 165913955 160907043 156165292 151963151 148336524
4833A48336524l143198k906803k449258j370658j421425j387356j024033m92800
$$ 148336524 145193326 142286523 139837265 138466607 137045182 135657826 134633793 134140993
4825A34140993m56465r8851l44462n06484q38000j244998j803178k220493k583608
$$ 134140993 133684528 133585677 133241215 132734731 131896731 130651733 128848555 126628062 124044454
4816A24044454l207943l362047l509165l903410l991769l807827l966180l793939
$$ 124044454 120836511 117474464 113965299 110061889 106070120 102262293 98296113 94502174
4808I4502174l789467l540318l534024l273722l189734k923617k563895k471128
$$ 94502174 90712707 87172389 83638365 80364643 77174909 74251292 71687397 69216269
4800F9216269k460454k198923k170953j735536j453769j492887j328772r54591
$$ 69216269 66755815 64556892 62385939 60650403 59196634 57703747 56374975 55420384
4792E5420384q60559q81044n25637o35740j73438Q777m58656n35959l75639l76440
$$ 55420384 54559825 53678781 53153144 52517404 52343966 52352743 51894087 51358128 50982489 50606049
4782E0606049n43206j27972n38985m85418n59391l22145J32711j73882P9745K16165
$$ 50606049 50062843 49934871 49395886 48910468 48351077 48028932 48161643 47987761 48067506 48283671
4772D8283671J91422M11737M64353M30361R60961P65462R62394J214696J056226
$$ 48283671 48475093 48886830 49351183 49781544 50742505 51507967 52470361 53685057 54741283
4763E4741283J711855J639383J429999J911250J927901K142865K489067K366363
$$ 54741283 56453138 58092521 59522520 61433770 63361671 65504536 67993603 70359966
4755G0359966K778357L412210L553540L565278L505978L662526M027288L997752
$$ 70359966 73138323 76550533 80104073 83669351 87175329 90837855 94865143 98862895
4747I8862895L861897L935116L789473L632175L448318L126521L014140K958613
$$ 98862895 102724792 106659908 110449381 114081556 117529874 120656395 123670535 126629148
4739A26629148K434721J627054J598854J199177J281052P61899P88464J189798
$$ 126629148 129063869 130690923 132289777 133488954 134770006 135531905 136320369 137510167
4731A37510167J431277J720616K003587K457183K659793K977054L353806M271192
$$ 137510167 138941444 140662060 142665647 145122830 147782623 150759677 154113483 158384675
4723A58384675M605499M893557M960143N207625M622377M302181M208202M121685
$$ 158384675 162990174 167883731 172843874 178051499 182673876 186976057 191184259 195305944
4715A95305944L757365K519177J496816L56542j118677k550517l421878m209487
$$ 195305944 199063309 201582486 203079302 203435844 202317167 199766650 196344772 192135285
4707A92135285m727974n218652m936180n075696m828434m440980m283197m198616
$$ 192135285 187407311 182188659 177252479 172176783 167348349 162907369 158624172 154425556
4699A54425556l648343k987133k777146k081827j935387j500571j359691j215948
$$ 154425556 150777213 147790080 145012934 142931107 140995720 139495149 138135458 136919510
4691A36919510j352558j869485j970515j939425k572738k830634l595493m208841
$$ 136919510 135566952 133697467 131726952 129787527 127214789 124384155 120788662 116579821
4683A16579821m415238m624328m815054n101486m680990m751335m455694m376873
$$ 116579821 112164583 107540255 102725201 97623715 92942725 88191390 83735696 79358823
4675G9358823m507974l868967l881768l321786l079592l277413k768827k321235
$$ 79358823 74850849 70981882 67100114 63778328 60698736 57421323 54652496 52331261
4667E2331261k141600k182466j614895j773878j326079j416214j558269j067478
$$ 52331261 50189661 48007195 46392300 44618422 43292343 41876129 40317860 39250382
4659C9250382j113388j035057p89089q17179q18034r35687q00403o55972o23415
$$ 39250382 38136994 37101937 36312848 35495669 34677635 33741948 32941545 32285573 31662158
4650C1662158o27474o88543p26579o83809p82790n15818l11402l80904o10980
$$ 31662158 31034684 30346141 29619562 28935753 28152963 27637145 27325743 26944839 26333859
4641B6333859o78132l90686l05710l55509n39655n80589m47969l88036l21861
$$ 26333859 25655727 25265041 24959331 24603822 24064167 23483578 23035609 22647573 22325712
4632B2325712m41876l68433m13472m27688j74116k42048m85750l04610l80840
$$ 22325712 21883836 21515403 21101931 20674243 20500127 20258079 19772329 19467719 19086879
4623A9086879l56035j87871l30247j5442j37547J8539j42600l26993j26220M2631
$$ 19086879 18730844 18542973 18212726 18197284 18059737 18078276 17935676 17608683 17482463 17525094
4613A7525094j91237J8867J68764J63031j62261k3937J50494K41656k03957J78826
$$ 17525094 17333857 17352724 17521488 17684519 17522258 17498321 17648815 17890471 17686514 17865340
4603A7865340J63119j77267J02918K48657r829J77251K48984K0804J11933L90281
$$ 17865340 18028459 17851192 17954110 18202767 18192938 18370189 18619173 18639977 18751910 19142191
4593A9142191J31480j09623j36315P8802J5955l854k24742O2793L5404j49690
$$ 19142191 19273671 19164048 19027733 19106535 19122490 19118636 18893894 18956687 18992091 18842401
4583A8842401l85860j28942j56178k89387l27240m58536k14163j19334l67029
$$ 18842401 18456541 18327599 18171421 17882034 17554794 17096258 16882095 16762761 16395732
4574A6395732l58828l17695k52488j86042l98067k55312k27774k07581k63662
$$ 16395732 16036904 15719209 15466721 15280679 14882612 14627300 14399526 14191945 13928283
4565A3928283j97075k68416k77447p4716j18173k16908l0808J29742K55743l03377
$$ 13928283 13731208 13462792 13185345 13110629 12992456 12775548 12744740 12874482 13130225 12826848
4555A2826848j52293l06688k16108K34541R4259m8813Q8844O7451j04331L3790
$$ 12826848 12674555 12367867 12151759 12386300 12480559 12431746 12520590 12588041 12483710 12517500
4545A2517500K13278k14101K21199N725K04251K57869J84388n0265N0270q8215
$$ 12517500 12730778 12516677 12737876 12743601 12947852 13205721 13390109 13339844 13390114 13301899
4535A3301899k79187J15951J96784J85846j10623j52338j18969p3357L6895L9218
$$ 13301899 13022712 13138663 13335447 13521293 13410670 13258332 13139363 13066006 13102901 13142119
4525A3142119K84667r0624J03937M9544n39473l20001j3888l53965l42689l25095
$$ 13142119 13426786 13336162 13440099 13489643 12950170 12630169 12616281 12262316 11919627 11594532
4515A1594532j7061q5816K01191j78165k90952k12035j19900m11281L4043n5089
$$ 11594532 11577471 11491655 11692846 11514681 11223729 11011694 10891794 10480513 10514556 10459467
4505A0459467j9416l31068k52737R6288j44980k8553q0247Q7147k28117l55200
$$ 10459467 10440051 10108983 9856246 9952534 9807554 9779001 9698754 9785901 9557784 9202584
4495I202584k25788J81895P6313Q5187J40832q5446l27720p570K6010j86974n5475
$$ 9202584 8976796 9158691 9235004 9320191 9461023 9375577 9047857 9040287 9066297 8879323 8823848
4484H823848J94912r5574J60422J05805j76330K29082m5028j71351k14919L2003
$$ 8823848 9018760 8923186 9083608 9189413 9013083 9242165 9197137 9025786 8810867 8842870
4474H842870J87366k26748R2966K85024K11993k98351L1803l0166K54969k50764
$$ 8842870 9030236 8803488 8896454 9181478 9393471 9095120 9126923 9096757 9351726 9100962
4464I100962j69982J01368L63044K14940O7673n6973J03760n6951N1429m5325
$$ 9100962 8930980 9032348 9395392 9610332 9678005 9621032 9724792 9667841 9719270 9673945
4454I673945q5046j40561L25072L03972q6846P1819L60725J99393k87305P9745
$$ 9673945 9588899 9448338 9773410 10077382 9990536 10062355 10423080 10622473 10335168 10414913
4444A0414913N2414N0446J30581L49647J60063m6975J51533k8700R4293K53381
$$ 10414913 10467327 10517773 10648354 10998001 11158064 11111089 11262622 11233922 11328215 11581596
4434A1581596K1122O9422J60429l4950K73726L27584J10964J04358K7381K33327
$$ 11581596 11602718 11672140 11832569 11797619 12071345 12398929 12509893 12614251 12641632 12874959
4424A2874959Q2244J05747P9358K30972J72124J76481L76139J53629N198K91388
$$ 12874959 12957203 13062950 13142308 13373280 13545404 13721885 14098024 14251653 14256851 14548239
4414A4548239Q3107P6724J33230o58J82195L47770J29957L55638j9825j40042
$$ 14548239 14631346 14708070 14841300 14840642 15022837 15370607 15500564 15856202 15836377 15696335
4404A5696335J89794L28145Q6506k5422J83639K68845j38282p9309K4213L04126
$$ 15696335 15886129 16214274 16300780 16275358 16458997 16727842 16589560 16510251 16534464 16838590
4394A6838590K27590k08688K52208M35039K50619M4308l5585L57062N48239M61732
$$ 16838590 17066180 16857492 17109700 17544739 17795358 17839666 17804081 18161143 18709382 19171114
4384A9171114K7434j171K12037O0184K11387K79647K92316K3742j84985o4280
$$ 19171114 19198548 19197377 19409414 19469598 19680985 19960632 20252948 20276690 20091705 20027425
4374B0027425K22620J86698q7257j36668J71183Q6807M1174j38528M18395M49146
$$ 20027425 20250045 20436743 20349486 20212818 20384001 20470808 20511982 20373454 20791849 21240995
4364B1240995J25471J20392L11269J35304L27407J54642J88962J07090L03139
$$ 21240995 21366466 21486858 21798127 21933431 22260838 22415480 22604442 22711532 23014671
4355B3014671K87621L11364Q3469N0346K31360J91549L98719K63113K04122M62085
$$ 23014671 23302292 23613656 23697125 23747471 23978831 24170380 24569099 24832212 25036334 25498419
4345B5498419k7171K1755K63718n970p419j54260J74673J33553J9709j66325K25075
$$ 25498419 25471248 25493003 25756721 25750751 25743332 25589072 25763745 25897298 25917007 25750682 25975757
4334B5975757L14961o4582j9718K60133J51495M8185l62890J9927R1986k04631
$$ 25975757 26290718 26226136 26206418 26466551 26618046 26666231 26303341 26323268 26415254 26210623
$$ [...]
##END NTUPLES=NMR SPECTRUM
##END=
