##TITLE=1H_EC-3343-Oc
 200.13MHz, DMSO,
 8 sc
 
 11.2.2025
##JCAMPDX= 6.0         $$ Bruker NMR JCAMP-DX V2.0
##DATA TYPE= NMR SPECTRUM
##DATA CLASS= NTUPLES
##ORIGIN= UXNMR, Bruker Analytische Messtechnik GmbH
##OWNER= pz
$$ XWIN-NMR		Version 3.5
$$ Tue Feb 11 15:40:10 2025 Russian Standard Time (UT+4h)  she@DPX200
##.OBSERVE FREQUENCY= 200.1313
##.OBSERVE NUCLEUS= ^1H
##.ACQUISITION MODE= SIMULTANEOUS
##.ACQUISITION SCHEME= undefined
##.AVERAGES= 8
##.DIGITISER RES= 18
##SPECTROMETER/DATA SYSTEM= spect
##.PULSE SEQUENCE= zg30
##.SOLVENT NAME= DMSO
##.SHIFT REFERENCE= (INTERNAL, DMSO, 0, 15.5001)
##AUDIT TRAIL= $$ (NUMBER, WHEN, WHO, WHERE, WHAT)
$$ ##TITLE= Audit trail, XWIN-NMR		Version 3.5
$$ ##JCAMPDX= 5.01
$$ ##ORIGIN= Bruker BioSpin GmbH
$$ ##OWNER= she
$$ F:/spectra/data/she/nmr/H-C/1/pdata/1/auditp.txt
$$ ##AUDIT TRAIL=  $$ (NUMBER, WHEN, WHO, WHERE, WHAT)
(   1,<2025-02-11 15:38:38.65 +0400>,<she>,<DPX200>,
      <created by zg, POWCHK disabled, PULCHK disabled
       configuration hash MD5:
       00 E9 B6 7A A2 85 ED C7 34 08 36 98 17 FE 4E 26
       data hash MD5: 16K
       50 5B AF EB 49 7B 9A 4E 17 77 AC 6C ED BD 70 FB>)
(   2,<2025-02-11 15:38:41.14 +0400>,<she>,<DPX200>,
      <Start of raw data processing
       efp BC_mod = 2 LB = 0.25 FT_mod = 6 PKNL = 1 PHC0 = -469.9567 PHC1 = 11.19221 SI = 16K 
       data hash MD5: 16K
       AA 87 87 E9 1E 5D CD 4B 26 CD 68 5B 7E 6A E3 C6>)
(   3,<2025-02-11 15:39:04.75 +0400>,<she>,<DPX200>,
      <pk PHC0 = 2.021711 PHC1 = -3.2 
       data hash MD5: 16K
       FA 62 67 AB A9 11 7C AE 8D A9 4F B9 6E 92 A8 05>)
(   4,<2025-02-11 15:39:08.25 +0400>,<she>,<DPX200>,
      <abs ABSG = 5 
       data hash MD5: 16K
       7A F3 E6 9C 19 CA AB C1 80 E4 31 EB 4A 5F AB 8A>)
(   5,<2025-02-11 15:39:42.98 +0400>,<she>,<DPX200>,
      <abs ABSG = 5 
       data hash MD5: 16K
       6E 59 3E 7A 19 70 E3 EB 19 DA E3 C2 48 1C 4C 5E>)
$$ ##END=
$$ 
$$ hash MD5
$$ 29 6A 85 22 91 B6 62 6A 27 F4 98 48 1C 1F CA 2A
##$RELAX= 
##$RELAX= 
##$RELAX= 
##$RELAX= 
##$RELAX= 
##$RELAX= 
$$ Bruker specific parameters
$$ --------------------------
##$DU= <F:/spectra>
##$EXPNO= 1
##$NAME= <H-C>
##$PROCNO= 1
##$TYPE= <nmr>
##$USER= <she>
##$AMP= (0..31)
100 100 100 100 100 100 100 100 100 100 100 100 100 100 100 100 100 100 
100 100 100 100 100 100 100 100 100 100 100 100 100 100 
##$AQSEQ= 0
##$AQ_mod= 1
##$AUNM= <au_zg>
##$AUTOPOS= <>
##$BF1= 200.13
##$BF2= 200.13
##$BF3= 200.13
##$BF4= 200.13
##$BF5= 200.13
##$BF6= 200.13
##$BF7= 200.13
##$BF8= 200.13
##$BYTORDA= 1
##$CFDGTYP= 0
##$CFRGTYP= 5
##$CHEMSTR= <none>
##$CNST= (0..31)
1 1 145 1 1 1 1 1 1 1 1 1 1 1 1 1 1 1 1 1 1 1 1 1 1 1 1 1 1 1 1 1 
##$CPDPRG= <>
##$CPDPRG1= <>
##$CPDPRG2= <>
##$CPDPRG3= <>
##$CPDPRG4= <mlev>
##$CPDPRG5= <mlev>
##$CPDPRG6= <mlev>
##$CPDPRG7= <mlev>
##$CPDPRG8= <mlev>
##$CPDPRGB= <>
##$CPDPRGT= <>
##$D= (0..31)
0 0.7 0 0 0 0 0 0 0 0 0 0.03 0 0 0 0 0 0 0 0 0 0 0 0 0 0 0 0 0 0 0 0 
##$DATE= 1739273918
##$DBL= (0..7)
$$ [...]
##$SUBNAM3= <"">
##$SUBNAM4= <"">
##$SUBNAM5= <"">
##$SUBNAM6= <"">
##$SUBNAM7= <"">
##$SUBNAM8= <"">
##$SUBNAM9= <"">
##$SW= 18.0517328524113
##$SWIBOX= (0..15)
0 0 2 0 0 0 0 0 0 0 0 0 0 0 0 0 
##$SW_h= 3612.71676300578
##$TD= 16384
##$TD0= 1
##$TE= 0
##$TE2= 300
##$TE3= 300
##$TEG= 300
##$TL= (0..7)
0 120 120 120 120 120 120 120 
##$TP= (0..7)
150 150 150 150 150 150 150 150 
##$TP07= 0
##$TPNAME0= <>
##$TPNAME1= <>
##$TPNAME2= <>
##$TPNAME3= <>
##$TPNAME4= <>
##$TPNAME5= <>
##$TPNAME6= <>
##$TPNAME7= <>
##$TPOAL= (0..7)
0.5 0.5 0.5 0.5 0.5 0.5 0.5 0.5 
##$TPOFFS= (0..7)
0 0 0 0 0 0 0 0 
##$TUNHIN= 0
##$TUNHOUT= 0
##$TUNXOUT= 0
##$USERA1= <user>
##$USERA2= <user>
##$USERA3= <user>
##$USERA4= <user>
##$USERA5= <user>
##$V9= 5
##$VALIST= <valist>
##$VCLIST= <CCCCCCCCCCCCCCC>
##$VD= 0
##$VDLIST= <DDDDDDDDDDDDDDD>
##$VPLIST= <PPPPPPPPPPPPPPP>
##$VTLIST= <TTTTTTTTTTTTTTT>
##$WBST= 1024
##$WBSW= 4
##$XGAIN= (0..3)
0 0 0 0 
##$XL= 0
##$YL= 0
##$YMAX_a= 364095
##$YMIN_a= -339522
##$ZGOPTNS= <>
##$ZL1= 120
##$ZL2= 120
##$ZL3= 120
##$ZL4= 120
##$ABSF1= 15.50011
##$ABSF2= -2.55174
##$ABSG= 5
##$ABSL= 3
##$ALPHA= 0
##$AQORDER= 0
##$ASSFAC= 0
##$ASSFACI= 0
##$ASSFACX= 0
##$ASSWID= 0
##$AUNMP= <proc_1d>
##$AZFE= 0.1
##$AZFW= 0.1
##$BCFW= 0
##$BC_mod= 2
##$BYTORDP= 0
##$COROFFS= 0
##$CY= -3
##$DATMOD= 1
##$DC= 0
##$DFILT= <>
##$DTYPP= 0
##$F1P= 0
##$F2P= 0
##$FCOR= 1
##$FTSIZE= 16384
##$FT_mod= 6
##$GAMMA= 0
##$GB= 0
##$INTBC= 1
##$INTSCL= 3.241238e-09
##$ISEN= 128
##$LB= 0.25
##$LEV0= 0
##$LPBIN= 0
##$MAXI= 10000
##$MC2= 0
##$MEAN= 0
##$ME_mod= 0
##$MI= 1.114404
##$NCOEF= 0
##$NC_proc= -4
##$NLEV= 6
##$NOISF1= 3.799351
##$NOISF2= 2.8
##$NSP= 0
##$NTH_PI= 0
##$NZP= 0
##$OFFSET= 15.50011
##$PC= 1
##$PHC0= -467.935
##$PHC1= 7.99221
##$PH_mod= 1
##$PKNL= yes
##$PPARMOD= 0
##$PSCAL= 0
##$PSIGN= 0
##$REVERSE= no
##$SF= 200.130004321612
##$SI= 16384
##$SIGF1= 3
##$SIGF2= 2
##$SINO= 0.751879
##$SIOLD= 32768
##$SREGLST= <19F.Aceton>
##$SSB= 0
##$STSI= 16384
##$STSR= 0
##$SW_p= 3612.71676300578
##$SYMM= 0
##$S_DEV= 0
##$TDeff= 16384
##$TDoff= 0
##$TI= <>
##$TILT= no
##$TM1= 0
##$TM2= 0
##$TOPLEV= 0
##$USERP1= <user>
##$USERP2= <user>
##$USERP3= <user>
##$USERP4= <user>
##$USERP5= <user>
##$WDW= 1
##$XDIM= 16384
##$YMAX_p= 355050489
##$YMIN_p= -97723
$$ End of Bruker specific parameters
$$ ---------------------------------
##NTUPLES= NMR SPECTRUM
##VAR_NAME=  FREQUENCY,     SPECTRUM/REAL,   SPECTRUM/IMAG
##SYMBOL=    X,             R,               I
##VAR_TYPE=  INDEPENDENT,   DEPENDENT,       DEPENDENT
##VAR_FORM=  AFFN,          ASDF,            ASDF
##VAR_DIM=   16384,         16384,           16384
##UNITS=     HZ,            ARBITRARY UNITS, ARBITRARY UNITS
##FACTOR=    0.220516191357247, 1,           1
##FIRST=     3102.03701575217, 0,            0
##LAST=      -510.679747253612, 0,           0
##MIN=       -510.679747253612, -97723,      0
##MAX=       3102.03701575217, 355050489,    0
$$ Real data points
##PAGE= N=1
##DATA TABLE= (X++(R..R)), XYDATA
$$ [...]
9071B482887j12786j13739j03584q1813j45899j39568j59021j12808p1089m8938
9061A393642o7405p6497l6506m0482m3502n7955o0429j2205k9154l1226j1735
9050I26546j2573j9445l5706j7409r71K570m4705k2024Q980j3646q658K893r269
9037G56583j889J3192j0568O934J0915l5437j6176k037n907L9937j3051r799K0319
9024G53016j1362j0929J6923j526L2702L6370Q276L7252r200K6846M9995L4721
9012I63084Q975N6075K7050J8532J6723N9929K4946M0003O7100Q8412N8586L4318
9000A463733P6677N0422J01341R2909J32179J04404R9229Q2638J13246J75740
8990B492518J40975J76086J90084K07694K17878K59100K68312K16253K37512K83467
$$ plain form
9071 2482887 2370101 2256362 2152778 2070965 1925066 1785498 1626477 1513669 1442580 1393642
9061 1393642 1326237 1249740 1213234 1172752 1129250 1071295 1010866 998661 969507 938281 926546
9050 926546 913973 894528 858822 841413 840442 843012 798307 776283 785263 771617 762959 765852 756583
9037 756583 754694 767886 757318 764252 775167 739730 723554 721517 715610 755547 742496 732697 753016
9024 753016 741654 730725 747648 746122 778824 815194 823470 860722 851522 878368 928363 963084
9012 963084 972059 1028134 1055184 1073716 1090439 1150368 1175314 1215317 1282417 1370829 1429415 1463733
9000 1463733 1540410 1590832 1692173 1785082 1917261 2021665 2120894 2203532 2316778 2492518
8990 2492518 2633493 2809579 2999663 3207357 3425235 3684335 3952647 4168900 4406412 4689879
8980D689879K73278K12571L11278M00419M09481M49901M91436N14128N53540N40919
8970H846830M66723M04899L08754R5483q2155k97598m24584n14711n31585n81086
8960G690970o10872n20504m92643m69944m00865l58763l40273k54013k95892k66773
8950C680428j75482j60777j19966j41888j07797m9213p3516o5427r2289j28592
8940B565481j74500j26308j35769j55303j46091q7520n8830o5858p9086p2938
8930A463278q8865p0475l0392r7488l3511j2159l0893m5368l8133j9480m2040
8919I54474k6544o7989l1779r62o712m4046l5241m1891K877J58j9441j1115j4627
8906F57162k335k0725k9455l139K4493k8262p1602j2026J9999q693J1504M563
$$ plain form
8980 4689879 4963157 5175728 5487006 5887425 6296906 6746807 7238243 7752371 8305911 8846830
8970 8846830 9313553 9718452 10027206 10122689 10040534 9742936 9318352 8803641 8272056 7690970
8960 7690970 7080098 6559594 6066951 5597007 5196142 4837379 4497106 4243093 3947201 3680428
8950 3680428 3504946 3344169 3224203 3082315 2974518 2925305 2851789 2786362 2694073 2565481
8940 2565481 2390981 2264673 2128904 1973601 1827510 1739990 1681160 1615302 1536216 1463278
8930 1463278 1374413 1303938 1273546 1176058 1142547 1130388 1099495 1054127 1015994 996514 954474
8919 954474 927930 859941 828162 827200 820488 776442 741201 699310 702187 702345 682904 671789 657162
8906 657162 654827 634102 604647 601508 626001 597739 526137 514111 534110 525417 536921 541484
8894E41484M408K0360K424j9974J0805l0245l0535n6174p930L3697O340p03k3088
8881D50869k5209j3767J3673Q006o383J6799Q370j7606K1007j0635j2812R962
8869D42274j3390J9078O484L759o6541j0742j1691k677O444O047K708l6860j724
8856C43169J5441K1490o15K3202k3344P186K0992R441q647J91q224J7939j1079
8843D07142l3364R188K3024J9093j0222J7280l1118k9229J348K7358O664L893
8831D11057J0042j882J8238k289k1610M954J6768p182J269j8595J8427J5304q655
8818D35846K6021K9411K5025L17j1549m007N200L947L0602J2789K8334J0242K1376
8805F13554M8293K2929j2421K0902J3764k4524R61J7404L2023k7240L7229M1637
$$ plain form
8894 541484 545892 566252 568676 548702 559507 529262 498727 442553 434623 468320 474660 473957 450869
8881 450869 425660 411893 425566 433572 427189 443988 452358 434752 455759 445124 432312 442274
8869 442274 428884 447962 454446 458205 391664 380922 369231 366554 372998 379045 381753 344893 343169
8856 343169 358610 380100 379485 402687 379343 386529 407521 416962 408315 408506 400282 418221 407142
8843 407142 373778 382966 405990 425083 414861 432141 401023 371794 373142 400500 407164 411057
8831 411057 421099 419217 437455 435166 413556 418510 435278 428096 429365 410770 429197 444501 435846
8818 435846 461867 491278 516303 516620 505071 501064 506264 510211 540813 553602 581936 592178 613554
8805 613554 661847 684776 672355 693257 707021 682497 683458 700862 732885 705645 742874 784511
8793G84511K6634J1565m2425J8460Q550o270M4638L4879J4203M5814K2354p12
8781I62201K726K7043M7847K7863L0719L6739P0024O5374K6700N7863P6552M4131
8769A475782Q5275O4647Q1526Q8014J11820P9520J02355J26636J22181J17887
8759B455643J49906J30775J42875J91373J72006K24577J95850K17761K40410K52223
8749D373399K51712K87120L28273L64907L94382M14193M67966M40719L89437M02593
8739H114701L11975K24989J39846J9445j02967k39634l01001l52345m20747m36766
8729F957496m42825m48704m42502l85738l72451l30252k88607k51512j99849j77119
8719C617937j80202j02098j07198j36072j01381r4799j36799j58572j35911j48083
$$ plain form
8793 784511 811145 822710 780285 798745 807295 801025 845663 880542 894745 940559 962913 962201
8781 962201 964927 991970 1039817 1067680 1098399 1135138 1205162 1270536 1297236 1355099 1431651 1475782
8769 1475782 1561057 1625704 1707230 1795244 1907064 1986584 2088939 2215575 2337756 2455643
8759 2455643 2605549 2736324 2879199 3070572 3242578 3467155 3663005 3880766 4121176 4373399
8749 4373399 4625111 4912231 5240504 5605411 5999793 6413986 6881952 7322671 7712108 8114701
8739 8114701 8426676 8651665 8791511 8810956 8707989 8468355 8167354 7815009 7394262 6957496
8729 6957496 6514671 6065967 5623465 5237727 4865276 4535024 4246417 3994905 3795056 3617937
8719 3617937 3437735 3335637 3228439 3092367 2990986 2896187 2759388 2600816 2464905 2316822
8709B316822j22714q8762j06212j04196j01969q7498n3805r6437p7721o5691n3932
8698A357885l8069m3269p2073l1134k0537m5263l2037M763J9914k9974l4831j0583
8686A024792N749M759l183l0679n915k2735j2980M7054N69k9916J8395M2264j5953
8673A022221o800l5406m4145o8592p9297n2462n7270q3145R202j2528k2258l6155
8661E33365m1311O352M546m3171k9595k7139p547J0594n391J4551q080l0789k4813
8648C51572k0469J4460J2793k1800j5620l5587j0225j7795J7327J9910l5233k6100
8636B33233N346n560M6836l869L374j4234J4595j2804o588k5215J4101r474l2730
8623B07011K0445M345K0273j5431j6222J685J5907J3577k9747j1619j5154J4199
$$ plain form
8709 2316822 2194108 2105346 1999134 1894938 1792969 1705471 1651666 1555229 1477508 1411817 1357885
8698 1357885 1319816 1276547 1204474 1173340 1152803 1107540 1075503 1080266 1100180 1070206 1035375 1024792
8686 1024792 1030541 1035300 1032117 1001438 995523 972788 959808 1006862 1007431 977515 995910 1038174 1022221
8673 1022221 1015421 980015 935870 867278 787981 735519 678249 595104 604306 591778 569520 533365
8661 533365 492054 498406 502952 459781 430186 403047 395500 406094 400703 415254 407174 376385 351572
8648 351572 331103 345563 358356 336556 320936 285349 275124 257329 274656 294566 259333 233233
8636 233233 238579 233019 279855 275986 279360 265126 279721 266917 260329 235114 249215 239741 207011
8623 207011 227456 231801 252074 236643 220421 222106 238013 251590 221843 210224 195070 209269
8611B09269J4651j6868J1785P264J5671l584k2939k6948J5699R596p284m323j9807
8598A82182Q873K1229l1111j4026j430O598j2928K2742J3485p309j34l2285j9118
8585A36768P287K9451k5087k7412k6638L4686L3356l2466J0904j432r205J9224
8573A49436L29j7962P625k9820K452M1980N878j8878o867L517j612j7958q590
8560A09530r1R624L0561M66o708R451K88n2377k2477J6771K0195J2528l5173k6236
8546F6352J3843K758J3805j6150j0352j1441J4774j8324l915K7744k2886l2342
8534B3866o739J5054j9305M9894j0905J631M2192k6916l2780K6714o555j1824
8522D4327K0895M045q690L5233l339j9360r664J023O904k0259L1118o26J105l652
$$ plain form
8611 209269 223920 207052 218837 226101 241772 238188 215249 188301 204000 213596 206312 201989 182182
8598 182182 191055 212284 181173 167147 165717 172315 159387 182129 195614 188305 188171 155886 136768
8585 136768 144055 173506 148419 121007 94369 129055 162411 129945 140849 139417 130212 149436
8573 149436 149765 131803 139428 109608 112060 154040 159918 141040 134173 137690 136078 118120 109530
8560 109530 109439 119063 149624 150090 143382 152833 153121 100744 78267 95038 115233 127761 92588 66352
8546 66352 80195 82953 96758 80608 70256 58815 73589 55265 51350 79094 56208 23866
8534 23866 17127 32181 12876 62770 51865 53496 95688 68772 35992 62706 56151 44327
8522 44327 65222 69267 60577 95810 92471 73111 63447 64470 71374 51115 82233 81607 82712 79060
8508G9060M35M958k9670o247j7351j2930J0971K9300l7931j0558q975K0236J1842
8495C3140J8724j9193l3387J7011K6044J5878k7862o817O251L253K346J1458k1638
8482B5208j2405r114K1091M140o526k3059k599M8673j5104o109k644J4734K1474
8469E7760j246j8073j9631j8232j8669L6976M1896J2113j4235l4631K6232k834
8457D7426m0222o784k0665J0099l628K6384Q056K1410m1156j1289R377R975K1086
8444C0069L107j9257J708n232j7658J6941J6219J0819K4047l5998o831K6872O816
8431E1622n021M906l4170K9480p369k4132K0695j3666o257P088j2075j0406J8148
8418A8843r112j1075J3532j7348J7092M0742k6736j664J3170J06j4727K0959K9859
$$ plain form
8508 79060 79495 84453 54783 48536 31185 18255 29226 58526 20595 10037 1062 21298 33140
8495 33140 51864 32671 -716 16295 42339 58217 30355 23538 29789 33042 35388 46846 25208
8482 25208 12803 3689 24780 28920 22394 -665 -3264 45409 30305 24196 21552 36286 57760
8469 57760 56514 38441 18810 578 -18091 18885 60781 72894 58659 24028 50260 47426
8457 47426 7204 420 -20245 -10146 -13774 12610 20666 42076 920 -10369 -992 8983 30069
8444 30069 33176 13919 15627 10395 -7263 9678 25897 36716 60763 24765 17934 44806 51622
8431 51622 46601 51507 17337 46817 39448 15316 36011 22345 16088 23176 11101 695 18843
8418 18843 9731 -1344 12188 -5160 11932 52674 25938 24274 37444 37550 22823 43782 73641
8405G3641l7125j8724K0739M074K0659l9087J2706m236N769J4742q702m5145P998
8392G309L1030k4529k4328Q499K5440j1559k4307K195O8950J6577l2889j5572
8380B6816j4989R76o521N419J518P561P199m570j9466k572K2340J7209l4150j012
8366E758J8770J1554j0572K659n342k3693p300J712l766k0004K8497J2532j7925
8353g120J1109N292J952j0941P44l8394j7685M5109J9195L337l3409o818Q586
8340a9043J1306N08K248m18K1562K0448l8959N505K2784K9j7874M977p612k2964
8326a7503n034K602j4216J4298J138P166P445j5492o967J1312K4422j370Q018
8313A5819j1368J9003k4066j3465K5909J5704P192k4434N172k1110l922K7627
$$ plain form
8405 73641 36516 17792 38531 42605 63264 24177 36883 32647 38416 53158 44456 -689 7309
8392 7309 38339 13810 -10518 -2019 23421 11862 -12445 -10250 58700 75277 42388 26816
8380 26816 11827 12803 6282 11701 13219 20780 27979 23409 3943 1371 23711 40920 6770 5758
8366 5758 24528 36082 25510 28169 22827 -866 -8166 -6454 -10220 -30224 -1727 10805 -7120
8353 -7120 3989 9281 11233 292 1036 -37358 -55043 -9934 9261 12598 -20811 -27629 -19043
8340 -19043 -7737 -7229 -4981 -5399 16163 36611 -2348 3157 25941 25970 8096 13073 5461 -17503
8326 -17503 -22537 -19935 -34151 -19853 -18715 -11549 -4104 -19596 -26563 -15251 9171 7801 15819
8313 15819 4451 23454 -612 -14077 11832 27536 34728 10294 15466 -5644 -9566 18061
8301A8061j3620l098R180K5149j8506j2277k262J3158L9326l3231k6128j4943
8289a9191N823k0255J0314L1772l4838j2400j3884L1172J2780J7972j962j628
8277E675R356k0989k3128P779O364k787l854j159M01J8433m6259j0452K6435m567
8263c8752j9727j2039K9008k4100J4491N7152j526K5602r749l1856r937L786j9828
8250c7475L6033j2921l1935K8064M0703j4019o1362R480j5157J2108R520L0666
8238f295M864j7578m568k7609J775K5714k244Q196L581k3548J6937K1294j7922
8225a7403r806R692K6960k9559J3641J8677l3309p504J7586j630n216k412K8300
8212H017N560N076J164J0533k811r218k968K3587j8659k2021j7281K1208q269
$$ plain form
8301 18061 4441 1343 10523 35672 17166 4889 2627 15785 55111 21880 -4248 -19191
8289 -19191 -13368 -33623 -23309 8463 -26375 -38775 -52659 -21487 -8707 9265 7303 5675
8277 5675 15031 -5958 -29086 -21307 -14943 -17730 -21584 -22743 -22342 -3909 -50168 -60620 -34185 -38752
8263 -38752 -58479 -70518 -41510 -65610 -51119 6033 4507 30109 20360 -11496 -21433 -17647 -37475
8250 -37475 -1442 -14363 -46298 -18234 22469 8450 -52912 -43432 -58589 -46481 -36961 -6295
8238 -6295 -1431 -19009 -23577 -51186 -49411 -23697 -25941 -17745 -14164 -37712 -20775 519 -17403
8225 -17403 -27209 -17517 9443 -20116 -6475 12202 -21107 -28611 -11025 -12655 -17871 -20283 8017
8212 8017 13577 18653 19817 30350 27539 18321 15353 38940 20281 -1740 -19021 2187 -6082
8199f082K1182j4442M3037j3606m404K8645K22493J17242l66788m8761k437J2793
8187a1128l8733K4176j2919j9136L8441k3369j2745K8380K4142r047L844l0631
8175c8725R939L19P949K1303m7222k277J6208J1837j9615l91L1413j9815m831
8162c3908j3552J1085N1422r862q936J9995j8033j0051K4198q105j0255P381j3483
8149a2104k7777K0251p76m2131K9811J1592P83P67L4227k7013j8559j1506P21
8136d1714R432K4863o247K752m130j2103J0620K6402j2048k083q054Q583J4063
8123A0336r470n291O762p27m1828l4174K6337M8102K207q649K930J289j1898j9855
8109c3929j1927J6094K4511J6000n606j9769J0360j0713j7571N881J4171J5676
$$ plain form
8199 -6082 15100 658 43695 30089 25685 54330 276823 394065 27277 -21484 -23921 -11128
8187 -11128 -49861 -25685 -38604 -57740 -19299 -42668 -55413 -27033 -2891 -11938 -8094 -38725
8175 -38725 -28786 -28467 -20518 785 -46437 -48714 -32506 -20669 -40284 -40675 -9262 -29077 -33908
8162 -33908 -47460 -36375 15047 5185 -3751 16244 -1789 -11840 12358 4253 -6002 1379 -12104
8149 -12104 -39881 -19630 -20406 -62537 -32726 -21134 -20351 -19584 14643 -12370 -30929 -42435 -41714
8136 -41714 -32282 -7419 -13666 -10914 -15044 -27147 -16527 9875 -2173 -4256 -12310 -3727 10336
8123 10336 866 -4425 2337 1610 -40218 -74392 -48055 47 2254 -6395 -3465 -2176 -14074 -33929
8109 -33929 -45856 -29762 -5251 10749 5143 -14626 -4266 -14979 -32550 -26669 -12498 3178
8097C178j8190j1773J8949J295k2778o376M5279L3339m2640j2459K6851O032j1415
8084I292p051k850k2009m070J2532m6905P0199j5472k126K3143o504o223j6854
8071a4898J2637k087P228o070j0348l4319J3844M3267J3614n0621K50L41j160
8058b8322K3576l1191K1794P96j5476J3438K8164m840n205K8262k5470M683j2660
8045b451J9504j0282o624J8118J5234K3968l5704k3335o289K7242m3606l3103
8033e7328k54J1492J0748K815O079l4505l017L1695J2717R878j3217j6953J5332
8020b4518j7244k7257J7581N1904p583m0037N815j6272Q140O1701J313j6057k0141
8007b2655j6451L7472J6302j1823n711l0244k920J5230N594K3202P63p255j6786
$$ plain form
8097 3178 -15012 -26785 -7836 -6541 -29319 -35695 9584 42923 283 -12176 14675 20707 9292
8084 9292 2241 -609 -22618 -26688 -14156 -61061 9138 -6334 -8460 14683 8179 1956 -14898
8071 -14898 -2261 -4348 2880 -3190 -13538 -47857 -34013 9254 22868 -27753 -27503 -27162 -28322
8058 -28322 -4746 -35937 -14143 -13347 -28823 -15385 12779 7939 2734 30996 5526 10209 -2451
8045 -2451 17053 6771 147 18265 33499 57467 21763 -1572 -7861 19381 -24225 -57328
8033 -57328 -57582 -46090 -35342 -32527 -26448 -60953 -63970 -32275 -19558 -9680 -22897 -39850 -24518
8020 -24518 -41762 -69019 -51438 466 -7117 -47154 -41339 -57611 -49471 12230 13543 -2514 -22655
8007 -22655 -39106 -1634 14668 2845 -2866 -33110 -36030 -20800 -15206 7996 8759 1504 -15282
7994a5282m023N816o989J0227J8396J2421J9660K4118m9781k5508j7139o596J219
7981c3461j1815K9886j5846K4671P10L207P514j418l8341J1528J286l34l4758
7968e7171n744L3861J892P957L3700k03n376J0717N63P127k7916j3928L0386O790
7954B2655m3525J670K7618J4913j1693l9506k0274J4131R520R644K395J228K5831
7941A4607l4203j0071N8086l0032n278j891K2305r412j1981r793l900j537r597
7928c2697N112K5393m432K451m761r662o451J0616J4449k5477j6336K3288j5523
7915c4030n50J0180K8889k7448J9665k4276j1743J0129N62K0112L508L6896R241
7902D1135m5366j3951K556k247O414j2422j186J1066K6349k2683q020o973k3038
$$ plain form
7994 -15282 -19305 -13489 -20478 -10251 8145 20566 40226 64344 14563 -10945 -28084 -34680 -33461
7981 -33461 -45276 -15390 -31236 -6565 -5855 -2648 4866 3448 -34893 -23365 -22079 -22413 -57171
7968 -57171 -62915 -29054 -27162 -19205 14495 14292 8916 19633 20196 27323 -593 -14521 15865 22655
7954 22655 -20870 -19200 8418 23331 11638 -27868 -48142 -34011 -24491 -14847 -12452 -11224 14607
7941 14607 -19596 -29667 28419 -1613 -6891 -8782 13523 4111 -7870 -17663 -21563 -23100 -32697
7928 -32697 -27585 -2192 -6624 -4173 -8934 -18596 -25047 -14431 18 -25459 -41795 -18507 -34030
7915 -34030 -34580 -24400 4489 -22959 -3294 -27570 -39313 -29184 -28622 -8510 -5002 31894 41135
7902 41135 -4231 -18182 -15626 -17873 -11459 -23881 -25067 -14001 12348 -10335 -18355 -25328 -48366
7889d8366L3398J6798j4256j5744R440j6993J678J8826k0915r94K1230K9795Q954
7876B2851j1213l5619n384j3377J4153M136J5753K540P21J7794N152n60r785K8547
7862C5709j3311j3860j5458K069J9929k0712J6660J718M93k6029p781j682k2801
7849d5056K0296N4615m7159p635m968R13J0602j0198K0020k9141K5480K8320j9513
7836c424l340J3462K642j5247k1289L4806J0016l3474k296j0051K2330l9260P235
7823c7890L7607j6603l4258l420j9403P1448m382j7636P164L33P301J2447m308
7810a600l381n217q648o434n480m3362o366N8771J2721k1893j5520L594J3065
7797b9750l299J7664q958J141L365J0909J5514o000k553m168j0474k5691M4296
$$ plain form
7889 -48366 -14968 1830 -12426 -28170 -18730 -35723 -34045 -15219 -36134 -37128 -15898 13897 22851
7876 22851 11638 -23981 -29365 -42742 -28589 -24453 -8700 -6160 -5439 12355 17507 16947 7162 35709
7862 35709 22398 8538 -6920 -4851 15078 -5634 11026 12744 13237 -12792 -20573 -22255 -45056
7849 -45056 -24760 29855 -17304 -24939 -29907 -28994 -18392 -28590 -8570 -37711 -12231 16089 -3424
7836 -3424 -6764 6698 9340 -5907 -27196 7610 17626 -15848 -18144 -28195 -5865 -45125 -37890
7823 -37890 -283 -16886 -51144 -54564 -73967 -2519 -6901 -24537 -17373 -17040 -9739 2708 -1600
7810 -1600 -4981 -10198 -18846 -25280 -30760 -74122 -80488 -21717 -8996 -30889 -46409 -42815 -29750
7797 -29750 -33049 -15385 -24343 -23202 -19837 -8928 6586 586 -1967 -6135 -16609 -42300 1996
7784A996J4570l5006k6374M368p814L4718l7668o056O924J2255K0255n676k029
7771b5537L3527p753p611J883N157k3176q105n837Q993j1996K5518j1426j5622
7758d1985K2425N412k2882L4144j3750L555K608j2394k073J6826K5377M867J0105
7745C2235l2334m124j3713L618j0475k2973L972M7634J370k4221O003J1192k319
7732d135J965k9119J9093M4620j9199j6231k1224O907N334L577k1128l0907K8858
7719c1589j16k7248L638L7036Q564l3960J148J6453J5745R350J3581k2987k705
7706a3090L0013j4046j7462k3352L1673K1131l8914L7448M552j5050j5008J9570
7694G465J2022l9340K855K8772J6673k5500P427j4188M3214Q990k9280k5327L27
$$ plain form
7784 1996 16566 -18440 -44814 -40446 -48260 -13542 -51210 -57266 -50342 -38087 -17832 -23508 -25537
7771 -25537 7990 237 -7374 -5491 -334 -23510 -31615 -37452 -28459 -40455 -14937 -26363 -41985
7758 -41985 -19560 -14148 -37030 -2886 -16636 -13081 -10473 -22867 -24940 -8114 17263 22130 32235
7745 32235 -99 -4223 -17936 -14318 -24793 -47766 -43794 3840 5210 -19011 -13008 -1816 -4135
7732 -4135 -2170 -31289 -12196 32424 13225 -3006 -24230 -17323 -11989 -8412 -29540 -60447 -31589
7719 -31589 -31705 -58953 -55315 -18279 -9715 -43675 -42527 -26074 -10329 -979 12602 -10385 -13090
7706 -13090 16923 2877 -14585 -37937 -6264 14867 -24047 13401 17953 2903 -12105 7465
7694 7465 19487 -19853 -16998 11774 28447 2947 10374 -3814 39400 48390 19110 -6217 -5890
7681e890N822j5557r164k62j332K4346J0526k1745J5910J7583j0792k6995q429
7668b5979Q674k6353r551N700K3081l634J7454M169O085J7960l086j9839j3758
7655a9077P675o750J617k330J0367K6817k955N906p644k1243K4794J9110l4302
7642A985m8739j051M8958k07j7111J9149J4028j7951j7772J8553l1950j6034M7962
7629a80m201j1744q37L721m037r020K4780J8092j9563k5429K5198j5423j8611
7616c7254K030J5957O611L4269J5328k7362p283k0997k6797L4145K2106j8407
7604g654P229n013K9805j4131K8849K821n706k635n5733j2259o657K3012J843
7591a6229N598K810j6745j235J0162R126l719k1682J0140N971J2294j4062J8666
$$ plain form
7681 -5890 -68 -15625 -24789 -25051 -26383 -2037 8489 -13256 2654 20237 9445 -17550 -25979
7668 -25979 -17305 -43658 -53209 -47509 -24428 -28062 -10608 -6439 -354 17606 14520 -5319 -19077
7655 -19077 -11402 -18152 -16535 -18865 -8498 18319 15364 21270 13626 -7617 17177 36287 1985
7642 1985 -46754 -47805 1153 946 -16165 2984 17012 -939 -18711 -158 -32108 -48142 -180
7629 -180 -4381 -16125 -16962 -13241 -17278 -26298 -1518 16574 -2989 -28418 -3220 -18643 -37254
7616 -37254 -35224 -19267 -12656 21613 36941 9579 2296 -18701 -45498 -11353 10753 -7654
7604 -7654 -425 -5438 24367 10236 39085 41906 36200 33565 -22168 -34427 -41084 -18072 -16229
7591 -16229 -10631 -7821 -24566 -25801 -15639 -6513 -10232 -31914 -21774 -15803 -3509 -17571 1095
7578A095r62M111m6682j2672M5464j4432m6666k44K8213L860J3972l1582J4043
7565d2482L3824o983L619O610J4167j365K127n225j8358q772l318J3060k5896
7552c8992j1267j1138M2201K1357k2960j718K5084j662m443J0255p27k3229O90
7539a6549L3324j3466K007M65j7642m246l7147K6762K1930K617K569J2850O563
7526B0037m5466l914K3877K1351k6738k0058J1011j1522n73p23L2249l723l3289
7513c7481J5464J7413j3297j342R116l1254M885J4895l113r477J8925l2659J4856
7500c3069p224J6784j1372k6456j1065M2750K7589j6588K2743J6823j1875k7982
7488a8942J3902Q818r63j7696P152l925J6457j6535r453J77K0159j496l6109O448
$$ plain form
7578 1095 133 4244 -42438 -55110 -9646 -24078 -70744 -70988 -42775 -38915 -24943 -56525 -42482
7565 -42482 -8658 -15641 -12022 -5412 8755 7390 9517 4292 -14066 -22838 -26156 -13096 -38992
7552 -38992 -50259 -61397 -19196 2161 -20799 -22517 2567 905 -3538 6717 5990 -17239 -16549
7539 -16549 16775 3309 5316 5781 -11861 -16107 -53254 -26492 -4562 -1945 624 13474 20037
7526 20037 -25429 -29343 -5466 15885 -10853 -30911 -19900 -31422 -31995 -32718 -469 -4192 -37481
7513 -37481 -22017 -4604 -17901 -19243 -10127 -41381 -36496 -21601 -24714 -34191 -15266 -47925 -33069
7500 -33069 -40293 -23509 -34881 -61337 -72402 -29652 -2063 -18651 4092 20915 9040 -18942
7488 -18942 -5040 3778 2815 -14881 -7729 -11654 4803 -11732 -21185 -21008 -849 -2345 -38454 -32006
7474c2006M0988l6354k0998J7016K4958k653j5132P084k4963l818k58j7620L427
7461f0329J5262J6274J4747j5137l8076M1316K0767l9621L0481n677j0474n612
7449c6079L481J2260J1370M9k320j3645J9172l182j874p560J3506R935j7585l4318
7435d6790m753L3569M622J1757p026q329j2639m051J9940l702n345O647N437K82
7421a0381P377l4270k756M496p611j7182O927L1012l692K525j0025J3174l109
7408b3515M088j4026J5921k1242q392n481K6477L730J818j5131M4785P162j8964
7395b770J2498J4158k0265L006j0418k2924j0089J6899K2702p143O651K5663J1558
7382C9526l0841k3334O552L3726m4182J474L366L5465K093l4555J9309J7857k5279
$$ plain form
7474 -32006 8982 -27372 -48370 -31354 -6396 -9049 -24181 -17097 -42060 -45878 -46136 -63756 -60329
7461 -60329 -45067 -28793 -14046 -29183 -67259 -25943 -5176 -44797 -14316 -19993 -30467 -36079
7449 -36079 -32598 -20338 -8968 -8919 -11239 -24884 -5712 -8894 -10768 -18328 -4822 5113 -12472 -46790
7435 -46790 -51543 -17974 -13352 -1595 -8621 -16950 -29589 -33640 -13700 -17402 -22747 -16100 -10663 -10381
7421 -10381 -3004 -37274 -40030 -35534 -43145 -60327 -53400 -22388 -26080 -23555 -33580 -20406 -23515
7408 -23515 -19427 -33453 -17532 -38774 -47166 -52647 -26170 -22440 -20622 -35753 9032 16194 -2770
7395 -2770 9728 23886 3621 6627 -3791 -26715 -36804 -19905 2797 -4346 2305 27968 39526
7382 39526 8685 -14649 -8097 25629 -18553 -17079 -13713 21752 23845 -10710 8599 26456 1177
7369A177M880K804k8181P964J816j7544L922m966K6619L970K557K549R470j5314
7355A723k7458J9570k561J1855O623k5940q615K9723L4564j7136m2155n422J2262
7342a2967l1125K3426J4937K0051j1795j1115J8388J1834N365O198j253l0527
7330A417k740j0184j634l2893J6280N081k3404K1862K1867K0962J2491m0526n8357
7317f9778j8903J5903L7139L9874J3944k8339l976J8449m0771j9851N3392P456
7305D539j2757J4352n5m9519n756N506O592L4481J5626k8924j2579K4442R340
7292E288k716m8351J3760J6787j318L445q820p855K1479n35L732j0393K1014k6814
7278b1297k0761K7541k9221J2701O421K1555L1259P828j4601N441j2356j024N655
$$ plain form
7369 1177 6057 8861 -19320 -11356 -9540 -27084 -23162 -28128 -1509 2461 5018 7567 17037 1723
7355 1723 -25735 -6165 -8726 3129 9752 -16188 -24803 4920 39484 22348 -19807 -25229 -12967
7342 -12967 -44092 -20666 -5729 14322 2527 -8588 9800 21634 26999 33197 31944 1417
7330 1417 -1323 -11507 -13141 -46034 -29754 -24673 -48077 -26215 -4348 16614 29105 -11421 -69778
7317 -69778 -88681 -72778 -35639 4235 18179 -10160 -14136 4313 -36458 -56309 -2917 4539
7305 4539 -8218 6134 6079 -43440 -49196 -43690 -37098 -2617 13009 -15915 -28494 -4052 5288
7292 5288 2572 -45779 -32019 -15232 -16550 -13105 -21925 -29780 -8301 -8836 -5104 -15497 5517 -21297
7278 -21297 -42058 -14517 -43738 -31037 -24616 -3061 28198 36026 21425 26866 14510 13486 19141
7265A9141j5874j113j8980J8757j983k153p253q436Q092P398n060N14q122J8100
7251C028K187q609j4666k9921j4721K133L4155K2472k6967k563j674K6453n576
7238a4269m446K5877j9208n143J9687K2980k7614J3422J0706p319l0599L4469
7226A8543j5736n193P867P614K5244k2766m1688J544K1097j8701m102J7871j0312
7213a8718R782J2897n551j6741K917J0727j646k6242p034R438K5652L0339j9027
7200F793o1711K0929J2743m893J6949N4382l764l2932j3617k9853K6j0001j0319
7187e5268Q332K1439N415J3842j0053L906J8543Q241j6129J3551R603o681K6899
7174D1640j3617k6810k573o576J3460l8824O196K1389l285l773M3885l5724J5163
$$ plain form
7265 19141 3267 2154 -16826 1931 -52 -2205 -9458 -17894 -9802 -2404 -7464 -6950 -15072 3028
7251 3028 5215 -3394 -18060 -47981 -62702 -60569 -26414 -3942 -30909 -33472 -35146 -8693 -14269
7238 -14269 -18715 7162 -12046 -17189 2498 25478 -2136 11286 21992 14673 -15926 18543
7226 18543 2807 -2386 5481 13095 38339 15573 -26115 -24571 -3474 -22175 -26277 -8406 -18718
7213 -18718 -8936 3961 -1590 -18331 -15414 -4687 -6333 -32575 -39609 -30171 -4519 25820 6793
7200 6793 -54918 -33989 -21246 -26139 -9190 45192 41428 8496 -5121 -34974 -34948 -44949 -55268
7187 -55268 -46936 -25497 -20082 -6240 -16293 -12387 6156 14397 -1732 11819 21422 14741 41640
7174 41640 28023 1213 -1360 -7936 5524 -33300 -27104 -5715 -9000 -12773 31112 -4612 10551
7161A0551j712r354q34k9130J013M358J7994p364L55N0325l1019m0388K9767K0361
7147A4923j8972P504j7086l2465M1811L7177m962l999P206k1888O245k9804j725
7134a6035L2685l348j8664k9738J6521L7655K016n537P037o433j2979j3110k0389
7121c0319K1497j7988M522j3074k080J1173o653R385M8330Q150k1631l0729j955
7108b1372K4719r389k5920l3808R722J9298K4182m868O889p349p771L9956M435
7095A8724l3897J6335j8480L0554J2135j6356J6400j4863K9779k5793K0231j7617
7083A7152j1346J1742k0498J2320j3089j4659R039L5230l1967m443Q548J0550
7071H579K573J3076l3272j9467L7528l7584J3919q554P937J0795q323k3306J3435
$$ plain form
7161 10551 8839 -515 -1349 -30479 -29466 -25108 -7114 -14478 -14123 36202 5183 -35205 -5438 14923
7147 14923 -4049 3455 -13631 -46096 -4285 32892 27930 23931 31137 9249 15494 -14310 -16035
7134 -16035 16650 13302 -5362 -35100 -18579 19076 21092 15555 22592 16159 3180 -9930 -30319
7121 -30319 -8822 -26810 -22288 -35362 -37442 -26269 -32922 -23537 24793 32943 11312 -19417 -21372
7108 -21372 3347 -6042 -31962 -65770 -56048 -36750 -12568 -17436 -10547 -17896 -25667 14289 18724
7095 18724 -15173 1162 -17318 13236 25371 9015 25415 10552 40331 14538 34769 17152
7083 17152 5806 17548 -2950 9370 -3719 -18378 -9339 25891 -6076 -10519 -1971 8579
7071 8579 11152 24228 -9044 -28511 9017 -28567 -14648 -23202 -15265 -4470 -12793 -36099 -22664
7058b2664J6210m6117k441L2011L2203J0406k7120j8763L3246J5293q907l1670
7046a8313J3376j0634P675J8502K622k4457k8968K8421j672k3263o93Q303M176
7033b4925J5988m741p417o342l093j001o841j9189L9529K9351j1363J3450J6441
7020B9847k8808k7664m143j7495o79p934O985J5986j8362J1098m234K8677L5837
7007A9111O280o774q562k3589r470L5652J1032k0102N766M310L76k8777j140R237
6993f650N652P193m39L128j4309l7831J8908Q56k2235M1299Q461j0663j3463J7209
6979b884j9082J0855l214p214n605M4208R983l6543O409j1865M915r860j2228
6966c2125K2307L810j8559l2092M0172J5409p346K4763L877J0776j4143l7117
$$ plain form
7058 -22664 -6454 -52571 -55012 -23001 9202 19608 -7512 -26275 6971 22264 13357 -18313
7046 -18313 -4937 -15571 -7896 10606 13228 -11229 -40197 -11776 -13448 -36711 -37404 -29101 -24925
7033 -24925 -8937 -13678 -21095 -27437 -30530 -31531 -38372 -57561 -18032 11319 -44 13406 29847
7020 29847 1039 -26625 -30768 -48263 -48942 -56876 -49891 -33905 -52267 -41169 -45403 -16726 19111
7007 19111 25391 18617 10055 -13534 -23004 12648 23680 3578 9344 13654 14030 -14747 -15887 -6650
6993 -6650 -998 6195 5756 8884 -5425 -43256 -24348 -23492 -45727 -4428 4033 -6630 -20093 -2884
6979 -2884 -21966 -11111 -14325 -21539 -27144 17064 27047 -9496 -3087 -14952 -10037 -19897 -32125
6966 -32125 -9818 -6008 -24567 -56659 -16487 -1078 -8424 16339 20216 30992 16849 -20268
6954b0268j79K1898n667J139J8498o071j3137n315q799q280M688K7880j8520N005
6940g128K8217q573Q048k769n42j9243k9202J9623K7055J6097j1672j5414n672
6927a175n002o404M420K2060J0189k4370j7971K1482J3483k5408M423N618l2121
6914c0776K3264O147K9108Q92m3527L792J873o867l1211K3758m182J4734L029
6901i966k0807K0587O597q75N678K3689J6309k7719l0416N467k736N738k2658
6888c1112J1317K8063j9091P947k2840J4193J3588j2955O963L706J1490m3753
6876c2484J4828p827J7134j7794R562J2448K15j6475J4052O39l390J7893l3731
6863b4930J0390J4920L839J536q384j7250o29Q069N9645m1524o782J6721N317
$$ plain form
6954 -20268 -20447 1451 -4216 -3077 15421 9350 -3787 -9102 -17901 -26181 -21493 6387 -12133 -7128
6940 -7128 21089 12516 20564 17795 17253 -1990 -31192 -11569 15486 31583 19911 4497 -1175
6927 -1175 -6177 -12581 -8161 13899 24088 -282 -18253 3229 16712 -8696 -4273 1345 -30776
6914 -30776 -7512 -1365 27743 28635 -14892 -11100 -9227 -16094 -47305 -23547 -27729 -12995 -9966
6901 -9966 -30773 -10186 -3589 -4464 1214 24903 41212 13493 -16923 -11456 -14192 -8454 -31112
6888 -31112 -19795 8268 -10823 -2876 -25716 -11523 2065 -10890 -3927 -221 11269 -32484
6876 -32484 -17656 -25483 -8349 -26143 -16581 -4133 -3918 -20393 -6341 -5702 -9092 8801 -24930
6863 -24930 -14540 380 4219 5755 -2629 -19879 -20508 -12439 47206 5682 -1100 15621 20938
6850B0938M916l91J3381J4574k1106j4559m29j4780k9391J3212P604l9861L7149
6837h743J2159Q371j0548j8818l045K9570Q478j2001K4411j044m496k11p44j3601
6823I738l0957R858L4690q946r868q783O917j6911P418Q642n487k991j1306q071
6809b6057Q034l0626o654J4532R407J3013J9615k5079p801J6502m1681K7762J8525
6796a0508J6627P964k7720j2378J2079j2455O299M409K0834J4335m122N731m7802
6783b6707o836L0443N710L2713J5666j6811j2806j4055O144N3980k9876l2409
6771E156M898j5804j0085J0746J4682k3736P737Q798m915k3834J6007j1194J7015
6758d529P288J6165P469j4646J1715j1014k5381R180j4776j888K886K8813N351
$$ plain form
6850 20938 25854 25463 38844 53418 32312 17753 17324 2544 -26847 -13635 -6031 -45892 -8743
6837 -8743 3416 11787 1239 -17579 -20624 8946 17424 5423 29834 28790 24294 24083 23339 9738
6823 9738 -21219 -11361 23329 14383 4515 -4268 2649 -14262 -6844 1798 -3689 -6680 -17986 -26057
6809 -26057 -18023 -48649 -55303 -40771 -31364 -18351 1264 -23815 -31616 -15114 -56795 -29033 -10508
6796 -10508 6119 14083 -13637 -26015 -13936 -26391 -20092 -15683 5151 19486 15364 21095 -26707
6783 -26707 -33543 -3100 2610 35323 50989 34178 21372 7317 13461 67441 37565 5156
6771 5156 10054 -5750 -15835 -5089 9593 -14143 -6406 2392 -2523 -26357 -10350 -21544 -4529
6758 -4529 2759 18924 26393 11747 23462 12448 -12933 -3753 -18529 -20417 -17531 11282 16633
6745A6633j3460K3689o328j3788k631Q042j0061J2283j8466n889J6737J125p428
6732D58J2198k9607N578n503N475p50p135O641Q717j2161n951M1557k463o418
6718A0636j8789n929K5388l3512j3255K9326J9584j168P103j2505l290K6701l787
6705B6503q981k0343J1403K1389k3909J9086J1205k2179k1384J9023O3j9295Q594
6692A175K710j7202j6987M142J0778J8076K5158k6219R097P839j6017l841j3729
6679a5020K6181j7190K1069j4598j0878K7258l613k8095l552O058M399J0538J7344
6666A9901j6005l513P160l5187j544J1841J3294L03J0360n565J3274q732l6522
6653c0935K7648l668r710N047L3698r528k5741q85J8693P704k9974k8983J3752
$$ plain form
6745 16633 3173 26862 20534 6746 4115 12157 2096 14379 -4087 -9976 6761 7886 458
6732 458 12656 -16951 -11373 -16876 -11401 -12151 -19286 -12645 -3928 -16089 -22040 19517 17054 10636
6718 10636 -8153 -14082 11306 -22206 -35461 -6135 13449 12281 19384 6879 3589 30290 26503
6705 26503 17522 -2821 8582 29971 6062 25148 36353 14174 -7210 11813 11876 -7419 1175
6692 1175 3885 -13317 -30304 -26162 -15384 2692 27850 1631 10728 18567 2550 -1291 -15020
6679 -15020 11161 -6029 15040 442 -10436 16822 13209 -14886 -18438 -12380 -7981 2557 19901
6666 19901 3896 383 7543 -27644 -29188 -17347 -4053 -3750 6610 1045 14319 5587 -30935
6653 -30935 -3287 -6955 -16665 -11618 22080 12552 -13189 -14074 4619 12323 -17651 -46634 -32882
6640c2882m462j3561K7666O744K3629K1118j4718Q79O500k1880J6626J5861k9249
6627B271j5103K7030J4548K4342K0389j8775l7101J3518N180j7333L805L263j6107
6614I927J5205R507p787J0756K1076l0846M498J5626r013J0404Q400l408k6347
6601B7998Q287L2126m5205q14J8124l344Q570j3965J2662J6621L80k6476L665
6588C8629j6774j6995J3895J5236k8573k4959L3336J2036L216P241l9514j0009
6576a3235M412m953R514M273K4843J3761J2085k7403r9M234j0795K3129J36k644
6562C7258j0765J2882M708p374k3371j1582L829J4050j9813L0672P977K001L287
6549D3759K390o629j4687k408M1645j6997l910r948L434j493j4176J5368N070
$$ plain form
6640 -32882 -37344 -50905 -23239 -16495 7134 28252 13534 14413 20913 -967 15659 31520 2271
6627 2271 -12832 14198 28746 53088 73477 54702 17601 31119 36299 18966 22771 26034 9927
6614 9927 25132 34639 26852 37608 58684 27838 32336 47962 38949 49353 57753 54345 27998
6601 27998 36285 68411 23206 22392 40516 37172 45742 31777 44439 61060 61440 34964 38629
6588 38629 21855 4860 18755 33991 5418 -19541 13795 25831 29047 36288 -3226 -13235
6576 -13235 -8823 -13776 -4262 11 24854 38615 50700 23297 23198 27432 16637 39766 39902 37258
6562 37258 26493 39375 44083 36709 13338 1756 5585 19635 -178 30494 38471 40472 43759
6549 43759 46149 39520 24833 22425 64070 47073 43163 33215 36649 35156 20980 36348 41418
6536D1418m024P035M233p996J6820p417O519k039K058m5048J4740M7376j5690
6523E7985j3683P867O001k0246j2400N1675P919l6339M73n630k3706p771J7504
6510B9649K4397P362l4398r381K8600R984j024L834j4642r222K4304J8064p556
6497F9971l1859k329N882K5483k9528l9428L916R676O215L7747K4281l5804k5001
6484A9222L9734J7146l3235k1040q976J3563K9360o823O542m4217p271j6251k0708
6471c2954K3096Q522K8124L4092m8772J1990Q548m963n075o591Q82j534N8974
6458G4339l018l9578l4311Q582L7227j0013K05n297l558J6209j1722j1419O948
6445B4594K307j865k2449K4034K2138j5093K7560j5769l09Q686M0343P800l7021
$$ plain form
6536 41418 37394 44429 48662 40666 57486 50069 56588 54549 56607 11559 26299 73675 57985
6523 57985 44302 52169 58170 37924 25524 77199 85118 48779 49252 43622 19916 12145 29649
6510 29649 54046 61408 27010 17629 46229 56213 55189 59023 44381 35159 59463 77527 69971
6497 69971 38112 35783 41665 67148 37620 -1808 2108 11784 17999 55746 80027 44223 19222
6484 19222 58956 76102 42867 21827 12851 26414 55774 48951 55493 11276 4005 -12246 -32954
6471 -32954 -9858 -1336 26788 60880 12108 24098 32646 27683 22608 16017 16899 15365 74339
6458 74339 71321 31743 -2568 6014 43241 33228 33433 28136 24578 40787 29065 17646 24594
6445 24594 26901 25036 2587 26621 48759 33666 61226 45457 45148 53834 94177 101977 64956
6432F4956Q205r243k8833K6995j0697n348n805K3147j1211m3010K0146J7117j1729
6419C4690J2612K090k038K0064k4844K1310j9583j2940o876j2131J8826L2K3656
6406E4868q410J6154k242n828l2946j5096K5912L6171j9324l133j0709L5019j8121
6393E2315j6072M491j2657l984K0542K8373K594O571l0743m278M079m007k8053
6380A9171L7161P70j8305J4587Q207L0815J3473l1466k0436J7344K9038K1712
6368A22071j4852o7232j6069K8519K5551j2516J5916j5283k2927o324K4040N812
6356F6706M453j0728p304L0291J1812k2846j5262L5050K912k6369q544m262J3744
6343F9653k349l959J0981j7907j5209K1742k378j3402O6344K1004l8924j9143
$$ plain form
6432 64956 73161 63918 35085 62080 51383 46035 40230 63377 52166 9156 29302 46419 34690
6419 34690 47302 49392 47354 67418 42574 63884 44301 31361 24485 12354 31180 31212 54868
6406 54868 46458 62612 60370 54542 21596 6500 32412 68583 49259 46126 35417 70436 52315
6393 52315 36243 40734 28077 24093 44635 73008 75602 82173 51430 47152 51231 47224 19171
6380 19171 56332 57102 38797 53384 61591 92406 105879 74413 53977 71321 100359 122071
6368 122071 107219 39987 23918 52437 77988 65472 81388 66105 43178 36854 60894 66706
6356 66706 71159 60431 53127 83418 95230 72384 57122 92172 95084 68715 60171 55909 69653
6343 69653 67304 63345 74326 56419 41210 62952 60574 47172 113516 134520 95596 76453
6331G6453J703L5899m8189n321L6554R348Q165j3943L0607j3949j2658k5644J1319
6318I0344L736j4242K7977O914L867J3587K2353K116L4657j69j5761M7249j6436
6305B06192m0943n837j7038m790l717j3572J3870k1038J3122J6042j3078n033
6293A24180O990k7155p68J1141o491k9875J1599j268j0330m300q433l2203l0439
6280B648M1081L6499K1774O811M078j4202k995o86N990k15O463l6323n853M8466
6266A13536p493l8386n952L3184J5085l680K466n118j794R809J4871k6901l4249
6253F5378K412K553k243J8841J8312L857J8735m943K783j254n457J7919j5248
6240A21645K594J0635k1668k0557L6507j4345j4018K3631j5632o2L60p713j8284
$$ plain form
6331 76453 78156 114055 65866 60545 97099 106447 114612 100669 131276 117327 104669 79025 90344
6318 90344 94080 79838 107815 114729 118596 132183 154536 156652 191309 191140 175379 222628 206192
6305 206192 165249 159412 142374 137584 133867 120295 134165 113127 126249 142291 129213 124180
6293 124180 131170 104015 103247 114388 107897 78022 89621 88353 78023 73723 65290 33087 2648
6280 2648 43729 80228 102002 108813 112891 98689 95694 95008 100998 100783 107246 70923 65070 113536
6266 113536 106043 67657 61705 94889 109974 106294 108760 103642 101848 111657 126528 99627 65378
6253 65378 67790 70343 68100 86941 105253 109110 127845 122902 125685 124431 118974 136893 121645
6240 121645 124239 134874 113206 92649 129156 114811 100793 124424 108792 108730 109090 101377 83093
6227H3093L8418j639m8392K517M4298J6711q945j2682q371M957k1388l9106J5030
6214F4501J8965p587k1215o129K4316k815K8462j518K1913J2188l9726k3166K6539
6201I4728o587L955J5233k96p019J9340j3681M58J852k5971r663L3175M3008N454
6187A53986o735l2017n718L4270j2304k8m1760j7435L3225J8723R028j1310J6913
6174A38838q360J5368K0121p262j7451M68J2076o919J9250J6949p479j209j1145
6161A63245j6732K3140j1673l4039L396J5055j3104N508L1329q157r739j1063
6149A37166J1504m538K4828k706j5835N885k8902r673J4271L108K305m884J5129
6136A47658L7296p184K5124P252j4246j801l3004L9864j4156n15J6767J8832R24
$$ plain form
6227 83093 121511 119872 71480 73997 118295 135006 126061 113379 105008 109965 88577 49471 64501
6214 64501 83466 75879 54664 48535 72851 70036 98498 96980 118893 131081 91355 68189 94728
6201 94728 88141 92096 107329 107033 100014 119354 105673 106131 107983 82012 72349 105524 148532 153986
6187 153986 147251 115234 109516 143786 131482 131454 89694 72259 105484 124207 133235 121925 138838
6174 138838 130478 145846 165967 158705 141254 141722 153798 146879 166129 183078 175599 174390 163245
6161 163245 146513 169653 157980 123941 127337 142392 129288 134796 166125 157968 148229 137166
6149 137166 148670 144132 168960 166254 150419 156304 127402 117729 132000 135108 137413 132529 147658
6136 147658 184954 177770 202894 210146 195900 194099 161095 200959 186803 186288 203055 221887 222811
6123B22811J3804k8453n825N309j0392k212j5149K9705p074l7839J3628M0129
6111B18442r840j1313J6590R20N58K1043L8850l3794l4656j5397J9781j395J2906
6098B22695J8179j5210j3793k407K7941R788j0040K854J8930K9172k910m5995
6086B39204k347L5187J8368k1898K508K3337J995l322K8662l809N38k6654m180
6073B87589o15J9992k789J9255p715j7051L1062J090j211K9881L3383P53K5317
6060D18941K4913j4008J792O900n659o890l6146N6751K3074J32l059k5701L668
6047D44708J8214Q339Q389J4182J0721l680k6277J8496P0655J5867l3495k9174
6035E16945L8687L5384k2341J2622L4233J0038K7177L9645J5853l656K9086O2675
$$ plain form
6123 222811 236615 208162 202337 207646 197254 195042 179893 209598 202524 164685 178313 218442
6111 218442 208602 197289 213879 214799 215357 236400 275250 241456 206800 191403 211184 209789 222695
6098 222695 240874 225664 211871 209464 237405 247193 237153 240007 258937 288109 285199 239204
6086 239204 236857 272044 290412 268514 271022 294359 296354 293032 321694 317885 318423 291769 287589
6073 287589 286974 306966 304177 323432 315717 298666 329728 330818 329607 359488 392871 393624 418941
6060 418941 443854 429846 431638 438538 432879 425989 389843 446594 469668 469800 466741 441040 444708
6047 444708 462922 471261 479650 493832 504553 500873 474596 493092 563747 579614 546119 516945
6035 516945 555632 591016 568675 581297 615530 625568 652745 692390 708243 704587 733673 796348
6023G96348P041M6452J6551M2455P123M9482M8896O5230M8678L8599O2394N6216
6011A285465P6180J06700J00127Q2337J05621J41797J39243J14617J11153J29833
6001B393073J59903J80967K23698K35385J98849K37578L03273L05414L20065L67359
5991D925564L46977L80625M54318M55003N33587O02001P03156Q32688J059824
5982A0293743J282598J594476J905682K158956K504379K706185K304708J112779
5974B5863506l48464j652089k551094k751210k431882k034833j796178j577988
5966A0719768j406643j147081r19235q20520o36214n47536m33756l81882l37838
5957D089063k49148k30644k63093k12163j82353j66698j43837j25161j00903j46504
$$ plain form
6023 796348 803389 849841 866392 908847 915970 965452 1014348 1079578 1128256 1166855 1229249 1285465
6011 1285465 1361645 1468345 1568472 1650809 1756430 1898227 2037470 2152087 2263240 2393073
6001 2393073 2552976 2733943 2957641 3193026 3391875 3629453 3932726 4238140 4558205 4925564
5991 4925564 5272541 5653166 6107484 6562487 7096074 7698075 8401231 9233919 10293743
5982 10293743 11576341 13170817 15076499 17235455 19739834 22446019 24750727 25863506
5974 25863506 25515042 23862953 21311859 18560649 16128767 14093934 12297756 10719768
5966 10719768 9313125 8166044 7246809 6426289 5790075 5242539 4808783 4426901 4089063
5957 4089063 3839915 3609271 3346178 3134015 2951662 2784964 2641127 2515966 2415063 2268559
5947B268559j10842q3772r8656p1401p1362j15511r8846n8273j3379k3320l0892
5936A492305m3669m5102o1791p9930o9081k5281q558n3514j8810k1579k2110j9160
5924A023720k1789l1668l4446q140m9133K4922l4503m6930q715l952j974m2027
5912G65365k9521j6217N113k0319j5089j0214O689M236k2034q714k0295P523M791
5899F51314R203J6281j6422Q275J8395j7534j4724j0474n672j7893j99L223J4515
5886F38288p137j4022N914j516k0323K2038m683l470l022J4549J4544K8411L2037
5873G01608q72N554M9823j4323j9360p783J0796j2361l6957j0522j6422k8869
5861F20312J7157j126j069j2342N934J5553m7599J1267p374L1166k1863n91J5736
$$ plain form
5947 2268559 2157717 2073945 1975289 1903888 1832526 1717015 1618169 1559896 1546517 1523197 1492305
5936 1492305 1448636 1403534 1341743 1261813 1192732 1167451 1158893 1105379 1086569 1064990 1042880 1023720
5924 1023720 1001931 970263 935817 927677 878544 903466 868963 822033 813318 809366 807392 765365
5912 765365 735844 719627 724740 704421 689332 679118 685807 690043 668009 659295 639000 646523 651314
5899 651314 660517 676798 660376 668651 687046 669512 654788 644314 638642 620749 620550 623773 638288
5886 638288 631151 617129 623043 621527 601204 623242 618559 615089 612067 626616 641160 669571 701608
5873 701608 700736 706290 756113 741790 722430 714647 725443 713082 676125 665603 649181 620312
5861 620312 637469 636343 635274 622932 628866 644419 596820 608087 600713 631879 610016 609425 625161
5848F25161k0275r078M4974j0439j0149k3088Q865K0662M679O243J6033J4329
5836F67917p87N256O593q485M019L1361M2412j391L1882m58k7071r405j8268j5203
5822G08372N947J145J5176J756K404j4950L056j5360K1625j569L866j3528o566
5809G11374M9006L97J8416k2972M437L1627L5640N3729P84k1789J5539q569R607
5796H77226M6610Q157j0378N5262j4597j884M7073J3880j4660n909j0022j1025
5784I79733J436j935L0478P984M6324k559o298M921P860R722M9787O0276L2255
5771A219984N4565J5987J3230O1357J2823J2981O1686k751l694o8357m4111k0539
5759A313161j3844k7092n639l2044j6262L3021K4681J7067j5278J4510M0653O520
$$ plain form
5848 625161 604886 595808 640782 630343 620194 597106 605971 626633 631312 637555 653588 667917
5836 667917 667130 672386 678979 670494 674513 705874 748286 746895 778777 778319 751248 741843 723575 708372
5822 708372 714319 715464 730640 732396 734800 719850 722906 707546 729171 727602 731468 717940 711374
5809 711374 760380 760777 779193 756221 760658 792285 827925 881654 882438 860649 876188 867619 877226
5796 877226 923836 931993 921615 976877 962280 960396 1007469 1021349 1006689 1000780 990758 979733
5784 979733 981169 979234 1009712 1017696 1064020 1061461 1055163 1060084 1067944 1077666 1127453 1187729 1219984
5771 1219984 1274549 1290536 1303766 1365123 1377946 1390927 1452613 1449862 1446168 1377811 1333700 1313161
5759 1313161 1299317 1272225 1266586 1234542 1218280 1251301 1275982 1293049 1277771 1292281 1332934 1339454
5747A339454J3492K5660K1665K1525K3204L5508l171l5413M2581M1560O1934J8918
5735A606917O7082O7704N7203J01575J04246J34140J65733J62170K24967K45266
5725B937003K58034J55740k415j24295k09417k28543k36840j63456j48051j59958
5715B077802j20668r2583q3811l0284p543k4190j5051k3136k5569K6269l5972
5704A645264J0494k3561m934r388J8891L1496q265k1341m1725k2187l6078l0799
5692A507867q483j8123k7784j7544J3134k4886k3218l0528j1712o624k0971l4919
5680A296209J9005j9367j0256K2185Q259j0752k1445k603M396L7439m7698M567
5668A279939J7958K9945K3170M0074K6898k1079M3653N0069R634N293L038K6916
$$ plain form
5747 1339454 1352946 1378606 1400271 1421796 1445000 1480508 1477337 1441924 1484505 1526065 1587999 1606917
5735 1606917 1673999 1741703 1798906 1900481 2004727 2138867 2304600 2466770 2691737 2937003
5725 2937003 3195037 3350777 3348362 3224067 3014650 2786107 2549267 2385811 2237760 2077802
5715 2077802 1957134 1864551 1780740 1750456 1742913 1718723 1703672 1680536 1654967 1681236 1645264
5704 1645264 1655758 1632197 1627263 1617875 1636766 1668262 1659997 1638656 1596931 1574744 1538666 1507867
5692 1507867 1499384 1481261 1453477 1435933 1449067 1424181 1400963 1370435 1358723 1352099 1331128 1296209
5680 1296209 1315214 1295847 1285591 1307776 1316035 1305283 1283838 1281235 1285631 1323070 1275372 1279939
5668 1279939 1297897 1327842 1351012 1391086 1417984 1396905 1440558 1490627 1500261 1505554 1508592 1535508
5656A535508J0461O438J1501J3375M4311J6528J1563L6220K3856K3853N4152N1095
5644A838861K3028M0183N4697M6134L8667M5743J5359K5280K7307J7188r140M8266
5632B211573M7630J1977P273K5964j5308K3606O7374Q406N0514O1045N8778M2586
5620B601418N7222Q2448N4288L6607P4426O4245P4200Q8189N7981J03234Q9357
5609C383615K9086L6051N4937M1193N7982N9833N8814M7189N1838Q8728J4999
5598C924265P1565Q4988J10631O0486N5439R3189P4387R5273O9817Q7267Q2455
5587D809762Q2280L7936J02541J26980Q9302J26142J23588J06878J17155J31700
5577E854264J24001J52305J71466J86053J88893J96098J74441J86991J70165J96420
$$ plain form
5656 1535508 1545969 1552407 1563908 1577283 1621594 1638122 1649685 1685905 1709761 1733614 1787766 1838861
5644 1838861 1861889 1902072 1956769 2002903 2041570 2087313 2102672 2127952 2155259 2172447 2163307 2211573
5632 2211573 2259203 2271180 2278453 2304417 2289109 2312715 2380089 2388495 2439009 2500054 2558832 2601418
5620 2601418 2658640 2741088 2795376 2831983 2906409 2970654 3044854 3133043 3191024 3294258 3383615
5609 3383615 3412701 3448752 3503689 3544882 3602864 3662697 3721511 3768700 3820538 3909266 3924265
5598 3924265 3995830 4080818 4191449 4251935 4307374 4400563 4474950 4570223 4640040 4727307 4809762
5587 4809762 4892042 4929978 5032519 5159499 5248801 5374943 5498531 5605409 5722564 5854264
5577 5854264 5978265 6130570 6302036 6488089 6676982 6873080 7047521 7234512 7404677 7601097
5567G601097K11797K11295K65525K10068K08085K30940K74135L05876K71421K68834
5557A0059073K99295L03252L11952M04511M10250M05925M54877M69979M96123
5548A3615237O07668N90845O19220P13228P48385Q12311Q80458R38146J006160
5539B0531658J118296J236479J316695J354256J489750J647327J689204J828369
5531C2212034J985128K092988K276819K476609K662832K887455L195704L433362
5523E3222931L708124L986248M252564M572833N004359N380919N799681O294666
5515I2222325O729653P252668P883110Q654994R599877J0791027J2281857J4032915
5507A69448426J6173190J8652720K1147789K3528861K5248935K5742912K4259859
$$ plain form
5567 7601097 7812894 8024189 8289714 8499782 8707867 8938807 9212942 9518818 9790239 10059073
5557 10059073 10358368 10661620 10973572 11378083 11788333 12194258 12649135 13119114 13615237
5548 13615237 14222905 14813750 15432970 16146198 16894583 17706894 18587352 19525498 20531658
5539 20531658 21649954 22886433 24203128 25557384 27047134 28694461 30383665 32212034
5531 32212034 34197162 36290150 38566969 41043578 43706410 46593865 49789569 53222931
5523 53222931 56931055 60917303 65169867 69742700 74747059 80127978 85927659 92222325
5515 92222325 98951978 106204646 114087756 122742750 132342627 143133654 155415511 169448426
5507 169448426 185621616 204274336 225422125 248950986 274199921 299942833 324202692
5500C24202692J9558496J1140044J49257j0785309j9372649k4347787k6063095
5493B74481649k5802268k4616794k3009216k1047715j8800110j6458004j4221017
5486A30526525j2258271j0620295r153156p959054o968420o104299n411628m842611
5478F7208791m288499l891381l576839l265117l019380k707707k531886k349234
5470D1578748k171329k002959j839010j731220j571418j469473j410074j266964
5462B8116301j200008j182954j037229r75776r48086r05612q72573q22470p39483
5453A9432110p48063p61987o94699o58124o06982n77206n59880n36747n28446
5444A3759976m94528m81899m83074m03645m24177m22670l63434l52200l35310
$$ plain form
5500 324202692 343761188 354901232 355050489 344265180 324892531 300544744 274481649
5493 274481649 248679381 224062587 201053371 180005656 161205546 144747542 130526525
5486 130526525 118268254 107647959 98494803 90535749 83567329 77463030 72051402 67208791
5478 67208791 62920292 59028911 55452072 52186955 49167575 46459868 43927982 41578748
5470 41578748 39407419 37404460 35565450 33834230 32262812 30793339 29383265 28116301
5462 28116301 26916293 25733339 24696110 23720334 22772248 21866636 20994063 20171593 19432110
5453 19432110 18684047 17922060 17227361 16569237 15962255 15385049 14825169 14288422 13759976
5444 13759976 13265448 12783549 12300475 11896830 11472653 11049983 10686549 10334349 9999039
5435I999039l28447k74929k89093k71737k38673k67871k31795j90652j98265j79060
5425G528517j71922j81326j83700j38624j48212j61185j28978j58741j61115j33567
5415E961147j18649j45488j22647j18154j44198j25032r6715j32038r5666j06603
5405D755957j51194r0351p7587j10099r4191q8137r5300o8164o4238q6360n6143
5394C774193p1880p4324p6200o6877o4673m7090j6876n7744p2164n5233j8444
5383C152688n3803l3293m9591n0685j7453j5047n3694j3214l4481m1021l3351
5372B757055p5924l1834n4969m3187n2723k4392o1097l6475k8617n8489j0124
5361B279224l2887j5377n3468l3108k8977l1342o2939l9320j6697l7994M507j1208
$$ plain form
5435 9999039 9670592 9395663 9106570 8834833 8596160 8328289 8096494 7905842 7707577 7528517
5425 7528517 7356595 7175269 6991569 6852945 6704733 6543548 6414570 6255829 6094714 5961147
5415 5961147 5842498 5697010 5574363 5456209 5312011 5186979 5090264 4958226 4862560 4755957
5405 4755957 4604763 4514412 4436825 4326726 4232535 4144398 4049098 3980934 3916696 3830336 3774193
5394 3774193 3702313 3627989 3551789 3484912 3420239 3373149 3356273 3298529 3226365 3171132 3152688
5383 3152688 3098885 3065592 3016001 2965316 2947863 2932816 2879122 2865908 2831427 2790406 2757055
5372 2757055 2681131 2649297 2594328 2551141 2498418 2474026 2412929 2376454 2347837 2289348 2279224
5361 2279224 2246337 2230960 2177492 2144384 2115407 2084065 2021126 1981806 1965109 1927115 1931622 1920414
5349A920414k8670k4444k4930m2873n3712L1655k7404m7305j1180m4816j3678
5338A633057m5825q114l0318k2215J5604k1703j2145l2850k6766J9882j4460j4950
5326A439197j0378k0827l2010n3191k5495J2241K666k1109m6574k5611q214l1302
5314A179393n6336j3647m4947k4953l2591n6606j3076j8333j6450m3320N468J5893
5302H80495J4782m4063l5263P847J0685j678m1789p600J736j1591J6928j9793
5290G70696l0345n2773J5801L4754n414j2571j5644M3485L9342m2015j0850n852
5278G28614o507J4545j0938k5121j9200O680n115N76l0184l2597J0510N765n470
5265F31558j5772m7728K5595l206l8792K3035k2378N399l012J00J338k0364J1607
$$ plain form
5349 1920414 1891744 1867300 1842370 1799497 1745785 1777440 1750036 1702731 1691551 1646735 1633057
5338 1633057 1587232 1579118 1548800 1526585 1542189 1520486 1508341 1475491 1448725 1468607 1454147 1439197
5326 1439197 1428819 1407992 1375982 1322791 1297296 1309537 1312203 1291094 1244520 1218909 1210695 1179393
5314 1179393 1123057 1109410 1064463 1039510 1006919 950313 937237 918904 902454 859134 864602 880495
5302 880495 895277 851214 815951 823798 834483 832805 791016 783416 785152 773561 790489 770696
5290 770696 740351 687578 703379 738133 732719 720148 704504 747989 787331 745316 734466 728614
5278 728614 722107 736652 725714 700593 681393 688073 682958 683534 653350 620753 631263 637028 631558
5265 631558 615786 568058 593653 590447 551655 574690 552312 557711 554699 554799 556137 535773 547380
5252E47380o433l5147L758K4227j0245r619k6476J1553k438j5330R771L176k0971
5239D73206k56k7993j336J9114j3393j6292k3588k2223K1089l7528K2110N9207
5227D52117l0814k9706J3006J0796j9737n015O966J869k2882j6537K4371L309
5215C87743J9290K9776j1861k3139K697j0699j9133k2761o7j9443K0730K4719
5203C77852k2351j8245K5342J4738l2753m747K7937j3398j6859M7593k0853K83
5191C64539m619M4633l338j720j8904l1720P265j1948Q222k9873Q719M5865j5362
5178C61759l8062j3606J9991J0806n81R584k5032m480j5317j4039k3197j1948
5166B55878J597J1085k2556k6676k32J2631J7449k0422K3824k0978j807J9736
$$ plain form
5252 547380 540947 505800 509558 533785 523540 513921 487445 498998 496560 481230 491001 494177 473206
5239 473206 472950 444957 443621 462735 449342 433050 409462 387239 408328 370800 392910 452117
5227 452117 421303 391597 404603 415399 395662 390647 397613 399482 376600 360063 384434 387743
5215 387743 407033 436809 424948 401809 404506 393807 374674 351913 351846 332403 353133 377852
5203 377852 355501 337256 362598 377336 344583 339836 367773 354375 337516 385109 364256 364539
5191 364539 359920 404553 401215 399495 380591 348871 356136 344188 352410 322537 331256 377121 361759
5178 361759 323697 310091 330082 340888 340307 349891 324859 320379 305062 291023 267826 255878
5166 255878 257475 268560 246004 219328 219096 231727 249176 228754 252578 231600 229793 249529
5154B49529O450j1921J447j7823J3343J3581o58n605n2936l2739L6907M1238Q094
5141B48907j4038n198j7555k0409J9188l618r566J2457j6544r57p97n856M146
5128A90160L634J2938n7263k2045J8456J6191K96j1184J4278J0769R317R001l9836
5115A54712o9L5903m4001j1311K9924K1493J2962J323k9248k5234J949j2547L6387
5102A72243M963n537k4270M474L7252j014p966M0638l3980Q37K278l7647K6422
5089A78693J5520k3160O534K4576m0373l6908J0803M3328J7463L859j3361l8343
5077A48631O201N4937k395r419R339l935k9803K5933k1883j8695J2550p784K3290
5064A86967k1110M046l2101p986j2936p450j8364J0645J7829M565r815J0079O960
$$ plain form
5154 249529 255979 244058 245505 227682 241025 254606 253948 248343 195407 162668 199575 240813 248907
5141 248907 234869 229671 212116 191707 210895 207277 197711 210168 193624 192667 191870 186014 190160
5128 190160 193794 206732 149469 127424 145880 162071 162367 151183 165461 176230 185547 194548 154712
5115 154712 154643 190546 146545 135234 165158 186651 199613 200936 171688 146454 148403 135856 172243
5102 172243 177206 171669 147399 151873 189125 188111 180145 220783 186803 187640 189918 152271 178693
5089 178693 194213 171053 177587 202163 161790 124882 135685 179013 196476 200335 186974 148631
5077 148631 154832 209769 207374 197955 207294 203359 173556 199489 177606 158911 171461 163677 186967
5064 186967 165857 169903 137802 129816 116880 109430 91066 101711 119540 124105 114290 124369 131329
5051A31329m0594K1130o694J7087m099k3579N630j2011j4177N6759o584j6733
5039A07464Q04K3264L576q707J8271j1211J6065l9647n008J5204l22P611J2075
5026A39439J9143n624L51l7052j6441L3808K2383k977n1139K513L3880M29j0382
5013A28331R323M697k4908L724n714P004R772J6731j0454L592k5945N45j5059
5000A01639k054J6480q781j1359N979J2744k419m691L1398J3782j2484Q722L800
4987A52756l330k4272j4836j46J0257k0855l5038J9384K8070J8975p138J0739
4975A34566O117k322j3214j2377K0382j1955p313M909o412o00q259k053K9979
4962A31448k7487J0806K5900q276J1374J2156n5205K7582l4781p826J1746K8666
$$ plain form
5051 131329 90735 111865 105171 122258 118159 94580 100210 88199 74022 130781 124197 107464
5039 107464 108268 131532 135108 126401 144672 133461 149526 109879 104871 120075 119753 127364 139439
5026 139439 158582 152958 153309 116257 99816 133624 156007 153030 101891 104404 138284 138713 128331
5013 128331 137654 142351 117443 121167 115453 122457 132229 148960 138506 142098 116153 116698 101639
5000 101639 99585 116065 107284 95925 101904 114648 112229 107538 138936 152718 140234 148956 152756
4987 152756 149426 125154 110318 110172 120429 99574 64536 83920 111990 130965 123827 134566
4975 134566 140683 138361 125147 112770 133152 121197 113884 118793 112381 111781 103522 101469 131448
4962 131448 103961 114767 140667 132391 143765 155921 100716 128298 93517 85691 97437 126103
4950A26103J1172l90l2745n233j123J4813k3090j136j5146K2077L5323j0744P973
4937A27854l6424k8238P793J4431J7988M473j2924K7048M122K090n452o747j3175
4924A02839N1470k4462K0079n457j4217K0189J3952j2961K7862r840M06R615L854
4911A83329Q122k8881j9364k52K9969j892P306R3Q22O341j544k5586Q044M1485
4897B07992m1186o368J5895L1823N829J0547P415m2217k5101m34K6905n1723R258
4884A48635J0625N202n807l7068J0397j1056j7964K438K5266j949M009j9160K2897
4871A36465o245j8602k7231K9781L1072k9993o339l4532L6848K9484N88m3556
4859I7740m2234L8811Q195j6936P518k1385J3007j0515N86J3052l0374K440L1192
$$ plain form
4950 126103 137275 136885 104140 98907 97784 112597 89507 88371 73225 95302 130625 119881 127854
4937 127854 91430 63192 70985 85416 103404 107877 94953 122001 126123 128213 122761 116014 102839
4924 102839 154309 129847 149926 144469 130252 150441 164393 151432 179294 169454 169860 179475 183329
4911 183329 191451 162570 143206 142954 172923 171031 178337 178430 179252 185593 184049 158463 166507 207992
4897 207992 166806 160438 176333 208156 213985 224532 231947 189730 164629 164195 191100 139377 148635
4884 148635 159260 164462 158655 121587 131984 120928 102964 105402 130668 128719 132728 113568 136465
4871 136465 130220 111618 84387 114168 145240 115247 108908 74376 111224 140708 141296 97740
4859 97740 55506 94317 102512 85576 93094 71709 84716 74201 74787 87839 57465 59905 91097
4846I1097j6006J7103j0120p340K7897m1127N717j0134P069J453M137P44j610
4833F8880J3969O981j7131k312J0938J4424J3262k2636Q059j1406l8804J8825
4821F3049j9272K7572L5404l596K7847j1742K094r381q819J0654J4903j1677j5247
4808A01789J185R441l648m1745l920K9084K0096O124l3817l809J923P873L051
4795I3627J9456J7004k4177j767Q125M326k1690m1476K3589K4231q233j4317K0095
4782I8793K1228j7168j1510q113J9165n564j5247k5210J8863J3911l558R327n877
4769H9040R610k9752R0o396o15K0351J6611J6080J243l6237j8613K0830j5584
4756F6658j726J202L4551J0828l4252L704J972l0227r203L2225k940K5226J9750
$$ plain form
4846 91097 75091 92194 82074 74734 102631 61504 67221 57087 64156 65609 69746 70490 68880
4833 68880 82849 89830 72699 70387 81325 95749 109011 86375 94434 83028 44224 63049
4821 63049 43777 71349 106753 103157 131004 119262 121356 111975 103156 113810 128713 117036 101789
4808 101789 102974 112415 108767 67022 63102 92186 112282 118406 84589 80780 82703 90576 93627
4795 93627 113083 130087 105910 104143 112268 116594 94904 53428 77017 101248 93015 78698 98793
4782 98793 120021 102853 91343 83230 102395 96831 81584 56374 75237 89148 85590 94917 89040
4769 89040 98650 68898 68988 62592 61977 82328 98939 115019 116262 80025 61412 82242 66658
4756 66658 64932 66134 100685 111513 77261 80965 82937 52710 43507 75732 72792 98018 117768
4743A17768k3166j6258J7196O751J7698j2973J153J254p215j0568P743Q830L914
4730A12127K6367j4532L3500N986k0732O401J7242k5938o59M158O722J1859K4246
4717A86747K48k0801K2951j0283N842j1820J7853P987l2888l5657p800J7968L0570
4704A70917J1294R811M946j5704J1007M756p756n493K545K8758K0740j7249j2397
4691B06175n7J4901J6422q060k6579J5226L1511j082p979n027J8085M316j1355
4678B46497q118o746L3264K1488J6137J5395q676k1160J5019P336J0749L0208
4666C51393j4866J2660l79k0391J4762j252K6156J7864O736P951M0041p686K126
4653D35115K4646K4028O001O749J9046R114K7434J0805k4216J5836r355K387O9363
$$ plain form
4743 117768 94602 78344 95540 102291 119989 107016 108169 109423 102208 91640 99383 108213 112127
4730 112127 138494 123962 157462 163448 142716 149117 166359 140421 139762 143920 150642 162501 186747
4717 186747 186995 166194 189145 178862 184704 172884 190737 198724 165836 130179 122379 140347 170917
4704 170917 182211 192022 196968 181264 192271 197027 189271 183778 186323 215081 235821 218572 206175
4691 206175 206118 221019 237441 229381 202802 218028 249539 248457 240478 235451 253536 257852 246497
4678 246497 238379 231633 264897 286385 302522 317917 309241 288081 303100 310436 321185 351393
4666 351393 336527 349187 348808 328417 343179 341927 368083 385947 392683 400634 440675 432989 435115
4653 435115 459761 483789 489790 496539 515585 524699 552133 562938 538722 554558 545203 547590 616953
4640F16953N5373M0873K0247M9797J2070L0710O2634M6357Q9015L7524J3759O6914
4628A142226Q5761M9992J05078N9087P4761J28340J05799J24956J32198J68324
4618B176522J65992J81278J58807J74793K24381K26525K64853L29393L40420L42419
4608D585383L99595M40719N27582O15626O03208O18955O00544N85983N22675N38941
4598A0039211N56764O60834O94947P28775O35816M96015L97148K44346K46963
4589A4700819L19879L71004M11601L43564J34610j30780l72693m89178m64814
4580A4824012l93311l34090l01833m00255n12569o68149p39719p72884p45618
4571I955584o13382n39482n55300n50864n78384o24318n83216n61078n04917m25688
$$ plain form
4640 616953 672326 713199 733446 783243 795313 826023 888657 935014 1024029 1061553 1075312 1142226
4628 1142226 1227987 1277979 1383057 1442144 1516905 1645245 1751044 1876000 2008198 2176522
4618 2176522 2342514 2523792 2682599 2857392 3081773 3308298 3573151 3902544 4242964 4585383
4608 4585383 4984978 5425697 5953279 6568905 7172113 7791068 8391612 8977595 9500270 10039211
4598 10039211 10595975 11256809 11951756 12680531 13316347 13812362 14209510 14453856 14700819
4589 14700819 15020698 15391702 15803303 16146867 16281477 16150697 15778004 15288826 14824012
4580 14824012 14430701 14096611 13794778 13394523 12881954 12213805 11474086 10701202 9955584
4571 9955584 9342202 8802720 8247420 7696556 7118172 6493854 5910638 5349560 4844643 4418955
4561D418955m05265l07646l06044k77829k31271k03497j69559k09497j07102j21265
4551B079980j34418p9763j26038j08291o8649p8952n2592n6192n3229n9777l5623
4540A226456n3284q5834n3400l4566m0956k7571l7053m4485l6672k7654k1392
4529G63589n5753k0422k7060j1318j7476l8430j5819J4045n463m2657k6370k6608
4517D90258j5906p087n732k4843l8848q089K2178j6635j2955o683k3538L0504
4505C82624n888l3800K5796j5428k8325J2281j4038k674m4479m2469m319K6482
4493B55763M445k8401R408O809J2716l0951j2565k3762J6218o776k3938L2323
4481B11289K258j2453l1074O879l1113k1851O546L4549J6445j2176K7250l3468
$$ plain form
4561 4418955 4013690 3706044 3400000 3122171 2890900 2687403 2517844 2308347 2201245 2079980
4551 2079980 1945562 1865799 1739761 1631470 1562821 1483869 1431277 1375085 1321856 1262079 1226456
4540 1226456 1173172 1087338 1033938 999372 958416 930845 893792 849307 812635 784981 763589
4529 763589 707836 687414 660354 649036 631560 593130 577311 591356 585893 543236 516866 490258
4517 490258 474352 467265 461533 436690 397842 389753 411931 395296 382341 375658 352120 382624
4505 382624 376736 342936 368732 353304 324979 337260 323222 320548 276069 233600 229281 255763
4493 255763 260208 231807 241215 248024 260740 229789 217224 193462 209680 202904 178966 211289
4481 211289 213547 201094 170020 176899 145786 123935 130481 165030 181475 169299 196549 163081
4469A63081l5663K710L1366j8854J7629M507k7228J4900J0472M843k0442J0593
4457A57914j8851l2603Q068J9936J3951l9274k8383K7394Q823L922n230j9435
4445I6232J6075K5199J1563l0906j6218K6880j86Q796m534k0834p683L2947j7045
4432A20286q579k3785R06J2493J1775j3379k7630p510K6605O349j4645J9329O948
4419A09163l0720l590N5010l1450m0621K1689o48q668J5925m501m885J2630M36
4406H9770o1239J8068L4564Q902o854J1455k7560j2872J9917O762J869J0049J1733
4393A04564l7980n374o635k4824J1232J3812k3149O935L445M74j8632M3136J8609
4380H5613l7071j2875J8379J6314p817q288N163k1052L7276R798j3803j2048j6274
$$ plain form
4469 163081 127418 130128 161494 142640 160269 164776 137548 152448 162920 167763 147321 157914
4457 157914 139063 106460 114528 134464 148415 109141 80758 108152 116975 120897 115667 96232
4445 96232 112307 137506 149069 118163 101945 128825 128639 137435 132901 112067 104384 137331 120286
4432 120286 111707 87922 88828 101321 113096 99717 72087 64577 91182 97531 82886 102215 109163
4419 109163 78443 74853 129863 98413 57792 79481 78833 70165 86090 81589 76704 89334 89770
4406 89770 28531 46599 81163 90065 83211 94666 67106 54234 74151 80913 82782 92831 104564
4393 104564 66584 61210 54575 29751 40983 54795 31646 38581 42026 42500 23868 67004 85613
4380 85613 48542 35667 54046 70360 62543 54255 59418 38366 75642 85440 71637 59589 43315
4367D3315J9115M10k186j9682k4490j0487P166o1P118J4783L5105k1978k3177
4354B4951j5884L1762K4261k4481P335M332l6095K8263p342m886J9759j1130m183
4341C6662l646j0293J835J895j1999J5814J2063K568j1320j4651L2220l6672k2667
4328h191L804L0308M4864l8077K9136j8224l409J2649k9161J032L132j644q636
4315A7583M1245L5518j7944l1412o952K785L724k1j4165j892j2367J5950j0467
4302B1585j2734J6085K5791J6634o435J7141m639K3j2223R496K1196k6875l496
4289F1549j2063K6410j2069j3409l857J0549K5973J7035L8730J0000k2944k2456
4277A03448R416K910o31o296j2160j368j924j9212J2911L6228J0322l3693K217
$$ plain form
4367 43315 62430 62840 60654 40972 16482 5995 13161 13100 20218 35001 70106 48128 24951
4354 24951 9067 40829 65090 40609 47944 52276 16181 44444 37102 32216 51975 40845 36662
4341 36662 33016 22723 24558 26453 14454 30268 42331 44899 33579 18928 51148 14476 -8191
4328 -8191 -4387 25921 70785 32708 61844 43620 40211 52860 23699 24731 27863 26219 17583
4315 17583 58828 94346 76402 44990 38038 40823 44547 44526 30361 28469 16102 32052 21585
4302 21585 8851 24936 50727 67361 60926 78067 73428 73451 61228 70724 91920 65045 61549
4289 61549 49486 75896 63827 50418 46561 57110 83083 100118 138848 148848 125904 103448
4277 103448 112864 115774 115143 108847 96687 95319 93395 74183 87094 123322 133644 99951 102168
4264A02168P528j4130P463j1010K320J237l4922j5299J8607p715j8102J4378J4170
4251F6693K0938q661j2398j6075J2008l100k2170K6309j1479l300l5504J0259
4239B3520K9049j1168Q799j4209M67J7703l1461l5830K3789J5274L1266K1906
4227G9105j6779j0402j2053O031l632j9391J7669K2758J0175j3899M5073J6051
4215A20706k4921j4145K5189M7502O993q832O579o657K3059L4440K5185L6668
4203B71766L3064N3322Q3947M0668J3081p27n0968m9520n6652k1189r110n8435
4191B49247o1211l6396j1166j280k4887O603k4599l2502k3926L0004R022K143
4179H1052r85m173l4856m41N922J2023j3832j4431R664N665k0467J100J4964q059
$$ plain form
4264 102168 109696 95566 103029 92019 94339 95576 60654 45355 63962 56247 38145 52523 66693
4251 66693 87631 78970 66572 50497 62505 59405 37235 63544 52065 48765 13261 23520
4239 23520 52569 41401 50200 35991 36458 54161 22700 -13130 10659 25933 57199 79105
4227 79105 62326 51924 39871 45902 42270 22879 40548 63306 73481 59582 104655 120706
4215 120706 95785 81640 106829 154331 161324 152492 159071 152414 175473 209913 235098 271766
4203 271766 304830 358152 442099 482767 495848 495121 444153 394633 337981 316792 307682 249247
4191 249247 188036 151640 140474 139194 114307 120910 96311 63809 39883 69887 78909 81052
4179 81052 80067 75894 41038 40597 46519 58542 44710 30279 39943 45608 25141 26241 41205 33146
4165C3146J2106K129j694j321Q000j4148j3675l6636J1815J2970j2970j2042j3333
4152b5653K4461J2775l3221J2455K6249J0562j9497J0589k1528J1865n08j3933
4140e384K039Q122K0176j3367p469J7210J4696j3623q714k731J9862J5356j7998
4127B8175k7623Q379P466K599k3731l8031O731K0179n5M837K1629m538k9727K6070
4113B360L3972k370P600k9562m9984j3193M2319O2000j9145l548L359k8982K0645
4100B5471p812n677O295k8433j5860R192P645k0088K457M55L529o26J8687m453
4086i218J0665J2344j2053J1739m63p865J4563O436k1907k2284j3338K2451K2253
4073A3323K2612k7213j3951L326j2155k2430l532K6544J7364K4988n901r106K077
$$ plain form
4165 33146 45252 47381 45687 44366 52366 38218 24543 -12093 -278 12692 -278 -12320 -25653
4152 -25653 -1192 11583 -21638 -9183 17066 27628 8131 18720 -2808 9057 8549 -5384
4140 -5384 -3345 4777 24953 11586 4117 21327 36023 22400 13686 10955 30817 46173 28175
4127 28175 552 8931 16397 18996 -4735 -42766 -36035 -15856 -15911 -11074 10555 6017 -23710 2360
4113 2360 36332 33962 41562 12000 -37984 -51177 -8858 53142 33997 30449 33808 4826 25471
4100 25471 17659 11982 18277 -10156 -26016 -16824 -9179 -29267 -26810 -26355 -22826 -23452 -4765 -9218
4086 -9218 1447 13791 1738 13477 13014 5149 19712 26148 4241 -18043 -31381 -8930 13323
4073 13323 35935 8722 -5229 -1903 -14058 -36488 -40020 -13476 3888 28876 22975 13869 15946
4060A5946R876J4697l6499k0099K8952l2643m445M0681j2015l4535K632N850J1150
4047a0452l391L1356j927o749J9270P372J6285j0640n2999j181J5430Q346j149
4034I571l480L283k9633L788J4948K3273P978j2916l9089K7680j1626R214J9095
4021B2086J2075m5523l832K303k7577R552O2570N512k6269o224j312R076J0517
4008B2954l6221P435J7206j2820K7911k1781j9681j2849J2743J2650j6114L230
3996a5337M167J3380O117K1121j7247p436O683j2553J0118J7545N091Q67j7107
3983A5409k0940p199o523J0423J4492K9392k105o760P890o260k9239L9355j8180
3970A9755J1939j2884j0178K0755k195P220R521l022k3493O703k664j4449j2624
$$ plain form
4060 15946 25822 40519 4020 -16079 12873 -19770 -24215 16466 4451 -30084 -27452 -21602 -10452
4047 -10452 -13843 17513 15586 8837 28107 35479 51764 41124 -11875 -13056 2374 10720 9571
4034 9571 6091 9374 -20259 -16471 -1523 21750 29728 16812 -22277 5403 -6223 2991 22086
4021 22086 34161 -11362 -15194 -12891 -40468 -30916 31654 37166 10897 4673 3361 12437 22954
4008 22954 -13267 -5832 11374 -1446 26465 4684 -14997 -27846 -15103 -2453 -18567 -15337
3996 -15337 -11170 2210 8327 29448 12201 4765 11448 -1105 9013 26558 31649 32516 15409
3983 15409 -5531 -12730 -19253 -8830 5662 35054 32949 26189 34079 27819 -1420 37935 19755
3970 19755 31694 18810 8632 29387 27192 34412 43933 40911 17418 24121 21457 7008 -5616
3957e616j9942J6198J4689k4411j8870L5296J2482j8939k809L6128k4972j0006
3945a0772k137L3919l2440o763r010J3761J6694J3814o979p07J2654j3492p786
3932G56k5370Q068p528j3986Q069J0916j279k159M0K2686r16K8938o8l9212k9355
3917d0400K124k1084J9596m490Q175j437M150J4808l885J6121J9655Q29J5504
3904B9666l3768k59K2386p296J4562R382k8583l7928J9868J4578O144K980l805
3891G927k5476k442J7580P26j063j1671Q304j7800K00L0517N370N369k104l091
3877A2346m569J913k4700q269J6148r638K1440q29M771O689j7224P292j432O14
3863D552P571N320k0024M956L497p59p481l0370J7332J3983r522K15J1214k3402
$$ plain form
3957 -5616 -25558 -9360 5329 -19082 -37952 -2656 9826 -9113 -11922 24206 -766 -10772
3945 -10772 -12909 21010 -11430 -18193 -27203 -13442 3252 17066 10087 9380 22034 8542 756
3932 756 -24614 -16546 -24074 -38060 -29991 -19075 -20354 -22513 -22473 213 -703 28235 28167 -11045 -40400
3917 -40400 -38276 -59360 -39764 -44254 -36079 -37516 -33366 -18558 -22443 -6322 13333 14162 29666
3904 29666 -4102 -4361 18025 10729 25291 34673 6090 -31838 -11970 2608 8752 11732 7927
3891 7927 -17549 -19991 -2411 -1685 -2748 -14419 -6115 -23915 -23715 6802 12172 17541 15437 12346
3877 12346 7777 9690 -15010 -23279 -7131 -16769 4671 3842 8613 15302 -1922 5370 3938 4552
3863 4552 12123 17443 -2581 2375 5872 5113 -2368 -32738 -15406 -1423 -10945 -10730 484 -22918
3849b2918P071k570p955K6221J6266K192l9695J2539M3656l2025l6689K5216n4033
3836f2724j2850P0489k2247K8878J3102k9089j4398K6532n521J8411P157k0634
3824b894k0208r23J3762q306Q679M039K2730Q888k3256k28J0268J7457j4985J2948
3810B7971J0305p053o254j6251K401K1499l6370j6417K9537J3662Q582J7476j6703
3797C2385k8928l952k119k4475K6024L2421j1557j098l2375K0941m266l733O399
3784E667J3895j1131p78R908M418j5719r341J7185o976l4255J6912J0644M258
3771D687j389L0138j0005L0508p668l797j8064p299M687R736m0670j0485K0587
3758I66k60J2831j6648K747J2761k5837n324P288k767K0076P163J4559L077j2608
$$ plain form
3849 -22918 -15847 -18417 -26372 -151 16115 18307 -21388 -8849 34807 2782 -33907 -8691 -62724
3836 -62724 -75574 -5085 -27332 1546 14648 -14441 -28839 -2307 -7828 10583 17740 -2894
3824 -2894 -23102 -24025 -10263 -18569 -9890 -5851 16879 25767 2511 2283 12551 30008 15023 27971
3810 27971 38276 31223 24969 8718 11119 32618 -3752 -20169 9368 23030 31612 49088 32385
3797 32385 3457 -495 -2614 -27089 -1065 31356 19799 18701 -13674 7267 3001 -732 5667
3784 5667 19562 8431 7653 17561 21979 6260 -3081 14104 7128 -27127 -10215 429 4687
3771 4687 3298 33436 23431 53939 46271 42474 24410 17111 21798 31534 -9136 -19621 966
3758 966 706 13537 -3111 -364 12397 -13440 -18764 -11476 -14243 5833 12996 27555 30632 18024
3744A8024k1200j3154K5341j979P225N3879k9621l7794j0932o232p661J5710J919
3731f475m489q249K2367L631k3056l2830L2062N660k6289n241L5286J3430k0329
3718a4522J5515j0783K5298K0027l8302n384j549k1636j0536J9142P681K3336
3706H287J5691j5794M087R100r218k0240J8488q851n5364L9586R199q526K03j8305
3692c1657K2319J633N823K4151J812k3114M121K2032j307k53k5344P59l015j2229
3678a4269K3275P28M191j2578k3893j0428L1213Q610j9150j3029J6824p019m653
3665b0178K5026j2379j8207j4722J0572q137J1085l63L2120J9958o96j4909J81
3652I351r718j0496K9501M415j5996m712q62J0341K939P845j1962j351O80k8037
$$ plain form
3744 18024 -3176 -16330 9011 7032 14257 68136 38515 721 -10211 -16443 -24104 -8394 -6475
3731 -6475 -10964 -19213 3154 6785 -16271 -49101 -17039 -11379 -37668 -42909 -7623 5807 -14522
3718 -14522 993 -9790 15508 35535 -2767 -8151 -9700 -31336 -41872 -22730 -15049 8287
3706 8287 23978 8184 12271 21371 12153 -8087 10401 1550 -53814 -14228 -5029 -13555 -13352 -31657
3692 -31657 -9338 -7705 -1882 22269 24081 967 5088 27120 25813 25560 216 975 -2040 -14269
3678 -14269 9006 9734 13925 1347 -22546 -32974 -1761 6849 -12301 -25330 -8506 -15525 -20178
3665 -20178 4848 -7531 -25738 -40460 -29888 -38025 -26940 -27303 4817 24775 24079 9170 9351
3652 9351 -367 -10863 18638 23053 7057 2345 1483 11824 14763 22608 10646 9295 9975 -18062
3638a8062J0520J5118J450k9193L9451K4553l2261l095p589k289N545j3941j2601
3625b2394N251N2331k5253j8548P646K0258m4567Q699L4339J3141j0196k7031
3613f324l377J4167K6653l0235p096l649r824K4826J0698k9678M938r804l51J5060
3599c996j1979J480J7548J1265J2742m2025j4433m11k4411L3802m18k3950K5635
3586a9151K7355p799r394J9088o014n925K077P485n539p32j5482P671K2397j0100
3572E937j2556n132L929L85j5438O12M2526p870j2695R927R089K6639m799m2927
3558b373J3984K2958n829l3358k6319K3905m603l3433J4637n30L263j621n88M4124
3544A4217j6719m875K4780L4811k0782j8153q947n083o370J4823K7089k7288J3349
$$ plain form
3638 -18062 -7542 7576 9026 -20167 19284 43837 11576 8481 892 -1397 4148 -9793 -22394
3625 -22394 -17143 35188 9935 -8613 -967 19291 -25276 -16577 17762 30903 20707 -6324
3613 -6324 -9701 4466 31119 884 -6212 -9861 -19685 5141 15839 -13839 -8901 -18705 -19056 -3996
3599 -3996 -15975 -14495 3053 14318 27060 -14965 -29398 -29809 -54220 -20418 -20836 -44786 -19151
3586 -19151 8204 405 -8989 10099 4085 -1840 237 7722 2183 1451 -14031 -6360 16037 5937
3572 5937 -6619 -11751 -7822 -7437 -22875 -22263 20263 12393 -302 9625 18714 45353 40554 -2373
3558 -2373 11611 34569 28740 -4618 -30937 -7032 -11635 -45068 -30431 -30961 -27698 -29319 -29907 14217
3544 14217 -2502 -7377 17403 52214 31432 13279 4332 -751 -7121 7702 34791 7503 20852
3531B0852o166l4496M454k7316O952K3045J3803k0969K3906L222o377o90j6559
3518a6339L1489J9297q838l3498p262k5900L9967o69J8566m711j999j9098p941
3505a6936J8478o504j8031n965L0950M154j1484q739M3297o237k7212L955J5230
3492A4956m81j7295L945J750p457j9697N621J5290J9641j52R741j528k3439j5311
3478a4416J0129j8310q380K2702j9756L5035L5285j8840j8837j5344q029K4055
3466E294J7064j7005j1124O124J5545n00q21j5809L703J1845k5299J897j1803
3453b0889j121J9888M269k8871p4j7912K4867J5906j1819L9061k537M794N8L3007
3439E8627j2146q722J6379j3771K720n154K7063j0075j8538R212m437N635q531
$$ plain form
3531 20852 14686 -19810 -15356 -42672 -35720 -12675 1128 -19841 4065 7287 910 220 -16339
3518 -16339 15150 34447 25609 -7889 -15151 -41051 -1084 -1753 16813 12102 10103 -8995 -16936
3505 -16936 1542 -4962 -22993 -28958 1992 6146 -5338 -14077 29220 22983 -4229 -274 14956
3492 14956 14475 -2820 1125 2875 -4582 -24279 -18658 -3368 16273 16121 25862 24334 895 -14416
3478 -14416 -4287 -22597 -30977 -8275 -28031 7004 42289 23449 4612 -10732 -18761 5294
3466 5294 22358 5353 -5771 353 15898 15398 14577 -1232 2471 14316 -10983 -9086 -20889
3453 -20889 -22010 -2122 2147 -26724 -26798 -44710 -19843 -3937 -15756 23305 20768 25562 25620 58627
3439 58627 46481 37759 54138 40367 43087 37933 64996 54921 36383 45595 41158 46793 38262
3426C8262j8485k26J2401k7598p60K8580l6248P749K0682J3779k225O397P303
3413D9611j5364l4683J266K9260O119Q615k6997J6211k702j2434l35q377K1939
3400C2129l1996j7677L282J1198q197J6453J0303J7999k793K2557J1340m3438
3388B1160l8003k841M2323K8616j7640l6192J1316R120j0231J0699J6858q415
3376B6770j2209J2642K002m367l6715k6119K2331L1180j3418j3669J2869J4602
3364A5899L7295n8141J7354n795K948M1078r244L8649j789k954p058j6591J8593
3351G0244J2298l153N084J7339j199N963k6138n2341P059K0121l2093L0094J6569
3338F9847L3780l6901l1892J6721M486l5447l0612J0499K3891l474M112R84o160
$$ plain form
3426 38262 19777 19551 31952 4354 3594 32174 -4074 3675 24357 38136 35911 42308 49611
3413 49611 34247 -436 830 30090 36209 44824 17827 34038 31336 18902 18567 10190 32129
3400 32129 133 -17544 -14262 -3064 -11261 5192 15495 33494 30701 53258 64598 21160
3388 21160 -16843 -19684 22639 51255 33615 -2577 8739 17859 7628 18327 35185 26770
3376 26770 14561 27203 29205 24838 -11877 -37996 -15665 15515 2097 -11572 1297 15899
3364 15899 53194 -4947 12407 6612 9560 50638 41394 80043 78254 75300 68242 51651 70244
3351 70244 82542 79389 84473 101812 100613 106576 80438 28097 35156 55277 23184 53278 69847
3338 69847 103627 66726 34834 51555 56041 20594 -10018 481 24372 20898 25010 25994 19834
3325A9834Q348K820K0172n0750j1191J3548N096j8636K11Q89j7532m284J7355
3312a4120J3868J9496k6309L802J5624o496K5928n865k9171J1992M760J0728M90
3299B4727n360J2046k44j1641N951R047j0318j85k2855j3351j8136K6126L2441
3286B8248n958J39p307l03J2643P659O190k5020K261l079j6027N660J3193k5232
3272f933L096L50K5019J3361J006J7821k7961R550k8167O853J8862j0346m436
3259A8075K3294k889l1684L515J4201M48r631p75m386J0387J405j3474J2983M945
3245B6414m049m461O868J684K6367K407l6296k3129J4800O326p327k6854K829
3232a4421R528L5495j699r477N025K363q107k6733K2739P405j5029k0329J4663
$$ plain form
3325 19834 28182 31002 51174 424 -10767 2781 7877 -10759 -10548 -9659 -27191 -31475 -14120
3312 -14120 -252 19244 -7065 -3263 12361 5865 31793 25928 -3243 8749 13509 24237 24727
3299 24727 19367 31413 31169 19528 25479 34526 24208 24023 1168 -12183 -30319 -4193 28248
3286 28248 22290 22429 15122 14819 27462 35121 41311 16291 18552 15473 -554 5106 18299 -6933
3272 -6933 -3837 -3487 21532 34893 35899 53720 25759 35309 7142 13995 32857 22511 18075
3259 18075 41369 38480 6796 10311 24512 24960 15329 14554 10168 20555 21960 8486 21469 26414
3245 26414 22365 17904 24772 26456 52823 55230 18934 -4195 10605 16931 9604 -17250 -14421
3232 -14421 -4893 30602 28903 19426 24451 26814 18707 -8026 14713 22118 7089 -13240 1423
3219A423K6378K166k3249J5851k7309k1925k331K5808J8188M976K1997j180j9541
3206B1252l8435J7285J3079l530j9352L851J0944K656k9999l9196J2763j4621
3194f3303L2192K4475k3147R061P113M705R492p823K0991j3676k3485j6318L1632
3181h091P639n468J4260p002l1001K0613O374r255J7445k3072J348j5212J1419
3168b0003K0806J8677o655m681R572j4117n2532M0138N70k4327k495L2298k020
3155d769p911o201J995J2830k1965R011m261K9105m2924j9298J4366J0559L4649
3142E186K8216q126N711o884m3794R713J4453j3857j4768Q846J9755P492k1040
3129i097p408M4537p906R029k3876p910m790j0502R079o137j2158N731K5450j2640
$$ plain form
3219 1423 27801 29967 6718 22569 -4740 -26665 -28996 -3188 15000 19976 41973 40793 21252
3206 21252 -17183 102 13181 9651 -9701 -5850 5094 7750 -22249 -61445 -48682 -63303
3194 -63303 -31111 -6636 -29783 -20722 -13609 -8904 588 -7235 13756 80 -23405 -39723 -8091
3181 -8091 -452 -5920 8340 1338 -29663 -9050 -2676 -11931 5514 -17558 -16210 -31422 -20003
3168 -20003 803 19480 12825 8144 17716 3599 -48933 -8795 -8225 -32552 -35047 -2749 -4769
3155 -4769 -12680 -18881 -16886 -4056 -26021 -17010 -21271 7834 -35090 -54388 -40022 -29463 5186
3142 5186 33402 25276 30987 24103 -19691 -9978 4475 -9382 -24150 -15304 4451 11943 -9097
3129 -9097 -16505 28032 20126 29155 5279 -2631 -7421 -17923 -8844 -14981 -27139 -21408 4042 -8598
3115h598K461K296j6522J0565J2578p811j3270j7944j2935J2714L5318k2744k4315
3102d8207M1470J7855l891j2740k4180K1557K3660k0872j598n31j3428P906J3201
3089B02j2014n756J0820J630k6090K2050J0724J3111K1288j7859j1663k9090L5576
3076A2929j9509n471K4418o940k303O108j7817J8531j210j6843j7861p891J598
3063c2261j7029J5854K6072K5465k677k0568K2916J0524k6063q831j0927N885
3051a1640K4220K3531r846o863J9732p654p971l1067l9864K2966M036N832j3076
3038b7664Q295J3584k6177J0143L5673j1659j4891J8232R235Q829O036N830m8743
3025a3277l5566J3823L7221o128R486K3486j5290l5901J8534o37J0077j3304k6821
$$ plain form
3115 -8598 -6137 -3841 -20363 -9798 2780 -5031 -18301 -36245 -49180 -36466 -1148 -23892 -48207
3102 -48207 -6737 11118 7227 -5513 -29693 -8136 15524 -5348 -6946 -7477 -20905 -12999 202
3089 202 -11812 -17568 -6748 -5118 -31208 -9158 1566 14677 35965 18106 6443 -22647 12929
3076 12929 -6580 -12051 12367 5427 3124 9232 -8585 9946 8736 -8107 -25968 -33859 -32261
3063 -32261 -49290 -33436 -7364 18101 15424 -5144 17772 28296 2233 -6598 -17525 -11640
3051 -11640 12580 36111 26265 19402 39134 31480 23509 -7558 -47422 -24456 -20420 -14588 -27664
3038 -27664 -19369 -5785 -31962 -21819 13854 2195 -12696 5536 14771 23600 29636 35466 -13277
3025 -13277 -48843 -35020 2201 -3927 5559 29045 13755 -22146 -3612 -4249 5828 -7476 -34297
3012c4297Q870K9917K8885m8489l4533r219K4185l2680L267L9955L0603k9689
3000b3225j1843J6972J154L3017r462m2984J9158j113K599J2461O303P773Q76
2987A1686K769j307J9390L021r456j8271J9338o646k9334j5520k0612J7227M456
2974b3259q746K5286k0746J2188j0841J3947j4184N476P7338n5379k2329j0250
2962c1499K970M891N975K1463J610K635o347k9350J0513L3032O820l1324k915
2949a1526K6318K7329k3873k6206j5958m0767K3177N4252m834l0664l09Q704j9122
2936c3479l239L8576M185j2459j4019R952j6672J3985L678K8033p197j4092k490
2923e238j7286J2888j743k2059K7481J5564l0215Q389N859j9825m007M369O144
$$ plain form
3012 -34297 -25427 4490 33375 -15114 -49647 -58866 -34681 -67361 -64094 -24139 6464 -23225
3000 -23225 -35068 -18096 -16942 16075 6613 -36371 -17213 -18326 -15727 -3266 3037 10810 11686
2987 11686 14455 13148 32538 35559 26103 7832 27170 20524 -8810 -24330 -44942 -27715 -23259
2974 -23259 -32005 -6719 -27465 -15277 -26118 -12171 -26355 -20879 56459 1080 -21249 -31499
2962 -31499 -28529 -23638 -17663 3800 5410 8045 1698 -27652 -17139 15893 22713 -8611 -11526
2949 -11526 14792 42121 18248 -7958 -23916 -64683 -41506 12746 7912 -22752 -23061 -14357 -33479
2936 -33479 -36718 1858 6043 -6416 -20435 -10483 -27155 -13170 -9492 18541 11344 -2748 -5238
2923 -5238 -22524 -9636 -11379 -33438 -5957 9607 -20608 -12219 -6360 -26185 -30192 -25823 -19679
2910a9679O5969n5909j0829L3772p590k1275j5234k900j8020M8357J5814k4185
2898a1709r523J1262j6768M1067j3599k0096J6358o204M304j9511p260N553K3318
2885b808l6779j1655K8563L038o379L4652l982N171M209r24J966p478K708l150
2871G152J4661k1964k9703J1533N01l667J6098J9973o566k4056K7527M15k8364
2858a6460p457K2088j3720q289j2527Q559j424j2976j0127J3587K0500N589j8186
2845c0843L5079J5015P408J4400k7930k4177N12J0419j0998J4228R39Q593p834
2832D811n334r229j8875k788J3787K1965n311o199R600n10j117q884m0309K2573
2818b5820K4952M120P901m6361k0666N1430K4402j278J83M78O783l2918o991J008
$$ plain form
2910 -19679 46290 -9619 -20448 13324 5734 -15541 -30775 -33675 -51695 -3338 12476 -11709
2898 -11709 -21232 -9970 -26738 14329 730 -19366 -3008 -9212 -4908 -24419 -31679 -26126 -2808
2885 -2808 -39587 -51242 -22679 -19641 -26020 8632 4650 9821 14030 13106 15072 7594 10302 7152
2871 7152 21813 -151 -29854 -18321 -17820 -21487 -5389 14584 8018 -16038 11489 11904 -16460
2858 -16460 -23917 -1829 -15549 -23838 -36365 -27806 -29230 -42206 -52333 -38746 -18246 -12657 -30843
2845 -30843 4236 19251 26659 41059 13129 -11048 -10536 -117 -11115 3113 4052 12645 4811
2832 4811 -523 -9752 -28627 -31415 -17628 4337 -974 -7173 2427 1917 800 -8084 -48393 -25820
2818 -25820 -868 3252 11153 -35208 -55874 -4444 19958 18680 18863 19341 26124 -6794 -13785 -12777
2804a2777J5411k3092K0207M759J518J2296l7152k2540p624J6251n129j3439N5522
2791D211O726r368J5268J4651o25k7359j1189J087K4773J17k2782K9171l2468
2778g787J470J3109l6628K1626J2149K1172L951m4443o072J2950l031J2469K044
2765B979j3860L462M379l5734J5682J6740N760l5261P503J7296o261J5110M345
2752B140k6473j230O61R584O033J4923J0456j4922K5970j5079j3574k1811K586
2739b0736j8924O686L1358J1990q276L825r132k2360o28l293L9287j126J7386
2726B6057J464l7350j3660L450J6184L4591r7k7530j3495k1649J1550J1018k2591
2713c2058l887L1246J9088r67k260j3538j3351R239J440n085j2390J5552J9638
$$ plain form
2804 -12777 2634 -20458 -251 4508 6026 18322 -18830 -41370 -48994 -32743 -37872 -51311 4211
2791 4211 10937 1569 16837 31488 30863 3504 -7685 -6598 18175 18292 -4490 24681 -7787
2778 -7787 -6317 6792 -29836 -8210 3939 25111 29062 -15381 -21453 -8503 -11534 935 2979
2765 2979 -10881 -7419 -3040 -38774 -23092 -6352 -592 -35853 -28350 -11054 -17315 -2205 2140
2752 2140 -24333 -25563 -24902 -15318 -9285 5638 16094 1172 27142 12063 -1511 -23322 -20736
2739 -20736 -39660 -32974 -1616 10374 2098 5923 -3209 -25569 -26197 -29490 9797 8671 26057
2726 26057 27521 -9829 -23489 -20039 -3855 30736 30639 3109 -10386 -32035 -20485 -9467 -32058
2713 -32058 -35945 -4699 14389 13422 11162 -2376 -15727 -6488 -5048 -10133 -22523 -6971 12667
2700A2667j469k103r976p741J0504r163K3502N205m2919M944j3212N718L8010
2687A3967O978j3488k0674p223j8571J9784K2655j7114j4909q491K0014K4205
2675G133k3159k2971M2106J3429J3969j158n15j7891k5476J7163M372j1533k1201
2662b5732K5361p692P42M8663l505j3033J2612l2457l0041J323j1996J6295O027
2649a3433q270K8114J1734r921j0179j656r479m820J5259j3489K0777o087J3908
2636A2458J2489l3624k62K7348j282j5479p554N917J7108j4299k8639L491K5442
2623C114L0290o46l2684P70J1310m425J1700l347j1331M073L384j9071J9208K1497
2609C3842m6298m024K5584J7832J685j8411j5424l968K7501j4349J3113J680k0040
$$ plain form
2700 12667 11198 9095 -881 -8622 1882 -7281 16221 21426 -21493 -16549 -29761 -24043 13967
2687 13967 20945 7457 -13217 -20440 -39011 -19227 3428 -13686 -28595 -37086 -17072 7133
2675 7133 -16026 -38997 3109 16538 30507 29349 28834 10943 -14533 2630 7002 -4531 -25732
2662 -25732 -371 -8063 -7321 41342 37837 24804 37416 4959 -25082 -23759 -35755 -19460 -13433
2649 -13433 -21703 6411 18145 8224 -1955 -3611 -13090 -17910 -2651 -16140 4637 -1450 12458
2636 12458 24947 -8677 -8939 18409 17127 1648 -5906 11 17119 2820 -25819 -22328 3114
2623 3114 33404 32758 74 844 12154 7729 19429 16082 4751 8824 12208 -6863 12345 33842
2609 33842 -12456 -16480 9104 26936 28621 10210 -5214 -9182 18319 3970 17083 18763 -1277
2596a277L056j5989L4783j5210k4022K3694J2459J376K441l2266J6565l000m997
2583b387m952k5029M414J1328M77j6177K617m172J6510K8936j3761j3504K3545
2570G845J8584j1696j5483j5851K0526j3447o725K6509j1929k78j5143J1847J5582
2557A0341m1752P791L6918k4749j6671j5644J6941M21J8962L178k0827R718k468
2544a7841p351K3909k531J9461L490m2700P86r323J6217l89K0451n842p058K607
2530f114j0321J0147K2798k6594J8001j8855l8119M0219K0535k4012l755J5137
2518i33o668L848M953k1096k7525K0103j2914M1564J597j9045O531L310m643J9517
2504H599J7972Q009l4371j7703K0985q246O237j2728K2824N896j1190P836q233
$$ plain form
2596 -1277 1779 -14210 20573 5363 -18659 5035 17494 18870 21311 -10955 5610 2610 -2387
2583 -2387 -7339 -32368 -27954 -16626 -16149 -32326 -29709 -33881 -17371 11565 -2196 -15700 7845
2570 7845 26429 14733 -750 -16601 3925 -9522 -16247 10262 -1667 -1945 -17088 -5241 10341
2557 10341 -31411 -23620 13298 -11451 -28122 -43766 -26825 -26404 -7442 -4264 -25091 -15373 -17841
2544 -17841 -25192 -1283 -3814 15647 19137 -23563 -22777 -32100 -15883 -16272 4179 -1663 -8721 -6114
2530 -6114 -16435 -6288 16510 -10084 7917 -10938 -49057 -8838 11697 -12315 -16070 -933
2518 -933 -7601 -3753 1200 -19896 -47421 -27318 -40232 1332 2929 -16116 -9585 -6275 -10918 8599
2504 8599 26571 34580 209 -17494 3491 -4755 1482 -11246 11578 17474 6284 14120 5887
2491E887l2718J940Q924N33N811j1141o259L5258j3698j126L51J396K0859q963
2477G054N97J1851Q008K1r709R437j7684Q950N548j6348m380J9005K2178k1986
2463B2542j9857J2506L66Q98M249k0543j5165j34k394K6522j8117J4799M7627
2450E3299n9376Q78J8611P205m3648k4529L7470K6556p33j1139j4689L3826K0228
2437D3959k4034m1097K8430J3438p43n426J7283l0513l2120q135K3605J7079M543
2424F269L5550k5680k3451k6767J1310L0210k6386N110j0800J4276K4314k5039
2412a1084K9115j0949j5852K5698k196j0574p318P691K912J4081p145j0276L8184
2399D2287l8458n298r424R721j1625j084j0702o479J1486K3001j7830j9258N653
$$ plain form
2491 5887 -26831 -24891 -15967 -15434 -9623 -20764 -27023 8235 -5463 -6589 -6238 -4842 16017 7054
2477 7054 7651 19502 27510 27531 17822 27259 9575 18525 24073 7725 3345 22350 44528 22542
2463 22542 2685 15191 15557 16455 20704 161 -15004 -15138 -17532 8990 -9127 5672 53299
2450 53299 -6077 -5199 13412 20617 -23031 -47560 -10090 16466 15733 4594 -10095 23731 43959
2437 43959 19925 -21172 7258 20696 19953 14527 31810 1297 -30823 -38958 -15353 1726 6269
2424 6269 41819 16139 -7312 -34079 -22769 7441 -18945 -13835 -24635 -10359 13955 -11084
2412 -11084 18031 7082 -8770 16928 14732 4158 -3160 4531 7443 21524 14379 4103 42287
2399 42287 3829 -1469 -10893 -1172 -12797 -13881 -24583 -31062 -19576 3425 -14405 -33663 -28010
2386b8010k45K8235J3144j0567k6563M0765Q960l249j4359l6081o050l873M4368
2373F475J4540k999j0901k4843j3475J8353j324O838O983m649J5745l4798K7750
2360C695M723k5062k78Q704l815q1k537o702M8775R350j0330q907P604L21k7910
2345b450j3426J1156L4746k1408J3063j552n619j9235k264Q086K982K2606m4584
2332a7899K0292O150M961O256l5019j8160J6129K59J7778Q532K451J2030q239
2319A5521r139k5090j1250K3177P622n140O562M095J2689j2277J1513R107N870
2306C3260j4400j3730n803L1093J3955Q16k2169N430q334k0215m14J4590r051
2293E028j1347q640K1129j5598q161K4587p250P800q477J6931j0507k1449L1569
$$ plain form
2386 -28010 -28255 -20 13124 2557 -24006 16759 25719 22470 8111 -27970 -34020 -37893 6475
2373 6475 21015 18016 7115 -17728 -31203 -12850 -14174 -7336 -353 -5002 10743 -24055 3695
2360 3695 8418 -16644 -16922 -8218 -12033 -12114 -14651 -21353 27422 36772 26442 17535 25139 25460 -2450
2345 -2450 -15876 -4720 30026 8618 21681 20129 14510 -4725 -6989 1097 4079 26685 -17899
2332 -17899 2393 8543 13504 19760 -15259 -33419 -17290 -17031 747 9279 11730 23760 15521
2319 15521 6382 -18708 -29958 -6781 841 -4299 2263 6358 19047 6770 18283 27390 33260
2306 33260 18860 5130 -673 30420 44375 45191 23022 28452 20118 -97 -511 14079 5028
2293 5028 -6319 -14959 6170 -9428 -17589 6998 -252 7548 -929 16002 5495 -15954 15615
2280A5615r406m204k031j4222K8315l940m048M198j0037j9222r573Q01J1572k7848
2266d4030L9413j2557j857j6228L3885J2142l0234M9262J6974l2854J1419o833
2254A8502m2403J7334J3199k9675K5700k793j5814k5156K537L8088r407K546K1615
2241A4273l9942k601M3831l2292K2337J4431r521j8484k5214J0152N418K1044
2229C432J1562k2037L232J4032l4162K4940k600l3435K4071J0176j2459K7538
2217A4290O631j7515J6264l0552k7307n181K2356M8234k200l2387Q685P679L2780
2204D1777j500j0180J1092j3430p517l051j6394L889j5303Q897K6016J1720j132
2191C4884m858l7713k2052O047m970K9677J929l9009J0462M368J8790J9608K7014
$$ plain form
2280 15615 6209 2005 -26 -14248 14067 10127 6079 10277 240 -18982 -28555 -27754 -16182 -44030
2266 -44030 -4617 -17174 -19031 -35259 -1374 10768 -19466 29796 46770 13916 25335 18502
2254 18502 -23901 -6567 6632 -23043 2657 -136 -15950 -41106 -38569 -481 -9888 -7342 14273
2241 14273 -25669 -28270 15561 -16731 5606 20037 10516 -7968 -33182 -23030 -17612 3432
2229 3432 14994 -7043 -3811 10221 -23941 999 -1601 -35036 -10965 -789 -13248 14290
2217 14290 20921 3406 19670 -10882 -38189 -43370 -21014 27220 25020 -7367 1318 8997 41777
2204 41777 40277 30097 41189 27759 20242 17191 797 4686 -10617 -1720 24296 36016 34884
2191 34884 30026 -7687 -29739 -23692 -28662 1015 2944 -36065 -25603 -21235 -2445 17163 44177
2178D4177j6446k9122R228R103j3715j4685r351K4153J0438Q876k8086j1580l759
2165b0769R977J189K6892j5077Q719j7161l8205L0015R575r770M535j9975L758
2152b6297j293k5266R008L680M6378n147j200K4749o13l5496J4509J9094k3976
2139a870K6536k4706j7707L1591k8384n219q073J2690L192j43j7630p738L1540
2126e921j0191k5594L1256J0259k8356j476K4001l291J99J7811o974k01J5017
2113A6539J143k0007k2824J4887J2976K5033k0756J3714K4269K89l6230O193P562
2100B2788j859l585k5637j4614K6963j8470j6696R01K1417r949j3608L1862R579
2087I092j2840r545j6443j6710K1182K9795j0470o465P108l3757J2383K5078k104
$$ plain form
2178 44177 27731 -1391 7837 16940 3225 -11460 -20811 3342 13780 22656 -5430 -17010 -20769
2165 -20769 -10792 -9603 17289 2212 10931 -6230 -44435 -14420 -4845 -14615 -10080 -30055 -26297
2152 -26297 -27590 -52856 -43848 -40168 6210 1063 -137 24612 23999 -11497 3012 22106 -1870
2139 -1870 24666 -40 -17747 13844 -14540 -19759 -27832 -15142 -11950 -12093 -29723 -37461 -5921
2126 -5921 -16112 -41706 -10450 -191 -28547 -30023 -6022 -9313 -9114 8697 1723 1522 16539
2113 16539 17682 -2325 -25149 -10262 2714 27747 6991 20705 44974 45263 9033 15226 22788
2100 22788 20929 17344 -8293 -22907 4056 -14414 -31110 -30209 -8792 -18741 -32349 -487 9092
2087 9092 -3748 -13293 -29736 -46446 -25264 4531 -5939 -12404 -5296 -39053 -26670 -1592 -3696
2074c696J8216n279J2027k2423j0200j9635J1803L1470j6078m4295j0664l39m288
2061f3381J3867J3661K6328n83R221L133j3128j8619R967P850k0776k130J1899
2048b2691J9122j361m1961J6648R782L4179n737l4569l1744R039R088J8237L0557
2035H589l813o320J4790k3139l241K2098k020j9404j0207P905J0258K092J875
2022e37j8464k8598j5594K5050J5517L7391q498j5682l347J3729k5807j5081J4615
2009b5306K938J9898p581K39J426k6692M645o78M49L6117p564j4224j3172K1603
1995g902K613j0776L4654K449J9103j9924L133L340n686r726j2523k4798k295
1982b8338J5580j3435O151k567l751o522K3336j6495J6946J4159l8101k2476L4337
$$ plain form
2074 -3696 14520 9241 21268 -1155 -11355 -30990 -19187 12283 -3795 -48090 -58754 -59093 -63381
2061 -63381 -49514 -35853 -9525 -10108 -887 2246 -10882 -29501 -19534 -11684 -32460 -34590 -22691
2048 -22691 -3569 -4930 -46891 -30243 -20461 13718 7981 -26588 -58332 -49293 -40205 -21968 8589
2035 8589 4776 -1544 13246 -9893 -13134 8964 6944 -12460 -22667 -14762 -4504 -2412 -537
2022 -537 -19001 -47599 -63193 -38143 -22626 14765 6267 -9415 -12762 967 -24840 -39921 -25306
2009 -25306 -22368 -2470 -10051 -9812 -8386 -35078 -30433 -31111 -30662 5455 -2109 -16333 -29505 -7902
1995 -7902 -5289 -16065 18589 21038 40141 20217 23350 26690 21004 11278 -1245 -26043 -28338
1982 -28338 -12758 -26193 -20042 -22609 -26360 -32882 -9546 -26041 -9095 5064 -33037 -55513 -21176
1969b1176K0698j476l1559K282M455J0439O802Q439J2081r307M555m659O814k208
1955F180J706m4318J4111J4793j4827J5310K2336N77k0018j3005K2866j8618m0954
1942e3861J7358K0119J9178P253j5951j7600J6942O094L9101j6255j8411J6249
1930B0216j6324j5747J4486K2362N592P41k3044P8j7230N689j9975l3938K4380
1917c2714j1317P11K6699L3475l7888m863L3641J0090p176K271r270N837k5124
1904a5628M724O261J7120k6373q502k8747J428L2821k457J8523l359M282L1043
1891C1136P778Q402l0375l0634L5461j8938n082N870P982j7355k6778K249j4635
1878d4919L1742K762k9825q932o130J6191M0306L2763k0088k0259j6217M147m910
$$ plain form
1969 -21176 -478 -1954 -33513 -31231 -26776 -16337 -9535 -1096 10985 1678 6233 1574 8388 6180
1955 6180 7886 -36432 -22321 -7528 -22355 -7045 15291 15868 -4150 -17155 5711 -12907 -53861
1942 -53861 -36503 -16384 2794 10047 -5904 -23504 -6562 -468 38633 22378 3967 20216
1930 20216 3892 -11855 2631 24993 30585 31326 8282 8360 -8870 -3181 -23156 -57094 -32714
1917 -32714 -44031 -43320 -16621 16854 -21034 -25897 7744 17834 10658 12929 3659 9496 -15628
1904 -15628 -10904 -4643 12477 -13896 -22398 -51145 -49717 -16896 -19353 -830 -4189 93 31136
1891 31136 38914 47316 16941 -13693 21768 2830 -2252 3618 11600 -5755 -32533 -30284 -44919
1878 -44919 -13177 -10415 -40240 -49172 -55302 -39111 1195 33958 13870 -6389 -22606 -18459 -23369
1865b3369K5974O060K918L249k0110R720J1565p441Q079K108k5608n53J4725L990
$$ plain form
1865 -23369 2605 8665 11583 14832 -5278 4442 16007 8566 16645 18753 -6855 -7408 7317 11307
$$ [...]
##END NTUPLES=NMR SPECTRUM
##END=
