##TITLE=1H_EC-3343-P
 200.13MHz, DMSO,
 8 sc
 
 11.2.2025
##JCAMPDX= 6.0         $$ Bruker NMR JCAMP-DX V2.0
##DATA TYPE= NMR SPECTRUM
##DATA CLASS= NTUPLES
##ORIGIN= UXNMR, Bruker Analytische Messtechnik GmbH
##OWNER= pz
$$ XWIN-NMR		Version 3.5
$$ Tue Feb 11 15:32:47 2025 Russian Standard Time (UT+4h)  she@DPX200
##.OBSERVE FREQUENCY= 200.1313
##.OBSERVE NUCLEUS= ^1H
##.ACQUISITION MODE= SIMULTANEOUS
##.ACQUISITION SCHEME= undefined
##.AVERAGES= 8
##.DIGITISER RES= 18
##SPECTROMETER/DATA SYSTEM= spect
##.PULSE SEQUENCE= zg30
##.SOLVENT NAME= DMSO
##.SHIFT REFERENCE= (INTERNAL, DMSO, 0, 15.542)
##AUDIT TRAIL= $$ (NUMBER, WHEN, WHO, WHERE, WHAT)
$$ ##TITLE= Audit trail, XWIN-NMR		Version 3.5
$$ ##JCAMPDX= 5.01
$$ ##ORIGIN= Bruker BioSpin GmbH
$$ ##OWNER= she
$$ F:/spectra/data/she/nmr/H-C/1/pdata/1/auditp.txt
$$ ##AUDIT TRAIL=  $$ (NUMBER, WHEN, WHO, WHERE, WHAT)
(   1,<2025-02-11 15:31:12.46 +0400>,<she>,<DPX200>,
      <created by zg, POWCHK disabled, PULCHK disabled
       configuration hash MD5:
       00 E9 B6 7A A2 85 ED C7 34 08 36 98 17 FE 4E 26
       data hash MD5: 16K
       EC 14 91 6E 6C 96 36 E3 8F A0 B3 DE 41 45 D1 C2>)
(   2,<2025-02-11 15:31:16.20 +0400>,<she>,<DPX200>,
      <Start of raw data processing
       efp BC_mod = 2 LB = 0.25 FT_mod = 6 PKNL = 1 PHC0 = -462.5378 PHC1 = 4.39221 SI = 16K 
       data hash MD5: 16K
       02 B5 80 80 A5 72 B8 E6 DC A4 B7 20 0B AD 07 CC>)
(   3,<2025-02-11 15:31:40.09 +0400>,<she>,<DPX200>,
      <pk PHC0 = -15.49588 PHC1 = 19 
       data hash MD5: 16K
       59 03 3D 9F AC 3F 71 2B 77 83 31 89 36 6A D3 C1>)
(   4,<2025-02-11 15:32:03.59 +0400>,<she>,<DPX200>,
      <pk PHC0 = 8.076983 PHC1 = -12.2 
       data hash MD5: 16K
       6E E8 26 9D 0C 2F FA B3 ED E3 7B C4 8F 7F AB A6>)
(   5,<2025-02-11 15:32:07.46 +0400>,<she>,<DPX200>,
      <abs ABSG = 5 
       data hash MD5: 16K
       4E 3B 85 40 6A 85 F1 26 45 A0 47 4A 88 9C F9 8F>)
$$ ##END=
$$ 
$$ hash MD5
$$ 6E A0 9C 0B C1 E7 23 EE 49 9B 96 21 FE 13 C6 74
##$RELAX= 
##$RELAX= 
##$RELAX= 
##$RELAX= 
##$RELAX= 
##$RELAX= 
$$ Bruker specific parameters
$$ --------------------------
##$DU= <F:/spectra>
##$EXPNO= 1
##$NAME= <H-C>
##$PROCNO= 1
##$TYPE= <nmr>
##$USER= <she>
##$AMP= (0..31)
100 100 100 100 100 100 100 100 100 100 100 100 100 100 100 100 100 100 
100 100 100 100 100 100 100 100 100 100 100 100 100 100 
##$AQSEQ= 0
##$AQ_mod= 1
##$AUNM= <au_zg>
##$AUTOPOS= <>
##$BF1= 200.13
##$BF2= 200.13
##$BF3= 200.13
##$BF4= 200.13
##$BF5= 200.13
##$BF6= 200.13
##$BF7= 200.13
##$BF8= 200.13
##$BYTORDA= 1
##$CFDGTYP= 0
##$CFRGTYP= 5
##$CHEMSTR= <none>
##$CNST= (0..31)
1 1 145 1 1 1 1 1 1 1 1 1 1 1 1 1 1 1 1 1 1 1 1 1 1 1 1 1 1 1 1 1 
##$CPDPRG= <>
##$CPDPRG1= <>
##$CPDPRG2= <>
##$CPDPRG3= <>
##$CPDPRG4= <mlev>
##$CPDPRG5= <mlev>
##$CPDPRG6= <mlev>
##$CPDPRG7= <mlev>
##$CPDPRG8= <mlev>
##$CPDPRGB= <>
##$CPDPRGT= <>
##$D= (0..31)
0 0.7 0 0 0 0 0 0 0 0 0 0.03 0 0 0 0 0 0 0 0 0 0 0 0 0 0 0 0 0 0 0 0 
##$DATE= 1739273472
##$DBL= (0..7)
$$ [...]
##$SUBNAM3= <"">
##$SUBNAM4= <"">
##$SUBNAM5= <"">
##$SUBNAM6= <"">
##$SUBNAM7= <"">
##$SUBNAM8= <"">
##$SUBNAM9= <"">
##$SW= 18.0517328524113
##$SWIBOX= (0..15)
0 0 2 0 0 0 0 0 0 0 0 0 0 0 0 0 
##$SW_h= 3612.71676300578
##$TD= 16384
##$TD0= 1
##$TE= 0
##$TE2= 300
##$TE3= 300
##$TEG= 300
##$TL= (0..7)
0 120 120 120 120 120 120 120 
##$TP= (0..7)
150 150 150 150 150 150 150 150 
##$TP07= 0
##$TPNAME0= <>
##$TPNAME1= <>
##$TPNAME2= <>
##$TPNAME3= <>
##$TPNAME4= <>
##$TPNAME5= <>
##$TPNAME6= <>
##$TPNAME7= <>
##$TPOAL= (0..7)
0.5 0.5 0.5 0.5 0.5 0.5 0.5 0.5 
##$TPOFFS= (0..7)
0 0 0 0 0 0 0 0 
##$TUNHIN= 0
##$TUNHOUT= 0
##$TUNXOUT= 0
##$USERA1= <user>
##$USERA2= <user>
##$USERA3= <user>
##$USERA4= <user>
##$USERA5= <user>
##$V9= 5
##$VALIST= <valist>
##$VCLIST= <CCCCCCCCCCCCCCC>
##$VD= 0
##$VDLIST= <DDDDDDDDDDDDDDD>
##$VPLIST= <PPPPPPPPPPPPPPP>
##$VTLIST= <TTTTTTTTTTTTTTT>
##$WBST= 1024
##$WBSW= 4
##$XGAIN= (0..3)
0 0 0 0 
##$XL= 0
##$YL= 0
##$YMAX_a= 387891
##$YMIN_a= -364125
##$ZGOPTNS= <>
##$ZL1= 120
##$ZL2= 120
##$ZL3= 120
##$ZL4= 120
##$ABSF1= 15.54196
##$ABSF2= -2.509892
##$ABSG= 5
##$ABSL= 3
##$ALPHA= 0
##$AQORDER= 0
##$ASSFAC= 0
##$ASSFACI= 0
##$ASSFACX= 0
##$ASSWID= 0
##$AUNMP= <proc_1d>
##$AZFE= 0.1
##$AZFW= 0.1
##$BCFW= 0
##$BC_mod= 2
##$BYTORDP= 0
##$COROFFS= 0
##$CY= -3
##$DATMOD= 1
##$DC= 0
##$DFILT= <>
##$DTYPP= 0
##$F1P= 0
##$F2P= 0
##$FCOR= 1
##$FTSIZE= 16384
##$FT_mod= 6
##$GAMMA= 0
##$GB= 0
##$INTBC= 1
##$INTSCL= 3.241238e-09
##$ISEN= 128
##$LB= 0.25
##$LEV0= 0
##$LPBIN= 0
##$MAXI= 10000
##$MC2= 0
##$MEAN= 0
##$ME_mod= 0
##$MI= 1.114404
##$NCOEF= 0
##$NC_proc= -6
##$NLEV= 6
##$NOISF1= 3.799351
##$NOISF2= 2.8
##$NSP= 0
##$NTH_PI= 0
##$NZP= 0
##$OFFSET= 15.54196
##$PC= 1
##$PHC0= -469.9567
##$PHC1= 11.19221
##$PH_mod= 1
##$PKNL= yes
##$PPARMOD= 0
##$PSCAL= 0
##$PSIGN= 0
##$REVERSE= no
##$SF= 200.129995946015
##$SI= 16384
##$SIGF1= 3
##$SIGF2= 2
##$SINO= 0.751879
##$SIOLD= 32768
##$SREGLST= <19F.Aceton>
##$SSB= 0
##$STSI= 16384
##$STSR= 0
##$SW_p= 3612.71676300578
##$SYMM= 0
##$S_DEV= 0
##$TDeff= 16384
##$TDoff= 0
##$TI= <>
##$TILT= no
##$TM1= 0
##$TM2= 0
##$TOPLEV= 0
##$USERP1= <user>
##$USERP2= <user>
##$USERP3= <user>
##$USERP4= <user>
##$USERP5= <user>
##$WDW= 1
##$XDIM= 16384
##$YMAX_p= 482088559
##$YMIN_p= -794066
$$ End of Bruker specific parameters
$$ ---------------------------------
##NTUPLES= NMR SPECTRUM
##VAR_NAME=  FREQUENCY,     SPECTRUM/REAL,   SPECTRUM/IMAG
##SYMBOL=    X,             R,               I
##VAR_TYPE=  INDEPENDENT,   DEPENDENT,       DEPENDENT
##VAR_FORM=  AFFN,          ASDF,            ASDF
##VAR_DIM=   16384,         16384,           16384
##UNITS=     HZ,            ARBITRARY UNITS, ARBITRARY UNITS
##FACTOR=    0.220516191357247, 1,           1
##FIRST=     3110.41234427691, 0,            0
##LAST=      -502.304418728869, 0,           0
##MIN=       -502.304418728869, -794066,     0
##MAX=       3110.41234427691, 482088559,    0
$$ Real data points
##PAGE= N=1
##DATA TABLE= (X++(R..R)), XYDATA
$$ [...]
$$ plain form
8713 47830576 52182143 57155747 62589483 67741984 71331033 72609205 71861588 69290949
8705 69290949 65658370 61493468 57694095 54188167 51157664 48555553 46146740 43933990
8697 43933990 41702717 39584117 37508006 35605027 33719845 32258713 31131283 30196291
8689 30196291 29430268 28922975 28785800 29042566 29450590 30002109 30890586 31981613 33285366
8680 33285366 34722980 36359992 37933012 39094397 40183182 41560317 43105012 44919583
8672 44919583 47141727 49642807 52305459 54442385 55211212 54193980 51623575 48098786
8664 48098786 43863168 39571968 35581513 31922785 28558626 25682423 23428011 21499954
8656 21499954 19974197 18697756 17809093 16898347 16086490 15293414 14609678 13797932 12980194
$$ packed form
8713D7830576M351567M973604N433736N152501L589049J278172p47617k570639
8705F9290949l632579m164902l799373l505928l030503k602111k408813k212750
8697D3933990k231273k118600k076111j902979j885182j461132j127430r34992
8689C0196291p66023n07293j37175K56766M08024N51519Q88477J091027J303753
8680C3285366J437614J637012J573020J161385J088785J377135J544695J814571
8672D4919583K222144K501080K662652K136926P68827j017232k570405l524789
8664D8098786m235618m291200l990455l658728l364159k876203k254412j928057
8656B1499954j525757j276441q88663r10746q11857p93076o83736q11746q17738
$$ plain form
8647 12980194 12198702 11540821 11030483 10442377 9947637 9369883 8883604 8434141 8121237
8638 8121237 7847612 7515301 7228018 6945961 6574978 6267443 5945369 5680689 5507727 5352634
8628 5352634 5205171 5076326 4985064 4862698 4706214 4503538 4508682 4417672 4284973 4259252
8618 4259252 4113093 3987424 3895815 3698015 3603305 3528122 3420210 3494027 3543760 3439932
8608 3439932 3192237 3256199 3249448 3121070 3164087 3217419 2926179 2944048 2934508 2946263 3053731
8597 3053731 2722131 2762357 2707579 2542586 2518303 2553562 2567309 2481731 2414581 2322587 2324522
8586 2324522 2342728 2163710 2118221 2193589 2251908 2281195 2252118 2007620 1931132 1981023 1911861
8575 1911861 1927570 1890310 1920618 1737895 1656847 1773808 1751384 1860021 1685413 1690658 1714241
$$ packed form
8647A2980194p81492o57881n10338n88106m94740n77754m86279m49463l12904
8638H121237k73625l32311k87283k82057l70983l07535l22074k64680j72962j55093
8628E352634j47463j28845r1262j22366j56484k02676N144r1010j32699k5721
8618D259252j46159j25669r1609j97800r4710p5183j07912P3817M9733j03828
8608C439932k47695O3962o751j28378M3017N3332k91240J7869r540J1755J07468
8597C053731l31600M0226n4778j64993k4283L5259J3747q5578o7150r1994J935
8586B324522J8206j79018m5489P5368N8319K9287k9077k44498p6488M9891o9162
8575A911861J5709l7260L0308j82723q1048J16961k2424J08637j74608N245K3583
$$ plain form
8564 1714241 1683394 1699687 1803045 1710546 1533955 1487683 1480342 1599173 1651901 1501961 1600736
8553 1600736 1641878 1430785 1366735 1408995 1404153 1375179 1500186 1446402 1247802 1002631 1072090
8542 1072090 1123063 1214389 1008625 946229 958242 809697 883677 905153 874795 993026 922948
8531 922948 820556 822451 719072 833951 774268 780922 798691 782746 843401 767107 731914
8520 731914 718953 774260 816337 761054 864915 805860 658401 573472 534360 593981 550843
8509 550843 644054 731830 727439 579291 499353 574676 534655 529012 519995 548608 609868 524855
8497 524855 538477 505064 411320 468637 609519 461387 378295 447992 382099 539885 458581
8486 458581 403895 328456 343397 523533 432772 433769 323721 311358 249648 255890 255958 206891
$$ packed form
8564A714241l0847J6293J03358r2499j76591m6272p341J18831N2728j49940R8775
8553A600736M1142k11093o4050M2260m842k8974J25007n3784j98600k45171O9459
8542A072090N0973R1326k05764o2396J2013j48545P3980K1476l0358J18231p0078
8531I22948j02392J895j03379J14879n9683O654J7769j5945O0655p6294l5193
8520G31914j2961N5307M2077n5283J03861n9055j47459q4929l9112N9621m3138
8509E50843R3211Q7776m391j48148p9938P5323m0021n643r017K8613O1260q5013
8497E24855J3622l3413r3744N7317J40882j48132q3092O9697o5893J57786q1304
8486D58581n4686p5439J4941J80136r0761R97j10048j2363o1710O242O8m9067
$$ plain form
8474 206891 294493 307547 262073 292611 308192 266404 286743 296917 278564 303770 343514 328514
8462 328514 276764 264637 122709 143540 229216 243032 330457 344201 282960 115612 231393
8451 231393 247779 206183 291158 241147 157699 253764 243194 159333 299108 206104 262221
8440 262221 287572 204196 243068 297888 277446 120720 107214 102580 81580 142562 174393 113404
8428 113404 90804 95957 149907 173093 110351 105966 205436 227805 191586 132480 183220 238387
8416 238387 141708 -29789 119363 162812 70290 104251 1046 50207 253280 132346 127052
8405 127052 25455 -104912 56335 163756 139729 205449 168082 41049 105112 253616
8395 253616 237747 231727 194834 110919 169054 203724 239223 102858 292977 346926 246433
$$ packed form
8474B06891Q7602J3054m5474L0538J5581m1788K0339J0174j8353K5206L9744j5000
8462C28514n1750j2127j41928K0831Q5676J3816Q7425J3744o1241j67348J15781
8451B31393J6386m1596Q4975n0011q3448R6065j0570q3861J39775r3004N6117
8440B62221K5351q3376L8872N4820k0442j56726j3506m634k1000O0982L1831o0989
8428A13404k2600N153N3950K3186o2742m385R9470K2369l6219n9106N0740N5167
8416B38387r6679j71497J49152M3449r2522L3961j03205M9161K03073j20934n294
8405A27052j01597j30367J61247J07421k4027O5720l7367j27033O4063J48504
8395B53616j5869o020l6893q3915N8135L4670L5499j36365J90119N3949j00493
$$ plain form
8384 246433 120820 122213 195060 265565 205456 109961 118289 57956 152594 199924 2702 86429
8372 86429 123587 114322 186823 219573 255927 199034 114263 45483 78832 174594 84181 186366
8360 186366 198933 18897 54729 78574 170225 215921 121248 80200 254931 194003 184905
8349 184905 167757 187894 272923 166004 146639 320763 347066 294785 286056 163612 147766
8338 147766 160263 45048 70237 270445 288769 266316 237842 117968 187651 253406 167152
8327 167152 3507 93613 146238 230595 141667 -3711 82611 96750 42449 33447 -44004
8316 -44004 -28339 -133139 -134699 57376 -39848 94137 192688 149288 104301 131402 240712
8305 240712 408330 434389 380952 239237 117563 178890 165079 257972 190324 115647 35289
$$ packed form
8384B46433j25613J393P2847P0505o0109r5495Q328o0333R4638M7330j97222Q3727
8372H6429L7158r265P2501L2750L6354n6893q4771o8780L3349R5762r0413J02185
8360A86366J2567j80036L5832K3845R1651M5696r4673m1048J74731o0928r098
8349A84905j7148K0137Q5029j06919j9365J74124K6303n2281q729j22444j5846
8338A47766J2497j15215K5189K00208J8324k2453k8474j19874O9683O5755q6254
8327A67152j63645R0106N2625Q4357q8928j45378Q6322J4139n4301r002p7451
8316d4004J5665j04800j560J92075r7224J33985R8551m3400m4987K7101J09310
8305B40712J67618K6059n3437j41715j21674O1327j3811R2893o7648p4677q0358
$$ plain form
8294 35289 128702 93860 156270 353791 397946 284425 242331 267964 85045 23779 101265
8283 101265 91813 -464 30134 -11827 5320 34 -41410 -28208 -56881 -38988 -100053 -82677
8271 -82677 33495 38936 -130511 -85366 -12624 -64363 -79964 -101608 -104440 -228310 -179138 -94642
8259 -94642 -90406 -181141 -51332 -73374 12961 20496 114239 92291 -73700 -111817 -105405 -133429
8247 -133429 -104343 -72990 -124950 -146331 -47695 -67990 -83858 -55263 -57902 -77615 41919 -15404
8235 -15404 -59255 -24202 -148791 -36968 -87214 -74467 -143973 -130888 -142029 -58715 -28920
8224 -28920 80388 55489 -150078 -221738 -69789 -36120 -45595 -51948 -121752 -136136 -199999 -182057
8212 -182057 -85111 -107653 -73503 -119604 -216010 -199789 -326520 -343059 -319309 -278658 -101592
$$ packed form
8294C5289R3413l4842O2410J97521M4155j13521m2094K5633j82919o1266P7486
8283A01265r452r2277L0598m1961J7147n286m1444J3202k8673J7893o1065J7376
8271h2677J16172N441j69447M5145P2742n1739j5601k1644k832j23870M9172Q4496
8259i4642M236r0735J29809k2042Q6335P535R3743k1948j65991l8117O412k8024
8247a33429K9086L1353n1960k1381R8636k0295j5868K8595k639j9713J19534n7323
8235a5404m3851L5053j24589J11823n0246J2747o9506J3085j1141Q3314K9795
8224b8920J09308k4899k05567p1660J51949L3669r475o353o9804j4384o3863J7942
8212a82057R6946k2542L4150m6101r6406J6221j26731j6539K3750M0651J77066
$$ plain form
8201 -101592 -32802 -48421 -166770 -226110 -288018 -225460 -353282 -301800 -680403 -794066 83960
8190 83960 183619 40058 -114088 -42715 -95206 -72290 -19561 -13349 94352 62298 -191164
8179 -191164 -202438 -118125 -42948 -33586 -149091 -151486 -106321 -125619 -174753 -125658 -248166 -207010
8167 -207010 -131946 -85174 -26351 877 35690 -48505 -105975 -29666 -618 -72221 -93757 -150640
8155 -150640 4885 -100126 -158609 -148493 -143378 -172507 -174246 -140875 -103269 -77860 -139125 6723
8143 6723 -97999 -136802 -95611 -70896 -40200 22515 65976 25261 55040 47216 -104189 -189709
8131 -189709 -137746 -229758 -234517 -140446 -179651 -201020 -256719 -207580 -120088 -89209 -105362 -190943
8119 -190943 -113387 -120550 -160593 -61931 15559 41259 15265 2081 -33509 -17112 -82019 -109596
$$ packed form
8201a01592O8790j5619j18349n9340o1908O2558j27822N1482l78603j13663Q78026
8190H3960R9659j43561j54146P1373n2491K2916N2729O212J07701l2054k53462
8179a91164j1274Q4313P5177R362j15505k395M5165j9298m9134M9095j22508M1156
8167b07010P5064M6772N8823K7228L4813q4195n7470P6309K9048p1603k1536n6883
8155a50640J55525j05011n8483J0116N115k9129j739L3371L7606K5409o1265J45848
8143F723j04722l8803M1191K4715L0696O2715M3461m0715K9779p824j51405q5520
8131a89709N1963r2012m759R4071l9205k1369n5699M9139Q7492L0879j6153q5581
8119a90943P7556p163m0043R8662P7490K5700k5994j3184l5590J6397o4907k7577
$$ plain form
8107 -109596 -138135 -89290 -126957 -115905 -131624 -245146 -177389 -200134 -163075 -36721 -93806
8096 -93806 -136876 15932 76675 20096 23327 -50965 -50847 -88393 -123489 -137104 -93794 -118274
8084 -118274 987 -51473 -127814 -132904 -167836 -205586 -211856 -170547 -126590 -163641 -165032 -81565
8072 -81565 54854 65551 -75182 -126760 -157301 -158174 -69407 -169322 -145584 -189087 -173186 -53343
8060 -53343 -149034 -112509 -198552 -146745 -71194 -163128 -165196 -155957 -225584 -125938 -206717 -142482
8048 -142482 -31899 -158785 -86009 -158241 -150160 -114176 -109298 4915 49220 -41012 -123164
8037 -123164 -173983 -332175 -200663 -189519 -154097 -152089 -155381 -138560 -189780 -85495 -31046
8026 -31046 -67604 -121077 -173632 -166359 -87405 -127189 -170298 -48362 -216375 -269278 -204348 -255672
$$ packed form
8107a09596k8539M8845l7667J1052j5719j13522O7757k2745L7059J26354n7085
8096i3806m3070J52808O0743n6579L231p4292J18l7546l5096j3615M3310k4480
8084a18274J19261n2460p6341n090l4932l7750o270M1309M3957l7051j391Q3467
8072h1565J36419J0697j40733n1578l0541q73Q8767r9915K3738m3503J5901J19843
8060e3343r5691L6525q6043N1807P5551r1934k068R239o9627R9646q0779O4235
8048a42482J10583j26886P2776p2232Q081L5984M878J14213M4305r0232q2152
8037a23164n0819j58192J31512J1144L5422K008l292J6821n1220J04285N4449
8026c1046l6558n3473n2555P273P8954l9784m3109J21936j68013n2903O4930n1324
$$ plain form
8014 -255672 -206430 -238511 -175688 -95116 -66787 -100771 -117449 -172454 -297138 -112150 -36114
8003 -36114 -105942 -133579 -193676 -104880 -101126 -143175 -236694 -240219 -297376 -194374 -163204 -297126
7991 -297126 -146972 -165479 -155150 -187310 -272926 -275095 -148885 -132513 -134083 -64131 -106951 -149144
7979 -149144 -127299 -171258 74009 -10726 -67575 -114401 -176014 -135300 -30390 -99700 -202460
7968 -202460 -254698 -293717 -189295 -185119 -183076 -233635 -165081 -254834 -295148 -187199 -210628 -284151
7956 -284151 -294780 -242903 -212009 -204806 -203274 -163991 -210057 -235012 -243224 -242937 -226654 -206879 -189697
7943 -189697 -171466 -216589 -216610 -136133 -153884 -97651 -114614 -132807 -249788 -220425 -28620 -82531
7931 -82531 -153327 -130077 -124193 -164655 -235341 -86942 -159548 -190965 -200116 -159565 -72609 -181911
$$ packed form
8014b55672M9242l2081O2823Q0572K8329l3984j6678n5005j24684J84988P6036
8003c6114o9828k7637o0097Q8796L754m2049r3519l525n7157J03002L1170j33922
7991b97126J50154j8507J0329l2160q5616k169J26210J6372j570O9952m2820m2193
7979a49144K1845m3959K45267q4735n6849m6826o1613M0714J04910o9310j02760
7968b02460n2238l9019J04422M176K043n0559O8554q9753m0314J07949k3429p3523
7956b84151j0629N1877L0894P203J532L9283m6066k4955q212K87J6283J9775J7182
7943a89697J8231m5123k1Q0477j7751N6233j6963j8193j16981K9363J91805n3911
7931h2531p0796K3250N884m0462p0686J48399p2606l1417r151M0551Q6956j09302
$$ plain form
7919 -181911 -120861 -173094 -273574 -205705 -296974 -253029 -246766 -291866 -228297 -208332 -100656
7908 -100656 -58729 -88229 -88244 -33187 73186 -50861 -187767 -201336 -152549 -111084 -106739 -175082
7896 -175082 -142783 -135069 -195628 -247336 -158582 -231615 -199367 -122426 -126041 -103666 -18687 -121146
7884 -121146 -309752 -206460 -123624 -114088 -129606 -181282 -199159 -151491 -121623 -103651 -157645
7873 -157645 -107025 -43616 -194944 -198530 -243379 -206013 -170582 -274943 -286845 -241555 -232413 -280311
7861 -280311 -248519 -132270 -119714 -121134 -149319 -192127 -71615 -167488 -154711 -48233 -114842
7850 -114842 -78843 -133640 -251313 -117350 -21395 -74759 -45405 -216000 -140309 -104208 -97307
7839 -97307 -99087 -183902 -89864 -170731 -132251 -57211 -128659 -217086 -149206 -177533 -119306 -176479
$$ packed form
7919a81911O1050n2233j00480O7869r1269M3945O263m5100O3569J9965J07676
7908a00656M1927k9500j5N5057J06373j24047j36906j3569M8787M1465M345o8343
7896a75082L2299P714o0559n1708Q8754p3033L2248P6941l615K2375Q4979j02459
7884a21146j88606J03292Q2836R536j5518n1676j7877M7668K9868J7972n3994
7873a57645N0620O3409j51328l586m4849L7366L5431j04361j1902M5290R142m7898
7861b80311L1792J16249J2556j420k8185m2808J20512r5873J2777J06478o6609
7850a14842L5999n4797j17673J33963R5955n3364K9354j70595P5691L6101O901
7839i7307j780q4815R4038q0867L8480P5040p1448q8427O7880k8327N8227n7173
$$ plain form
7827 -176479 -135638 -115246 -180705 -199108 -192876 -218174 -211730 -109430 -78579 -74466 -76075 -147005
7815 -147005 -63694 -56291 -73848 -150749 -257875 -254739 -276227 -358274 -367747 -454160 -506405 -666979
7803 -666979 -346381 40046 36005 57635 -41094 -23765 99705 212573 89495 35870 77139
7792 77139 60610 -9795 -35284 -140900 -119371 19763 -34553 -14378 -18854 -69609 -197276
7781 -197276 -242937 -118654 -47345 -79535 -189723 -142776 -162254 -99821 -85317 -4728 -445
7770 -445 4642 39439 -24393 -155554 -180888 -131093 -117228 -134113 -124058 50047 133707 83476
7758 83476 -134304 -46891 -79654 -186619 -83340 -76614 -75665 -167012 -203965 -177249 -143891 -159874
7746 -159874 -134135 -192334 -357665 -221033 -143490 -214352 -186744 -177944 -181385 -67581 -88908
$$ packed form
7827a76479M0841K0392o5459j8403O232k5298O444J02300L0851M113j609p0930
7815a47005Q3311P403j7557p6901j07126L136k1488q2047r473q6413n2245j60574
7803f66979L20598L86427m041K1630r8729J7329J23470J12868j23078n3625M1269
7792G7139j6529p0405k5489j05616K1529J39134n4316K0175m476n0755j27667
7781a97276m5661J24283P1309l2190j10188M6947j9478O2433J4504Q0589M283
7770d45N087L4797o3832j31161k5334M9795J3865j6885J0055J74105Q3660n0231
7758H3476k17780Q7413l2763j06965J03279O726R49r1347l6953K6716L3358j5983
7746a59874K5739n8199j65331J36632P7543p0862K7608Q800l441J13804k1327
$$ plain form
7735 -88908 -139839 -207960 -195207 -72575 -78300 -106563 -130578 -163958 57754 64380 -85487 -124561
7723 -124561 -149742 -245854 -225623 -108498 -177355 -193850 -169890 -271367 -312529 -277918 -161769
7712 -161769 -124435 -82772 -51767 -138443 -17479 -44976 -201369 -209911 -101425 -139556 -66963
7701 -66963 -69785 -159633 -124686 -13489 -56277 -292508 -170991 -32110 -170288 -132382 -85719
7690 -85719 -12969 -55878 -131832 -73088 -155323 -110562 -29598 -96342 -144312 -118117 -97954 -49829
7678 -49829 -81148 -71652 -135300 -20722 -109964 -173927 -134794 -113401 2497 -118742 -60128
7667 -60128 -81056 12961 -37961 26115 111328 22310 -70578 -111062 -135357 -59344 -31685 -10438
7655 -10438 43039 60230 -87175 -34768 -685 -58946 24862 -101659 -171497 -138655 -89345
$$ packed form
7735h8908n0931o8121J2753J22632n725k8263k4015l3380K21712O626j49867l9074
7723a24561k5181r6112K0231J17125o8857j6495K3960j01477m1162L4611J16149
7712a61769L7334M1663L1005q6676J20964k7497j56393q542J08486l8131P2593
7701f6963k822q9848L4947J11197m2788k36231J21517J38881j38178L7906M6663
7690h5719P2750m2909p5954N8744q2235M4761Q0964o6744m7970K6195K0163M8125
7678d9829l1319R496o3648J14578q9242o3963L9133K1393J15898j21239N8614
7667f0128k0928R4017n0922O4076Q5213q9018r2888m0484k4295P6013K7659K1247
7655a0438N3477J7191j47405N2407L4083n8261Q3808j26521o9838L2842M9310
$$ plain form
7644 -89345 -171379 -129279 13032 26296 -107170 -93722 -103390 -127157 -98735 -1987 -31995 -295666
7632 -295666 -207851 -209193 -62012 -142317 -144550 -71043 -84118 -139241 -165880 36218 -4972 60129
7620 60129 23026 -83422 -31582 58721 -67599 -81340 -80021 -204508 -303911 -353625 -280817
7609 -280817 -174051 -131407 -152803 -12137 -44625 -165252 -203627 -161193 -136965 -73727 16944
7598 16944 -23248 -103065 -99421 -51081 -19943 -14384 -227624 -200387 -213737 -185754 -92293 -111170
7586 -111170 -18600 -47228 -167393 -96282 100373 153489 96041 45291 -120546 -197261 -186540
7575 -186540 -162229 -187261 -51305 -77668 -112968 -3051 6731 32262 -46814 -198205 -124656
7564 -124656 -178161 -135378 -49077 -154066 -230040 -274073 -197762 -168895 -62781 -46753 -79189
$$ packed form
7644h9345q2034M2100J42311J3264j33466J3448r668k3767K8422R6748l0008k63671
7632b95666Q7815j342J47181q0305k233P3507j3075n5123k6639K02098m1190O5101
7620F0129l7103j06448N1840R0303j26320j3741J319j24487r9403m9714P2808
7609b80817J06766M2644k1396J40666l2488j20627l8375M2434K4228O3238R0671
7598A6944m0192p9817L644M8340L1138N559k13240K7237j3350K7983R3461j8877
7586a11170R2570k8628j20165P1111J96655N3116n7448n0750j65837p6715J0721
7575a86540K4311k5032J35956k6363l5300J09917R782K5531p9076j51391P3549
7564a24656n3505M2783Q6301j04989p5974m4033P6311K8867J06114J6028l2436
$$ plain form
7553 -79189 -131513 -91239 -139667 -124089 -114714 -200629 -274171 -243008 -179538 -122953 -94584 -15649
7541 -15649 -82617 -211515 -131995 -188532 -66711 -15698 13225 -109508 -123633 -102623 -95379
7530 -95379 -22358 -34705 -114750 -48842 -32150 2915 -20949 -77877 -52176 -31105 -16080 -103128
7518 -103128 -265755 -157854 -27556 -138227 -240262 -232307 -42271 -3026 -48529 -113932 -36279
7507 -36279 -16017 16493 -94089 -211434 -236892 -182856 -26096 -27412 -42285 -5534 -15650
7496 -15650 -4617 9726 -22107 -6522 -102527 -172664 -179234 -41244 -141746 -158352 -14828
7485 -14828 -93552 -21095 -90094 -55291 68164 46929 5310 36551 10508 -54693 -65259 -21033
7473 -21033 -79521 -8555 87125 6207 19217 -107469 -131102 -89043 102276 19360 -106978
$$ packed form
7553g9189n2324M0274m8428J5578R375q5915p3542L1163O3470N6585K8369P8935
7541a5649o6968j28898P9520n6537J21821N1013K8923j22733j4125K1010P244
7530i5379P3021j2347q0045O5908J6692L5065k3864n6928K5701K1071J5025q7048
7518a03128j62627J07901J30298j10671j02035P955J90036L9245m5503o5403P7653
7507c6279K0262L2510j10582j17345k5458N4036J56760j316j4873L6751j0116
7496a5650J1033J4343l1833J5585r6005p0137o570J37990j00502j6606J43524
7485a4828p8724P2457o8999L4803J23455k1235m1619L1241k6043o5201j0566M4226
7473b1033n8488P0966R5680q0918J3010j26686k3633M2059J91319q2916j26338
$$ plain form
7462 -106978 -105727 -101536 -85629 -15164 62221 -45658 -29963 -89703 -199261 -134334 -125258 -106139
7450 -106139 -85106 -56273 -68967 -243711 -152742 -82665 51288 200528 -16041 -129556 -99852
7439 -99852 -150690 -122616 -179794 -208346 -211655 -177124 -103133 -59823 -70545 49478 21092 -23640
7427 -23640 -107017 -120826 -89450 100170 51731 10976 -79395 -24055 -94846 -113282 -69308 7918
7415 7918 48216 -19190 -61894 -42742 -24468 -41011 -28436 -97826 -195768 -301603 -207349 -210173
7403 -210173 -186383 14129 6047 -97991 -42676 -7767 -177500 -150614 -47552 -10335 65816
7392 65816 74327 146013 43737 -14515 16405 -78828 -104297 -161424 -214676 -45603 -31540 -56822
7380 -56822 -113103 -42220 -23498 20743 36469 28835 -13584 -21981 -20064 99639 23306 -98421
$$ packed form
7462a06978J251M191J5907P0465P7385j07879J5695n9740j09558O4927R076J9119
7450a06139K1033K8833j2694j74744R0969P0077J33953J49240k16569j13515K9704
7439i9852n0838K8074n7178k8552l309L4531P3991M3310j0722J20023k8386m4732
7427b3640q3377j3809L1376J89620m8439m0755r0371N5340p0791j8436M3974P7226
7415G918M0298o7406m2704J9152J8274j6543J2575o9390r7942j05835R4254k824
7403b10173K3790K00512q082j04038N5315L4909j69733K6886J03062L7217P6151
7392F5816Q511P1686j02276n8252L0920r5233k5469n7127n3252J69073J4063k5282
7380e6822n6281P0883J8722M4241J5726p634m2419q397J917J19703p6333j21727
$$ plain form
7368 -98421 13209 88133 10140 51238 -25668 -30089 -113151 -118493 -175781 -98790 -106858 -30702
7356 -30702 85803 79372 28125 -70838 -183082 -221037 -102542 -213929 -270914 -218192 -127202
7345 -127202 28103 -31678 -59137 -26479 -63539 -174486 -136074 7878 -21987 -95876 85330
7334 85330 166940 97584 45833 35839 49428 26780 -96288 -57743 -106519 -125559 -64706 -115477
7322 -115477 -27207 154355 100700 65358 111238 -271 73673 -11229 74443 82695 91349 -159026
7310 -159026 -86453 -53322 -45941 -43714 -120293 -42054 40010 7594 12482 35007 40220 -107238
7298 -107238 -78651 -66232 -175213 -83776 -28443 -52761 -13511 -31279 -23540 -76009 20739 57287
7286 57287 -186158 -235487 -126932 -91478 -168280 -177528 -218022 -63047 26785 22679 18601 -2782
$$ packed form
7368i8421J11630P4924p7993M1098p6906m421q3062n342n7288P6991q068P6156
7356c0702J16505o431n1247r8963j12244l7955J18495j11387n6985N2722R0990
7345a27202J55305n9781k7459L2658l7060j10947L8412J43952k9865p3889J81206
7334H5330Q1610o9356n1751r994J3589k2648j23068L8545m8776j9040O0853n0771
7322a15477Q8270J81562n3655l5342M5880j11509P3944q4902Q5672Q252Q654k50375
7310a59026P2573L3131P381K227p6579P8239Q2064l2416M888K2525N213j47458
7298a07238K8587J2419j08981R1437N5333k4318L9250j7768P739n2469R6748L6548
7286E7287k43445m9329J08555L5454p6802r248m0494J54975Q9832m106m078k1383
$$ plain form
7274 -2782 -21244 -67637 887 -42294 33803 81376 -42710 17210 -95409 -97909 9184 -104959
7262 -104959 -124232 -50248 -54738 -164239 -213743 -80590 -83153 -144066 -107588 -18387 -89436 -108577
7250 -108577 -118091 -143009 -8442 6846 -65542 -95939 -122525 -44768 49314 -59492 -81047
7239 -81047 21580 54145 -20266 33638 51176 -53740 -1229 10766 58213 41593 86114
7228 86114 61603 -53034 -75921 -47048 -60867 -9429 -65474 -721 -12276 -24722 28199 31947
7216 31947 74958 19274 50401 39655 37406 -23760 -43314 40903 2378 -114649 -150287 -155271
7204 -155271 -67330 -24264 -97401 -8858 49534 -26865 23482 -95584 -189983 -11851 30507
7193 30507 -24686 -40627 -53456 34483 43663 -32573 -23347 77106 119585 -36384 -17664 -17142
$$ packed form
7274b782j8462m6393O8524m3181P6097M7573j24086N9920j12619k500J07093j14143
7262a04959j9273P3984m490j09501m9504J33153k563o0913L6478Q9201p1049j9141
7250a08577r514k4918J34567J5288p2388l0397k6586P7757R4082j08806k1555
7239h1047J02627L2565p4411N3904J7538j04916N2511J1995M7447j6620M4521
7228H6114k4511j14637k2887K8873j3819N1438n6045O4753j1555j2446N2921L748
7216C1947M3011n5684L1127j0746k249o1166j9554Q4217l8525j17027l5638m984
7204a55271Q7941M3066p3137Q8543N8392p6399N0347j19066r4399J78132M2358
7193C0507n5193j5941j2829Q7939R180p6236R226J00453M2479j55969J8720N22
$$ plain form
7181 -17142 -95797 -107938 -129559 -26151 76535 65421 4598 -74352 -29749 73069 66919
7170 66919 -34105 -42010 -68232 -35552 43736 -11787 -5305 -110957 -37267 91971 99731 80664
7158 80664 125081 117473 15119 10910 106514 71247 77691 35587 23521 -68389 -157235 -122322
7146 -122322 -211920 -116426 -117334 -188897 -56937 41221 126562 120048 169749 173147 87421 23975
7134 23975 90998 51018 116040 82942 -24141 16209 68659 121241 18957 -29114 -72981
7123 -72981 -41295 -25888 -3742 5097 34371 94563 127055 10126 -64103 -56753 -118740 -71579
7111 -71579 -6723 -129836 -65916 -39174 -89627 -73362 -5211 -118757 -46908 -24391 -16114 -13556
7099 -13556 1090 105782 108003 856 -152529 -77575 -149235 -184725 -172465 -143556 -25209
$$ packed form
7181a7142p8655j2141k1621J03408J02686j1114o0823p8950M4603J02818o150
7170F6919j01024p905k6222L2680P9288n5523O482j05652P3690J29238P760j9067
7158H0664M4417p608j02354m209R5604l5267O444m2104j2066r1910q8846L4913
7146a22322q9598R5494r08p1563J31960R8158Q5341o514M9701L398q5726o3446
7134B3975O7023l9980O5022l3098j07083M0350N2450N2582j02284m8071m3867
7123g2981L1686J5407K2146Q839K9274O0192L2492j16929p4229P350o1987M7161
7111g1579O4856j23113O3920K6742n0453J6265O8151j13546P1849K2517Q277K558
7099a3556J4646J04692K221j07147j53385P4954p1660l5490J2260K8909J18347
$$ plain form
7088 -25209 -65488 -6665 57665 16806 21233 100121 140598 6702 -7245 22720 -34701 -12041
7076 -12041 124751 20635 75642 23247 -13480 -24167 -21546 81907 14485 -11067 39809
7065 39809 90537 150685 120602 23864 -110240 -118375 22397 24694 -65065 -40792 -41971 -80157
7053 -80157 -68473 13341 54795 58321 62838 78600 -2475 -76818 -109158 -120519 -13554 10357
7041 10357 -50558 -53483 52943 -50526 -71188 -18890 -144640 -97842 -33397 -5156 -88056
7030 -88056 42659 91828 11104 163189 148374 68546 -33423 -17504 5267 95584 103598
7019 103598 159434 148991 124185 90132 97589 5720 -37952 -32415 -75224 -131209 12828 47694
7007 47694 51740 -35233 18695 27979 11450 -11379 -13218 94829 243331 211177 97882 50118
$$ packed form
7088b5209m0279N8823O4330m0859M427P8888M0477j33896j3947K9965n7421K2660
7076a2041J36792j04116N5007n2395l6727j0687K621J03453o7422k5552N0876
7065C9809N0728O0148l0083r6738j34104q135J40772K297q9759K4273j179l8186
7053h0157J1684Q1814M1454L526M517J5762q1075p4343l2340j1361J06965K3911
7041A0357o0915k925J06426j03469k0662N2298j25750M6798O4445K8241q2900
7030h8056J30715M9169q0724J52085j4815p9828j01969J5919K2771R0317Q014
7019A03598N5836j0443k4806l4053P457r1869m3672N537m2809n5985J44037L4866
7007D7694M046q6973N3928R284j6529k2829j839J08047J48502l2154j13295m7764
$$ plain form
6995 50118 17636 73418 29212 13085 -33612 27936 92069 71946 174219 60946 42068
6984 42068 105591 47139 -34143 21393 -11996 -13782 64982 80789 67884 35344 150288 77855
6972 77855 19074 -46212 -28993 -558 -18922 48403 43444 77274 32201 72870 117682 -59050
6960 -59050 21742 -13360 -62570 9698 38656 -24279 -29505 39675 53928 -39281 72191 159200
6948 159200 101761 -35902 44257 49248 83731 -9123 -55001 51005 157024 144923 170002
6937 170002 130838 202513 129822 -30284 -41910 121477 38552 17248 -114774 74364 199640
6926 199640 265914 260460 135384 57231 87143 154140 140922 187577 166867 199435 264531 254633
6914 254633 197371 10168 97619 32424 -75113 136691 65326 119058 106549 -44251 -34008
$$ packed form
6995E0118l2482N5782m4206j6127m6697O1548O4133k0123J02273j13273j8878
6984D2068O3523n8452q1282N5536l3389j786P8764J5807j2905l2540J14944p2433
6972G7855n8781o5286J7219K8435j8364O7325m959L3830m5073M0669M4812j76732
6960e9050Q0792l5102m9210P2268K8958o2935n226O9180J4253r3209J11472Q7009
6948A59200n7439j37663Q0159M991L4483r2854m5878J06006J06019j2101K5079
6937A70002l9164P1675p2691j60106j1626J63387q2925k1304j32022J89138J25276
6926A99640O6274n454j25076p8153K9912O6997j3218M6655k0710L2568O5096r898
6914B54633n7262j87203Q7451o5195j07537K11804p1365N3732j2509j50800J0243
$$ plain form
6903 -34008 28343 -48664 -1955 9203 43510 -4714 125697 165658 121619 149183 125484 218244
6891 218244 184176 91157 159110 150857 62254 35544 154623 244341 138989 4828 80805
6880 80805 23875 186048 287937 240698 272543 210495 148204 248095 169616 118454 39617
6869 39617 12554 -64440 171399 96235 29283 212154 242217 60368 -60128 45217 66377
6858 66377 -41292 56792 59601 183441 86911 70469 92324 64696 60514 140662 97503 57484
6846 57484 81142 21870 117936 127613 28109 16143 125156 -7934 17923 43260 45701 16095
6834 16095 122957 127125 104628 30003 -47560 68073 117320 73690 115312 216959 147527
6823 147527 42357 -14749 65584 46123 142660 215971 165015 223401 225387 173961 188673 221017
$$ packed form
6903c4008O2351p7007M6709J1158L4307m8224J30411L9961m4039K7564k3699R2760
6891B18244l4068r3019O7953q253q8603k6710J19079Q9718j05352j34161P5977
6880H0805n6930J62173J01889m7239L1845o2048o2291R9891p8479n1162p8837
6869C9617k7063p6994K35839p5164o6952J82871L0063j81849j20496J05345K1160
6858F6377j07669R8084K809J23840r6530j6442K1855k7628m182Q0148m3159m0019
6846E7484K3658n9272R6066R677r9504j1966J09013j33090K5857K5337K441k9606
6834A6095J06862M168k2497p4625p7563J15633M9247m3630M1622J01647o9432
6823A47527j05170n7106Q0333j9461R6537P3311n0956N8386J986n1426J4712L2344
$$ plain form
6811 221017 174741 83901 113701 144281 177931 149804 -41599 -14242 47126 -48343 -69368
6800 -69368 28678 64860 61205 27620 82377 -28815 44223 133729 88079 131310 262468 219331
6788 219331 196856 71371 135578 211903 156191 184389 207102 130792 91916 120720 162996
6777 162996 123256 52442 32370 41287 81239 74683 95296 169814 101364 156953 182075 138419
6765 138419 36826 51988 96059 115003 115177 67274 155810 126116 211366 224781 128078 156734
6753 156734 132513 75983 96863 137758 179291 211584 64798 -21816 79874 263095 162877
6742 162877 87840 29383 81317 89184 126787 170809 185006 118522 131899 222385 139192 118472
6730 118472 131881 76077 145203 194819 207138 193406 165326 238559 148485 116147 90718 135131
$$ packed form
6811B21017m6276r0840K9800L0580L3650k8127j91403K7357O1368r5469k1025
6800f9368R8046L6182l655l3585N4757j11192P3038Q9506m5650M3231J31158m3137
6788B19331k2475j25485O4207P6325n5712K8198K2713p6310l8876K8804M2276
6777A62996l9740p0814k0072Q917L9952o556K0613P4518o8450N5589K5122m3656
6765A38419j01593J5162M4071J8944J74m7903Q8536k9694Q5250J3415r6703K8656
6753A56734k4221n6530K0880M0895M1533L2293j46786q6614J01690J83221j00218
6742A62877p5037n8457N1934P867L7603M4022J4197o6484J3377R0486q3193k0720
6730A18472J3409n5804O9126M9616J2319j3732k8080P3233r0074l2338k5429M4413
$$ plain form
6718 135131 27475 -17880 131592 139620 44462 144935 149307 235605 274817 265816 228815 131430
6706 131430 260675 232311 69896 178249 171378 167725 221864 259339 222259 157094 242282
6695 242282 183668 288089 230630 115804 174164 185060 96790 171157 150307 127669 295022
6684 295022 283074 139440 46816 87110 52568 147143 186613 194895 179150 172337 218097 316029
6672 316029 280600 263488 267545 215507 69087 146682 202103 179742 220705 185605 203381 183118
6660 183118 97968 173858 241750 225874 65595 148984 190600 77398 189859 261189 331018
6649 331018 323671 206625 286188 311334 269986 244760 259454 204013 133408 341739 341498 193265
6637 193265 298682 256735 230704 240270 165414 -33477 3248 31052 83682 199655 312546
$$ packed form
6718A35131j07656m5355J49472Q028r5158J00473M372Q6298L9212r001l7001r7385
6706A31430J29245k8364j62415J08353o871l653N4139L7475l7080o5165Q5188
6695B42282n8614J04421n7459j14826N8360J0896q8270P4367k0850k2638J67353
6684B95022j1948j43634r2624M0294l4542R4575L9470Q282j5745o813M5760R7932
6672C16029l5429j7112M057n2038j46420P7595N5421k2361M0963l5100J7776k0263
6660A83118q5150P5890O7892j5876j60279Q3389M1616j13202J12461P1330O9829
6649C31018p347j17046P9563K5146m1348k5226J4694n5441p0605K08331k41j48233
6637A93265J05417m1947k6031R566p4856j98891L6725K7804N2630J15973J12891
$$ plain form
6626 312546 311804 257052 252362 181689 284782 291666 268491 179250 114299 156144 226885 217668
6614 217668 226628 197123 264455 343166 361519 348600 332405 397718 407163 371929 308868 211234
6602 211234 173761 110016 91670 149973 320579 338626 216724 246829 261402 184062 176331
6591 176331 186756 361886 308420 272093 158942 53946 76848 98674 194500 178378 163365
6580 163365 266971 307018 435329 404996 316241 183848 82311 163375 217619 212692 249583
6569 249583 295458 347751 300666 257652 163891 244245 333908 270489 305211 162341 93588
6558 93588 183225 182383 309580 294208 150402 136692 193561 319837 323413 281316 194253 301467
6546 301467 317757 354296 384626 401494 287491 208364 273025 344145 324756 233922 277892
$$ packed form
6626C12546p42n4752m690p0673J03093O884k3175q9241o4951M1845P0741r217
6614B17668Q960k9505O7332P8711J8353j2919j6195O5313R445l5234o3061r7634
6602B11234l7473o3745j8346N8303J70606J8047j21902L0105J4573p7340p731
6591A76331J0425J75130n3466l6327j13151j04996K2902K1826R5826j6122j5013
6580A63365J03606M0047J28311l0333q8755j32393j01537Q1064N4244m927L6891
6569B49583M5875N2293m7085m3014r3761Q0354Q9663o3419L4722j42870o8753
6558I3588Q9637q42J27197j5372j43806j3710N6869J26276L576m2097q7063J07214
6546C01467J6290L6539L0330J6868j14003p9127O4661P1120j9389r0834M3970
$$ plain form
6535 277892 238929 292759 341486 346067 442216 438032 346569 294442 306031 349918 382980 402302
6523 402302 357280 430678 328281 308907 268610 196099 195435 174066 159201 182327 324230 342158
6511 342158 342338 230599 205872 270940 243139 158234 170237 278999 422728 392458 462339
6500 462339 380513 290649 358309 389737 223556 274415 336500 263879 202141 316042 286815
6489 286815 338029 361476 347868 419960 251197 274870 269423 382779 452985 398733 399027 463542
6477 463542 421216 304496 352362 323717 265629 324195 416406 414507 381597 482272 471691
6466 471691 388933 454312 533832 495706 478785 275468 339294 384933 466058 354890 364765
6455 364765 467940 391484 411021 398300 274445 152914 156296 243991 231783 326976 357815
$$ packed form
6535B77892l8963N3830M8727M581R6149m184r1463n2127J1589M3887L3062J9322
6523D02302m5022P3398j02397j9374m0297p2511o64k1369j4865K3126J41903J7928
6511C42158J80j11739k4727O5068k7801q4905J2003J08762J43729l0270O9881
6500D62339q1826q9864O7660L1428j66181N0859O2085p2621o1738J13901k9227
6489B86815N1214K3447j3608P2092j68763K3673n447J13356P0206n4252K94O4515
6477D63542m2326j16720M7866k8645n8088N8566R2211j899l2910J00675j0581
6466D71691q2758O5379P9520l8126j6921k03317O3826M5639Q1125j11168R875
6455C64765J03175p6456J9537j2721j23855j21531L382Q7695j2208R5193L0839
$$ plain form
6444 357815 288795 308832 281355 313172 386212 417204 455975 510192 426000 316167 305406
6433 305406 430680 426037 341523 433564 406637 255208 277152 382510 432812 398189 483123
6422 483123 477194 490407 402926 315882 198577 239086 220799 323560 420823 409411 419254 431110
6410 431110 395487 326271 321823 435064 399971 398094 467551 379466 261762 404966 500427
6399 500427 555206 556093 554657 491971 433846 576232 500088 370739 387390 486465 568650 523580
6387 523580 428200 476873 508077 478095 392741 423096 447100 440954 529928 447650 397778 567298
6375 567298 605041 615435 311912 364249 442236 478673 625047 612411 542022 556201 490239
6364 490239 453096 260601 240333 275750 298928 452825 399209 413158 322604 363980 443306
$$ packed form
6444C57815o9020K0037k7477L1817P3040L0992L8771N4217q4192j09833j0761
6433C05406J25274m643q4514R2041k6927j51429K1944J05358N0302l4623Q4934
6422D83123n929J3213q7481q7044j17305M0509j8287J02761R7263j1412R843J1856
6410D31110l5623o9216m448J13241l5093j877O9457q8085j17704J43204R5461
6399E00427N4779Q87j436o2686n8125J42386p6144j29349J6651R9075Q2185m5070
6387E23580r5380M8673L1204k9982q5354L0355K4004o146Q8974q2278m9872J69520
6375E67298L7743J0394l03523N2337P7987L6437J46374j2636p0389J4179o5962
6364D90239l7143j92495k0268L5417K3178J53897n3616J3949r0554M1376P9326
$$ plain form
6353 443306 530024 574056 570337 516517 315443 417972 464026 328595 433260 511279 490458
6342 490458 500212 613758 579035 542303 556490 621324 530284 447832 475722 540898 505966 463162
6330 463162 570133 403708 442534 494819 561804 601879 529465 435147 559896 615986 721273
6319 721273 690310 600764 574585 621163 533150 518655 598636 546212 540801 501390 465233 412055
6307 412055 429841 474795 544462 474506 691661 624732 563368 566109 581884 545055 578297 632962
6295 632962 575763 459497 430122 507695 507069 569185 678853 680605 687564 618293 639960 614174
6283 614174 669609 668164 650938 571366 578135 571747 591267 731974 660824 808611 669006 606516
6271 606516 627842 602321 663010 714840 704526 616838 620938 485958 473192 710623 850120
$$ packed form
6353D43306Q6718M4032l719n3820k01074J02529M6054j35431J04665P8019k0821
6342D90458R754J13546l4723l6732J4187O4834r1040q2452K7890O5176l4932m2804
6330D63162J06971j66425L8826N2285O6985M0075p2414r4318J24749N6090J05287
6319G21273l0963q9546k6179M6578q8013j4495P9981n2424n411l9411l6157n3178
6307D12055J7786M4954O9667o9956K17155o6929o1364K741J5775l6829L3242N4665
6295F32962n7199j16266k9375P7573o26O2116J09668J752O959o9271K1667k5786
6283F14174N5435j445j7226p9572O769o388J9520J40707p1150J47787j39605o2490
6271F06516K1326k5521O0689N1830j0314q7688M100j34980j2766K37431J39497
$$ plain form
6260 850120 676745 671177 560581 563169 562160 521439 599040 527383 474977 571285 631309 672928
6248 672928 665610 575896 543419 603570 630762 556835 564417 603343 623016 687518 647876 715738
6236 715738 810365 874147 894842 775636 835115 717187 639599 530217 667660 742822 747834
6225 747834 694766 771933 686378 847504 757455 691975 749031 793548 879382 956097 864631
6214 864631 722044 715115 701319 800208 756635 774593 807988 930421 849122 842992 764925 733952
6202 733952 802963 815282 769336 791857 848532 781499 787752 786378 793840 840831 794591 699060
6190 699060 682719 796081 767301 686265 805238 810330 806616 777481 766208 767177 929974 914620
6178 914620 977193 1003416 918574 965949 939311 924723 897379 925903 909038 761930 832612
$$ packed form
6260H50120j73375n568j10596K588j009m0721P7601p1657n2406R6308O0024M1619
6248F72928p318q9714l2477O0151K7192p3927P582L8926J9673O4502l9642O7862
6236G15738R4627O3782K0695j19206N9479j17928p7588j09382J37443P5162N012
6225G47834n3068P7167q5555J61126r0049o5480N7056M4517Q5834P6715r1466
6214H64631j42587o929j3796R8889m3573J7958L3395J22433q1299o130p8067l0973
6202G33952O9011J2319m5946K2521N6675o7033O253j374P462M6991m6240r5531
6190F99060j6341J13362k8780q1036J18973N092l714k9135j1273R69J62797j5354
6178I14620O2573K6223q4842M7375k6638j4588k7344K8524j6865j47108P0682
$$ plain form
6167 832612 948364 948754 915593 861359 882211 861678 840619 1048355 1042468 980286 1013729 930742
6155 930742 949926 934156 917893 937782 1059541 1060457 985036 995726 991432 897463 976976 1004539
6143 1004539 1021303 1025426 1057789 1005617 945914 954779 1094676 1066427 1078209 1121464 1218107 1181594
6131 1181594 1057632 1140980 1189295 1160071 1118347 1056263 1044025 1071988 1236745 1210064 1187889
6120 1187889 1184351 1187784 1215566 1226679 1256156 1237055 1180840 1195375 1087095 1119756 1302010
6109 1302010 1346231 1325514 1308630 1479375 1478924 1366543 1379676 1321092 1299423 1313722 1345216
6098 1345216 1293828 1276654 1165924 1234746 1354196 1335139 1361411 1512520 1429188 1208413 1311073
6087 1311073 1464876 1581727 1615978 1492867 1580656 1601043 1408733 1279242 1370723 1483450
$$ packed form
6167H32612J15752L90l3161n4234K0852k0533k1059K07736n887o2182L3443q2987
6155I30742J9184j5770j6263J9889J21759R16p5421J0690m294r3969P9513K7563
6143A004539J6764M123L2363n2172n9703Q865J39897k8249J1782M3255R6643l6513
6131A181594j23962Q3348M8315k9224m1724o2084j2238K7963J64757k6681k2175
6120A187889l538L433K7782J1113K9477j9101n6215J4535j08280L2661J82254
6109A302010M4221k0717j6884J70745m51j12381J3133n8584k1669J4299L1494
6098A345216n1388j7174j10730O8822J19450j9057K6272J51109q3332k20775J02660
6087A311073J53803J16851L4251j23111Q7789K0387j92310j29491R1481J12727
$$ plain form
6077 1483450 1524864 1619323 1461609 1465357 1564844 1556613 1426678 1474111 1465550 1417150 1453578 1555570
6065 1555570 1635511 1687706 1740370 1739358 1783685 1868400 1777204 1696626 1817194 1873396 1842145
6054 1842145 1894621 1989155 1944387 1894093 2101340 2183362 2195436 2269233 2478948 2430889 2560465
6043 2560465 2722475 2802525 2855775 2869743 2672369 2564513 2550688 2459735 2321116 2131658
6033 2131658 2115584 2093231 1984749 1959549 1925764 1916858 2052906 2154780 2107646 2218252 2158656
6022 2158656 2168622 2077374 2142301 2168876 2029800 2062887 2161385 2095803 1996258 2087336 2109075
6011 2109075 2111778 2153076 2190456 2176671 2280142 2254500 2200022 2131132 2316911 2281931 2287712
6000 2287712 2453801 2464647 2497153 2409469 2374630 2399786 2330234 2360254 2525282 2563828 2645604
$$ packed form
6077A483450M1414R4459j57714L748R9487q231j29935M7433q561m8400L6428J01992
6065A555570P9941N2195N2664j012M4327Q4715r1196q0578J20568N6202l1251
6054A842145N2476R4534m4768n0294K07247Q2022J2074P3797K09715m8059J29576
6043B560465J62010Q0050N3250J3968j97374j07856j3825r0953j38619j89458
6033B131658j6074k2353j08482k5200l3785q906J36048J01874m7134J10606n9596
6022B158656R966r1248O4927K6575j39076L3087R8498o5582r9545R1078K1739
6011B109075K703M1298L7380j3785J03471k5642n4478o8890J85779l4980N781
6000B287712J66089J0846L2506q7684l4839K5156o9552L0020J65028L8546Q1776
$$ plain form
5989 2645604 2724824 2762145 2761326 2904435 2957025 2983777 3126244 3391511 3438601 3537879 3598648
5978 3598648 3636015 3832482 4057970 4289766 4420907 4882293 5090321 5556476 5967496 6227004
5968 6227004 6269724 6215709 6098146 5720575 5433167 5162865 4802371 4420563 4246616 4103242
5958 4103242 3929525 3704414 3630567 3688458 3572314 3462986 3361951 3393703 3219284 3186182
5948 3186182 3060753 3120999 3294238 3307453 3190147 3145362 3215839 3224114 3132516 3093838 3187993
5937 3187993 3317429 3172255 2974993 3135172 3194394 3257946 3266722 3217621 3174162 3126499 3168188
5926 3168188 3235240 3231942 3250076 3210181 3138910 3157013 3223015 3194469 3155091 3270999 3322299
5915 3322299 3490215 3452057 3466502 3448466 3453576 3580180 3521365 3397892 3525851 3608575 3635105
$$ packed form
5989B645604P9220L7321q19J43109N2590K6752J42467K65267M7090R9278O0769
5978C598648L7367J96467K25488K31796J31141M61386K08028M66155M11020K59508
5968F227004M2720n4015j17563l77571k87408k70302l60494l81808j73947j43374
5958D103242j73717k25111p3847N7891j16144j09328j01035L1752j74419l3102
5948C186182j25429O0246J73239J3215j17306m4785P0477Q275r1598l8678R4155
5937C187993J29436j45174j97262J60179N9222O3552Q776m9101m3459m7663M1689
5926C168188O7052l298J8134l9895p1271J8103O6002k8546l9378J15908N1300
5915C322299J67916l8158J4445j8036N110J26604n8815j23473J27959Q2724K6530
$$ plain form
5904 3635105 3610051 3665475 3800594 3757342 3736116 3687789 3723337 3788083 3744877 3839866 3949115
5893 3949115 3931629 3877352 3888123 3997464 3999258 3975839 3859356 3954464 3966087 4163351 4272269
5882 4272269 4221899 4192499 4200018 4217708 4273203 4081760 4098713 4222869 4345009 4448843 4446254
5871 4446254 4507884 4536847 4704939 4655108 4726923 4761029 4762930 4729896 4700347 4735291 4786442
5860 4786442 4932842 4961700 4970676 5059706 5069759 5112925 5258153 5193634 5136390 5198200 5207065
5849 5207065 5315035 5417996 5417204 5420324 5434032 5505094 5541549 5671782 5788732 5753128 5693702
5838 5693702 5799109 5720538 5749363 5878227 6102329 6100650 6224479 6403872 6336159 6540316
5828 6540316 6632924 6634013 6733526 6847862 6942253 7138709 7277132 7374024 7470459 7534741 7629273
$$ packed form
5904C635105k5054N5424J35119m3252k1226m8327L5548O4746m3206R4989J09249
5893C949115j7486n4277J0771J09341J794k3419j16483R5108J1623J97264J08918
5882D272269n0370k9400P519J7690N5495j91443J6953J24156J22140J03834k589
5871D446254O1630K8963J68092m9831P1815L4106J901l3034k9549L4944N1151
5860D786442J46400K8858Q976Q9030J0053M3166J45228o4519n7244O1810Q865
5849E207065J07970J02961p92L120J3708P1062L6455J30233J16950l5604n9426
5838E693702J05407p8571K8825J28864K24102j679J23829J79393o7713K04157
5828F540316R2608J089R9513J14336R4391J96456J38423R6892R6435O4282R4532
$$ plain form
5817 7629273 7588735 7588325 7577500 7694895 7764083 7761134 7745180 7758261 7623272 7639744 7850270
5806 7850270 8028948 8116696 8068003 8173923 8330784 8333277 8539767 8632628 8703723 8839365 8711090
5795 8711090 8960021 9134242 9133446 9217558 9574008 9851213 10079762 10294481 10447954 10608584
5785 10608584 10722684 10777363 11015308 11237031 11378695 11584363 11890773 12244741 12522410 12913925
5775 12913925 13213387 13415071 13727563 14127525 14576071 15001235 15414587 15695686 16071915
5766 16071915 16378539 16597399 17011116 17468126 17873061 18207040 18777621 19210709 19702788
5757 19702788 20222050 20716848 21291826 22011336 22740386 23624735 24647212 25543457 26600824
5748 26600824 27900560 29573423 31228035 32481381 33459247 34126526 35019742 36168145 37763471
$$ packed form
5817G629273m0538m10j0825J17395O9188k949j5954J3081j34989J6472K10526
5806G850270J78678Q7748m8693J05920J56861K493K06490R2861P1095J35642j28275
5795H711090K48931J74221p96Q4112L56450K77205K28549K14719J53473J60630
5785A0608584J14100N4679K37945K21723J41664K05668L06410L53968K77669L91515
5775A2913925K99462K01684L12492L99962M48546M25164M13352K81099L76229
5766A6071915L06624K18860M13717M57010M04935L33979N70581M33088M92079
5757A9702788N19262M94798N74978P19510P29050Q84349J022477Q96245J057367
5748B6600824J299736J672863J654612J253346R77866O67279Q93216J148403J595326
$$ plain form
5739 37763471 39487636 41381247 43465578 45834140 48550033 51332564 54453886 58054244
5731 58054244 61915281 66095632 70923797 76386200 82975156 90234432 98536334 108381680
5723 108381680 120738973 135550027 151855109 170000730 191137406 211564681 224073937
5716 224073937 226008282 218879435 204787908 186392926 166812483 148238379 131161053
5709 131161053 116034447 102565208 91116795 81908027 74755955 69086459 64428277 60507769
5701 60507769 57189561 54207466 51674018 49359104 47417752 45552941 43906545 42566582
5693 42566582 41253543 40126767 38989365 37954351 36938111 35940252 35055431 34083130 33304659
5684 33304659 32700189 32012125 31500926 30915532 30562665 30410666 30108421 29625719 29489065
$$ packed form
5739C7763471J724165J893611K084331K368562K715893K782531L121322L600358
5731E8054244L861037M180351M828165N462403O588956P259276Q301902R845346
5723A08381680J2357293J4811054J6305082J8145621K1136676K0427275J2509256
5716B24073937J934345p128847j4091527j8394982j9580443j8574104j7077326
5709A31161053j5126606j3469239j1448413r208768p152072n669496m658182l920508
5701F0507769l318208k982095k533448k314914j941352j864811j646396j339963
5693D2566582j313039j126776j137402j035014j016240r97859q84821r72301p78471
5684C3304659o04470o88064n11199n85394l52867j51999l02245m82702j36654
$$ plain form
5675 29489065 29222691 29024001 28961684 28955558 28917109 28965887 28967532 28995526 29012126 29020065 29055498
5664 29055498 29168250 29287766 29442897 29652484 29736908 29886929 30041254 30213209 30468301 30815058
5654 30815058 30984625 31136784 31432574 31714636 31941102 32284572 32677757 32984510 33463574
5645 33463574 33916275 34423815 34914943 35308588 35714683 36253538 36781525 37297427 37849736
5636 37849736 38412992 39143271 39719590 40135040 40734318 41429589 42190415 42823926 43543768
5627 43543768 44227498 45105410 45877506 46559799 47530355 48496765 49476563 50553504 51582983
5618 51582983 52533356 53625964 54736505 55902103 57129315 58441098 59794088 61136462
5610 61136462 62541418 63996972 65549057 67179400 68698347 70312616 72078742 73975143
$$ packed form
5675B9489065k66374j98690o2317o126l8449M8778J645K7994J6600P939L5433
5664B9055498J12752J19516J55131K09587Q4424J50021J54325J71955K55092L46757
5654C0815058J69567J52159K95790K82062K26466L43470L93185L06753M79064
5645C3463574M52701N07540M91128L93645M06095N38855N27987N15902N52309
5636C7849736N63256P30279N76319M15450N99278O95271P60826O33511P19842
5627D3543768O83730Q77912P72096O82293R70556R66410R79798J076941J029479
5618E1582983R50373J092608J110541J165598J227212J311783J352990J342374
5610F1136462J404956J455554J552085J630343J518947J614269J766126J896401
$$ plain form
5602 73975143 75972877 77951415 79962951 81961455 84033856 86550520 88903484 91288872
5594 91288872 94109923 96837339 99650392 102615090 105639527 108795833 112181828 115575618
5586 115575618 119138720 123025387 126984651 131071051 135293530 139720114 144478772 149304717
5578 149304717 154294251 159628929 165155127 170997235 177041247 183287428 189826040 196515249
5570 196515249 203437134 210658706 218382618 226219009 234361893 242677877 251145561 260052280
5562 260052280 269375607 278829237 288370572 298359667 308527005 318983457 329721190 340596449
5554 340596449 351449986 362422510 373459682 384358821 395272545 405882728 416167336
5547 416167336 426198456 435760582 444714617 452977580 460409083 467011356 472418776 476665784
$$ packed form
5602G3975143J997734J978538K011536J998504K072401K516664K352964K385388
5594I1288872K821051K727416K813053K964698L024437L156306L385995L393790
5586A15575618L563102L886667L959264M086400M222479M426584M758658M825945
5578A49304717M989534N334678N526198N842108O044012O246181O538612O689209
5570A96515249O921885P221572P723912P836391Q142884Q315984Q467684Q906719
5562B60052280R323327R453630R541335R989095J0167338J0456452J0737733J0875259
5554C40596449J0853537J0972524J1037172J0899139J0913724J0610183J0284608
5547D16167336J0031120R562126Q954035Q262963P431503O602273N407420M247008
$$ plain form
5539 476665784 479800481 481649933 482088559 481178062 478857560 475305881 470678127 464751017
5531 464751017 457800307 449942396 441271815 431678950 421535031 410977257 399966879 388678485
5523 388678485 377453683 365887477 354318093 343020302 331780534 320716224 309941980
5516 309941980 299245782 288908279 278753867 269046492 259674140 250774884 242061695 233529147
5508 233529147 225505626 217757444 210111779 202762991 195822217 189221873 182864324 176733991
5500 176733991 170816777 165155179 159804495 154586713 149727549 144931733 140308677 135988179
5492 135988179 131839116 127774047 123884791 120112846 116519255 113015332 109833231 106674823
5484 106674823 103506566 100601019 97787259 95160959 92496466 90024323 87605538 85257406
$$ packed form
5539D76665784L134697J849452M38626r10497k320502l551679m627754n927110
5531D64751017o950710p857911q670581r592865j0143919j0557774j1010378j1288394
5523C88678485j1224802j1566206j1569384j1297791j1239768j1064310j0774244
5516C09941980j0696198j0337503j0154412r707375r372352q899256q713189q532548
5508B33529147q023521p748182p645665p348788o940774o600344o357549o130333
5500A76733991n917214n661598n350684n217782m859164m795816m623056m320498
5492A35988179m149063m065069l889256l771945l593591l503923l182101l158408
5484A06674823l168257k905547k813760k626300k664493k472143k418785k348132
$$ plain form
5476 85257406 83018554 80870602 78856538 76854730 74889985 72939162 71058466 69380769
5468 69380769 67813432 66176527 64661148 63161613 61705460 60287345 58947315 57678410
5460 57678410 56325529 54968621 53650606 52557482 51517616 50325927 49297441 48273700
5452 48273700 47386524 46352841 45350511 44567262 43725692 42917289 41928857 41058932 40412350
5443 40412350 39744196 38986858 38205914 37577485 36854271 36197421 35596804 34957390 34474120
5434 34474120 33864749 33249178 32578869 31976884 31465301 30870540 30365048 29796053 29364000
5425 29364000 28902977 28335284 27824403 27378031 26841715 26400018 25965906 25493166 25068632
5416 25068632 24826479 24496638 24203714 23818005 23435939 23198888 22889159 22448112 22155408
$$ packed form
5476H5257406k238852k147952k014064k001808j964745j950823j880696j677697
5468F9380769j567337j636905j515379j499535j456153j418115j340030j268905
5460E7678410j352881j356908j318015j093124j039866j191689j028486j023741
5452D8273700q87176j033683j002330p83249q41570q08403r88432q69925o46582
5443D0412350o68154p57338p80944o28429p23214o56850o00617o39414m83270
5434C4474120o09371o15571o70309o01985n11583n94761n05492n68995m32053
5425B9364000m61023n67693n10881m46372n36316m41697m34112m72740m24534
5416B5068632k42153l29841k92924l85709l82066k37051l09729m41047k92704
$$ plain form
5407 22155408 21886155 21677880 21373766 21161003 20959754 20784629 20502364 20161304 19957126
5398 19957126 19515180 19182262 19034973 18860492 18543179 18397710 18132805 17882209 17700352
5389 17700352 17632605 17506460 17364229 17069979 16933203 16690569 16487755 16211203 15750424 15548597
5379 15548597 15350408 15104642 14741188 14537249 14481855 14175084 13922546 13803029 13609537 13494159
5369 13494159 13221013 13061763 12877190 12678300 12570477 12445892 12329188 12116825 11843746
5360 11843746 11657344 11707636 11526149 11320001 11292137 11115232 10997081 10992708 10749225 10529575
5350 10529575 10493926 10498457 10185183 10163364 10108158 9945967 10010956 9856289 9688297 9577048
5340 9577048 9367108 9269416 9159638 8973541 8906211 8941085 8838955 8662584 8626686 8628504 8583159
$$ packed form
5407B2155408k69253k08275l04114k12763k01249j75125k82265l41060k04178
5398A9957126m41946l32918j47289j74481l17313j45469k64905k50596j81857
5389A7700352o7747j26145j42231k94250j36776k42634k02814k76552m60779k01827
5379A5548597j98189k45766l63454k03939n5394l06771k52538j19517j93492j15378
5369A3494159k73146j59250j84573j98890j07823j24585j16704k12363k73079
5360A1843746j86402N0292j81487k06148k7864j76905j18151m373k43483k19650
5350A0529575l5649M531l13274k1819n5206j62191O4989j54667j67992j11249
5340I577048k09940r7692j09778j86097o7330L4874j02130j76371l5898J818m5345
$$ plain form
5329 8583159 8407862 8310975 8165720 8123625 8092511 8006320 7962065 7945254 7796366 7774306 7733575
5318 7733575 7685472 7679219 7648844 7491657 7363969 7268887 7201865 7226505 6965639 6818668 6905764
5307 6905764 6861030 6831817 6772835 6733896 6585538 6475095 6441970 6264556 6239116 6207971 6244298
5296 6244298 6123552 6031195 5991992 5918359 5892698 5788743 5722697 5730570 5663077 5648136 5546359
5285 5546359 5359930 5312579 5445445 5480851 5365750 5330656 5325721 5475582 5356718 5257036 5203215
5274 5203215 5144904 5041740 5051501 4994440 4919474 4976014 4965593 4878039 4926999 4816500 4721133
5263 4721133 4687780 4791331 4719338 4502079 4440236 4487614 4553244 4447399 4423649 4413312 4400662
5252 4400662 4271931 4336479 4262556 4211564 4130198 4139064 4133405 4119979 4047005 4025835 3868172
$$ packed form
5329H583159j75297r6887j45255m2095l1114q6191m4255j6811j48888k2060m0731
5318G733575m8103o253l0375j57187j27688r5082o7022K4640k60866j46971Q7096
5307F905764m4734k9213n8982l8939j48358j10443l3125j77414k5440l1145L6327
5296F244298j20746r2357l9203p3633k5661j03955o6046P873o7493j4941j01777
5285E546359j86429m7351J32866L5406j15101l5094m935J49861j18864r9682n3821
5274E203215n8311j03164R761n7061p4966N6540j0421q7554M8960j10499r5367
5263D721133l3353J03551p1993k17259o1843M7378O5630j05845k3750j0337j2650
5252D400662j28731O4548p3923n0992q1366Q866n659j3426p2974k1170j57663
$$ plain form
5241 3868172 3827586 3813294 3855568 3878860 3929636 3824654 3756567 3786167 3771025 3709034 3543456
5230 3543456 3503091 3576523 3563496 3454991 3507989 3451792 3524094 3511472 3471919 3306337 3390573
5219 3390573 3414165 3392064 3353850 3250326 3251732 3149936 3144165 3198042 3159657 3038449 3073991
5208 3073991 3261928 3211098 3060683 3071944 3135180 3257638 3211050 3068397 2917789 2966193
5198 2966193 2993468 2938142 2804692 2839528 2842990 2839534 2909511 2909390 2841729 2695741 2684064 2862969
5186 2862969 2834395 2581974 2629263 2511950 2629094 2513290 2391957 2457282 2484276 2558962
5176 2558962 2571574 2504256 2431182 2331052 2398488 2498201 2416292 2490462 2552858 2437740 2346939
5165 2346939 2408006 2392887 2418582 2303822 2298914 2399278 2468568 2430450 2268103 2170468 2090815
$$ packed form
5241C868172m0586j4292M2274K3292N0776j04982o8087K9600j5142o1991j65578
5230C543456m0365P3432j3027j08505N2998n6197P2302j2622l9553j65582Q4236
5219C390573K3592k2101l8214j03524J406j01796n771N3877l8385j21208L5542
5208C073991J87937n0830j50415J1261O3236J22458m6588j42653j50608M8404
5198B966193K7275n5326j33450L4836L462l456O9977j21o7661j45988j1677J78905
5186B862969k8574k52421M7289j17313J17144j15804j21333O5325K6994P4686
5176B558962J2612o7318p3074j00130O7436R9713q1909P4170O2396j15118r0801
5165B346939O1067j5119K5695j14760m908J00364O9290l8118j62347r7635p9653
$$ plain form
5154 2090815 2117427 1976526 1942689 2045137 2093534 2152318 2070605 2016742 1935216 1830412 1882509
5143 1882509 2003820 2008499 1963892 1902819 1956854 1959516 1876508 1743170 1831327 1897179 1838534
5132 1838534 1817610 1747755 1803293 1865064 1871397 1919566 1806387 1746133 1856610 1865564 1878484
5121 1878484 1892832 1932417 1938533 1965529 1826746 1848997 1990595 1940317 1885202 1862639 1730536
5110 1730536 1639750 1508723 1562895 1717465 1669234 1761174 1827102 1643986 1705803 1830357 1821907
5099 1821907 1740698 1568316 1545721 1599318 1525022 1520953 1585840 1650832 1689792 1607142 1575160
5088 1575160 1762824 1812652 1646508 1603373 1539099 1534985 1569004 1447437 1444268 1616921 1581328
5077 1581328 1493399 1418217 1379668 1453774 1359348 1496559 1529080 1497243 1621678 1597305 1607690
$$ packed form
5154B090815K6612j40901l3837J02448M8397N8784q1713n3863q1526j04804N2097
5143A882509J21311M679m4607o1073N4035K662q3008j33338Q8157O5852n8645
5132A838534k0924o9855N5538O1771O333M8169j13179o0254J10477Q954J2920
5121A878484J4348L9585O116K6996j38783K2251J41598n0278n5115k2563j32103
5110A730536r0786j31027N4172J54570m8231R1940O5928j83116O1817J24554q450
5099A821907q1209j72382k2595N3597p4296m069O4887O4992L8960q2650l1982
5088A575160J87664M9828j66144m3135o4274m114L4019j21567l169J72653l5593
5077A581328q7929p5182l8549P4106r4426J37211L2521l1837J24435k4373J0385
$$ plain form
5066 1607690 1532233 1464892 1590981 1644480 1531107 1313789 1293001 1295751 1262546 1334163 1343591
5055 1343591 1435123 1398204 1446944 1391403 1344111 1240976 1189014 1237977 1284762 1335702 1329314
5044 1329314 1185799 1204994 1264051 1226079 1279672 1295107 1275891 1228756 1212983 1345818 1247619
5033 1247619 1166574 1290624 1263719 1343535 1354885 1256369 1251765 1240600 1111505 1136119 1212883
5022 1212883 1185219 1307739 1172023 1164419 1272441 1143171 1149435 1192552 1231145 1285673 1184758
5011 1184758 1345496 1378231 1270540 1205678 1129399 1122568 1093211 1123640 1101212 1213142 1210525
5000 1210525 1225286 1275345 1204107 1045120 1054335 1062622 1061583 1144246 1089070 1038377 1076780 1096504
4988 1096504 1243242 1140145 1131708 1313463 1243934 1198319 1206833 1350277 1237323 1181191 1083517
$$ packed form
5066A607690p5457o7341J26089N3499j13373k17318k0788K750l3205P1617R428
5055A343591R1532l6919M8740n5541m7292j03135n1962M8963M6785N0940o388
5044A329314j43515J9195N9057l7972N3593J5435j9216m7135j5773J32835r8199
5033A247619q1045J24050k6905P9816J1350r8516m604j1165j29095K4614P6764
5022A212883k7664J22520j35716p604J08022j29270O264M3117L8593N4528j00915
5011A184758J60738L2735j07691o4862p6279o831k9357L0429k2428J11930k617
5000A210525J4761N0059p1238j58987R215Q287j039Q2663n5176n0693L8403J9724
4988A096504J46738j03097q437J81755o9529m5615Q514J43444j12954n6132r7674
$$ plain form
4977 1083517 1176827 1165676 1076747 1231434 1161790 1184530 1164752 1243932 1162669 1122066 1108677
4966 1108677 1104184 1081009 1053983 1059037 1064312 1094616 1047649 1014026 946551 970869 1035424 1034575
4954 1034575 1101152 1065869 1037150 1052210 1006319 936672 944954 1062708 1137271 964871 1014019
4943 1014019 1049001 1077947 968349 742184 794321 804621 923235 833897 872361 831650 908262
4932 908262 1000326 922401 938692 979408 989728 1024531 1043405 942861 980111 953108 950671 980094
4920 980094 968622 1007507 1041645 1020940 1070693 1109827 1193744 1101059 898833 929703 1092651
4909 1092651 1197995 1123118 1155081 1164584 1197704 1240353 1250602 1175371 1138515 1212995 1333430
4898 1333430 1330590 1253892 1342276 1386647 1347962 1269793 1268758 1246179 1291661 1328637 1193133 1255531
$$ packed form
4977A083517R3310j1151q8929J54687o9644K2740j9778P9180q1263m0603j3389
4966A108677m493k3175k7026N054N275L0304m6967l3623o7475K4318O4555q49
4954A034575O6577l5283k8719J5060m5891o9647Q282J17754P4563j72400M9148
4943A014019L4982K8946j09598k26165N2137J0300J18614q9338L8464m0711P6612
4932I08262R2064p7925J6291M0716J0320L4803J8874j00544L7250k7003k437K9423
4920I80094j1472L8885L4138k0705M9753L9134Q3917r2685k02226L0870J62948
4909A092651J05344p4877L1963R503L3120M2649J0249p5231l6856P4480J20435
4898A333430k840p6698Q8384M4371l8685p8169j035k2579M5482L6976j35504O2398
$$ plain form
4886 1255531 1250577 1272636 1175691 1082216 1202597 1158381 1204571 1211614 1169832 1175321 1323510 1255164
4874 1255164 1098779 976702 823277 852013 915832 938536 858455 882268 886809 763357 813296
4863 813296 835420 860638 840663 782665 817942 754038 691021 885269 829200 765531 868447
4852 868447 899947 917975 829839 780460 730846 775812 705571 710149 778256 840619 779542 704612
4840 704612 731534 910400 878346 632633 614133 592182 679311 684487 662149 594991 798956
4829 798956 943784 833539 884415 919720 761451 673595 738580 760181 695428 738359 770311
4818 770311 637926 671013 615010 632481 725259 754001 759483 691905 596427 655407 711630 720820
4806 720820 720269 738294 632068 735425 642066 709821 817650 770298 783072 711512 729411
$$ packed form
4886A255531m954K2059r6945r3475J20381m4216M6190P043m1782N489J48189o8346
4874A255164j56385j22077j53425K8736O3819K2704q0081K3813M541j23452M9939
4863H13296K2124K5218j9975n7998L5277o3904o3017J94248n6069o3669J02916
4852H68447L1500J8028q8136m9379m9614M4966p0241M578O8107O2363o1077p4930
4840G04612K6922J78866l2054k45713j8500k1951Q7129N176k2338o7158K03965
4829G98956J44828j10245N0876L5305j58269q7856O4985K1601o4753M2931L1952
4818G70311j32385L3087n6003J7471R2778K8742N482o7578r5478N8980N6223R190
4806G20820n51J8025j06226J03357r3359O7755J07829m7352J2774p1560J7899
$$ plain form
4795 729411 747484 724441 765405 790012 859863 850260 824821 873282 760102 810825 805981 823054
4783 823054 815284 835209 887179 897133 851590 866428 854519 904070 911098 920219 853421 916999
4771 916999 1032115 1171038 1102272 1039611 1035209 1121395 1220198 1247996 1220770 1185654 1138304
4760 1138304 1075002 1172298 1065916 1112193 1120084 1092550 1123289 1219639 1281966 1225510 1217223 1044950
4748 1044950 996593 982786 1068308 1073384 1117516 1125035 1081503 1093242 1085095 1101361 1074269 1043030
4736 1043030 1073972 1258623 1130296 1028456 1054942 1099720 994289 1031635 1022524 1038266 1049670
4725 1049670 1160305 1041706 983676 1115558 1138630 1085749 1060997 1138346 1188882 1187720 1095962
4714 1095962 1154440 1185560 1162513 1149885 1116256 1067255 1142733 1121190 1097184 1070712 1078908 1139682
$$ packed form
4795G29411J8073k3043M0964K4607O9851r603k5439M8461j13180N0723m844J7073
4783H23054p770J9925N1970R954m5543J4838j1909M9551P028R121o6798O3578
4771I16999J15116J38923o8766o2661m402Q6186R8803K7798k7226l5116m7350
4760A138304o3302R7296j06382M6277P891k7534L0739R6350O2327n6456q287j72273
4748A044950m8357j3807Q5522N076M4132P519m3532J1739q147J6266k7092l1239
4736A043030L0942J84651j28327j01840K6486M4778j05431L7346r111J5742J1404
4725A049670J10635j18599n8030J31882K3072n2881k4752P7349N0536j162r1758
4714A095962N8478L1120k3047j2628l3629m9001P5478k1543k4006k6472Q196O0774
$$ plain form
4702 1139682 1288219 1320174 1214140 1187877 1110743 1134211 1168033 1274239 1133994 1142397 1216813
4691 1216813 1053868 1041456 1112069 1207549 1239822 1195876 1310389 1339742 1282661 1451449 1477480
4680 1477480 1414390 1472991 1464646 1472077 1454461 1476602 1504517 1469791 1575838 1664456 1712077 1665266
4668 1665266 1626034 1527241 1591533 1651786 1810419 1925291 1919023 1896621 1954706 2053927 2076236
4657 2076236 2037065 2064936 2179570 2314548 2291462 2297005 2482570 2501589 2618762 2793290 2898907
4646 2898907 3042971 3144775 3108673 3201143 3310798 3344931 3419486 3719093 3967028 4108993
4636 4108993 4377122 4564906 4807342 5176972 5511727 5682053 6000678 6225317 6565335 6925260
4626 6925260 7270227 7656981 8077149 8597241 9005150 9495157 10113270 10733675 11246757 11921233
$$ packed form
4702A139682J48537L1955j06034k6263p7134K3468L3822J06206j40245Q403P4416
4691A216813j62945j2412P0613R5480L2273m3946J14513K9353n7081J68788K6031
4680A477480o3090N8601q345P431j7616K2141K7915l4726J06047Q8618M7621m6811
4668A665266l9232r8793O4292O0253J58633J14872o268k2402N8085R9221K2309
4657B076236l9171K7871J14634J34978k3086N543J85565J9019J17173J74528J05617
4646B898907J44064J01804l6102R2470J09655L4133P4555K99607K47935J41965
4636D108993K68129J87784K42436L69630L34755J70326L18625K24639L40018L59925
4626F925260L44967L86754M20168N20092M07909M90007O18113O20405N13082O74476
$$ plain form
4616 11921233 12762352 13634135 14540252 15745817 16963835 18116956 19502237 21058740 22712675
4607 22712675 24678832 26814254 29178724 31686397 34260081 36846001 39481205 42060175
4599 42060175 44461245 47040324 49849161 52799859 55692494 58563393 60968549 62860150
4591 62860150 64480360 66018177 67502367 68924280 70523001 71850568 72370534 72195800
4583 72195800 71246583 69740594 68043860 66402254 64891494 63329788 61444236 59056872
4575 59056872 56491022 53529572 50247224 47278656 44686857 41983214 39352150 36710972
4567 36710972 34099174 31502055 28768964 26358044 24131717 21970176 20160593 18454394
4559 18454394 16880274 15711391 14575377 13548711 12666903 11900590 11041336 10253630 9724982
$$ packed form
4616A1921233Q41119Q71783R06117J205565J218018J153121J385281J556503J653935
4607B2712675J966157K135422K364470K507673K573684K585920K635204K578970
4599D2060175K401070K579079K808837K950698K892635K870899K405156J891601
4591F2860150J620210J537817J484190J421913J598721J327567N19966j74734
4583G2195800r49217j505989j696734j641606j510760j561706j885552k387364
4575E9056872k565850k961450l282348k968568k591799k703643k631064k641178
4567C6710972k611798k597119k733091k410920k226327k161541j809583j706199
4559A8454394j574120j168883j136014j026666q81808p66313q59254p87706n28648
$$ plain form
4550 9724982 9246663 8860177 8411925 7978508 7578936 7215336 6938476 6604486 6293102 6046807
4540 6046807 5752904 5504868 5308964 5048949 4783597 4680519 4518206 4230576 4116191 4063095
4530 4063095 3852063 3701624 3577897 3493003 3484934 3260437 3130549 3116663 3172804 3030645
4520 3030645 2794725 2761478 2642735 2650933 2575699 2532358 2417035 2291898 2319192 2224992 2192727
4509 2192727 2197381 2049562 2111925 2241238 2187165 2105406 2032772 1991268 1873030 1825594 1840846
4498 1840846 1934960 2067368 2048548 1822268 1760509 1801480 1799149 1732323 1795624 1787002 1616187
4487 1616187 1567514 1752101 1843515 1751250 1807072 1881234 1978472 2059119 1915012 2022911 1970602
4476 1970602 1903727 1965423 1727562 1622641 1635434 1644791 1644096 1560771 1487613 1446852 1243534
$$ packed form
4550I724982m78319l86486m48252m33417l99572l63600k76860l33990l11384k46295
4540F046807k93903k48036j95904k60015k65352j03078j62313k87630j14385n3096
4530D063095k11032j50439j23727q4894q069k24497j29888j3886N6141j42159
4520C030645k35920l3247j18743Q198p5234m3341j15323j25137K7294r4200l2265
4509B192727M654j47819O2363J29313n4073q1759p2634m1504j18238m7436J5252
4498A840846R4114J32408j8820k26280o1759M0971k331o6826O3301q622j70815
4487A616187m8673J84587R1414r2265N5822P4162R7238Q0647j44107J07899n2309
4476A970602o6875O1696k37861j04921J2793R357o95q3325p3158m0761k03318
$$ plain form
4465 1243534 1326199 1331867 1248723 1221501 1261559 1151285 1255565 1229868 1129712 1126538 1144197
4454 1144197 1272246 1254419 1334192 1347144 1264770 1221686 1178516 1131775 1010815 898473 937987
4443 937987 1078324 1081565 967442 1029099 1164360 1172325 1060411 965076 987915 901423 945877
4432 945877 940196 843199 882034 811084 730137 883466 1020182 1113049 1047489 1016492 1086702
4421 1086702 1000114 980726 822565 676951 673283 726004 715696 746395 774002 852992 807597
4410 807597 856600 883080 735919 677827 657794 683833 753724 778847 737483 757174 732911
4399 732911 539043 541269 528125 534595 494018 534306 644377 662222 532600 614768 717536
4388 717536 769157 722031 694705 626323 690148 761396 746678 750460 774739 711565 765449 768369
$$ packed form
4465A243534Q2665N668q3144k7222M0058j10274J04280k5697j00156l174J7659
4454A144197J28049j7827P9773J2952q2374m3084m3170m6741j20960j12342L9514
4443I37987J40337L241j14123O1657J35261P965j11914r5335K2839q6492M4454
4432I45877n681r6997L8835p0950q0947J53329J36716R2867o5560l0997P0210
4421A086702q6588j9388j58161j45614l668N2721j0308L0699K7607P8990m5395
4410H07597M9003K6480j47161n8092k0033K6039O9891K5123m1364J9691k4263
4399G32911j93868K226j3144O470m0577M0288J10071J7845j29622Q2168J02768
4388G17536N1621m7126k7326o8382O3825P1248j4718L782K4279o3174N3884K920
$$ plain form
4376 768369 617638 732085 715639 673366 675572 837448 931872 867847 798677 833223 805826
4365 805826 907941 834478 719623 778708 822742 823299 720293 755349 866966 955325 901559
4354 901559 905365 907010 672162 702444 713219 833890 925215 787699 685318 703803 680334
4343 680334 684202 664965 741505 762931 802871 841921 832117 750543 664443 700303 589285 554691
4331 554691 622228 737472 821412 848945 822908 790708 784731 935400 847118 821298 929035
4320 929035 997506 879516 792956 816571 850953 946822 873744 808285 890356 928922 915805
4309 915805 972807 895653 915369 995189 1008557 957228 972144 1037311 963385 1067881 1048697
4298 1048697 939861 1017607 1143617 1121573 1191083 1168574 1218694 1371622 1427640 1345186 1146570
$$ packed form
4376G68369j50731J14447j6446m2273K206J61876R4424o4025o9170L4546k7397
4365H05826J02115p3463j14855N9085M4034N57j03006L5056J11617Q8359n3766
4354I01559L806J645k34848L0282J0775J20671R1325j37516j02381J8485k3469
4343F80334L868j9237P6540K1426L9940L9050r804q1574q6100L5860j11018l4594
4331E54691O7537J15244Q3940K7533k6037l2200n977J50669q8282k5820J07737
4320I29035O8471j17990q6560K3615L4382R5869p3078o5459Q2071L8566j3117
4309I15805N7002p7154J9716P9820J3368n1329J4916O5167p3926J04496j9184
4298A048697j08836P7746J26010k2044O9510k2509N0120J52928N6018q2454j98616
$$ plain form
4287 1146570 1268022 1495742 1540078 1491183 1471518 1533495 1574342 1441912 1540760 1710811 1841786
4276 1841786 1727361 1731400 1798912 1923797 1969239 1800460 1894956 1960153 1909553 1878504 1859041
4265 1859041 1916383 1991591 2063881 2098172 2148169 2186016 2069693 2067185 2225798 2237204 2250715
4254 2250715 2240279 2279872 2402953 2617459 2675593 2688799 2898323 3007650 2999406 3075069 3188754
4243 3188754 3280188 3460809 3656258 3808275 3889593 4039834 4256793 4508959 4795163 5023416
4233 5023416 5276089 5607154 5994724 6262508 6669736 7258652 7749839 8341827 9169681 9917687
4223 9917687 10940072 12037241 12681496 13026558 13190970 13596472 14183226 14775274 15673916
4214 15673916 16676750 17866453 19234198 20740337 22419477 24182280 26142329 28258942
$$ packed form
4287A146570J21452K27720M4336m8895j9665O1977M0847j32430R8848J70051J30975
4276A841786j14425M039O7512J24885M5442j68779R4496O5197n0600l1049j9463
4265A859041N7342P5208P2290L4291M9997L7847j16323k508J58613J1406J3511
4254B250715j0436L9593J23081K14506N8134J3206K09524J09327q244P5663J13685
4243C188754R1434J80621J95449J52017Q1318J50241K16959K52166K86204K28253
4233E023416K52673L31065L87570K67784M07228N88916M91187N91988Q27854P48006
4223I917687J022385J097169O44255L45062J64412M05502N86754N92048Q98642
4214A5673916J002834J189703J367745J506139J679140J762803J960049K116613
$$ plain form
4206 28258942 30741219 33483042 36592036 40137732 44062059 48783303 54733670 62732821
4198 62732821 72662778 82554676 93822858 110699070 126617331 133597240 132059176 124849539
4190 124849539 113350871 99253086 86041822 74415087 64019420 54727489 46520062
4183 46520062 39934340 35148692 31441189 28554379 26230139 24322310 22394183 20910239
4175 20910239 19450720 18191477 16996704 15927087 14815271 13898258 13177846 12426342 11734413
4166 11734413 11338625 10715722 9862098 9253122 8758377 8234016 7761516 7462458 7015534
4157 7015534 6637785 6440423 6225598 5815953 5441557 5209151 5050813 4887941 4765707 4584545
4147 4584545 4402207 4283924 4010383 3858723 3745618 3661790 3581990 3378776 3190525 3163440
$$ packed form
4206B8258942K482277K741823L108994L545696L924327M721244N950367P999151
4198F2732821R929957R891898J1268182J6876212J5918261O979909j538064p209637
4190A24849539j1498668j4097785j3211264j1626735j0395667r291931q207427
4183D6520062o585722m785648l707503k886810k324240j907829j928127j483944
4175B0910239j459519j259243j194773j069617j111816r17013p20412p51504o91929
4166A1734413l95788o22903q53624o08976m94745n24361m72500k99058m46924
4157G015534l77749j97362k14825m09645l74396k32406j58338j62872j22234j81162
4147D584545j82338j18283k73541j51660j13105q3828p9800k03214j88251k7085
$$ plain form
4137 3163440 3051881 2947500 2793382 2647280 2641103 2579636 2509579 2527985 2364383 2246568
4127 2246568 2345722 2226743 2248446 2270691 2121977 2082621 2149132 1984659 1950648 1905537 1946067
4116 1946067 2013241 1775947 1773453 1904318 1878461 1728044 1533244 1597601 1579834 1558985 1383255
4105 1383255 1400978 1474478 1406614 1351562 1290518 1171571 1212882 1220236 1103681 1123700 1119591
4094 1119591 962605 972235 1008516 1208870 1145930 1055574 1028130 978258 992894 989918 958674
4083 958674 859293 821980 806170 902973 910096 922030 853229 937070 898381 819878 759049 735377
4071 735377 732828 810691 883032 797047 755845 776288 621517 626721 631748 616082 665750 584552
4059 584552 637569 680388 665671 619648 573763 536114 549842 615919 503143 466575 511268
$$ packed form
4137C163440j11559j04381j54118j46102o177o1467p0057J8406j63602j17815
4127B246568R9154j18979K1703K2245j48714l9356O6511j64473l4011m5111M0530
4116A946067O7174k37294k494J30865k5857j50417j94800O4357j7767k0849j75730
4105A383255J7723P3500o7864n5052o1044j18947M1311P354j16555K0019m109
4094A119591j56986R630L6281K00354o2940r0356k7444m9872J4636k976l1244
4083I58674r9381l7313j5810R6803P123J1934o8801Q3841l8689p8503o0829k3672
4071G35377k549P7863P2341q5985m1202K0443j54771N204N027j5666M9668q1198
4059E84552N3017M2819j4717m6023m5885l7649J3728O6077j12776l6568M4693
$$ plain form
4048 511268 557087 614193 459613 523260 557533 498587 411147 555088 516746 513729 462233
4037 462233 474615 578802 483084 480923 393079 314323 211882 262138 338882 411690 503811
4026 503811 395056 319110 277299 424340 440712 437159 558801 480414 443899 502078 457007
4015 457007 490479 425838 493503 541972 364931 369982 399003 381412 433436 281577 174141
4004 174141 280324 298880 233175 262074 410375 290576 269647 279585 354196 282422 387872
3993 387872 422889 287652 314606 298304 255071 388415 340061 216686 248891 348129 408237
3982 408237 517180 460170 367109 321075 259209 232992 139088 193555 311448 241430 267482
3971 267482 230435 276424 281501 283881 243215 280229 402487 371653 414350 357022 303914 239009
$$ packed form
4048E11268M5819N7106j54580O3647L4273n8946q7440J43941l8342l017n1496
4037D62233J2382J04187r5718k161q7844p8756j02441N0256P6744P2808R2121
4026E03811j08755p5946m1811J47041J6372l553J21642p8387l6515N8179m5071
4015D57007L3472o4641O7665M8469j77041N051K9021j7591N2024j51859j07436
4004A74141J06183J8556o5705K8899J48301j19799k0929R938P4611p1774J05450
3993C87872L5017j35237K6954j6302m3233J33344m8354j23375L2205R9238O0108
3982D08237J08943n7010r3061m6034o1866k6217r3904N4467J17893p0018K6052
3971B67482l7047M5989N077K380m0666L7014J22258l0834M2697n7328n3108o4905
$$ plain form
3959 239009 356000 300422 180103 289614 388633 340331 254276 250466 360035 139615 126251
3948 126251 193930 154930 219166 255889 244759 175719 198119 216430 241359 252124 229853 310128
3936 310128 271438 210076 306849 362659 356081 299241 312170 238739 315534 295289 337428 464063
3924 464063 386502 325590 257814 315994 308325 322790 322669 276953 345441 351402 413248 364009
3912 364009 355110 456416 628682 602569 648175 634489 653764 725969 812259 771368 801839
3901 801839 725006 612908 605947 618076 506575 482937 371842 301684 326752 395106 393025
3890 393025 519741 429623 226288 283110 243969 205635 27088 145080 146474 160067 279411
3879 279411 259360 397958 411585 251819 292016 249288 217447 173340 272487 370651 328330
$$ packed form
3959B39009J16991n5578j20319J09511R9019m8302q6055l810J09569k20420j3364
3948A26251O7679l9000O4236L6723j1130o9040K2400J8311K4929J0765k2271Q0275
3936C10128l8690o1362R6773N5810o578n6840J2929p3431P6795k0245M2139J26635
3924D64063p7561o0912o7776N8180p669J4465j21m5716O8488N961O1846m9239
3912C64009q899J01306J72266k6113M5606j3686J9275P2205Q6290m0891L0471
3901H01839p6833j12098o961J2129j11501k3638j11095p0158K5068O8354k081
3890C93025J26716r0118k03335N6822l9141l8334j78547J17992J394J3593J19344
3879B79411k0051J38598J3627j59766M0197m2728l1841m4107R9147R8164m2321
$$ plain form
3868 328330 102260 100186 132018 78886 6414 95844 78491 120714 91966 107871 150505 125848
3856 125848 130520 213835 249763 202077 64038 -12955 -57546 -1836 145351 137317 95938 110087
3844 110087 117205 99775 172269 184962 32607 33812 179545 99504 17075 106958 133416 -235
3832 -235 -45944 71423 27577 104567 76711 44693 -57619 15846 125931 111781 146830 209557
3820 209557 230471 124463 149786 135326 129427 219126 162209 146855 68773 55003 119023 107789
3808 107789 38503 167616 118913 91576 79865 116123 79169 46396 224328 61636 -13348
3797 -13348 16185 89823 122382 131959 123273 190290 81613 33254 45767 58202 126084 136278
3785 136278 89435 143818 99445 208427 162657 143402 131144 29415 72865 46268 39891
$$ packed form
3868C28330k26070k074L1832n3132p2472Q9430j7353M2223k8748J5905M2634k4657
3856A25848M672Q3315L5928m7686j38039p6993m4591N5710J47187q034m1379J4149
3844A10087P118j7430P2494J2693j52355J205J45733q0041q2429Q9883K6458j33651
3832b35m5709J17367m3846P6990k7856l2018j02312P3465J10085j4150L5049O2727
3820B09557K0914j06008K5323j4460n899Q9699n6917j5354p8082j3770O4020j1234
3808A07789o9286J29113m8703k7337j1711L6258l6954l2773J77932j62692p4984
3797a3348K9533P3638L2559R577q686O7017j08677m8359J2513J2435O7882J0194
3785A36278m6843N4383m4373J08982m5770j9255j2258j01729M3450k6597o377
$$ plain form
3774 39891 -21183 32549 183265 96989 54508 51627 113062 85941 114252 57905 15487 69198
3762 69198 31971 14707 144923 81110 75196 41846 106702 204108 207074 142771 -27757 14370
3750 14370 121021 198177 213052 107444 71383 80788 130414 80561 92909 145145 123345 161392
3738 161392 81420 75607 83182 -32391 87505 101931 79346 9383 61319 48391 59575 16954
3726 16954 -182230 -112454 61387 163995 49717 26302 135744 104173 149760 128709 71937
3715 71937 -8555 -81422 -4818 96454 154573 77354 120696 27017 87474 73119 95778 89197
3703 89197 88693 162070 144179 51498 62769 -11886 55673 107338 -89028 61017 207981 146897
3691 146897 50092 15110 19169 -71503 -110120 -107479 -23923 43981 38984 70569 64607 13504
$$ packed form
3774C9891o1074N3732J50716q6276m2481k881O1435k7121K8311n6347m2418N3711
3762F9198l7227j7264J30216o3813n914l3350O4856R7406K966o4303j70528M2127
3750A4370J06651P7156J4875j05608l6061R405M9626m9853J2348N2236k1800L8047
3738A61392p9972n813P575j15573J19896J4426k2585o9963N1936j2928J1184m2621
3726A6954j99184O9776J73841J02608j14278k3415J09442l1571M5587k1051n6772
3715G1937q0492p2867P6604J01272N8119p7219M3342r3679O0457j4355K2659o581
3703H9197n04P3377j7891r2681J1271p4655O7559N1665j96366J50045J46964o1084
3691A46897r6805l4982M059r0672l8617K641Q3556O7904m997L1585n962n1103
$$ plain form
3679 13504 21636 102454 -28467 -15004 140385 91649 93821 43578 135542 79911 79454 23653
3667 23653 -60946 -65689 -88836 -30081 -7012 -11445 18162 157095 280607 119985 9271
3656 9271 -93735 -66572 11441 77139 122054 44421 64158 99869 167764 113645 59816 -61171
3644 -61171 14365 63136 125467 67607 93205 122937 -13981 -24726 40215 113892 78469 -35241
3632 -35241 -180633 -192856 -93475 -102458 -95546 140380 127763 184060 63064 -14602 6531 -5159
3620 -5159 116156 15218 -59014 -126678 -209783 -129411 -72674 -98696 -6990 59234 114098 117834
3608 117834 52941 19040 -34350 103845 31232 -22613 5542 843 -7016 43779 -56890 -104384
3596 -104384 -105767 -11523 117515 88692 20405 -13508 -23548 25601 99480 109555 54848 7328
$$ packed form
3679A3504Q132Q0818j30921J3463J55389m8736K172n0243R1964n5631m57n5801
3667B3653q4599m743k3147N8755K3069m433K9607J38933J23512j60622j10714
3656I271j03006K7163P8013O5698M4915p7633J9737L5711O7895n4119n3829j20987
3644f1171P5536M8771O2331n7860K5598K9732j36918j0745O4941P3677l5423j13710
3632c5241j45392j2223R9381q983O912K35926j2617N6297j20996p7666K1133j1690
3620e159J21315j00938p4232o7664q3105Q0372N6737k6022R1706O6224N4864L736
3608A17834o4893l3901n3390J38195p2613n3845K8155m699p859N0795j00669m7494
3596a04384j383R4244J29038k8823o8287l3913j0040M9149P3879J0075n4707m7520
$$ plain form
3584 7328 99192 -109884 -24563 75505 -33564 -16112 90163 94560 162386 121867 48032
3573 48032 85610 121665 157057 138623 38592 -1481 13278 -65836 -9210 83685 58437 158392
3561 158392 86420 60915 37088 83114 122479 160421 175599 159501 189957 231217 26203
3550 26203 -51803 -91045 -43704 65188 16064 -61482 -173826 -50684 25785 -74262 -223533
3539 -223533 -184272 -35075 -40182 -159862 -80526 -67449 -16895 -69652 -22368 -32256 -11611 17341
3527 17341 -66374 20682 32595 42882 -19111 -152653 -66251 14582 -3596 -81847 -159893 -217046
3515 -217046 -147999 18453 107725 -37290 -47113 -32178 -69303 45609 -44890 -23568 76749
3504 76749 87570 49086 -43750 37476 -19277 68674 49886 117911 173296 93662 78592 -10787
$$ packed form
3584G328R1864k09076Q5321J00068j09069J7452J06275M397O7826m0519p3835
3573D8032L7578L6055L5392j8434j00031m0073J4759p9114N6626R2895k5248R9955
3561A58392p1972k5505k3827M6026L9365L7942J5178j6098L0456M1260k05014
3550B6203p8006l9242M7341J08892m9124p7546j12344J23142P6469j00047j49271
3539b23533L9261J49197n107j19680P9336J3077N0554n2757M7284r888K0645K8952
3527A7341q3715Q7056J1913J0287o1993j33542Q6402Q0833j8178p8251p8046n7153
3515b17046O9047J66452Q9272j45015r823J4935l7125J14912r0499K1322J00317
3504G6749J0821l8484r2836Q1226n6753Q7951j8788O8025N5385p9634j5070q9379
$$ plain form
3492 -10787 43267 86011 123025 52127 7346 10268 111051 57439 79354 11127 25686 9897
3480 9897 32279 86391 -2083 11158 7230 78721 97460 -6747 -7949 -2440 195463 188903
3468 188903 227410 133369 92746 27893 -44905 116879 98013 12548 64307 59538 27407 -20040
3456 -20040 -4626 -9617 -164876 -6894 48856 70356 -2325 -27115 -43496 -8395 15243 -69615
3444 -69615 -80286 28739 42011 -32131 -35861 -18365 -25172 -25628 -24313 62189 144036 42804
3432 42804 83739 62049 76703 20994 2272 23438 -21729 67202 193315 194572 133870 110934
3420 110934 30858 6854 55322 136896 129663 170486 176915 182867 143280 86729 7156 32648
3408 32648 55024 58845 192987 250538 71745 131864 61092 35969 79217 67551 21247 28101
$$ packed form
3492a0787N4054M2744L7014p0898m4781K922J00783n3612K1915o8227J4559j5789
3480I897K2382N4112q8474J3241l928P1491J8739j04207j202N509J97903o560
3468A88903L8507r4041m0623o4853p2798J61784j8866q5465N1759m769l2131m7447
3456b0040J5414m991j55259J57982N5750K1500p2681k4790j6381L5101K3638q4858
3444f9615j0671J09025J3272p4142l730J7496o807m56J315Q6502Q1847j01232
3432D2804M0935k1690J4654n5709j8722K1166m5167Q8931J26113J257o0702k2936
3420A10934q0076k4004M8468Q1574p233M0823O429N952l9587n6551p9573K5492
3408C2648K2376L821J34142N7551j78793O0119p0772k5123M3248j1666m6304O854
$$ plain form
3396 28101 145480 134562 -32934 89 33649 129573 183536 85609 26122 43612 129820
3385 129820 122576 155402 57382 150249 187169 119809 46386 24933 -24176 -102798 -75578 599
3373 599 62671 -81275 31979 -49631 -64722 28237 122691 253312 77746 55142 26130
3362 26130 25004 90994 137375 144611 245279 194456 241232 270254 233299 186865 135791 201348
3350 201348 211719 125448 165642 97989 198904 205736 134383 327190 333552 230340 239534 347339
3338 347339 372826 335378 315275 298658 242469 271709 276611 357579 348016 264980 133127 78958
3326 78958 146019 215462 201690 -49515 -92402 165244 57598 93857 255243 115082 78672
3315 78672 177312 178909 167043 175744 150147 212382 174794 182076 140651 116050 194899 227914
$$ packed form
3396B8101J17379j0918j67496L3023L3560R5924N3963r7927n9487J7490Q6208
3385A29820p244L2826r8020R2867L6920o7360p3423k1453m9109p8622K7220P6177
3373E99O2072j43946J13254q1610j5091R2959R4454J30621j75566k2604k9012
3362B6130j126O5990M6381P236J00668n0823M6776K9022l6955m6434n1074O5557
3350B01348J0371q6271M0194o7653J00915O832p1353J92807O362j03212R194J07805
3338C47339K5487l7448k0103j6617n6189K9240M902Q0968r563q3036j31853n4169
3326G8958O7061O9443j3772k51205m2887K57646j07646L6259J61386j40161l6410
3315G8672R8640J597j1866Q701k5597O2235l7588P282m1425k4601P8849L3015
$$ plain form
3303 227914 145668 89700 179046 275510 225146 205607 200689 281672 351122 390532 388605 277510
3291 277510 294193 346795 431595 430890 451897 501902 561869 603505 683451 677136 569643 484287
3279 484287 346301 309798 334105 168984 225913 267995 194688 217074 364755 445073 401476
3268 401476 480667 550265 530559 393458 289469 338759 457453 548243 583643 542146 565478
3257 565478 548434 689732 835050 1033248 1147334 1130513 1076886 950549 792113 789638 626577
3246 626577 559257 558141 573453 523993 435567 423547 352386 355753 329492 285953 249129 247657
3234 247657 262095 161926 233144 210347 277164 379217 458114 581688 542562 592418 555548
3223 555548 642545 604762 527798 531346 516159 584535 440332 364620 319606 298269 293494 406851
$$ packed form
3303B27914q2246n5968Q9346R6464n0364j9539m918Q0983O9450L9410j927j11095
3291B77510J6683N2602Q4800p05K1007N0005N9967M1636P9946o315j07493q5356
3279D84287j37986l6503K4307j65121N6929M2082p3307K2386J47681Q0318m3597
3268D01476P9191O9598j9706j37101j03989M9290J18694R0790L5400m1497K3332
3257E65478j7044J41298J45318J98198J14086j6821n3627j26337j58436k475j63061
3246F26577o7320j116J5312m9460q8426j2020p1161L367k6261m3539l6824j472
3234B47657J4438j00169P1218k2797O6817J02053P8897J23574l9126M9856l6870
3223E55548Q6997l7783p6964L548j5187O8376j44203p5712m5014k1337m775J13357
$$ plain form
3211 406851 283392 214527 433235 291226 153069 118823 153267 120586 -52214 -76306 64656
3200 64656 168751 201506 81128 134135 227403 41776 91202 181798 96282 -36667 -106390
3189 -106390 -64800 -10852 -97004 -128309 3298 991 -4020 41188 4935 50768 160588 43400
3177 43400 33274 -49502 -38476 -3787 -2190 22919 96988 44384 19911 -44939 -96598 10437
3165 10437 84534 -8245 -27462 -8628 -20698 -6288 38428 20641 56161 -65027 3337 146951
3153 146951 69184 146686 116543 -29048 75060 18878 26503 -6641 -53549 -48299 885 -56756
3141 -56756 -201773 -87154 -78642 -27421 160410 168698 55038 64543 -8173 -54198 -3132 6916
3129 6916 33688 -99410 -82114 -36514 -8628 64161 44806 9957 -12619 -8468 70191 72837
$$ packed form
3211D06851j23459o8865K18708j42009j38157l4246L4444l2681j72800k4092J40962
3200F4656J04095L2755j20378N3007R3268j85627M9426R0596q5516j32949o9723
3189a06390M1590N3948q6152l1305J31607k307n011M5208l6253M5833J09820j17188
3177D3400j0126q2776J1026L4689J597K5109P4069n2604k4473o4850n1659J07035
3165A0437P4097r2779j9217J8834j2070J4410M4716j7787L5520j21188O8364J43614
3153A46951p7767P7502l0143j45591J04108n6182P625l3144m6908N250M9184n7641
3141e6756j45017J14619Q512N1221J87831Q288j13660R505p2716m6025N1066J0048
3129F916K6772j33098J7296M5600K7886P2789j9355l4849k2576M151P8659K646
$$ plain form
3117 72837 -28164 14290 -46555 3745 -13120 1907 -127792 -84419 -33358 8275 11321 71839
3105 71839 178651 97048 37321 -22951 35421 -802 26399 -69833 -51106 -169506 -231830
3094 -231830 -155571 -80530 63704 -49247 78636 54112 117470 -80270 -112738 -37563 -79211
3083 -79211 -73080 29092 26736 54868 83989 6931 -11315 -87290 -11061 -20796 4098 45996
3071 45996 39527 -11065 -106414 -174045 -62564 -61154 -61844 -7973 39044 -58877 -44998 67772
3059 67772 23503 77135 278788 128492 102915 -19523 -52806 -21827 -81872 -35947 68478
3048 68478 182838 37467 16372 191067 44065 -85567 105488 24612 73601 108417 55968
3037 55968 9507 90300 100138 147985 227906 279010 209151 -83902 -130343 -81655 -123363 37630
$$ packed form
3117G2837j01001M2454o0845N0300j6865J5027j29699M3373N1061M1633L046O0518
3105G1839J06812q1603n9727o0272N8372l6223K7201r6232J8727j18400o2324
3094b31830P6259P5041J44234j12951J27883k4524O3358j97740l2468P5175m1648
3083g9211O131J02172k356K8132K9121p7058j8246p5975P6229r735K4894M1898
3071D5996o469n0592r5349o7631J11481J410o90N3871M7017r7921J3879J12770
3059F7772m4269N3632K01653j50296k5577j22438l3283L0979o0045M5925J04425
3048F8478J14360j45371k1095J74695j47002j29632J91055q0876M8989L4816n2449
3037E5968m6461Q0793R838M7847P9921N1104o9859k93053m6441M8688m1708J60993
$$ plain form
3025 37630 -15783 -120022 -144788 -138068 -65514 -59447 -74218 45826 -64522 -132824 83658
3014 83658 112589 -38394 -6786 -86385 22173 22188 10247 -20553 79453 76481 -4751 -45261
3002 -45261 40798 138089 228275 179635 22472 63035 -35874 -142375 -99593 -48266 17778
2991 17778 35093 -4520 -40749 -99316 -18509 -49414 -41501 -61256 -41992 -4595 128853 22332
2979 22332 -31643 6156 123941 19056 39617 70105 76055 -43072 -40322 -10418 57514 26554
2967 26554 -31966 -53076 2150 116027 79661 80667 63706 41340 -82135 -92717 -169111 -225252
2955 -225252 -187644 -187630 -126821 -171503 -158006 13460 -43530 -57718 -86988 -56942 -7874 -3864
2943 -3864 26422 -8611 -130505 -34202 3761 -88333 -213245 -240314 -37179 -97399 -31166
$$ packed form
3025C7630n3413j04239k4766O720P2554O067j4771J20044j10348o8302K16482
3014H3658K8931j50983L1608p9599J08558J5j1941l0800J00006k972q1232m0510
3002d5261Q6059R7291R0186m8640j57163M0563r8909j06501M2782N1327O6044
2991A7778J7315l9613l6229n8567Q0807l0905P913j9755J9264L7397J33448j06521
2979B2332n3975L7799J17785j04885K0561L0488N950j19127K750K9904O7932l0960
2967B6554n8520k1110N5226J13877l6366J006j6961k2366j23475j0582p6394n6141
2955b25252L7608J4O0809m4682J3497J71466n6990j4188k9270L0046M9068M010
2943c864L0286l5033j21894R6303L7963r2094j24912k7069K03135o0220O6233
$$ plain form
2932 -31166 -72210 -7612 -139182 -154008 -35928 -44080 -133522 -156526 -27584 731 -25881
2921 -25881 49747 -115459 -105767 -69224 140575 76677 -52382 39989 87324 -20108 -70760
2910 -70760 22846 -2718 -23175 -9288 -2349 61684 89984 46715 -50220 -136637 66035 39165
2898 39165 -6872 -93962 45092 58985 -124026 -146735 -37072 -36047 -118109 -81221 -99086
2887 -99086 -86150 -48469 -15846 62506 36299 36603 -45490 -20998 -38542 122848 29979 -171731
2875 -171731 -175953 -233500 -123743 8927 77853 120821 70983 55992 29333 -9069 -45896
2864 -45896 -122525 -155152 -97999 -16742 -56112 -174228 -181614 -172240 -94882 -114151 -13229 59506
2852 59506 -8912 -75580 -24010 -83524 -65678 19870 -13359 -87761 -19694 87559 20556 -486
$$ packed form
2932c1166m1044O4598j31570j4826J18080q152q9442k3004J28942K8315k6612
2921b5881P5628j65206R692L6543K09799o3898j29059R2371M7335j07432n0652
2910g0760R3606k5564k0457J3887O939O4033K8300m3269r6935q6417K02672k6870
2898C9165m6037q7090J39054J3893j83011k2709J09663J025q2062L6888j7865
2887i9086J2936L7681L2623P8352k6207L04q2093K4492j7544J61390r2869k01710
2875a71731m222n7547J09757J32670O8926M2968m9838j4991k6659l8402l6827
2864d5896p6629l2627N7153Q1257l9370j18116p386R374P7358j9269J00922P2735
2852E9506o8418o6668N1570n9514J7846Q5548l3229p4402O8067J07253o7003k1042
$$ plain form
2840 -486 176832 58899 41079 41528 102518 10017 -165488 -27050 27123 7881 1502 -36085
2828 -36085 -55059 -69518 -188694 -78071 -27969 15331 101774 59109 34664 19684 45188
2817 45188 -24537 -103147 63190 42977 18845 2723 63625 -698 11766 128553 5704
2806 5704 52237 70243 -3911 -1006 16200 -64002 -55095 -40622 -126917 -43573 25683 82066
2794 82066 39061 -111465 -167813 -140974 -47221 52332 123620 125374 13020 101949 75161 -2304
2782 -2304 15019 -15266 63650 63917 -43368 -59650 -19914 -63126 -30072 87551 30485 -73079
2770 -73079 2428 179268 135987 21073 6622 -26177 5442 -41170 -179387 -152385 -58733
2759 -58733 88892 210547 98571 -20912 -37790 71423 146273 18520 -109030 -94486
$$ packed form
2840d86J77318j17933j7820M49O0990r2501j75505J38438N4173j9242o379l7587
2828c6085j8974j4459j19176J10623N0102M3300Q6443m2665k4445j4980K5504
2817D5188o9725p8610J66337k0213k4132j6122O0902o4323J2464J16787j22849
2806E704M6533J8006p4154K905J7206q0202Q907J4473q6295Q3344O9256N6383
2794H2066m3005j50526n6348K6839R3753R9553P1288J754j12354Q8929k6788p7465
2782b304J7323l0285P8916K67j07285j6282L9736m3212L3054J17623n7066j03564
2770g3079P5507J76840m3281j14914j4451l2799L1619m6612j38217K7002R3652
2759e8733J47625J21655j11976j19483j6878J09213P4850j27753j27550J4544
$$ plain form
2749 -94486 17606 17076 -55219 12629 2337 -40021 -39174 -63803 57565 11403 11013 -46852 11966
2736 11966 -31822 -12725 32683 12625 24237 -78998 -74943 -30222 43207 -80035 -91967 -29176
2724 -29176 -71445 64660 115984 86640 109347 103874 30208 -47984 -90834 -65838 -14447 -92748
2712 -92748 -47194 -116535 47696 106135 -3882 67747 -74299 -64845 -33658 50655 53834 70858
2700 70858 -38994 19813 69313 7153 12120 10620 46424 -49272 -51107 -7927 105413 -71818
2688 -71818 -82288 68025 59537 -58804 2700 52303 11604 5546 21513 104753 -33315 -65173
2676 -65173 -122608 -175677 -240320 -102807 -31584 -52158 -82749 9436 106243 -43066 94651
2665 94651 68905 112786 103362 75819 44764 -86895 -52634 -35911 -44263 -101168 -147738 -141901
$$ packed form
2749i4486J12092n30p2295O7848j0292m2358Q47k4629J21368m6162l90n7865N8818
2736A1966m3788J9097M5408k0058J1612j03235M055M4721P3429j23242j1932O2791
2724b9176m2269J36105N1324k9344K2707n473p3666p8192m2850K4996N1391p8301
2712i2748M5554o9341J64231N8439j10017P1629j42046R454L1187Q4313L179J7024
2700G0858j09852N8807M9500o2160M967j500L5804r5696j835M3180J13340j77231
2688g1818j0470J50313q488j18341O1504M9603m0699o058J5967Q3240j38068l1858
2676f5173n7435n3069o4643J37513P1223k0574l0591R2185R6807j49309J37717
2665I4651k5746M3881r424k7543l1055j31659L4261J6723q352n6905m6570N837
$$ plain form
2653 -141901 -45875 -89284 -124661 -152723 -89041 25587 33636 -18119 34823 37834 -41320 4808
2641 4808 -117094 -101123 4479 -13166 -11796 77855 16133 -31602 59113 -72642 -127609 -130117
2629 -130117 -115025 -157262 -257559 -126293 -82247 52935 134119 172107 166155 93568 25068
2618 25068 50044 134441 102158 68516 66120 69428 -41376 -108017 -80669 -106199 -19916 41151
2606 41151 66423 66816 48256 -48231 -134526 -181943 -48668 3177 55912 13272 -10079 60877
2594 60877 62862 141925 4156 -15391 54986 -141168 -170076 -65995 -53194 29295 104948
2583 104948 50353 -58489 11735 12870 -12542 632 -125533 -222007 -211308 -23745 -15914
2572 -15914 10265 -11715 98 -65795 -154434 -48622 -28392 -76078 -35262 10418 106349 -29121
$$ packed form
2653a41901R6026m3409l5377k8062O3682J14628Q049n1755N2942L011p9154M6128
2641D808j21902J5971J05602j7645J370Q9651o1722m7735R0715j31755n4967k508
2629a30117J5092m2237j00297J31266M4046J35182Q1184L7988n952p2587o8500
2618B5068K4976Q4397l2283l3642k396L308j10804o6641K7348k5530Q6283O1067
2606D1151K5272L93j8560r6487q6295m7417J33275N1845N2735m2640k3351P0956
2594F0877J985P9063j37769j9547P0377j96154k8908J04081J2801Q2489P5653
2583A04948n4595j08842P0224J135k5412J3174j26165r6474J0699J87563P831
2572a5914K6179k1980J1813o5893q8639J05812K0230m7686M0816M5680R5931j35470
$$ plain form
2560 -29121 -146380 -51817 17289 62969 -56120 34550 90605 -40221 -71121 17100 -120712
2549 -120712 -61557 -36947 145943 27592 -6069 74696 -29209 -57710 -73696 -32514 -44485
2538 -44485 -42544 -17881 -139478 -151996 -202698 -74037 7614 -20590 19182 -69064 -1795 -105339
2526 -105339 -103462 -132733 -74262 584 -11527 -145510 -201279 -206941 -220482 -135691 -90664 -67111
2514 -67111 -15060 -87655 -88982 25629 55023 -40807 -21584 -3331 19200 127486 -22596
2503 -22596 -144399 -52561 132308 314993 239414 90265 123903 151567 14036 21786 48923
2492 48923 -28553 -18125 5288 -22384 -25518 120204 29900 -9973 -36164 7000 22315 -3071
2480 -3071 15772 -71999 -135969 -101435 -33707 -25092 -3061 -93891 -75710 -81317 -138728 -105998
$$ packed form
2560b9121j17259R4563O9106M5680j19089R0670N6055j30826l0900Q8221j37812
2549a20712N9155K4610J82890j18351l3661Q0765j03905k8501j5986M1182j1971
2538d4485J941K4663j21597j2518n0702J28661Q1651k8204L9772q8246O7269j03544
2526a05339J877k9271N8471P4846j2111j33983n5769n662j3541Q4791M5027K3553
2514f7111N2051p2595j327J14611K9394r5830J9223J8253K2531J08286j50082
2503b2596j21803R1838J84869J82685p5579j49149L3638K7664j37531P750K7137
2492D8923p7476J0428K3413k7672l134J45722r0304l9873k6191M3164J5315k5386
2480c071J8843q7771o3970L4534O7728Q615K2031r0830J8181n607n7411L2730
$$ plain form
2468 -105998 -148832 -118175 -78634 -29351 -23684 85480 52248 62602 2671 8309 -24090 -3569
2456 -3569 -53714 -114 32213 168180 287378 71555 -125512 -32733 2119 -132303 -47194
2445 -47194 -41061 -123327 -216675 -166934 -22493 43764 -44046 -77721 -166616 -79861 -75861 -160985
2433 -160985 20812 35122 -115638 -10410 -33509 57932 79330 21380 -96811 45138 260084
2422 260084 270858 88342 9998 25918 -104441 5376 32273 -54258 -180421 -25171 14289
2411 14289 -111779 -102744 -57316 -6987 47136 37064 7415 -16200 -76071 -49081 106013 19622
2399 19622 25791 -78725 -129513 -54800 -102314 -72131 -139891 -106592 -68155 -49597 -148134 20855
2387 20855 30236 22667 67217 -58575 22002 120283 13505 -46405 -56910 12649 70482 62656
$$ packed form
2468a05998m2834L0657L9541M9283N667J09164l3232J0354n9931N638l2399K0521
2456c569n0145N3600L2327J35967J19198k15823j97067R2779L4852j34422Q5109
2445d7194O133q2266r3348M9741J44441O6257q7810l3675q8895Q6755M000q5124
2433a60985J81797J4310j50760J05228k3099R1441K1398n7950j18191J41949K14946
2422B60084J0774j82516p8344J5920j30359J09817K6897q6531j26163J55250L9460
2411A4289j26068R035M5428N0329N4123j0072k9649k3615n9871K6990J55094q6391
2399A9622O169j04516n0788P4713m7514L0183o7760L3299L8437J8558r8537J68989
2387B0855R381p569M4550j25792Q0577R8281j06778n9910j0505O9559N7833p826
$$ plain form
2375 62656 -93033 -32175 -53813 -12199 40021 -127675 -122160 -30615 -91899 -145831 -68917 -21374
2363 -21374 109418 23572 -27643 18491 -79858 30471 192 -37690 -103519 -51328 24752
$$ packed form
2375F2656j55689O0858k1638M1614N2220j67696N515R1545o1284n3932P6914M7543
2363b1374J30792q5846n1215M6134r8349J10329l0279l7882o5829N2191P6080
$$ [...]
##END NTUPLES=NMR SPECTRUM
##END=
