##TITLE=1H_EC-3342
 200.13MHz, CDCl3,
 8 sc
 
 31.1.2025
##JCAMPDX= 6.0         $$ Bruker NMR JCAMP-DX V2.0
##DATA TYPE= NMR SPECTRUM
##DATA CLASS= NTUPLES
##ORIGIN= UXNMR, Bruker Analytische Messtechnik GmbH
##OWNER= pz
$$ XWIN-NMR		Version 3.5
$$ Fri Jan 31 13:49:09 2025 Russian Standard Time (UT+4h)  she@DPX200
##.OBSERVE FREQUENCY= 200.1313
##.OBSERVE NUCLEUS= ^1H
##.ACQUISITION MODE= SIMULTANEOUS
##.ACQUISITION SCHEME= undefined
##.AVERAGES= 8
##.DIGITISER RES= 18
##SPECTROMETER/DATA SYSTEM= spect
##.PULSE SEQUENCE= zg30
##.SOLVENT NAME= D2O
##.SHIFT REFERENCE= (INTERNAL, D2O, 0, 15.521)
##AUDIT TRAIL= $$ (NUMBER, WHEN, WHO, WHERE, WHAT)
$$ ##TITLE= Audit trail, XWIN-NMR		Version 3.5
$$ ##JCAMPDX= 5.01
$$ ##ORIGIN= Bruker BioSpin GmbH
$$ ##OWNER= she
$$ F:/spectra/data/she/nmr/H-C/1/pdata/1/auditp.txt
$$ ##AUDIT TRAIL=  $$ (NUMBER, WHEN, WHO, WHERE, WHAT)
(   1,<2025-01-31 13:47:56.21 +0400>,<she>,<DPX200>,
      <created by zg, POWCHK disabled, PULCHK disabled
       configuration hash MD5:
       00 E9 B6 7A A2 85 ED C7 34 08 36 98 17 FE 4E 26
       data hash MD5: 16K
       A4 44 1E 63 DD 11 19 78 99 DB 23 13 C0 B8 C3 A9>)
(   2,<2025-01-31 13:48:01.04 +0400>,<she>,<DPX200>,
      <Start of raw data processing
       efp BC_mod = 2 LB = 0.25 FT_mod = 6 PKNL = 1 PHC0 = 245.3673 PHC1 = 20.39223 SI = 16K 
       data hash MD5: 16K
       1D 86 2A 97 A8 87 CB 35 3D 6C 9D 5E B6 EA 51 2D>)
(   3,<2025-01-31 13:48:21.39 +0400>,<she>,<DPX200>,
      <pk PHC0 = -9.354441 PHC1 = 11.4 
       data hash MD5: 16K
       29 94 66 2E 00 10 3A CF AC E3 D8 E0 F0 11 DE 08>)
(   4,<2025-01-31 13:48:25.04 +0400>,<she>,<DPX200>,
      <abs ABSG = 5 
       data hash MD5: 16K
       8A 64 5F 28 3B B3 08 DE 59 7C 41 77 E2 F8 2E 63>)
$$ ##END=
$$ 
$$ hash MD5
$$ DF 74 98 BF 26 43 3A CE EA 9A 46 47 A5 43 B9 22
##$RELAX= 
##$RELAX= 
##$RELAX= 
##$RELAX= 
##$RELAX= 
##$RELAX= 
$$ Bruker specific parameters
$$ --------------------------
##$DU= <F:/spectra>
##$EXPNO= 1
##$NAME= <H-C>
##$PROCNO= 1
##$TYPE= <nmr>
##$USER= <she>
##$AMP= (0..31)
100 100 100 100 100 100 100 100 100 100 100 100 100 100 100 100 100 100 
100 100 100 100 100 100 100 100 100 100 100 100 100 100 
##$AQSEQ= 0
##$AQ_mod= 1
##$AUNM= <au_zg>
##$AUTOPOS= <>
##$BF1= 200.13
##$BF2= 200.13
##$BF3= 200.13
##$BF4= 200.13
##$BF5= 200.13
##$BF6= 200.13
##$BF7= 200.13
##$BF8= 200.13
##$BYTORDA= 1
##$CFDGTYP= 0
##$CFRGTYP= 5
##$CHEMSTR= <none>
##$CNST= (0..31)
1 1 145 1 1 1 1 1 1 1 1 1 1 1 1 1 1 1 1 1 1 1 1 1 1 1 1 1 1 1 1 1 
##$CPDPRG= <>
##$CPDPRG1= <>
##$CPDPRG2= <>
##$CPDPRG3= <>
##$CPDPRG4= <mlev>
##$CPDPRG5= <mlev>
##$CPDPRG6= <mlev>
##$CPDPRG7= <mlev>
##$CPDPRG8= <mlev>
##$CPDPRGB= <>
##$CPDPRGT= <>
##$D= (0..31)
0 0.7 0 0 0 0 0 0 0 0 0 0.03 0 0 0 0 0 0 0 0 0 0 0 0 0 0 0 0 0 0 0 0 
##$DATE= 1738316875
##$DBL= (0..7)
120 120 120 120 120 120 120 120 
##$DBP= (0..7)
150 150 150 150 150 150 150 150 
##$DBP07= 0
##$DBPNAM0= <>
##$DBPNAM1= <>
##$DBPNAM2= <>
##$DBPNAM3= <>
##$DBPNAM4= <>
##$DBPNAM5= <>
$$ [...]
##$SUBNAM3= <"">
##$SUBNAM4= <"">
##$SUBNAM5= <"">
##$SUBNAM6= <"">
##$SUBNAM7= <"">
##$SUBNAM8= <"">
##$SUBNAM9= <"">
##$SW= 18.0517328524113
##$SWIBOX= (0..15)
0 0 2 0 0 0 0 0 0 0 0 0 0 0 0 0 
##$SW_h= 3612.71676300578
##$TD= 16384
##$TD0= 1
##$TE= 0
##$TE2= 300
##$TE3= 300
##$TEG= 300
##$TL= (0..7)
0 120 120 120 120 120 120 120 
##$TP= (0..7)
150 150 150 150 150 150 150 150 
##$TP07= 0
##$TPNAME0= <>
##$TPNAME1= <>
##$TPNAME2= <>
##$TPNAME3= <>
##$TPNAME4= <>
##$TPNAME5= <>
##$TPNAME6= <>
##$TPNAME7= <>
##$TPOAL= (0..7)
0.5 0.5 0.5 0.5 0.5 0.5 0.5 0.5 
##$TPOFFS= (0..7)
0 0 0 0 0 0 0 0 
##$TUNHIN= 0
##$TUNHOUT= 0
##$TUNXOUT= 0
##$USERA1= <user>
##$USERA2= <user>
##$USERA3= <user>
##$USERA4= <user>
##$USERA5= <user>
##$V9= 5
##$VALIST= <valist>
##$VCLIST= <CCCCCCCCCCCCCCC>
##$VD= 0
##$VDLIST= <DDDDDDDDDDDDDDD>
##$VPLIST= <PPPPPPPPPPPPPPP>
##$VTLIST= <TTTTTTTTTTTTTTT>
##$WBST= 1024
##$WBSW= 4
##$XGAIN= (0..3)
0 0 0 0 
##$XL= 0
##$YL= 0
##$YMAX_a= 569107
##$YMIN_a= -795561
##$ZGOPTNS= <>
##$ZL1= 120
##$ZL2= 120
##$ZL3= 120
##$ZL4= 120
##$ABSF1= 15.48797
##$ABSF2= -2.563879
##$ABSG= 5
##$ABSL= 3
##$ALPHA= 0
##$AQORDER= 0
##$ASSFAC= 0
##$ASSFACI= 0
##$ASSFACX= 0
##$ASSWID= 0
##$AUNMP= <proc_1d>
##$AZFE= 0.1
##$AZFW= 0.1
##$BCFW= 0
##$BC_mod= 2
##$BYTORDP= 0
##$COROFFS= 0
##$CY= -3
##$DATMOD= 1
##$DC= 0
##$DFILT= <>
##$DTYPP= 0
##$F1P= 0
##$F2P= 0
##$FCOR= 1
##$FTSIZE= 16384
##$FT_mod= 6
##$GAMMA= 0
##$GB= 0
##$INTBC= 1
##$INTSCL= 3.241238e-09
##$ISEN= 128
##$LB= 0.25
##$LEV0= 0
##$LPBIN= 0
##$MAXI= 10000
##$MC2= 0
##$MEAN= 0
##$ME_mod= 0
##$MI= 1.114404
##$NCOEF= 0
##$NC_proc= -4
##$NLEV= 6
##$NOISF1= 3.799351
##$NOISF2= 2.8
##$NSP= 0
##$NTH_PI= 0
##$NZP= 0
##$OFFSET= 15.52102
##$PC= 1
##$PHC0= 236.0128
##$PHC1= 31.79223
##$PH_mod= 1
##$PKNL= yes
##$PPARMOD= 0
##$PSCAL= 0
##$PSIGN= 0
##$REVERSE= no
##$SF= 200.130000136383
##$SI= 16384
##$SIGF1= 3
##$SIGF2= 2
##$SINO= 0.751879
##$SIOLD= 32768
##$SREGLST= <19F.Aceton>
##$SSB= 0
##$STSI= 16384
##$STSR= 0
##$SW_p= 3612.71676300578
##$SYMM= 0
##$S_DEV= 0
##$TDeff= 16384
##$TDoff= 0
##$TI= <>
##$TILT= no
##$TM1= 0
##$TM2= 0
##$TOPLEV= 0
##$USERP1= <user>
##$USERP2= <user>
##$USERP3= <user>
##$USERP4= <user>
##$USERP5= <user>
##$WDW= 1
##$XDIM= 16384
##$YMAX_p= 385463189
##$YMIN_p= -79866
$$ End of Bruker specific parameters
$$ ---------------------------------
##NTUPLES= NMR SPECTRUM
##VAR_NAME=  FREQUENCY,     SPECTRUM/REAL,   SPECTRUM/IMAG
##SYMBOL=    X,             R,               I
##VAR_TYPE=  INDEPENDENT,   DEPENDENT,       DEPENDENT
##VAR_FORM=  AFFN,          ASDF,            ASDF
##VAR_DIM=   16384,         16384,           16384
##UNITS=     HZ,            ARBITRARY UNITS, ARBITRARY UNITS
##FACTOR=    0.220516191357247, 1,           1
##FIRST=     3106.22172183001, 0,            0
##LAST=      -506.495041175766, 0,           0
##MIN=       -506.495041175766, -79866,      0
##MAX=       3106.22172183001, 385463189,    0
$$ Real data points
##PAGE= N=1
##DATA TABLE= (X++(R..R)), XYDATA
$$ [...]
11025 -32579 -8933 -3762 -28132 -41479 -60675 -32373 -33418 -35949 -2890 -18143 -46203 -48823
11013 -48823 -20204 2169 5210 -3915 110 -11144 -10376 -3347 1511 8854 3746 -9466 -13925 -17008
10999 -17008 -19251 19052 17883 -2810 5641 14076 20928 2184 12878 34394 6398 8127 2595
10986 2595 20068 -868 -27342 -34720 9072 15056 -34965 -41282 -48755 -29331 -37283 -42235 -12701
10973 -12701 26470 7992 -28360 -27695 -22470 -1670 12180 5761 -12317 -16734 -30472 -34946 -35224
10960 -35224 -41326 -32837 -52076 -21579 -4350 -7481 1117 -15081 14205 20511 7487 13935 -30614
10947 -30614 -30177 -12632 16122 9872 7549 -16910 -10161 -12462 -4303 -17426 -28562 -7623 -11502
10934 -11502 -11334 -4567 -7417 -37171 -20204 -15791 22943 36776 100 -41892 -60210 -28734 -17732
10921 -17732 -50460 -30770 -24660 30306 54366 18038 10995 16109 -15360 -14282 -2977 -38981
10909 -38981 -37638 10985 2891 -13712 -24458 -22589 -2151 -25233 -47219 -12200 6465 9261
10897 9261 -36837 -18882 -5410 -43129 -20880 -6228 -12631 -16533 -22417 -16963 -13196 -13344 2918
10884 2918 -9196 -5925 -29004 -39586 -34890 -20727 -45599 -37509 -37794 -7059 -910 -14184 -35671
10871 -35671 -17259 -35744 -47454 -24235 -26079 -32488 -27806 -50625 -59272 -34811 -19375 -36258
10859 -36258 -46652 -61078 -60418 -42028 -8109 819 -11698 -23035 -12328 -13097 -3162 -10697 -5700
10846 -5700 -10843 -32554 -31952 -45808 -31517 -16158 -8675 -12504 -36543 -48824 -35472 -24635 -29350
10833 -29350 -21656 -18099 -35406 -27278 -30842 -50447 -46881 -853 -15920 -25865 -16293 12999 20960
10820 20960 -2088 11704 17793 -7951 448 -9683 -13758 -5058 -23612 -56528 -39013 -36780 -49784
10807 -49784 -37748 -54328 -21426 16531 -2385 -32983 -56993 -68148 -37829 4181 -3565 -14094
10795 -14094 -32502 -8378 2406 -21084 -46874 -322 -39517 -44759 -10537 -4171 -15702 8898
10783 8898 -9624 19522 28456 -25487 -10160 -8011 -26902 -39502 -38118 -34190 -42491 -38840 -55452
10770 -55452 -70000 -35760 -8755 -22240 -32844 -28365 -38467 -6621 3649 -23718 -21130 6978
10758 6978 655 -15004 -21771 -19094 -21852 -41673 -3574 2460 -21781 -18971 -32922 -14195 -21063
10745 -21063 -24952 -39606 -33209 -45433 -9747 30623 -12290 -35777 -33382 -41695 -44777 -53297 -22319
10732 -22319 -31495 -27587 -21926 -43190 -31068 -27709 -40870 -11748 -9494 -17283 -12303 -13929 -18310
10719 -18310 -1571 -2276 -697 4938 -2352 -14570 -27980 -23269 -62918 -47993 -16745 -13549 -10705
10706 -10705 16950 -7448 -17616 -21537 -42030 -33845 -43133 -30391 -18350 -29289 -26534 -27443 -34799
10693 -34799 -37687 -42995 -26384 -30257 -18748 -30139 -21144 -31393 -13416 2174 -6228 -22239 6508
10680 6508 -17753 -5600 18682 -2155 -21436 -12566 -4278 -56115 -52858 -32865 -39889 -56152 -54938
10667 -54938 -30995 -27035 -8180 -8682 -38384 -51500 -71634 -66734 -65628 -47011 -34791 -10494 8565
10654 8565 -10919 -20698 -2284 -3593 -12122 -24011 -33815 -28611 -5193 -35401 -42927 -56476 -30488
10641 -30488 -26813 -16066 22292 32701 19600 -23766 -27279 -40088 -55660 -36305 -53686 -39018
10629 -39018 -21463 -24913 -47179 -28763 -12398 -29400 -32600 -52281 -18165 -32512 -20035 -32596
10617 -32596 -62438 -32968 -12776 6633 12267 -4372 -13528 -21654 -26186 -16839 -48400 -64839 -53438
10604 -53438 -40877 -26093 -33309 -36318 -56022 -68134 -35056 -14335 -8200 -14944 -28719 -30121 -10146
10591 -10146 -38948 -47864 -23719 -34186 -37935 -9915 -17377 -33814 -29667 -17551 2085 -5682 -2381
10578 -2381 -9899 -18446 -23594 -37086 -46643 -39634 -25981 -24058 -25811 -35498 -35576 12927 15391 -27461
10564 -27461 -22355 4173 -12621 -19232 -12044 -41342 -39140 -31330 -245 13675 -5663 -24846 -28076
10551 -28076 -33713 -37283 -15146 -27208 -25296 -57932 -42194 -4730 -12184 -7266 -32714 -16045 -16694
10538 -16694 5355 15729 -9347 -11137 9136 -11011 -22936 -32264 -18041 -30994 -26616 14329
10526 14329 -1901 -16595 -34953 -38018 -56461 -5260 -12514 -10343 -23772 -17336 -31249 -36039 -33329
10513 -33329 -29769 -14804 -12986 -37350 -33865 -48944 -46021 -29773 -64618 -39995 -22178 -15399 -17281
10500 -17281 -9342 -22269 -14128 7748 20326 212 -3012 -13056 -20382 -6915 -28967 -37439 -49185
10487 -49185 -48168 -15438 -158 -7558 -36506 -43772 -18940 -20706 -38990 -66306 -60341 -42923 -40154
10474 -40154 -39548 -58090 555 11520 14616 -43163 -66007 -63901 -56107 -32709 -25443 7105 -2593
10461 -2593 -38500 -13632 4868 6543 -6845 -13723 8667 -14591 -27848 -23642 3311 -12576
10449 -12576 -41906 -26076 -35943 -41421 -31238 -13570 -14716 -21586 -46660 -32423 -24506 -22803 -3648
10436 -3648 -22456 -35140 -32724 5824 5674 8966 17972 22264 -10159 -10651 -31337 -31261 -15800 -30607
10422 -30607 -11577 8349 -12539 -39823 -26959 -11030 -40977 -34528 -50587 -40500 -33950 -31782
10410 -31782 -31637 -15129 -23762 -33877 -17717 -35027 -30058 -20575 -28233 -13172 4525 -15566 -52460
10397 -52460 -22802 21152 14856 -1623 8175 21069 2926 -22875 -23151 1089 -2322 -12513 -23339
10384 -23339 -37104 -49082 -34250 -16638 -5783 8674 -14544 -21233 -28462 -29165 -39604 -34307 -39309
10371 -39309 -35061 -35233 -20653 -15239 -39699 -28541 -33325 -18946 -9500 -14178 -8914 -8676 -47022 7233
10357 7233 23465 1101 -31972 -40162 -21537 -32446 -35654 -8825 -29644 -49374 -1210 380
10345 380 -4261 -2392 -20937 -21825 -23952 -26593 -43353 -38284 -53163 -57590 -29038 -18865 -47454 -52389
10331 -52389 -55030 -9019 -15634 -42791 -33723 4129 -9922 -38106 -15402 4242 7619 -12827
10319 -12827 13079 10351 -22529 -37100 -38382 -41487 -24623 3585 -27005 -45137 -33452 -38149
10307 -38149 -39022 -56271 -52797 -53206 -63608 -61067 -40256 -27520 -55447 -67105 -78275 -44266 -8629
10294 -8629 -22722 -15412 6735 6630 -25606 -28276 -2556 -31534 -28001 -26764 -38647 -33052 -22070
10281 -22070 -12305 -3865 -5926 -4489 -19171 -15062 -701 -5245 2958 -13077 -20811 -28951 -29061 -22218
10267 -22218 -35055 -43359 -11125 -13803 -11614 -32481 -13802 -8117 -36901 -55876 -25065 -18497 -8417
10254 -8417 9155 -4229 1174 12440 -12568 -12984 -13262 14146 37479 50332 21972 -19213 -14423
10241 -14423 8665 45484 28562 -11653 -35282 -39254 -41230 -23794 10396 -4129 -18021 -10660
10229 -10660 -27759 -56196 -35993 -4504 -8586 -36026 -13730 -40400 -24111 -15750 -23774 -35152
10217 -35152 -16699 -28671 -19013 -23355 -40353 -26803 -22327 -23002 -29096 8266 -13207 -41333 -23779
10204 -23779 12138 26544 24431 11435 18658 11838 4332 -8625 22486 17270 11867 11231 -19970
10191 -19970 -26600 3974 -28479 2271 23505 -16868 -20009 14862 17553 9669 -9950 -24351
10179 -24351 -49284 -30513 -14204 -6116 -20860 5623 24921 10257 12083 -3278 4684 7078
10167 7078 -17694 -19603 -5817 -12986 -21274 -12585 27954 30912 -5449 -23030 -23752 2094 -19238
10154 -19238 -208 47580 30881 18501 -8823 -5625 -9147 -9821 28857 10449 -8480 -23469
10142 -23469 -48623 -31027 -22965 -47128 -36879 -6914 -18619 1307 -25221 -34089 -31199 -55278
10130 -55278 -35223 4872 -18663 -11669 14267 2654 2671 -45505 -36706 -44147 -70561 -49976 -6404
10117 -6404 1673 18825 50183 -9053 2373 -12601 4216 7933 6701 -5405 -45040 -48672 -51860
10104 -51860 -63795 -33798 -13731 -54536 -50493 -42177 -14434 3397 -38351 -42757 -5955 -1327
10092 -1327 18148 -22301 -22699 -26866 -13692 3340 13804 76 -9870 308 -16150 7980 -26791
10079 -26791 -16870 1431 -3241 7048 7366 -12818 -12452 1551 -5512 -11585 -29561 -36097 -17810
10066 -17810 20312 16422 -4919 -5171 5904 -27507 -36297 -21285 -20095 -9844 11387 12526 14786
10053 14786 7208 22420 26245 20956 34375 32935 37339 -15161 -15046 -30043 -2958 3348 -9894
10040 -9894 807 2632 18693 7866 14281 29079 -6300 -46884 -13423 -4045 -42770 -40226 -14403
10027 -14403 -41779 -33267 -22847 -24775 9090 -21090 -22039 -8985 -2665 6434 17746 11041 -9987
10014 -9987 -13172 -15841 -41503 -44457 -19261 -5406 -5601 23636 8336 -20847 -14351 -19026 -2640
10001 -2640 -24736 -10482 1764 6007 17483 2982 -4805 -7009 -220 4552 6588 -8350 -28397
9988 -28397 3273 33459 9610 -20058 -8000 3462 -9570 -17172 -33574 -53855 -34955 -6596
9976 -6596 -20896 -28282 -16077 -11813 1018 -34312 -20813 6274 -17848 -6784 -29231 -32102 -24302
9963 -24302 -32704 -40256 -7496 12477 -12289 -17648 -32496 -4689 9618 -18458 -30603 -43517
9951 -43517 -38592 -11958 13414 -681 -14837 -7120 -3562 -33196 -38320 -9944 7696 10038 -470
9938 -470 -1525 11190 -24957 -11371 -5383 -24658 4793 29434 13650 -2201 -19546 -24273 -20585
9925 -20585 -40232 -23570 24536 60072 35867 14137 2178 3661 -3565 1024 -17123 -4617
9913 -4617 -22760 -11593 -3815 -17213 -9059 -3541 -23057 -9832 -32267 -32202 -29323 -26904 -31657 -28680
9899 -28680 12697 -17149 -39068 -33316 -30899 -36610 -28602 -5512 712 -6560 3111 -26464 -10174
9886 -10174 -16971 -31555 -4912 -3996 -256 6260 5646 -38534 -4629 -3608 -2571 -11821 -39502 -3898
9872 -3898 1190 -15439 -25953 -12847 469 -9189 -6187 -18264 -18344 -11129 -7119 11329 -7532 -28164
9858 -28164 -5410 21852 27631 6628 -11808 17727 13687 18713 5127 -4310 -20729 -15858 -37375
9845 -37375 -35898 -20257 -1340 -22597 -23080 9041 11511 -18767 -25547 -8229 -12401 -16549 24471
9832 24471 -17200 -10883 -3410 -137 3135 -12889 -16425 -51191 -21967 -11289 20065 20174 -10368
9819 -10368 17583 30810 16210 11336 -4572 25202 45328 32176 42569 39027 -7886 18358
9807 18358 27045 798 -20868 -7831 -19032 -20904 -18468 7435 -18146 -28295 -11740 -17191 16193
9794 16193 43146 33647 -3710 -9874 5315 27936 40093 14084 -739 2392 -29516 27567
9782 27567 16742 -9650 -9792 6469 37110 38214 42795 26179 24115 34179 32727 12235 24596
9769 24596 27612 14190 40032 -616 -10956 -19272 -6245 13178 17298 18635 22953 4210 -9607
9756 -9607 -1815 8382 -10558 -29633 -17571 -14012 -1457 12964 31522 20315 -947 -17395
9744 -17395 -9067 -6398 36278 37039 5132 15511 1852 -15392 14709 8288 26549 28427 2828
9731 2828 9697 15023 12609 -19199 -20669 16020 -3681 12721 9738 8221 -4044 2495 45514
9718 45514 36203 -10466 957 18402 33518 32731 -5710 7209 22225 8129 -5519 14746
9706 14746 26351 -3456 -6837 -3750 -3693 12636 -4929 -4045 -2706 5072 41395 48479 47174 34362
9692 34362 28058 9532 -9104 17516 31170 10211 21530 4285 9553 24738 10038 20115
9680 20115 30308 15762 18696 29949 22106 48122 48256 30490 26945 28722 45491 72288 62378
9667 62378 61118 72987 57742 57837 75315 48344 61284 57594 48396 45674 61637 81802 55773
9654 55773 72094 49118 57619 109025 126115 136807 145439 134984 125241 147653 133850 138126 114146
9641 114146 86827 127997 129658 84205 94481 72324 64228 86304 75846 114092 100203 79228
9629 79228 67290 36239 40526 46256 66571 70906 74683 51726 74313 88354 92114 98384 74800
9616 74800 43831 37306 38559 65057 95441 100035 83671 63939 83634 66767 71831 72407 81792
9603 81792 104766 119070 99243 109582 116422 105499 105961 69852 80565 93371 101513 127991 122991
9590 122991 99925 106107 112002 97395 100505 101802 91025 114557 128408 115607 111832 104314 90416
9577 90416 99541 76389 93362 127519 129783 112497 111168 117415 112644 112144 117171 174416 111594
9564 111594 93311 147733 145096 134952 128922 118821 109708 71769 44471 85773 64676 79919
9552 79919 122249 129404 149486 110407 86601 112488 115555 84654 88543 66404 55401 75113
9540 75113 92121 89522 72024 87175 71882 59411 102490 106702 71373 67059 47984 57213 65018
9527 65018 68043 89621 74523 94524 92402 101457 109827 92093 74027 69792 85454 99901 75490
9514 75490 83462 92069 95540 94754 96482 132814 82136 99468 102716 93866 86510 101669 142321 112557
9500 112557 104533 119117 106118 99152 117612 144217 112863 108773 111513 114247 108856 107229 113666
9487 113666 107977 124897 148496 171737 184318 145581 130156 160891 153339 160617 150111 128883
9475 128883 118250 111821 128597 144727 117049 132145 144242 119417 118005 124003 99490 86542
9463 86542 85081 79443 77622 89110 131855 160947 134514 150274 130336 129767 138879 138945 162026 146152
9449 146152 82589 113198 90889 105138 145465 150300 152878 132545 127703 117506 142155 166610
9437 166610 170871 134759 119254 100023 117259 116804 94803 90617 92805 97069 117040 125787 128737
9424 128737 102592 87162 96340 58892 64063 81852 86844 75245 82662 88961 101670 116571 99106
9411 99106 69152 19882 49297 96285 64150 62713 102658 91334 89929 68917 104177 120743
9399 120743 94854 125183 138267 121079 153988 135750 117535 88065 104428 114036 118159 96593
9387 96593 98034 76073 82145 82586 59209 61588 50692 64027 92882 83763 83974 79862 83681 95049
9373 95049 83711 88424 88342 69909 76233 84560 82197 80730 78715 99155 103660 84392 79926 111575
9359 111575 87730 82101 65160 80425 94592 55697 82696 121381 117694 100478 73986 79387
9347 79387 86644 92417 98773 105985 74788 107526 111038 89446 74770 113262 121175 113063 121956
9334 121956 125399 124776 114856 115781 134421 106262 96516 136220 137477 148307 177362 203541 204306 156326
9320 156326 141152 146556 197051 191397 190085 193161 182691 224905 235750 211474 205333 229997 270022
9307 270022 307265 322621 300361 279819 303345 288666 305577 316627 293108 258802 227640 220365
9295 220365 254605 217589 212697 253449 243771 242019 244874 202865 175064 172788 187594 207084 213364
9282 213364 163605 180755 204665 213435 264245 265437 262860 248595 251424 228793 238768 258340 282644
9269 282644 331391 325090 327431 335750 318621 313481 336012 325292 325881 333611 341226 334240 296465
9256 296465 266867 253671 267407 232645 226066 217338 189972 201282 164147 179031 177908 163873
9244 163873 185424 172084 152691 154381 158062 125957 141217 169230 160853 139728 129153 133743
9232 133743 152959 141550 126813 134086 143084 171077 180892 150997 129455 128321 144595 161285
9220 161285 139630 153136 146807 168416 193126 162590 167824 177071 177974 159767 181464 193059 183512
9207 183512 171716 175580 189193 194347 215822 225300 228574 222906 237262 243011 226223 229194 261281
9194 261281 304759 291642 305470 294485 287061 305770 323178 366863 388443 418727 413392 436312
9182 436312 414218 385231 394020 348368 343813 308579 302749 333655 319421 298278 301343 327672
9170 327672 310015 332074 300993 308252 308618 292862 316965 307060 314972 315675 338226 327989 321237
9157 321237 346892 333174 335359 361119 364994 363763 332124 322416 310076 338849 388927 388390 426126
9144 426126 443233 451893 473799 517480 539043 512766 507664 497710 485094 458639 462975 459041 410398
9131 410398 389445 375623 346965 352370 378263 377267 358692 385014 425263 429313 391960 363141
9119 363141 347400 334192 383619 385976 349489 368028 384040 324102 336699 322389 317999 322630
9107 322630 326694 339635 305192 335877 343905 333659 327975 315438 347992 360850 349440 343311
9095 343311 348193 320052 304657 346833 330177 335518 312628 292053 268674 303305 354348 322993
9083 322993 306775 303205 309086 300478 312111 306738 305611 291947 287003 311997 295005 300023 294232
9070 294232 302058 313034 310354 301602 289595 295105 287566 317646 306157 295751 291248 294133 294526
9057 294526 282959 279122 287159 286670 294525 266279 241469 275403 269160 282517 275505 257857 263849
9044 263849 262025 292066 314758 303934 306653 279612 284886 288568 309673 300046 292347 300545 289653
9031 289653 293243 254481 248584 252754 264814 286304 279802 299213 281063 280225 283216 310539 293080
9018 293080 298258 324274 350663 356545 351753 333515 335872 331811 352538 341859 327314 336960 340253
9005 340253 329356 311120 331814 334317 351125 353138 353241 326977 342716 344798 364590 355053 360425
8992 360425 335460 336701 382365 411939 425334 431111 453569 428693 417325 440295 471646 500532
8980 500532 515000 532647 532858 534186 566350 596266 594227 604948 622103 665011 689494 675178
8968 675178 667819 684756 726488 775329 822526 869344 867542 897002 945382 963771 1022836 1102293
8956 1102293 1150605 1234722 1318170 1378561 1440130 1491335 1502561 1521757 1596003 1654416 1720315
8945 1720315 1847920 1977744 2031448 2135363 2237594 2359156 2494757 2646428 2818403 3024368
8935 3024368 3299367 3571239 3885187 4219413 4641736 5148008 5699399 6381501 7178945 8011671
8925 8011671 8848966 9601927 10022676 9885589 9238498 8212669 7045466 6018178 5126709
8916 5126709 4438917 3821061 3334588 2938147 2581015 2325834 2093507 1914347 1717410 1579891
8906 1579891 1449869 1346600 1233354 1184258 1091722 1019906 984506 916143 847230 785168 732885
8895 732885 755564 706921 662670 627936 584961 571440 550959 538706 495861 483748 488035 465340
8883 465340 419139 434728 384031 363891 380530 348874 346794 355549 380878 369856 330699 338480
8871 338480 343962 326480 316091 313634 304049 306751 299983 333457 357196 325607 289325 266637 279897
8858 279897 273885 232839 251512 261281 279445 253767 255811 253619 253444 234109 228075 257356 246658
8845 246658 225537 246728 278870 279380 232558 254526 277089 276989 264375 256414 253319 258282 276199
8832 276199 284951 295333 289846 266483 274647 281728 275973 275214 307071 294383 306835 323212 338340
8819 338340 346149 340725 327571 308333 348850 364695 361213 330772 321820 328603 331772 318878 322219
8806 322219 311717 293519 288549 298722 314114 287529 296192 309676 298476 306012 293447 297699
8794 297699 285681 311541 323061 333870 298122 279399 291073 328131 351328 354907 331941 350652
8782 350652 410238 434391 440446 406038 423290 425463 465790 481926 473068 486696 478659 476630 479178
8769 479178 482166 472781 478258 498880 497716 476779 456121 484449 527195 480248 462715 476093
8757 476093 467766 453242 454186 450299 456498 438780 422468 414957 414934 428462 433325 450965 440998 407556
8743 407556 378959 330347 350257 327389 316060 351563 342070 332870 359190 366381 332117 315344
8731 315344 311602 297297 287572 281477 298395 290967 280038 265481 306150 326106 326253 317361 312920
8718 312920 319433 313951 332956 317550 292351 268116 272360 279198 285063 284100 280592 299561 280369
8705 280369 286664 300844 283480 288058 281906 290384 282318 266009 268312 266348 288390 301505 260931
8692 260931 243063 254292 280663 269808 273880 275708 283041 285687 285308 259404 263168 281660 278774
8679 278774 280002 295799 292571 303032 281847 264999 291556 292402 268408 281039 282479 319586 293276
8666 293276 259893 277195 268883 264667 270755 284242 319689 324609 306535 297958 335745 399572 361668
8653 361668 352847 358320 344736 339510 310446 299970 335392 322911 347199 345541 341746 347688 374489
8640 374489 376001 362947 353338 338851 378444 389490 393389 391205 375826 374308 380719 435542 431610
8627 431610 370149 390419 397303 421207 417052 381727 396815 419204 384738 353894 355583 359805
8615 359805 360470 400399 409982 449837 407716 378359 367010 362155 371686 359895 362264 376092 381913
8602 381913 370782 342151 346280 395290 386912 394681 393708 425116 415982 436482 414914 391385 362634
8589 362634 372643 418285 422809 405012 375679 365014 373105 389961 378666 375681 367717 379759
8577 379759 352023 311382 318956 327280 328460 303532 290765 288348 310726 349302 363229 388223
8565 388223 387256 369427 374878 389596 387008 372821 400261 410491 423190 405062 424367 443543
8553 443543 422697 429992 442128 437624 458011 504194 489799 491609 497571 520118 520880 521159 548410
8540 548410 569574 564602 536178 556329 586095 587440 582113 578951 589468 584625 594167 612341 583203
8527 583203 561448 574124 553321 563871 614828 598339 624421 637832 644011 686514 705824 757128
8515 757128 769990 761931 798936 800774 786518 773579 792404 819759 837093 861599 836329 832877
8503 832877 881818 833568 831269 867996 903972 877801 873781 884526 863441 850299 823897 792397
8491 792397 806757 809645 768749 737729 742916 788275 737053 746320 733289 734855 745259 755199 771401
8478 771401 775133 814881 807958 812347 837872 842425 832021 808273 777455 795086 783669 819051
8466 819051 831235 834827 843601 822857 857642 870027 845945 826208 830082 821532 804853 835461
8454 835461 843855 841882 862376 826593 806960 794177 769891 743503 744754 758414 721956 682689
8442 682689 707648 708667 695816 682375 704168 699489 682735 645019 666296 652515 639626 642871
8430 642871 700215 697296 659397 668910 662038 660705 685442 699170 705324 693324 671739 696898 737215
8417 737215 736662 718133 700915 695967 738991 732595 719322 718310 731952 725812 707750 730136 723707
8404 723707 728443 744381 728223 753222 746257 720295 693811 707583 734720 715407 709624 747553
8392 747553 763960 773257 749514 757414 755471 768293 763061 780973 773909 785720 786916 784354 791786
8379 791786 769033 772603 807307 797718 817720 863609 828927 853139 862629 869104 867012 853277 903582
8366 903582 919348 908310 957931 1025934 1048524 1047899 1051127 1062932 1109862 1091475 1113338 1150667
8354 1150667 1214567 1267323 1311294 1350733 1366241 1362390 1374992 1413189 1404696 1462007 1473603 1432678
8342 1432678 1397238 1416653 1432087 1416713 1394213 1365106 1346971 1338966 1321427 1310510 1278642 1254243
8330 1254243 1232045 1203426 1195284 1191978 1179317 1149830 1165244 1168208 1173115 1192466 1173746 1176982
8318 1176982 1180821 1158040 1164989 1180415 1204180 1219805 1221207 1257606 1304052 1290155 1298071 1333296
8306 1333296 1353007 1403418 1385688 1383603 1408007 1401053 1409993 1451110 1445755 1498247 1535413 1519354
8294 1519354 1524608 1536950 1562558 1512096 1514288 1485291 1474625 1462369 1416183 1425248 1401934 1350052
8282 1350052 1323764 1301612 1295132 1279564 1275509 1269067 1264271 1253258 1225867 1214723 1205237 1218165
8270 1218165 1201866 1189913 1209237 1189955 1215620 1198036 1210605 1236881 1246303 1284576 1312245 1353488
8258 1353488 1372386 1375059 1430441 1453108 1462826 1509233 1545808 1580953 1600675 1653634 1698044 1713311
8246 1713311 1701368 1735216 1811605 1865724 1885829 1899009 1916523 1908304 1904764 1904605 1841054 1800757
8234 1800757 1752278 1730778 1688744 1637272 1568875 1525531 1489221 1442662 1401957 1386838 1384734 1323978
8222 1323978 1273230 1234371 1232683 1198084 1159641 1126845 1105863 1103476 1105173 1086645 1078748 1081776
8210 1081776 1103020 1100270 1087220 1056703 1047555 1058383 1065281 1043094 1050849 1017191 1003303 957105
8198 957105 959648 959741 967580 964062 925803 766704 687613 939954 985811 1004105 970706 948546
8186 948546 890410 908535 908903 902692 895180 881162 849142 871600 876066 859056 861027 828567 847570
8173 847570 846652 840823 811717 794000 767129 784107 810796 803929 826723 813895 784440 820953
8161 820953 800562 793342 777308 801515 799940 780988 742429 743597 774870 793045 783915 790978 773655
8148 773655 765963 766784 741979 742104 742659 756278 750760 749560 761842 772439 768279 757718 744229 750071
8134 750071 744550 734946 793508 808195 831470 817576 811390 810142 763034 752080 734865 721135
8122 721135 746544 755502 745179 699429 659085 672648 644568 654127 628429 592828 563420 587947
8110 587947 592629 568719 552861 531929 500761 492642 479008 501756 514476 505487 514955 491718
8098 491718 490215 462955 433972 425905 443471 447745 446520 462933 453527 416378 405379 416736 442740
8085 442740 415550 425825 414279 400164 373125 369676 356768 375076 364313 344693 386601 385664
8073 385664 362270 355475 333490 321521 339625 319907 319277 342542 339037 323530 336129 342566 338898
8060 338898 317377 325052 326315 311260 308586 293143 312810 302159 325408 326890 318834 290197 282412
8047 282412 286931 307937 309427 286972 287368 284951 315955 288086 245714 271717 282021 255454 259267
8034 259267 212347 221563 227439 267428 250933 238469 196891 228600 191014 202601 231904 214409
8022 214409 229623 249787 241702 201285 227251 230071 246077 270232 232635 222387 256337 249223
8010 249223 204978 187213 179284 205825 222543 214673 226986 213434 209323 218035 227968 240662 240586
7997 240586 211757 194842 229550 231982 240034 223623 245423 243559 215746 203005 228882 246984
7985 246984 245079 246775 228689 240797 226738 261716 232754 213644 198467 193122 204688 193615
7973 193615 191288 201313 200613 208879 201222 213000 188844 172532 147810 173238 183238 172454 186572
7960 186572 162248 132435 133903 131132 114765 137870 155250 137883 141390 138230 124510 131401 139187
7947 139187 133625 101851 129128 141402 139513 145641 122284 137211 154365 178365 135444 92369
7935 92369 91937 144104 131472 85048 75066 86984 120057 134264 88042 89060 104725 77950 72525
7922 72525 93889 104342 121034 132228 121946 108716 92981 112281 121757 121188 142120 129146
7910 129146 102968 77888 106038 111201 83943 94290 102982 128119 95205 83328 90350 93756
7898 93756 102607 115676 98079 85948 128669 129388 140721 140636 108736 100140 109439 94126 75187
7885 75187 125431 102151 82592 88256 77404 75477 52417 74958 84256 95141 107282 106821 101883
7872 101883 78817 70902 69467 55146 58811 60115 82675 93769 75978 87141 89463 76045 83227
7859 83227 90896 92560 110646 85769 103764 77130 71086 95152 79438 63803 64341 75106 107597
7846 107597 95402 105923 115181 105766 81000 86223 70802 78605 81841 89839 101603 104818 79242
7833 79242 104652 109741 92774 92076 82583 73205 38814 69004 93955 112776 70832 50471 70833
7820 70833 52595 44580 54304 44043 26787 55912 75576 78527 69798 94265 77709 103071 101372
7807 101372 70442 118760 141443 141059 108969 114640 96576 94582 80492 107984 99906 123360 145435
7794 145435 198261 206724 163737 133013 118126 126462 133328 124157 119260 137188 138374 132288 151556
7781 151556 163888 105386 61474 59902 64094 55617 50849 76787 78371 73522 65629 53482 67866
7768 67866 48829 82247 85459 45665 51125 73189 66746 66258 28253 32274 52477 46466 21599
7755 21599 40924 42131 1599 10173 20675 36880 55782 45437 26628 20874 43398 37945 32825
7742 32825 67121 69156 35618 29544 19645 26436 41004 45872 41682 13963 5465 21102 33222
7729 33222 -4423 35350 57415 35307 14140 9319 25839 55722 54016 34236 -13472 -5893
7717 -5893 -2703 -1176 6767 14622 13385 31586 45052 28664 -14272 27549 12471 6241 -39
7704 -39 4166 -11925 -38438 -24254 -26046 -11928 8973 28886 1474 4583 -1147 -1622 5819 50776
7690 50776 40325 49126 17986 22771 -12068 -12894 21913 31042 8619 42446 53269 20369 6589
7677 6589 2167 20147 -6760 -22378 -44964 -13885 11495 16625 5844 18247 1470 1578 -31591
7664 -31591 -24788 37057 47325 29970 14802 -2633 4113 38750 40221 27601 30893 22026 43306
7651 43306 65185 35347 26721 26766 -10986 16820 35519 41153 23188 1804 -7490 -5238 9527
7638 9527 -1833 -7483 2977 10264 29937 31872 -490 32575 58239 42858 15223 -12601 -2019
7625 -2019 9090 21976 36028 29148 39526 29720 36366 38451 36695 -4894 -16929 1248 16942
7612 16942 37910 46555 30964 47132 42170 27099 -8711 930 23811 18969 -18467 -23628 -6171
7599 -6171 -8535 24807 52698 37950 25564 34531 25810 -17618 16008 -2683 35898 17150 -6440
7586 -6440 -9891 -25820 8485 38408 29391 47318 -2822 -19911 42277 55571 23506 15750 33297
7573 33297 16301 25505 19082 29809 50359 50775 68394 83527 78131 82055 56954 53654 29495
7560 29495 69754 96158 73324 70905 80691 91886 99640 53285 57069 38527 50936 69182 84165
7547 84165 91405 92091 106885 111357 96993 119586 129426 125720 153896 146360 160575 175985 174429
7534 174429 179143 162001 140597 147127 172803 141700 129156 138286 122171 136005 115576 61134
7522 61134 79991 73107 62718 61504 38764 43353 50947 51539 49077 53044 6894 -20205 -741
7509 -741 -15781 16028 -9360 -21402 12542 28665 16314 32901 10919 807 30758 57149
7497 57149 38984 -733 -24661 -23558 5292 -17315 -16356 -38539 -20202 5395 -2441 -23300 -9738
7484 -9738 13948 13432 24533 3717 -11062 -14985 21193 47088 24304 36978 46408 5640 -7447
7471 -7447 -32937 -15445 6235 5737 -2701 5818 31776 27773 18693 -733 -9640 1679 7117 1926
7457 1926 -2304 9323 -11055 595 18712 33722 49703 10723 14988 37986 51707 20114
7445 20114 12851 -2799 23199 29169 26620 24344 123 15392 8395 7252 -10564 -36699 -6779
7432 -6779 14491 12262 9304 19656 5860 -26331 947 28486 9392 413 -8799 -3677 30560
7419 30560 29762 -424 -42156 -36854 -10432 -14156 -225 -2923 11879 -10087 -8929 11695 -17221
7406 -17221 299 51790 -1596 7533 16796 -30406 -33407 20195 41161 -12057 -12997 3353 19320
7393 19320 32596 20581 -430 8552 6027 -8958 -23676 -2291 -243 7928 43463 69618 49648
7380 49648 24782 22096 -33959 9974 21140 35927 5833 27219 -4262 33488 52319 -572
7368 -572 6884 4247 23580 36975 9513 21274 25322 27187 81684 79632 51191 44250 58550
7355 58550 31243 16686 54252 59183 80099 63799 61155 104416 90933 73816 73908 88632 98407
7342 98407 103630 106523 131284 120558 91355 111121 54134 61376 106186 113901 102092 99966 100042
7329 100042 82389 121544 125534 133661 164630 209013 163558 168393 180509 197022 197933 226981 218164
7316 218164 230345 220225 237314 228530 232625 239081 261332 253180 200695 167398 185963 186654 192618
7303 192618 151665 147777 128520 146438 130518 104539 107570 102047 83839 101097 119557 126143
7291 126143 107985 89417 90708 84362 93335 90403 82020 49003 45052 37028 55157 62941 62527 68577
7277 68577 26150 20844 42167 62518 31397 27190 32536 -3040 28561 18493 -3151 -3555 20188
7264 20188 29083 18032 34995 50990 33982 47754 33415 44115 18328 3222 29583 46463
7252 46463 20008 22882 59362 67136 38846 7274 14309 22927 2524 12514 24949 18795 -5047
7239 -5047 -3929 5506 -1042 21118 53492 17997 12589 17764 30272 26367 25045 17249 32121 27901
7225 27901 18683 -7152 8160 4991 726 -726 12808 36004 67393 33998 -6439 -4474 12036
7212 12036 51218 41784 33392 16014 15641 44507 23568 52311 52106 36809 23388 12648 37735
7199 37735 50882 47038 43009 45047 72061 93532 77613 72058 62221 29723 37039 40120 55210
7186 55210 57981 53432 67771 69280 91139 79001 77001 58376 55648 65186 79005 98021 104864
7173 104864 94545 89802 97491 147221 141837 116602 103379 99796 98462 126063 123260 138935 158689
7160 158689 144411 142535 156264 135289 177603 210739 205919 200558 203413 180921 194830 193864 181103
7147 181103 183598 211746 201535 189805 197510 226870 239780 236907 254226 251991 256206 280170 316473
7134 316473 300537 380178 391184 424625 458300 483489 544299 639188 722781 810376 879681 854085
7122 854085 837602 724260 622466 510410 427132 376912 331133 300387 291693 250375 212265
7111 212265 175870 160373 161454 132019 135897 154551 158300 143765 125600 87532 101752 110360
7099 110360 93183 122311 144333 102767 82674 47467 58771 67615 67144 70387 23101 45736
7087 45736 51937 66473 68482 43910 81331 70996 45664 48662 68878 41046 40312 39698 25105
7074 25105 11539 5664 29137 56884 86595 54086 23705 8507 28955 50889 59093 27795
7062 27795 36882 68563 84467 68291 39626 38463 9222 10998 9231 21804 36125 39872 56632
7049 56632 59771 36604 26309 34462 15240 13289 -22376 -37288 -14670 21350 33771 47065
7037 47065 31643 30273 34624 9730 9580 -8695 15076 27019 16265 17120 33457 46373 36796
7024 36796 47180 29551 23028 35282 27216 37978 45072 21632 -7477 28588 55828 36559
7012 36559 32276 59771 38603 35444 31945 33403 4072 50229 77853 53653 43662 23594 22333
6999 22333 2731 31346 64516 58407 42723 19736 29775 68600 72250 59788 54254 60374 47512
6986 47512 40499 41099 25475 36864 61938 40474 29920 34781 37571 69823 84260 88002 56576
6973 56576 69949 97372 71879 37329 37726 42007 66434 73878 80555 93764 57010 41246 14019
6960 14019 46713 73267 75561 73458 92494 85985 57260 44326 45689 35148 30999 28578 15727
6947 15727 45363 53740 87169 70907 30926 59672 67028 81648 85552 74005 59894 46335
6935 46335 37328 53294 47001 36480 65814 84719 89227 80515 64405 72660 61630 71605 90006
6922 90006 107758 127023 98035 96991 95571 102403 108774 122017 108436 108824 96297 82342 62306
6909 62306 70235 87625 90746 119093 94572 96766 109236 99366 106324 126418 134918 116722 116708 124347
6895 124347 142559 138775 116287 136088 123972 121226 133914 127003 130463 128982 100932 105224 124361
6882 124361 118260 102059 122813 124331 100939 117277 113669 86274 90852 88306 123565 128544 120561
6869 120561 95082 77229 81802 82084 95569 96327 111790 149805 151025 125455 111762 93895 116269
6856 116269 93939 115235 119686 104686 144119 139495 126639 129785 132160 127815 132923 130477 136897
6843 136897 167321 152316 154385 145616 119869 110812 110496 93551 102764 113458 123383 102555 86125
6830 86125 108005 149852 155171 141151 152149 141595 129476 128536 149585 126113 112974 122117 135527
6817 135527 113928 124542 119352 103868 94024 131904 142894 155875 152704 137447 154434 153797 150372
6804 150372 147561 144771 143099 142464 129972 105131 115010 127763 101247 94393 123060 169388 181303
6791 181303 176825 161929 158093 122673 131423 103967 107497 141526 127020 147432 160349 159945 138328
6778 138328 146432 175746 181121 170893 111085 117991 133763 155870 168919 149644 140530 164405
6766 164405 146013 127077 128601 136632 135116 129084 137658 140866 155843 160195 126316 137890 168502
6753 168502 147504 156631 184129 190438 160859 148815 186656 165893 181308 190111 143692 146298
6741 146298 165656 156553 154539 171887 146974 134296 149184 170743 158859 164183 168713 190078
6729 190078 153256 184886 182543 169560 169896 190755 209617 209085 190850 224923 227282 205635 175353
6716 175353 173595 202523 167028 187944 191542 211158 215957 202501 201460 199026 204314 208810 198697
6703 198697 197757 213932 209194 201738 183569 183520 207092 210352 196143 244249 256483 258641 279106
6690 279106 236677 217582 202293 240896 270471 266680 241951 220846 233312 234424 235073 245958
6678 245958 244588 253755 235806 235361 225267 222024 238898 275511 270782 283568 275033 273948 259523
6665 259523 223042 240784 226960 224302 256042 273659 289467 312776 315457 320460 332444 355382
6653 355382 345272 316272 303766 355104 358109 349152 354063 314918 379095 411080 419436 410479 410161
6640 410161 433946 459240 447347 469807 498715 508290 539305 580940 600053 596441 599972 644082
6628 644082 670267 688083 706783 691699 691388 714548 730576 715013 743015 764326 751917 731978
6616 731978 740891 766096 784179 811031 811352 818453 832228 843889 825925 825735 836496 822386 818416
6603 818416 806483 790566 795780 819878 803697 796410 770530 813502 785656 738415 748017 777441
6591 777441 792533 791072 803502 775913 761000 750748 722354 708472 656787 665084 635863 605067
6579 605067 578434 563917 559885 530653 511835 449147 454623 471549 488490 469043 461952 476508
6567 476508 446368 432176 418946 453769 418610 440679 473189 463143 417841 411003 428643 445476
6555 445476 436496 428922 419348 427166 415363 415091 412883 403100 390844 393939 438148 424622 390081
6542 390081 421354 437929 444015 442965 397342 413228 390448 410274 439640 478220 475146 464606
6530 464606 440255 419491 406952 418247 421794 428822 429724 441277 440247 450590 436208 439459 459126
6517 459126 444558 465162 431580 440780 482540 468111 460702 471570 458791 446677 475510 488938
6505 488938 481575 463758 480101 463110 460646 473601 482108 493311 492664 489819 483495 496174 489674
6492 489674 497029 476492 465172 487993 472967 492442 507742 510832 536112 551874 536051 542081
6480 542081 556458 569120 556056 531815 548442 585134 600894 581955 560682 563094 544896 550027
6468 550027 542890 593143 602209 592375 625090 637208 616385 649522 678379 734999 747511 740598
6456 740598 759382 749591 760359 775533 767853 769068 774344 797098 801757 807684 830517 848223 826803
6443 826803 835165 880998 889945 924495 907044 911967 930096 987759 997245 1004333 1049035 1077431 1086860
6430 1086860 1106924 1112859 1143100 1143425 1176740 1197483 1228241 1257496 1300945 1350659 1395613 1409057
6418 1409057 1394104 1411830 1414033 1432076 1476547 1500383 1538610 1584733 1597319 1605903 1598467 1609496
6406 1609496 1654969 1672569 1734303 1774848 1846644 1878016 1878878 1891676 1927898 1952529 2018684 2018064
6394 2018064 2050250 2125811 2162551 2189416 2234003 2291909 2339934 2368077 2416272 2455620 2493954
6383 2493954 2544396 2591068 2664823 2700324 2770068 2846180 2908121 2964865 3023923 3063645 3118438
6372 3118438 3155757 3223865 3296447 3399803 3516017 3635943 3720517 3781999 3829302 3846797 3857929
6361 3857929 3878118 3851407 3837256 3844963 3908307 3931643 3997865 4055229 4088697 4198073 4289325
6350 4289325 4388433 4468809 4555663 4696998 4821672 4934093 5050628 5166757 5304993 5475234
6340 5475234 5651291 5797852 5991266 6231809 6410486 6650710 6885190 7091325 7383129 7641088
6330 7641088 7970673 8305875 8643199 9049755 9472423 9913222 10393152 10857504 11369857 11926297
6320 11926297 12513838 13183769 13892617 14637378 15398438 16233993 17082835 17915755 18767512
6311 18767512 19743444 20759880 21910413 23171766 24560581 26061482 27704199 29508202
6303 29508202 31454016 33577390 35803581 38313803 41082028 44110676 47492309 51273799
6295 51273799 55554819 60357425 65555605 70978738 76159404 80445907 83348725 84812383
6287 84812383 85165591 84737482 83940375 83348812 83298412 84076875 85656787 87912424 90446303
6278 90446303 92772913 94525822 95812485 96889693 97794557 98645825 99501476 100121127 100154691
6269 100154691 99558449 98400088 96910323 95379366 94088846 93185542 92662890 92197856 91359318
6260 91359318 89869282 87916017 85733955 83719395 82212239 81403349 81374595 81946368 82706974
6251 82706974 82964877 81973146 79354901 75218933 69945403 64045984 57933563 52007972
6243 52007972 46562831 41702919 37471340 33891233 30813127 28146125 25852104 23866531
6235 23866531 22146374 20650677 19300035 18041281 16926528 15899164 14979617 14160492
6227 14160492 13398495 12673179 12058190 11492385 10879880 10347039 9866183 9414193 8952833
6218 8952833 8510287 8135729 7787592 7435526 7129002 6838491 6568333 6364466 6134134 5897254
6208 5897254 5662475 5466199 5277818 5035277 4819207 4631374 4464014 4306319 4169179 4008466
6198 4008466 3854056 3751654 3685999 3584813 3442121 3323259 3208148 3141244 3074102 3015944
6188 3015944 2937366 2891811 2844965 2765233 2677212 2598797 2549416 2510714 2423695 2346412 2316216
6177 2316216 2263870 2218469 2196001 2155441 2118099 2097932 2093904 2054999 2036425 1999057 1967045 1975984
6165 1975984 1943964 1911715 1874840 1851036 1794712 1715318 1670388 1656624 1598054 1552179 1482784
6154 1482784 1418510 1374143 1375075 1354611 1343748 1307961 1267674 1240747 1220184 1186975 1184850 1165966
6142 1165966 1157157 1147929 1148018 1157019 1100534 1074789 1058867 1022610 1017252 1017389 997465 968232 988000
6129 988000 971097 934666 908487 917493 882713 876227 865036 858075 880888 872080 895702 860834
6117 860834 858859 875952 861322 850552 818161 821378 878979 912761 865993 822727 865165 840586
6105 840586 825433 807997 791123 818004 797521 772012 785845 800673 828853 795043 815278 811756
6093 811756 812164 823755 837340 877892 917771 896614 892809 923509 942313 951795 943050 965462 1000912
6080 1000912 1042845 1084184 1103257 1111172 1139280 1151244 1151735 1145671 1125182 1133534 1133383 1173323 1169496
6067 1169496 1155733 1142353 1111562 1111426 1105750 1124622 1113613 1095776 1094166 1081628 1084953 1073470
6055 1073470 1060210 1070701 1089828 1104277 1080371 1066193 1084685 1077912 1070042 1048025 1024324 1010426
6043 1010426 983754 985197 981928 949679 958901 938304 908319 909069 896001 852596 824865 828778 782935
6030 782935 775157 753840 729159 709730 707182 717588 711388 669019 628478 628283 680597 682987 658198
6017 658198 629582 616309 596831 605916 617651 573251 593202 608238 617585 623744 615341 607642 579263
6004 579263 567616 567016 559545 533692 542081 570368 554337 557958 548393 519586 519613 532729 552158
5991 552158 561999 565506 551086 533878 550283 555986 568525 582802 576671 567952 526557 498320 492447
5978 492447 493009 519668 498308 469490 493014 522518 512963 517407 554843 568373 579676 554594
5966 554594 575290 621456 618219 635740 628887 633284 617735 621595 645443 648724 650325 691577 744583
5953 744583 763187 798547 803279 803489 820796 884277 946566 972380 948353 950847 942039 949072 996923
5940 996923 997195 1008030 991477 989266 1057400 1117461 1096012 1092160 1099952 1125046 1152811 1172006 1205870
5927 1205870 1201441 1183166 1187587 1211004 1215264 1223651 1249902 1280546 1294980 1290567 1255506 1281211
5915 1281211 1303363 1323533 1324564 1344985 1371499 1357061 1371115 1391631 1378524 1384895 1377808 1340145
5903 1340145 1317583 1261623 1267383 1203388 1199587 1267839 1254473 1244211 1255460 1242678 1251740 1267707
5891 1267707 1299787 1347925 1344541 1369094 1371156 1408646 1449564 1481144 1494258 1538875 1553459 1556057
5879 1556057 1583495 1573905 1572374 1575094 1596377 1652576 1654406 1670216 1731791 1754770 1780616 1803014
5867 1803014 1810959 1809819 1843134 1877620 1940094 1980623 2011801 2046493 2087855 2116068 2126901 2171812
5855 2171812 2218980 2294815 2330609 2345506 2419989 2476709 2539393 2594506 2641804 2669191 2746114
5844 2746114 2807551 2845291 2917531 2929948 2931499 2974394 3013897 3025797 3060735 3090659 3121533 3155124
5832 3155124 3186529 3249151 3306860 3358364 3374318 3444536 3481882 3534471 3634652 3663519 3752842
5821 3752842 3849954 3940102 4067335 4169234 4258157 4331783 4454777 4565231 4705591 4827151
5811 4827151 4955540 5108751 5254436 5417747 5561709 5751994 5943027 6175064 6375053 6606453
5801 6606453 6850781 7098718 7355127 7665708 7997331 8336605 8711672 9111193 9517667 9966190
5791 9966190 10470032 10990430 11504310 12062978 12683577 13369461 14093827 14829536 15633442 16494801
5781 16494801 17389397 18256048 19169219 20109068 21118033 22194944 23426392 24779948 26274573
5772 26274573 27899559 29718357 31675861 33802948 36182765 38749969 41593183 44741970
5764 44741970 48195089 51997352 56272252 61118331 66486029 72337356 78303629 83873669
5756 83873669 88405198 91297051 92564314 92563554 91710677 90550601 89635993 89306387 89757839
5747 89757839 90960956 92698164 94392829 95596452 96285111 96714543 97153589 97787852 98687467
5738 98687467 99888516 101101359 101947104 102150001 101693979 100734296 99530379 98321839 97158489
5729 97158489 96037170 94720560 92895065 90657665 88190317 85708135 83476876 81780825
5721 81780825 80777723 80551882 80858254 81318175 81414752 80477558 78168358 74585903 70058569
5712 70058569 64983857 59778307 54744018 50116758 46064281 42513176 39449599 36841266
5704 36841266 34612929 32688736 30994366 29546589 28293250 27230699 26405352 25740313
5696 25740313 25193458 24751670 24240059 23547939 22678046 21725815 20731196 19750637 18764072
5687 18764072 17871085 17070677 16356711 15727879 15120000 14544960 14018025 13470481 13026168
5678 13026168 12602493 12193292 11826424 11448608 11093157 10781257 10483029 10169158 9967009
5669 9967009 9823622 9691468 9536216 9379456 9249568 9032872 8761040 8418502 8027560 7604529
5659 7604529 7257618 6897531 6560665 6282212 5979716 5743453 5495384 5283508 5111589 4967892
5649 4967892 4823181 4681140 4566649 4456432 4324720 4247484 4173558 4098470 4070785 4005931
5639 4005931 3919576 3857239 3806490 3772504 3663046 3607782 3544961 3417931 3341798 3246091 3165441
5628 3165441 3084485 2975596 2894062 2816382 2778319 2746273 2684028 2622163 2640254 2610938 2597457
5617 2597457 2632324 2595320 2604168 2605401 2565058 2567227 2550983 2503078 2489741 2447245 2370659 2303347
5605 2303347 2248094 2141590 2043088 1952255 1860617 1793628 1748992 1683580 1666148 1653964 1621218
5594 1621218 1562730 1525019 1547165 1530548 1529020 1517794 1497382 1502201 1462334 1448025 1411580 1374594
5582 1374594 1340054 1302121 1233396 1214185 1216750 1204077 1179462 1155470 1166741 1150666 1142349 1122129
5570 1122129 1093236 1054913 1058423 1053865 1028664 1003918 1006103 968503 975813 1008324 990093 1014227
5558 1014227 1024197 992875 997616 976098 974991 981113 958365 996199 993755 973148 972347 996275 998775
5545 998775 948603 976003 998753 988805 986454 994542 977361 984027 991600 982347 1000678 984657 969808
5532 969808 979162 967017 926103 948381 944069 927113 903151 923886 941900 915589 904588 903914
5520 903914 894289 873831 865204 850360 857880 855067 854604 826208 801636 796550 761592 749887 734469
5507 734469 719020 727165 720834 725414 698786 674561 675849 686636 693523 684694 654759 616162 599421
5494 599421 587760 593511 591252 581984 573051 576399 566015 556533 559084 559500 570405 575767 579323 550391
5480 550391 549613 553773 547597 545307 492980 482937 524164 543399 517735 495967 484416 471906 481537
5467 481537 485117 474852 479400 521253 515999 495909 496641 460854 433199 430341 445546 419668 463287
5454 463287 484997 471285 447071 477114 517089 510209 519291 494961 492440 528230 571645 570645
5442 570645 588521 598300 636681 634906 635770 679680 709768 740822 795411 835116 868591 905724
5430 905724 969810 1002173 1009491 986898 1015613 1045036 1077942 1087220 1086359 1136465 1193884 1243082
5418 1243082 1223990 1239113 1324097 1387121 1406018 1459720 1500903 1541051 1608631 1674062 1756646
5407 1756646 1839429 1980813 2099507 2264923 2474353 2650361 2798216 2920132 2900099 2771463
5397 2771463 2610690 2373660 2185816 1965564 1766690 1652343 1568891 1457689 1414301 1330688
5387 1330688 1227651 1205554 1158189 1109395 1021295 943131 893683 834001 793317 756130 755427 734343
5375 734343 700539 686275 676304 646212 615071 598283 585740 584469 570616 598718 587752 599108
5363 599108 621345 595915 601028 608653 586408 579839 596188 545506 545290 575021 554551 535162 582927
5350 582927 572532 527244 518126 550415 526313 553150 590969 602210 575524 568810 583700 592366
5338 592366 587786 557657 545149 552574 539216 503491 503713 512975 527148 544311 554567 543544 538366
5325 538366 593946 607332 625527 707265 713450 712834 735119 774016 813918 817538 847006 837273 812097
5312 812097 801614 764325 734875 700917 727877 713319 664701 678020 679944 698586 750447 767934
5300 767934 796673 834697 833898 853270 901085 948415 998293 1014552 1069962 1133333 1193457 1270525
5288 1270525 1401359 1457479 1544510 1625085 1659175 1654969 1631866 1617198 1553828 1471135 1386106
5277 1386106 1333268 1266134 1168653 1079661 1048773 987492 939503 934724 938414 997449 1012574 1012981
5265 1012981 1075122 1159850 1198679 1256355 1355059 1452138 1538580 1683463 1792608 1931872 2092221
5254 2092221 2233180 2315248 2325249 2336834 2299170 2188724 2089335 2011881 1899084 1808862 1756038
5243 1756038 1683637 1636401 1615476 1590672 1597300 1611005 1680949 1697578 1741416 1788610 1796889 1827283
5231 1827283 1861327 1892470 1927196 1986413 2053233 2090361 2161851 2270538 2335629 2460316 2557992
5220 2557992 2629325 2698919 2742398 2748043 2781219 2805471 2787513 2799789 2829416 2911400 2937768 2980496
5208 2980496 2998241 3027457 3085684 3117013 3162371 3185450 3190387 3217870 3246152 3315214 3379681 3376081
5196 3376081 3388166 3427030 3514700 3592473 3642103 3680667 3756758 3881345 4031954 4144003 4296440
5185 4296440 4485800 4638289 4843958 5017883 5181365 5365486 5613185 5827852 6054946 6242816
5175 6242816 6465055 6697965 6901761 7052583 7221742 7363897 7503753 7559624 7505666 7427004
5165 7427004 7375682 7301803 7230745 7213334 7184170 7156055 7170607 7231803 7283337 7408747 7537288
5154 7537288 7687551 7877156 8110586 8328918 8597275 8908039 9263425 9586604 9969516 10328118
5144 10328118 10695508 11065722 11463240 11878324 12282057 12737484 13225387 13790228 14359473
5135 14359473 15011905 15708506 16468000 17234393 18047173 18924085 19870028 20878604 21879767
5126 21879767 22955195 24161108 25524697 26992611 28619799 30297521 32107396 34046296
5118 34046296 36151243 38431067 40959306 43700652 46620428 49778972 52981667 55681521
5110 55681521 57824936 59972940 62456149 65397078 68892125 72959726 77616976 82861145
5102 82861145 88699850 95160285 102390543 110520854 119870652 130738331 143186701 156592386
5094 156592386 170878855 187582921 208518703 234830520 266378809 302119518 340616705
5087 340616705 372812331 385463189 377341191 354412245 321348677 283220964 245331051
5080 245331051 210750096 181222173 156987144 137160410 120951146 107741116 96888759
5073 96888759 87885170 80268631 73718222 68035387 63038124 58640846 54672048 51098955
5065 51098955 47837856 44893319 42208339 39771992 37501584 35470649 33567517 31753932
5057 31753932 30061626 28442362 26927179 25553884 24287415 23133546 22130050 21175525
5049 21175525 20293396 19523258 18807298 18025469 17259487 16544682 15845631 15165049 14497527
5040 14497527 13910152 13389387 12943163 12512587 12087394 11686580 11275260 10893411 10504661
5031 10504661 10091525 9708983 9367235 9059792 8792031 8587031 8374282 8190547 8025728
5022 8025728 7867652 7707133 7551699 7445494 7316101 7199250 7066498 6963328 6827265 6673109
5012 6673109 6512392 6372096 6290246 6159892 6057129 5939475 5865222 5773973 5649014 5561364
5002 5561364 5459958 5323808 5190995 5103279 5015956 4951051 4901637 4867706 4876950 4881991 4892593
4991 4892593 4874829 4866722 4840983 4849405 4880116 4944334 5021054 5060586 5074352 5050964 5052355 5051216
4979 5051216 5006841 5034128 5019151 4986225 4980439 4933101 4889436 4844119 4844858 4868751 4845694 4808234
4967 4808234 4786648 4742620 4712218 4713237 4630003 4602449 4590708 4541183 4527774 4533364 4455959 4372528
4955 4372528 4316616 4278281 4189937 4132694 4102434 4081067 4051833 4050232 4061610 4075552 4100806 4098469
4943 4098469 4119503 4133071 4139908 4176432 4282724 4350160 4432737 4518941 4557731 4552753 4577054 4531132
4931 4531132 4487256 4445389 4377207 4312378 4259406 4167466 4116969 4054734 3977487 3919062 3914791 3919767
4919 3919767 3955072 4055122 4137216 4254208 4414783 4607653 4799434 4969259 5198730 5421274
4909 5421274 5642211 5888018 6177425 6467384 6757502 7051779 7398426 7644545 7793964 7851674
4899 7851674 7842733 7787016 7727527 7694282 7684841 7749491 7826631 7930201 8090263 8238649 8449221
4888 8449221 8648768 8847778 9065289 9229758 9406911 9532550 9679283 9863236 10019369 10158431
4878 10158431 10271689 10248698 10107763 9912355 9658076 9403880 9197612 9078394 9051523 9073448
4868 9073448 9050139 8909195 8734165 8487602 8184746 7837936 7541203 7272094 6994022 6736529
4858 6736529 6559333 6391277 6216499 6084862 5970629 5839820 5746375 5680224 5627190 5565169
4848 5565169 5534118 5495242 5482373 5487154 5509208 5496311 5535808 5627181 5661247 5623187 5520043
4837 5520043 5368402 5136106 4901728 4644518 4371735 4133502 3885838 3627092 3436169 3264542
4827 3264542 3092702 2922634 2792331 2715063 2605076 2521125 2424099 2351685 2321453 2283764 2220348
4816 2220348 2095179 2010131 1973713 1966891 1919865 1846035 1787038 1773042 1738133 1719436 1675306
4805 1675306 1676213 1672696 1645462 1617442 1569420 1543625 1525311 1537329 1528586 1497511 1502914 1479588
4793 1479588 1453603 1480593 1443965 1402728 1401967 1394236 1375040 1416564 1462834 1472349 1498394 1503650
4781 1503650 1481536 1563359 1594791 1634650 1703681 1778773 1852919 1984065 2160022 2334430 2504950
4770 2504950 2665180 2789103 2781985 2678675 2486404 2284446 2067926 1865639 1680929 1563427
4760 1563427 1437787 1340182 1288624 1212027 1113516 1034546 988670 952395 929196 904188 907192
4749 907192 889648 855539 845252 793584 785934 781825 758640 751604 736821 720629 715356 727300
4737 727300 694592 681405 661864 653428 645918 641017 607412 595684 583670 578449 592200 617143
4725 617143 613633 563413 567196 552355 525795 511253 485289 502434 501494 509785 467522 437833 448821
4712 448821 446992 444517 385493 398735 434351 434037 401915 406319 410741 438905 446821 395824 405311
4699 405311 415594 414437 409628 405891 371424 383645 343928 316741 343386 364017 384579 346367
4687 346367 366130 382747 370408 360818 349445 371431 389648 372951 344631 305146 279007 273544
4675 273544 312747 324847 338715 333789 313380 318891 338086 308572 314926 275520 287030 299544
4663 299544 260077 294795 310185 274786 300024 299436 290958 288057 289842 312634 321241 310201 271635
4650 271635 236480 225024 246083 270939 243230 234052 262019 245414 206683 244083 254718 242309
4638 242309 262872 249888 261997 274366 288413 304157 289224 283176 285808 234723 254681 249422
4626 249422 208768 234132 245297 252032 246247 216129 228029 250650 258567 251812 229954 269539
4614 269539 243148 231443 246931 227012 222342 217390 166789 190734 203816 188688 202223 184739
4602 184739 202217 187794 206138 220938 221059 222494 223626 175338 208598 228644 188474 179617 198107
4589 198107 180944 173455 183361 165209 165448 181092 172215 198620 190309 203907 201201 204649 213125
4576 213125 218349 227840 223206 192736 193323 201082 204855 188521 196469 171035 160100 183877 216587
4563 216587 200881 185074 202850 219650 237281 203471 171541 165321 168223 169671 185973 175761
4551 175761 159838 170209 153845 146503 164367 147374 115461 138550 120330 105415 131804 123514
4539 123514 101305 117958 134397 136225 145953 151001 125768 97019 116118 73867 69057 71027 113632
4526 113632 93018 136049 142673 119260 127186 130332 117134 91381 97419 99542 114029 98832 95594
4513 95594 91620 100369 93524 102116 69297 53473 75633 81301 90722 106548 96908 92354 99549 88466
4499 88466 92794 85407 88095 71994 104105 65794 55199 45665 46497 30174 42599 61709 64643
4486 64643 91022 102120 87528 102667 123801 120309 117168 120380 104317 72140 81359 108100 98418
4473 98418 137453 92305 79259 94853 92012 97574 93353 116175 131121 118218 106681 90758
4461 90758 69016 99419 141653 154741 127683 95957 90059 97434 117004 157862 173897 171309
4449 171309 147681 136245 118212 149086 165365 176444 128590 158315 154955 175845 175425 165749
4437 165749 159383 156408 159716 137077 119693 132051 135434 138240 146144 143047 163821 172087 155157
4424 155157 138672 126675 128107 151635 141860 131709 176420 198393 185450 196888 184051 179229
4412 179229 171611 180354 180793 211789 183422 193190 215104 222308 246508 264038 238479 207195 194301
4399 194301 221430 216107 220398 238512 205777 182389 186051 229781 225844 220085 237808 238317 232694
4386 232694 253123 241451 251582 238620 237945 249120 248973 261224 219555 238398 288130 300695
4374 300695 306667 288061 262404 256728 272341 268271 289983 263689 279700 269056 265622 273524 265942
4361 265942 259759 272091 296729 306919 312118 325877 340087 346380 395737 437658 386166 385674 332672
4348 332672 321433 333927 332563 315659 268640 256080 239269 276674 255087 232045 199127 170945
4336 170945 160627 146286 145416 169428 197595 194625 166765 160358 183468 144596 145424 179004 180354
4323 180354 168731 180418 182716 167814 185269 186994 201224 179081 188822 203562 207692 223494
4311 223494 181027 160506 204627 174302 174773 169587 169961 154776 177213 176621 191897 180880 183890
4298 183890 173040 152768 159874 165346 152559 147572 165283 162694 181593 191441 186784 174220 189062
4285 189062 222307 236038 246921 227440 185012 183797 187172 201664 247840 214998 165849 203307
4273 203307 234832 231560 226484 216464 222260 216296 203019 221439 228769 183640 176103 209203 199595
4260 199595 212032 208540 181825 158191 184107 189166 187679 185948 204430 217451 234470 233411 198572
4247 198572 228567 237232 190517 240031 274722 267777 259951 235957 194913 210699 210249 185548 194836
4234 194836 194985 216411 239495 202633 223899 230626 208358 224985 193634 187522 207572 237129
4222 237129 217294 220875 232495 253868 274571 246824 225374 217068 214068 238364 268390 264684
4210 264684 236952 242124 256738 264170 259341 253519 249540 274196 299250 308607 311648 296559 282937
4197 282937 287672 306262 309363 312270 344950 312407 298620 315508 314488 339933 336847 357820 318276
4184 318276 291833 308120 313978 342012 353412 342005 321615 309519 310538 336601 336569 317064 344735
4171 344735 368242 343942 348942 367510 394664 386611 383005 373860 381866 392910 401343 429151 428753
4158 428753 435116 432978 408381 431075 477412 437784 420455 414875 437771 434657 401676 392898 395723
4145 395723 424816 447227 449940 471720 452879 442843 434013 425464 443222 482543 503209 488104
4133 488104 474141 458926 471468 470604 481742 504624 503343 481311 488381 522300 491172 485220 490046
4120 490046 509079 494134 482449 501553 496174 469434 469746 470570 475494 475857 475192 488676 510714 539191
4106 539191 551608 558511 520744 510574 508560 512669 570655 585003 555089 537156 523632 513913
4094 513913 534165 528660 529276 522793 533868 547283 550631 535080 524986 549054 578882 593373 585092
4081 585092 591817 583121 608008 588778 601036 609723 612065 634898 616351 640513 668173 678236
4069 678236 662382 655001 684440 700720 699705 710909 767375 806576 777459 752240 809988 795710
4057 795710 780924 777751 825320 832712 856152 876232 883815 896112 905888 936942 1010118 1102953
4045 1102953 1152478 1175237 1249752 1302022 1300969 1312789 1302402 1330646 1355193 1373891 1392190 1412311
4033 1412311 1473091 1536362 1602467 1644821 1732459 1799096 1884405 1964643 2090907 2199648 2357146
4022 2357146 2547123 2692988 2847756 3008235 3196840 3401113 3625739 3877832 4201036 4533710
4012 4533710 4835450 5056325 5203458 5280077 5319314 5340906 5323840 5295993 5304427 5371005 5520475
4001 5520475 5710689 5960221 6240610 6496423 6739745 6923963 7010574 7125900 7198366 7266071
3991 7266071 7361983 7445890 7512196 7639613 7861678 8178098 8575491 9101162 9686609 10208978
3981 10208978 10466019 10383557 10055345 9587714 9004883 8457507 7932749 7545835 7278159 7038624
3971 7038624 6917549 6835602 6762176 6742183 6663439 6600556 6499409 6317310 6085805 5829754
3961 5829754 5538702 5264630 5048333 4877656 4756864 4717576 4699051 4713589 4751510 4729043
3951 4729043 4688632 4517807 4277024 4019035 3689424 3416307 3186846 2957937 2757752 2593125
3941 2593125 2466847 2299321 2160336 2011432 1897178 1779927 1684779 1617513 1577844 1498783
3931 1498783 1432831 1398260 1363056 1343013 1330009 1318595 1297313 1265823 1294387 1268808 1220106
3920 1220106 1214005 1200181 1196554 1156512 1117624 1057441 1018336 983755 961423 970615 969523 936389
3908 936389 905813 867416 898174 894353 843835 845689 863141 876899 840437 820395 784706 790732
3896 790732 810821 787094 735054 720154 717224 711471 749667 748624 737197 727574 708911 697191
3884 697191 672656 693636 721146 675027 673609 684208 669744 689958 730788 717885 691778 693300
3872 693300 694606 661131 659954 676044 671401 688023 666622 669035 676036 668572 671139 680455 701771
3859 701771 692305 680523 693151 664372 689344 679377 660165 643587 661198 658692 682720 688925
3847 688925 679003 644464 653514 677028 692714 703671 686166 664616 660237 717728 689331 689873 698923
3834 698923 676821 645008 656493 675563 690067 709983 709924 695864 689857 717446 680552 678550 694817
3821 694817 713558 686592 676275 666267 676320 672001 681688 695399 698686 717023 688923 698841
3809 698841 735006 727782 707920 681087 688367 688363 681877 708959 718485 729022 707120 741028 722085
3796 722085 717004 708031 757589 724385 685139 689957 691361 692661 697937 681970 690515 703081 719229
3783 719229 728267 710784 690001 676587 677958 689672 680775 648060 667719 718522 698162 676106
3771 676106 653970 680249 716838 699709 697750 725879 720319 699668 668857 679082 698886 717661
3759 717661 741630 743013 725636 725902 726075 745509 750261 701001 706231 734561 754515 727769 719448
3746 719448 710159 689082 705769 728266 730326 729862 695289 684598 706275 675827 663304 683185
3734 683185 672093 683012 717675 733561 752173 734727 758115 778199 757522 715018 692534 713650
3722 713650 730746 723471 715314 714213 719771 736363 752314 766416 740831 785943 778746 756608 754240
3709 754240 781079 762306 739794 729057 733489 715301 755484 773412 754113 745693 766187 757759
3697 757759 766687 739161 736366 716988 720071 736089 733172 731264 729088 750709 736349 723447 718432
3684 718432 720204 741999 759756 740564 741575 726213 750898 717204 666392 701348 722384 724148
3672 724148 719783 745625 720893 701220 695365 690991 684309 675652 698756 698709 691918 667774 674415 676005
3658 676005 704527 705913 710519 687473 670170 677564 671486 663472 674394 680232 684571 650850 659405
3645 659405 684813 682450 694707 696102 669158 681564 673527 678937 713666 686903 673380 636553
3633 636553 664010 694049 694883 718777 723462 742610 754448 729631 728384 716627 707662 731465 760187
3620 760187 766988 786197 820073 801632 773749 760117 749236 740625 759958 739541 748214 731584
3608 731584 753047 768853 749822 732395 741314 789984 818868 839565 845955 853894 851094 847295 809024
3595 809024 809409 833235 847659 867741 880678 889820 936908 963328 918544 916814 928108 925138 916695
3582 916695 922707 917678 920953 920678 947932 959019 992772 982026 969922 970249 986914 989478 1009617
3569 1009617 1037300 1017947 1021933 1061166 1070662 1055598 1060017 1040902 1077313 1084903 1117988 1177308
3557 1177308 1185659 1153329 1148106 1136589 1172083 1173384 1196838 1205651 1206266 1209566 1233526 1227899 1218411
3544 1218411 1266875 1262917 1295391 1312921 1332524 1315334 1323568 1345750 1364620 1374563 1402619 1428166
3532 1428166 1416576 1417397 1441680 1467329 1476518 1483608 1540301 1508476 1537094 1587661 1600262 1622903
3520 1622903 1614470 1634968 1677426 1712920 1712997 1741429 1727725 1756988 1774983 1824498 1889188 1908440
3508 1908440 1947506 2008671 2025599 2074834 2082245 2098288 2142027 2206691 2240170 2268783 2286361 2341097
3496 2341097 2390339 2409086 2457015 2531963 2593762 2655585 2701378 2744275 2788416 2845126 2907858
3485 2907858 2973244 3015254 3088254 3155420 3262753 3328174 3406315 3490294 3577350 3673548 3763910
3474 3763910 3839418 3941413 4068390 4175351 4293853 4411922 4554830 4712091 4848410 4931833
3464 4931833 5071456 5166172 5331352 5521478 5649742 5808419 5963367 6157440 6353433 6542165
3454 6542165 6767957 6996880 7264225 7544107 7894385 8212907 8582543 8938617 9324121 9737357
3444 9737357 10183576 10614370 11009930 11449255 11851634 12207743 12539046 12744507 12915488 12954843
3434 12954843 12850519 12662831 12405818 12105361 11759442 11387815 10981113 10564227 10151946
3425 10151946 9759854 9374724 9028235 8709656 8372713 8093265 7815529 7591732 7413115
3416 7413115 7237918 7047964 6954631 6813228 6705962 6602222 6515847 6475803 6415810 6346998
3406 6346998 6307877 6305732 6306409 6286399 6318975 6363776 6419763 6514894 6582239 6609242 6568980 6485618
3394 6485618 6300469 6076389 5819284 5597574 5352375 5124487 4888913 4705491 4531381 4370121
3384 4370121 4265271 4164733 4045640 3990413 3928077 3853457 3784069 3755172 3710915 3664910 3629731
3373 3629731 3588341 3551970 3542779 3537115 3581382 3587553 3627070 3682963 3715419 3659303 3577427 3520745
3361 3520745 3430213 3339313 3216947 3083416 2980965 2912243 2826819 2744068 2661457 2620345 2555140
3350 2555140 2482078 2434675 2407797 2374190 2331036 2295367 2271688 2238948 2228839 2194795 2193853 2170516
3338 2170516 2135351 2103600 2024794 1981396 1967174 1962460 1957478 1946553 1900847 1873853 1877867 1836703
3326 1836703 1829044 1789081 1740655 1756675 1717029 1703050 1670653 1677545 1646383 1616084 1593474 1571481
3314 1571481 1545712 1562348 1547632 1572571 1543032 1505698 1513396 1511497 1512687 1497039 1499615 1486354
3302 1486354 1466909 1445089 1439380 1413082 1406074 1408132 1412297 1390841 1400837 1413169 1390821 1368558
3290 1368558 1345554 1340449 1343132 1289929 1326445 1338390 1275662 1277168 1294611 1297709 1288062 1299293
3278 1299293 1290933 1261412 1256682 1250520 1227488 1243658 1270661 1252943 1257381 1215922 1199467 1193457
3266 1193457 1199386 1179639 1180679 1153856 1120588 1125285 1129781 1146552 1126175 1131858 1130846 1099394 1083067
3253 1083067 1083581 1110948 1103512 1110834 1092484 1098172 1090198 1069829 1068499 1099310 1079715 1062474 1045522
3240 1045522 1031373 1014521 991891 1034155 1050883 1072524 1055116 1032355 1030384 1022112 985540 970366
3228 970366 954567 909881 937879 938467 915423 909242 911446 917869 955681 975610 941643 949119 952789
3215 952789 912353 909151 928621 970979 970775 939230 984143 996650 960266 904212 929943 976949
3203 976949 988844 982554 977170 954619 974096 996800 981210 976378 955034 960591 1029124 1036549 1051991
3190 1051991 1057014 1081503 1107282 1146207 1163475 1181512 1218186 1202111 1200565 1210828 1230471 1242693
3178 1242693 1282096 1298701 1271979 1290816 1315686 1353857 1366482 1384691 1394711 1403717 1416426 1417535
3166 1417535 1379875 1387501 1417572 1440021 1395520 1419308 1456437 1470045 1492840 1510301 1559975 1582574
3154 1582574 1627082 1607717 1656615 1689945 1748642 1790517 1791453 1809224 1849032 1883213 1912855 1928563
3142 1928563 1935763 1992834 2009448 2037608 2057295 2074882 2120556 2145676 2207088 2237700 2279504 2320119
3130 2320119 2375373 2407695 2466301 2521967 2601900 2678206 2728413 2765735 2822896 2863208 2873117 2953602
3118 2953602 3004500 3012736 3040084 3087829 3124653 3173132 3244933 3278961 3337097 3434503 3515363 3653340
3106 3653340 3715541 3807746 3955527 4072308 4171962 4313649 4487022 4635175 4788216 4883851
3096 4883851 4937118 4992558 5025082 4946529 4863510 4779893 4671390 4580447 4469678 4388240 4348304
3085 4348304 4324210 4311332 4324691 4333228 4385077 4460574 4509633 4534661 4625156 4714516 4821023
3074 4821023 4895953 4962156 5045506 5106787 5104753 5131718 5144389 5128889 5094017 5033674 4925468
3063 4925468 4791309 4695426 4533271 4368450 4209918 4131105 4015704 3921747 3851491 3767147
3053 3767147 3711199 3699305 3678035 3664154 3647459 3609807 3581583 3579251 3531871 3491953 3445741 3334986
3041 3334986 3267975 3193049 3130384 3044040 2880092 2744544 2633789 2545649 2449825 2358896 2287190
3030 2287190 2195287 2137621 2060196 2013051 1950331 1905490 1862828 1792267 1743744 1714285 1658260
3019 1658260 1597284 1612359 1592955 1528739 1469954 1465834 1434164 1357342 1332573 1314077 1285401 1255437
3007 1255437 1182120 1145644 1140329 1114593 1080382 1049105 1013777 1003327 1003137 972950 965655 936734
2995 936734 905677 899208 879242 833659 833847 856127 811781 783361 793996 779430 769167 769105 735760
2982 735760 734811 715110 684503 678294 662468 675260 663617 651885 636280 623312 630475 617694
2970 617694 603385 585663 569379 576025 544960 506782 517567 527422 528457 537474 535886 519859 491185
2957 491185 475026 444060 415373 423738 471323 491125 448022 431516 423722 432091 439317 415223
2945 415223 410684 425537 429883 404355 376744 360695 353828 370644 365010 348430 365108 367465 366193
2932 366193 362735 364971 364179 336858 299705 300226 332517 321583 325100 300335 282820 303910 284659
2919 284659 238172 245516 255797 245769 291391 276671 254176 242846 243579 251742 245932 242025 242409
2906 242409 270414 259362 257293 246555 263015 223966 210687 224431 221820 211790 224072 246054
2894 246054 247846 261703 227944 221487 167040 204445 217362 182720 188578 154654 163867 199528
2882 199528 202569 161454 161261 172490 158740 151347 141306 159291 187433 167211 179224 168831
2870 168831 131803 167992 184697 195114 185380 199428 209595 204070 159327 162614 175276 172286
2858 172286 167326 144402 162399 172657 169855 176603 199007 161013 163335 135885 151429 178011
2846 178011 160151 145003 151801 142965 141427 135850 129845 152377 126908 124239 143458 153664 132302
2833 132302 116691 103254 140636 138615 129636 135871 133064 133330 112332 95105 126229 159213 149532
2820 149532 134238 173947 165808 135564 116888 86858 83204 74136 101387 95932 103564 115674 80502
2807 80502 99047 115526 78567 81237 95571 118372 86074 96651 89478 96649 121904 110940
2795 110940 119862 122023 115700 131378 121780 123702 133942 101022 80588 102566 147151 152088 151554
2782 151554 138061 117055 87410 94843 111507 91671 89386 108154 80945 119894 93751 105424
2770 105424 114341 102167 91161 44224 69383 69377 60657 63489 94500 72449 94161 97255 83507
2757 83507 75393 77686 101772 87369 78028 78924 52893 17441 43419 53304 77581 49860 33411
2744 33411 35022 50219 91509 76753 55002 60931 74423 58263 57322 51304 67100 73516 74713
2731 74713 61536 56528 27002 14574 29461 25598 -6881 -4396 8570 20320 12956 17278 29283
2718 29283 52913 54835 53100 60197 57219 54298 63919 83858 74982 57371 55546 72344 38588
2705 38588 24337 25652 6606 11131 56637 55877 18496 40701 57369 14382 48424 72881 56362
2692 56362 66870 67866 53298 58034 36873 22297 28584 35760 34590 36737 4685 -6277 1297
2679 1297 17935 9546 16468 38123 33361 23015 44398 34232 37826 50080 19286 7579 432
2666 432 -16240 -31621 -19411 -7208 21006 18452 23853 13140 23630 12247 3774 5603 12307
2653 12307 13695 15377 22694 13596 14000 35906 17378 -2839 -21605 -31615 -39260 -37679 8453
2640 8453 -4733 -11849 4861 17974 28641 34549 9996 5488 -8837 6904 -8855 27539 32727
2627 32727 34838 36882 6931 30809 39870 50741 35335 5936 18665 6538 3035 11461 7924
2614 7924 32715 8212 6241 -12294 9605 9132 -9551 -13677 -13571 -13687 -248 18294 1867 -922
2600 -922 -13295 -46716 -23746 12314 7573 -15390 -27438 -47981 -54524 -2926 -15224 -4422 -15387
2587 -15387 -30981 8360 -4553 -11578 -22534 -6846 -31543 -10153 19108 -13361 6735 7054
2575 7054 -6388 -13616 376 10780 8397 -29418 -35453 -39347 -45855 -16888 -18415 -25271 -32095 -21150
2561 -21150 -12367 -11239 -2874 -20628 -51448 -754 -14588 372 -27838 -52570 -23874 -31138 -27493
2548 -27493 -28781 -29238 -24720 -37255 -30198 -3927 13323 -13699 -23426 -9682 -20763 -3384 -29114
2535 -29114 10328 10385 -21890 -2696 -22179 -29027 -26032 -7845 -18754 -20328 9385 12535 4684
2522 4684 -32801 -31648 -11801 -38460 -31210 -12552 -46580 -61923 -58884 -36830 -8558 -14304 -12905
2509 -12905 -13035 -7913 6470 -12798 -2859 -14510 -29776 -11042 -36670 -59631 -41195 -52171 -37809
2496 -37809 -15855 -5823 -22840 -41854 -53939 -55492 -33139 -38551 -32795 -32478 4163 30874 3811
2483 3811 -18889 -30631 -14026 -18509 -8718 -3602 -8504 -5156 -32979 -45211 -42201 -28827 -14768
2470 -14768 -32660 2409 1861 -36064 -29694 -16405 -8822 14180 2771 8091 -14298 -27450 -26760
2457 -26760 -27447 -45401 -7117 7885 -2614 -18549 -16365 -16911 -19802 -25875 -13945 -12436 -21455 11356
2443 11356 -13498 -23363 -28378 -14565 -15010 -18848 28362 25353 -12247 -2220 -9513 -18616 -51298
2430 -51298 -33083 -30397 11908 5075 -1872 10519 7016 -5915 -27223 -12609 -21367 -25994 -35674
2417 -35674 -24159 -7127 -21156 -10947 -45598 -46584 -37479 -30109 -12879 4147 -7174 -25765 -133
2404 -133 -41129 -39929 -44615 -11477 5 -29283 -29935 -24688 5653 -3921 -30863 -13240 21315
2391 21315 -5388 11297 6541 14979 -13930 -8291 13430 39873 21293 32348 27672 26524 37745
2378 37745 22395 2758 -20194 -10468 -22661 -12881 -22073 -16572 17992 58415 34948 13457 2178
2365 2178 -20016 -3584 1654 8543 17840 35790 20004 23927 51368 47603 47922 73300 64578 76837
2351 76837 80041 96830 113280 102916 99115 85784 100679 112210 156228 169701 189407 175872
2339 175872 225024 213723 222632 245305 258486 272164 313629 376478 400814 398552 421892 448736
2327 448736 509241 537985 605072 674908 723945 722776 724157 771161 803828 893556 991279 1056332
2315 1056332 1113294 1217860 1345434 1462124 1563845 1697250 1852135 2040861 2249974 2483486
2305 2483486 2723011 3050819 3476631 4013104 4633885 5465632 6368780 6819830 6758825 6356732
2295 6356732 5716087 4966709 4247153 3582000 3082574 2659839 2315523 2045902 1816697 1646588
2285 1646588 1561155 1463930 1340516 1258382 1187006 1090694 1032822 956532 865214 807823 730500
2274 730500 687520 666646 626640 591407 569261 486247 458566 458892 446779 451980 444160 390961
2262 390961 366346 335938 305321 309581 293777 282876 276301 264221 238039 235871 238409 225803
2250 225803 218845 214190 208773 179902 193376 190666 177715 169068 165864 161102 142410 145938 172391
2237 172391 126968 123181 130387 129092 109932 109787 115041 92185 69002 90889 107912 125440 115284
2224 115284 87726 89727 100687 93631 96543 85943 43887 55162 104876 89502 79579 86384 74515
2211 74515 58608 58770 45993 55058 23948 51153 47802 23509 47036 26621 22807 28403 25418
2198 25418 48964 52257 28539 26456 41105 37900 27783 34895 37095 62750 51388 13052 26531
2185 26531 42288 34493 38168 56363 59550 38523 50704 18614 15458 8214 -15321 -24501 20607
2172 20607 38344 21723 -8940 -1396 -18889 -272 25144 635 -2710 51473 61873 87587
2160 87587 67726 38975 -800 -15907 -18290 -15943 -6036 23982 28602 32749 23107 10131 13225
2147 13225 7505 31364 37661 30459 40091 24639 25580 -11123 22287 16948 -7919 886 -10843
2134 -10843 19349 34041 14219 8042 6254 14245 14217 5425 -31774 -32071 10565 38735 36558 22852
2120 22852 19947 -8849 -2208 -25885 -6793 6106 812 -38058 -54781 -25457 151 -14022
2108 -14022 -11734 -1487 40016 5505 -16159 -27361 -20951 1680 -2721 112 25322 13653 -2858
2095 -2858 -7895 -10491 -15895 7803 -12106 3446 -550 -20634 -6743 -1990 -7673 10745 -1164
2082 -1164 -39863 -34383 -26170 -19633 -24662 -19304 -9714 -11909 -21689 7973 35262 31932 33469 29370
2068 29370 14023 4625 25390 55665 32557 2413 11886 -4465 3960 -9671 15616 3799
2056 3799 4953 8264 11721 15317 1698 16452 -1929 27204 -3506 5796 28100 -1701 -16400
2043 -16400 1283 12191 7687 -13627 -775 -43147 -57918 -518 -13349 16244 -1878 1200
2031 1200 20660 7115 35383 59073 44929 24697 6519 -12160 -18683 21102 1982 -17898
2019 -17898 20523 17653 32879 -6466 8345 -32897 -53163 -36132 -20309 -10390 -50848 -15449
2007 -15449 9186 -11886 7823 10921 1787 17257 32334 5261 -13799 -4583 -34277 -49988
1995 -49988 146 -10079 -16016 -6791 -20500 2343 40387 -12289 -26175 -8574 5530 24404
1983 24404 13522 -29147 -1833 -6209 -1678 -20930 -56084 -28523 -26321 -18660 -15688 -12407 -38848
1970 -38848 -43841 -20209 10972 3879 45013 44684 30925 12461 15018 19329 -6774 -16551 -214
1957 -214 1162 1269 -1697 1170 7477 -6837 1060 13700 7058 -6411 3027 -13333 -15864 2402
1943 2402 -22969 -5087 16922 -37210 -28681 3118 19235 16092 -14192 -22825 -6946 19633 -887
1930 -887 17915 26998 -32267 -21457 -25047 -22001 654 6273 3486 -5781 18761 4425 -33622
1917 -33622 -28447 -1809 18446 42197 -3503 -11792 3044 10419 30927 11344 -11133 -62078
1905 -62078 -63362 -25360 -12334 -30835 -31349 8009 -37854 -37725 -10672 -7124 -17040 -29751 -37955
1892 -37955 -42584 -9185 216 -14405 -14708 -50230 -27601 -30820 -26772 12497 119 -34583 -55266
1879 -55266 4343 9827 -28772 -20622 -19670 -76317 -45295 -37324 -26757 2398 -4044 -1952 -18216
1866 -18216 -25195 -4025 -4351 -53263 -48454 -32235 -17878 -12753 -1611 -15018 -28566 -37829 -9141
1853 -9141 10438 30990 -2543 -30402 4746 17717 6874 -15334 2342 -21832 -22317 -9485
1841 -9485 -28638 -34123 -12543 1298 28213 6711 7477 -9313 -14875 13251 -2121 -22979 -11181
1828 -11181 -10524 7837 5113 -6091 -24798 -28167 -22268 -26182 -507 -8690 -13705 -35364 -30377 -24979
1814 -24979 -13586 2638 3166 -13088 -21104 -48195 -64484 -51402 -34877 -40456 -46045 -34052 -28351
1801 -28351 -29455 -14351 23643 16755 -9090 4965 24836 10683 -5656 11377 19737 1833
1789 1833 -40740 -18733 -12459 -30777 -29589 -46039 -25366 -15161 -2762 -10790 -30374 -60765 -32680
1776 -32680 -12777 -51565 -76639 -49087 -27064 5213 -20173 -33801 -32170 -43694 -8954 -24016
1764 -24016 -36700 -48636 -40390 -54565 -41993 -12717 -33890 -43662 -31713 4279 25680 3489
1752 3489 -3373 2462 2741 4758 -4357 -16323 -4406 -39201 -53556 -20544 11324 -2438 -17153
1739 -17153 -5288 -1625 7384 -24865 -34475 -26069 8533 11148 1712 2342 13315 7220 -30813 -20437
1725 -20437 -11927 421 -14012 -28255 -33343 -31608 -10994 -30005 -27651 7560 -19792 -30658 684
1712 684 23332 15739 -10331 -22813 -16616 6533 -13326 -4349 8617 -18872 -22201 -23678 -26209
1699 -26209 -33651 -36900 -3541 -4108 -5629 -2908 -5444 -15143 3059 16608 14734 2430 875 -40988
1685 -40988 -48568 -32818 -1381 -17959 -25424 1471 -6603 4933 12540 -85 -45857 -26153 -38425
1672 -38425 -16043 -9001 -8571 -9690 34549 -342 -25499 -10200 -18320 16374 -14834 -24752 -25908
1659 -25908 -17127 -19538 -2365 5173 -13649 -43904 -43937 -34538 6120 6225 -16237 -20712 -25489 -12110
1645 -12110 3463 -846 -8694 -19471 -12407 37874 18151 39711 31593 11748 17995 46581 38448
1632 38448 18724 7620 14409 -8826 -35897 -51390 -53705 -1677 13369 -7671 -9526 -56190
1620 -56190 -55002 -24789 -36426 -18232 -19471 -20892 -26197 -46338 -30281 -34921 -75696 -62780 -40744
1607 -40744 -6053 30341 5455 -31662 -22898 -32125 -3706 13638 -1721 11805 16732 -2539
1595 -2539 -14959 -22119 -23286 -16095 -26015 -4549 -13026 -21396 -24156 -26790 7065 -2567 30069 -15594
1581 -15594 -47348 -15950 -26480 -18486 -10772 -12778 -20799 -48467 -38660 -10899 -1969 27147 -12708
1568 -12708 -5675 873 -9764 -25043 -19934 -24506 -35719 -38706 -30630 -30267 -27643 -23940 -11016 11286
1554 11286 17372 -720 3449 1399 -22563 -19856 -9992 -28755 -47166 -18416 -10436 -24075 -29660
1541 -29660 -10387 -6588 11273 -12279 -13053 12934 13981 -3636 -6021 -27180 -7628 9698 16022
1528 16022 -6198 -1586 -14756 -6364 2018 19670 20581 -959 -19999 -30964 -2298 1749 -32300
1515 -32300 -4434 -27 5782 612 3436 33859 -2459 25069 32205 -4132 -2778 -19260 -54007
1502 -54007 -25520 4969 -2141 18205 8107 -18089 -2708 14695 5815 19783 -13192 -1894
1490 -1894 -1917 -35604 -15125 -24349 -3167 -474 -21962 -17799 -759 -21689 -17212 4673 19938
1477 19938 13580 -18368 -22598 -21254 -47941 -52327 -27719 -20479 -30796 -27922 -31623 -12560 5284
1464 5284 15776 833 -14356 -19869 -20666 -38808 13638 21011 8436 2881 22725 11291 -11037
1451 -11037 -19125 22199 31418 29048 27640 -13850 -28065 -8322 -6924 6476 -11700 -21917 -21740
1438 -21740 -28712 -4735 8225 205 15924 47606 6798 -37931 -46564 -13691 10932 27000
1426 27000 -4653 -24703 -17207 19454 22102 16404 -8154 -43102 -15036 -8298 -9451 -9756 -29430
1413 -29430 -15693 -5651 -8437 -12774 5372 -18392 -12344 28730 13888 -258 -20593 -20607 12968
1400 12968 -14186 -46541 -73021 -63276 -24768 -17264 -21795 -4055 -1436 -19212 -13405 -16923 -28781
1387 -28781 -6882 -16595 -46338 -67797 -58614 -21697 -19692 -27077 -50222 -44540 -26984 12480 166
1374 166 -15340 -30689 -6379 7034 8450 -16576 -10890 -16325 -8283 -1356 2250 14928 -3649
1361 -3649 5310 -10724 -36085 -39062 -58434 -43972 23471 -6514 -29482 -39971 -17962 -11562 -16264
1348 -16264 -20493 2251 -16683 -18609 1189 2425 -11352 -14027 -45978 -9516 15712 -48571 -52057
1335 -52057 -23904 -62046 -53203 -79866 -25159 -31556 582 22620 -7016 -9972 -16048 -18149 -10353
1322 -10353 7615 -33300 -17702 -28249 -29729 -17028 9965 12933 -2241 -9709 -5859 -1308 41035
1309 41035 10157 3788 11033 -2875 -35045 -34685 -44706 -4074 18855 6639 -28539 -8504 -17163
1296 -17163 2016 2007 -25757 -39153 -44377 -14658 -25299 11199 13332 25396 -547 7745 17036
1283 17036 -7715 -30188 -30912 -19699 7786 15565 -8060 14804 5347 11538 26111 -5336 4683
1270 4683 9421 566 -2217 -24683 -29998 -30580 2587 -7826 2153 1210 -7101 3734 11491 20755
1256 20755 8385 4961 -6736 27466 31415 7460 37295 25610 34258 12316 -31780 4668
1244 4668 15438 17595 9621 25937 3175 -2580 -13388 -20559 -46052 -39862 -14218 -29369 -16217
1231 -16217 -9603 19155 13919 11065 40415 42735 24936 20340 -417 15153 37255 18147 -10276
1218 -10276 8430 13282 7904 9308 -26221 -36541 -14720 26961 5914 -26804 -33638 -22101 -10894
1205 -10894 -6587 3010 -21871 -7071 -7463 -14393 -733 -26671 6476 -15751 -33716 13531 -21970
1192 -21970 -30732 -8325 13650 -4154 -23733 -36048 -30496 4285 28686 10754 -13992 -34037
1180 -34037 -30040 -506 -6272 -910 8599 -19066 -3901 24432 -8706 -24742 -22504 -30322 -4054
1167 -4054 -28799 -36664 -27900 3353 34616 13462 -3527 4577 13696 3893 -7697 -21840 -605
1154 -605 -5761 -2852 -3854 -4003 -9166 16758 14880 11460 -1926 -1213 9780 10790 1018 5367 -9761
1139 -9761 3317 -7090 -1502 10707 -17877 21986 -3540 -26344 -31912 6422 14060 -11921 1141
1126 1141 14017 -15522 -20818 -34599 -29456 13325 26283 23334 22544 6624 8384 30971 1048
1113 1048 -22456 -8608 -8218 -7161 -5500 -10729 27222 40307 17259 2910 5534 -30188 -10004
1100 -10004 6118 -13788 -27674 -44307 -34672 -33036 -9673 25393 80 22648 7559 -25357
1088 -25357 -14256 -21060 -57973 -36290 5267 6317 -11781 -36980 -25849 -19829 -39411 -23109
1076 -23109 12814 19724 11739 19806 15813 1818 16067 21124 31484 37094 36864 11934 7922 -4085
1062 -4085 -8420 5268 11456 4327 8145 2677 16432 3835 -54958 -31561 10546 13756 -6158
1049 -6158 -39396 -16355 1163 10105 -8270 1934 -7348 -3914 19842 20758 23593 22757 823 15082
1035 15082 4634 2523 11513 467 7820 14940 30374 23474 26376 2214 8346 28048 33790
1022 33790 28320 15519 -15704 -11177 244 -1262 22810 21834 3917 1281 -17060 4192 -860
1009 -860 14718 -4554 6076 21580 13039 2480 2827 -5291 -20341 12756 714 -36450 -58370
996 -58370 -33887 4651 -16697 -14632 3822 41962 64924 12842 -9086 -23784 -10577 -9881 31610
983 31610 9231 32852 21999 30339 16413 -23271 -6877 14567 2783 -25718 2205 18420
971 18420 -15460 -1913 25656 8533 -892 18077 6152 2895 5737 313 22042 -990 1597
958 1597 438 -19288 -38845 -20260 14582 43021 16311 -1322 23954 5204 15094 14190 11174
945 11174 16976 32414 26973 22943 42082 27413 10215 -7034 18172 -9860 -26625 -6502 -9031
932 -9031 -45260 -19291 12157 -12744 -5489 -8959 -12456 -11857 -11356 17054 -5226 -9279 -10831 -17993
918 -17993 26959 37619 11112 -14684 11341 18448 -10947 -17662 -20299 -12994 -456 18509 1391
905 1391 -20958 -9822 -13749 5298 16990 11207 26827 -2466 2319 2014 30629 13550 10188
892 10188 29977 33270 -36414 -29338 2464 -3409 3103 21397 12455 38708 17056 -6452 7260
879 7260 20512 40411 12725 7736 -25888 -3070 2538 -1031 -15844 2558 18738 33629 57570
866 57570 51690 4562 -9504 -25919 14471 11645 19188 21476 -1661 -32910 -38542 -5872 -3093
853 -3093 11732 13406 -105 -8397 -353 39677 35785 12076 -3593 15762 39853 31188 1923
840 1923 4430 31664 33877 21081 45425 47531 36128 33343 3728 -29236 4808 7273 12032
827 12032 14826 3165 41210 -15424 -16001 4290 -22560 -11575 16408 1810 12540 15209 5305
814 5305 40059 36325 -6430 10227 7121 36158 31784 56169 38200 22170 -16851 -20713 13559
801 13559 2038 32485 28001 17818 -3429 -22674 16064 10923 -27751 -25052 -28341 -24454 -39069
788 -39069 -13086 4190 -7956 22501 28141 27577 12721 42187 31363 38779 30197 -13147 22899
775 22899 -4823 -8787 5289 27014 4098 15922 16039 13537 -16816 -29841 -40256 -37011 -20019
762 -20019 10501 12025 -10343 -5092 -278 -13875 -39053 -52014 -40077 -34625 -44236 -3763 15977
749 15977 341 15945 21651 24133 26307 31829 23179 28126 19855 32016 30613 -4653 14960 -1213
735 -1213 -20911 5793 22454 3851 3248 -21931 8578 12537 19063 1953 -2329 10876 3737
722 3737 7973 -2495 -1208 -40265 -34097 -5650 1822 3248 -2993 -3506 26147 13437 -10594 2694
708 2694 -14849 -17334 29789 22337 10395 2265 10940 24707 17893 24974 25084 26534 19543 21085
694 21085 28143 22709 44669 41065 21633 28715 16055 17241 -7371 17729 60926 69178 28770
681 28770 33212 40715 -1082 3134 -4593 -14052 425 -9628 22701 26133 12792 9803 10780 11670
667 11670 41014 26600 42903 27764 16289 42320 71947 47739 35099 41202 21365 14921
655 14921 28691 26395 -3649 17548 -8329 25248 29 -26310 -1062 -929 -34417 -17823 22704
642 22704 32229 43595 18973 -28994 3879 17791 27249 66705 62838 31862 25902 31981 6739
629 6739 -10800 -13192 22555 50930 35506 -24729 -9452 -14646 -19929 6682 954 -13234 -21417
616 -21417 177 22086 -20567 3477 27756 7908 35725 14797 -2675 -10613 4153 44068
604 44068 2430 -24330 12546 22071 24314 1233 1551 37592 48123 10301 13046 56662 52312
591 52312 34972 6396 11595 47603 65585 63766 36971 37044 21492 16698 7838 4073 -30385 -3855
577 -3855 6353 -5959 -30391 -17005 -5482 -1101 22237 -3950 15217 17767 12552 28432 -1158
564 -1158 -15124 -33642 -19928 -7299 27096 23028 30327 14597 6062 28400 -3229 18948 15742
551 15742 2639 1294 7979 12640 22890 42059 32548 675 -4869 15638 36340 53270 40261
538 40261 26950 43322 34883 42087 7837 10685 25731 44569 39319 48576 28976 21534 3650
525 3650 -3775 28450 24153 4502 2855 -841 14404 44256 18360 29684 -2937 -14463 -6397
512 -6397 -13831 -32218 -18349 -5531 8031 40999 4886 21377 37539 20517 33724 -8768
500 -8768 -9118 18405 7380 15980 12487 3233 19466 45167 26309 -5564 20092 24983 34912 52375
486 52375 26206 9273 14124 9997 15110 16799 -10150 7267 10493 8568 17007 -5271 -16393
473 -16393 -6212 -14118 -17725 -13434 30423 30492 25987 32674 15410 -4520 -11136 -5549 17790 28955
459 28955 47768 -2153 -14794 -4484 26830 30235 8219 31192 -5165 2615 5740 -3345 -12912
446 -12912 -36223 14992 37571 10325 21006 28869 46007 11156 3160 -4621 5425 -22381 -16246
433 -16246 3055 17385 25635 1070 41502 75351 32808 30681 19286 2104 21602 11263
421 11263 13084 -11104 -8621 -28561 -16296 1805 -3431 16537 31023 -12275 -20704 7421 23905
408 23905 10493 -9204 961 -18682 -6398 29717 8323 6103 11827 38030 60524 20720
396 20720 22136 15349 -2550 -7732 -2924 -6940 -11290 6690 28920 53603 43214 12912 36401
383 36401 26400 64370 68728 20792 -2013 -6698 -12405 -9639 -8397 4977 7023 10442 -13221
370 -13221 2332 31664 20746 28695 17351 -4789 4141 39812 33265 25244 20463 34283 19009
357 19009 33061 10257 24255 5737 -19625 -9695 -14484 11890 37256 24374 26830 57624 65399
344 65399 47101 24327 16038 4212 12672 25280 21336 15707 10521 -13752 -19069 -15662 3718
331 3718 -29658 -16965 33350 31356 18656 -8809 -8118 -15388 -31300 -7300 11784 34007 25254
318 25254 32636 12807 19548 7991 4188 27015 30879 18570 -7003 1826 32755 44655 50341
305 50341 60000 34079 26389 -1570 7137 24213 65330 65831 20235 -384 -25340 -42165 -41110
292 -41110 -23307 -33446 -43048 -41690 -22509 4011 39053 50483 26963 52342 66820 34286
280 34286 31023 15448 8919 -12386 -2830 -2462 -4161 40922 21431 16349 -757 2844 12301 3574
266 3574 26080 23492 6595 33690 6357 3389 -301 23895 31188 21367 -2662 7136 -5895
253 -5895 5685 6932 456 26591 55667 35658 -9626 14722 35666 23381 -5328 11998 22349
240 22349 41084 1992 23147 10898 -12221 -20018 23308 39322 38243 64652 63457 55133 63425
227 63425 41744 9588 5246 -8551 -12523 1578 13161 15423 -6868 -9538 -3206 14696 23539
214 23539 -4310 -6723 -13197 -1149 16522 -5693 -3284 -17976 -20256 18296 36609 83296 63267
201 63267 41238 34135 37325 9708 6830 22722 23387 9735 32623 23529 35488 27781 17363
188 17363 52617 45083 56906 61839 22195 22792 14990 15241 17401 -1804 -4018 -7541 -3740 -16799
174 -16799 -2932 19770 12400 -9618 4845 39147 68948 35564 28088 28041 21531 2417 -3462
161 -3462 26307 22412 6880 17952 5615 23486 32269 24928 23339 25373 2048 -1431 1466 -5145
147 -5145 -13391 559 17025 15046 21427 16565 30320 -8263 -6846 18153 39188 35120 22222
134 22222 20946 19394 3463 -6319 3651 2592 -13654 -41170 -9671 22403 16245 -6858 -16452
121 -16452 -3426 -17313 -19711 -8397 -6171 -17626 8674 27563 5121 8305 22572 32107 20354
108 20354 11371 11469 25895 28788 32446 35256 33300 14630 -1544 25788 27223 13771 42385 42161
94 42161 27181 10613 41673 27506 28079 30108 1624 23768 52410 18878 1947 12064 -14345
81 -14345 10156 29197 30510 28618 35259 12267 8281 25814 20606 19954 23096 36581 46939 34060
67 34060 30793 29375 11089 32073 39666 22829 32332 20754 3962 5420 14378 25360 29528 22569
53 22569 21473 16422 17111 27346 19563 23458 8988 -9188 17624 23723 9874 3211 6018 8736
39 8736 19170 2303 -7175 -13645 4761 1789 10975 8183 7911 6120 -5966 2142 11518 -2366
25 -2366 3660 29319 24530 22032 -190 19374 6435 444 6962 18306 34977 28224 21094 20429
11 20429 41113 43460 27988 25057 18792 19036 31269 18296 13864 14082 3064
0 3064
$$ Imaginary data points
##PAGE= N=2
##DATA TABLE= (X++(I..I)), XYDATA
16383 -318335 -323433 -344926 -339886 -316238 -300470 -294072 -275147 -268452 -257937 -261996 -257393 -236837 -245191
16370 -245191 -239580 -223395 -197247 -195583 -199130 -193836 -185066 -171248 -183119 -174210 -156712 -150293 -126866
16357 -126866 -115488 -103959 -109223 -86167 -66072 -66207 -72294 -56342 -56320 -70237 -39061 -17634 -8403
16344 -8403 -2147 -8489 7666 -1356 12437 28737 13726 29567 32032 58027 49045 57819 68728
16331 68728 43936 78123 93256 102892 102715 116768 129036 152336 152677 152583 188005 190784 195130 187637
16317 187637 163737 166315 191341 201449 180805 201577 212127 219753 242739 217912 245426 273965
16305 273965 284007 268402 262322 279427 314729 315666 315885 331266 306467 301859 311740 315714 346606
16292 346606 333927 346663 343846 358138 375726 395676 376155 381499 393633 428419 409072 397396
16280 397396 409084 413079 443115 461464 433329 445452 446487 455264 472815 453642 433924 445775
16268 445775 471335 479106 519783 523877 509764 511850 498221 502729 545663 522256 530569 536031 556933
16255 556933 558523 567828 553942 535098 540316 556330 605677 612417 578207 562529 582298 612544
16243 612544 592258 592135 618832 625158 601930 586762 612293 654062 627664 643737 629212 653046
16231 653046 664129 669575 670766 673559 681088 662960 674929 684911 691343 686997 692739 706121 683864
16218 683864 692799 696980 694830 729594 748179 718606 751835 743550 726429 736024 737813 753988 733891
16205 733891 733587 755130 773936 764709 744457 753405 764903 747303 778379 791400 766739 784549
16193 784549 792797 792575 782196 781822 804553 800042 828974 834875 808828 813670 825301 815827 804378
16180 804378 798418 809290 806066 804092 780013 789221 788200 799226 835574 835950 861182 851104 845819
16167 845819 827617 809841 828134 826238 840030 869475 863902 848901 869304 861726 870053 872403
16155 872403 865873 843961 864469 854449 840961 859321 898840 870515 859176 877731 867103 876145
16143 876145 893626 879785 885378 894552 904892 893321 921800 947225 930662 938150 922413 903240
16131 903240 915546 918942 943777 968523 949967 932970 912416 911065 899958 926787 927975 938046
16119 938046 932132 920929 923981 921303 930903 930231 922459 946141 934684 927629 930953 923371 895012
16106 895012 909223 930972 948347 941587 944377 934326 916132 940811 922700 926909 923253 916148
16094 916148 941157 961513 946446 935127 914140 938429 938562 935106 933287 949847 940567 894636
16082 894636 901964 941128 959741 960896 954053 940006 938502 954601 982347 975265 936245 901493
16070 901493 917196 961551 962690 922669 907497 917425 969166 963985 955131 976159 959589 949602
16058 949602 926650 956794 939604 940514 960276 932400 936258 973193 967843 935930 913623 929499
16046 929499 961323 962013 950187 926925 918442 941193 990445 958544 957976 983651 949016 942881 938212
16033 938212 915885 919853 922963 952816 990913 975669 935182 958436 947206 969654 964324 977358
16021 977358 965266 963768 955486 968509 958406 923104 953608 961690 949694 981514 996102 946944
16009 946944 940621 946983 930777 943038 956591 954836 950767 915719 918955 974373 980706 940388 936371
15996 936371 966581 968135 978551 983155 947322 940879 948994 942544 938182 941345 944775 952240 983181
15983 983181 997897 984038 961920 952426 953868 959234 956610 931396 949323 975443 966857 968007 958685
15970 958685 969970 985691 961838 980406 963999 963876 971688 978501 943170 973573 935304 925219
15958 925219 963333 977102 959793 958422 975230 960121 975957 999735 995126 968704 976590 979581
15946 979581 949230 955814 956149 934825 948976 961774 955613 943620 977838 990284 987943 956129
15934 956129 949843 958501 971194 969917 928676 932765 936534 945938 991106 985344 955966 958733 978989
15921 978989 990466 973037 975373 952937 985231 984804 988046 1000432 979397 980302 974577 968507 961456
15908 961456 965773 963978 964641 979280 956071 948701 937465 933948 935156 964575 977470 993260 998314
15895 998314 1001378 1004951 946206 961267 944555 959555 932872 944140 975615 977823 976413 956475
15883 956475 963798 948045 940835 956788 978712 975294 985665 1012953 973210 978925 977866 984515 963637
15870 963637 931611 926038 920546 955541 969780 968542 962637 962397 963014 952610 935548 940615 976875
15857 976875 978371 953806 950615 985756 1011392 1013974 1015979 967551 936694 971162 998366 999286 984063
15844 984063 973334 947075 952209 963343 983821 982664 984044 989700 991067 1016875 1002087 975089
15832 975089 980846 976442 960127 947769 969223 998544 983121 966544 975764 981324 1002337 992505
15820 992505 1015105 1022348 1020933 1049015 1035955 994627 967111 951315 960417 995450 991450 987391
15808 987391 989173 981365 960283 948833 971211 1014283 1008191 974653 962341 949691 966722 988713
15796 988713 988368 988045 963327 984719 988459 987810 991808 1015032 1006106 968417 963486 986562 984706 991654
15782 991654 986324 989418 984443 972322 969558 1008679 1002022 986387 965102 955589 970030 978086 977917
15769 977917 982348 1007905 1000425 992209 1013080 994287 984354 993343 1002201 1015813 1010353 1016346 1002837
15756 1002837 987993 1001959 1006882 1009566 985248 981560 1001099 960941 959301 966596 995602 1029124
15744 1029124 1039482 1028520 1013617 967071 975198 982071 970557 979001 966933 966540 972307 989980
15732 989980 985971 965090 960991 995320 1001767 972066 986299 993800 1004947 1010374 987594 985279 1001083
15719 1001083 992516 987246 970161 974771 962510 974372 1019653 1004417 1020911 1018485 990316 990203
15707 990203 1014898 996956 992452 1001895 985177 990333 1037381 1037733 982122 979262 1002170 1028148 1019716
15694 1019716 972429 963042 968163 974198 1020666 1035025 1007412 1019057 1015847 996800 1003213 1001019
15682 1001019 1018739 1025970 1007861 984255 976909 965424 962409 973928 990246 1003497 1016710 1030188
15670 1030188 1040578 986477 973090 973461 977095 993806 968150 964549 988759 996634 1018169 1031389
15658 1031389 1018155 1002235 1006174 992585 975481 1014388 1007070 987046 989537 1017596 998466 984792
15646 984792 970601 1002758 1029868 978480 959793 946628 965257 997261 995923 994780 1013375 1013207
15634 1013207 989688 974330 984776 995695 977260 1007092 1024590 1002119 996931 974230 1006803
15623 1006803 1032204 1015301 980969 1000463 990920 993754 955935 962554 981155 1006162 1023642 984125
15611 984125 979934 984617 1014544 1016381 1024350 1020548 1016685 1012703 1000124 1022886 989126 996851 980736
15598 980736 964399 958963 959290 982948 969693 974689 982737 1006381 991878 967476 976358 1011460 1029763
15585 1029763 1003997 994714 1007913 1003449 1017950 1029003 1061712 1018625 1016880 1001360 1025023 1007327
15573 1007327 1015803 992041 997863 1003804 1009487 1019801 980080 978641 1012373 980213 973963 980175 1023740
15560 1023740 1051342 1041568 993189 985154 1015372 1006415 991813 1000330 999096 997541 1042098 1014286
15548 1014286 1026933 1032691 1005456 986560 1011721 1003642 960368 950083 1007292 1016844 994421 1016320
15536 1016320 988197 972701 999192 997549 1015303 1021926 1008052 1020676 1011099 991029 1012025 1020598
15524 1020598 997782 994831 1033158 1030918 1007625 1018208 1026776 1010241 1024867 1006718 1010250 979835
15512 979835 984311 1020794 1027576 1005263 996685 1004697 1025241 1002270 1010809 1036332 1020519 1022138 1039384
15499 1039384 1017864 1006227 1002155 985045 1015107 1014078 998395 1006389 996507 1027623 1034836 1040729
15487 1040729 1047905 1034746 1009897 1038586 1047332 1052223 1040038 1019632 1031692 1020939 1007417 1041097
15475 1041097 1027514 986205 1004136 993130 1011012 1032832 999705 997399 1025191 1021519 1027892 1044775
$$ [...]
##END NTUPLES=NMR SPECTRUM
##END=
