##TITLE=1H_EC-3342(2)
 200.13MHz, CDCl3,
 8 sc
 
 7.2.2025
##JCAMPDX= 6.0         $$ Bruker NMR JCAMP-DX V2.0
##DATA TYPE= NMR SPECTRUM
##DATA CLASS= NTUPLES
##ORIGIN= UXNMR, Bruker Analytische Messtechnik GmbH
##OWNER= pz
$$ XWIN-NMR		Version 3.5
$$ Fri Feb  7 13:48:26 2025 Russian Standard Time (UT+4h)  she@DPX200
##.OBSERVE FREQUENCY= 200.1313
##.OBSERVE NUCLEUS= ^1H
##.ACQUISITION MODE= SIMULTANEOUS
##.ACQUISITION SCHEME= undefined
##.AVERAGES= 8
##.DIGITISER RES= 18
##SPECTROMETER/DATA SYSTEM= spect
##.PULSE SEQUENCE= zg30
##.SOLVENT NAME= D2O
##.SHIFT REFERENCE= (INTERNAL, D2O, 0, 15.4847)
##AUDIT TRAIL= $$ (NUMBER, WHEN, WHO, WHERE, WHAT)
$$ ##TITLE= Audit trail, XWIN-NMR		Version 3.5
$$ ##JCAMPDX= 5.01
$$ ##ORIGIN= Bruker BioSpin GmbH
$$ ##OWNER= she
$$ F:/spectra/data/she/nmr/H-C/1/pdata/1/auditp.txt
$$ ##AUDIT TRAIL=  $$ (NUMBER, WHEN, WHO, WHERE, WHAT)
(   1,<2025-02-07 13:47:03.12 +0400>,<she>,<DPX200>,
      <created by zg, POWCHK disabled, PULCHK disabled
       configuration hash MD5:
       00 E9 B6 7A A2 85 ED C7 34 08 36 98 17 FE 4E 26
       data hash MD5: 16K
       C6 5C BC BE E3 EB 42 5F C6 CE 54 61 A1 30 68 1E>)
(   2,<2025-02-07 13:47:05.25 +0400>,<she>,<DPX200>,
      <Start of raw data processing
       efp BC_mod = 2 LB = 0.25 FT_mod = 6 PKNL = 1 PHC0 = -270.6556 PHC1 = 14.79221 SI = 16K 
       data hash MD5: 16K
       01 CA AE 0C 82 D7 F9 1D 7B 57 54 C3 78 71 C5 AB>)
(   3,<2025-02-07 13:47:24.87 +0400>,<she>,<DPX200>,
      <pk PHC0 = 1.148237 PHC1 = -0.6 
       data hash MD5: 16K
       3D B9 86 01 A9 AE A5 A0 0B BF A0 62 5D F5 ED F6>)
(   4,<2025-02-07 13:47:28.45 +0400>,<she>,<DPX200>,
      <abs ABSG = 5 
       data hash MD5: 16K
       D3 7D BF 6D 61 01 01 2A 2D A3 5E 69 B5 9F 92 63>)
$$ ##END=
$$ 
$$ hash MD5
$$ 33 D7 05 75 50 43 76 9A AC F0 67 B8 5B 29 03 BE
##$RELAX= 
##$RELAX= 
##$RELAX= 
##$RELAX= 
##$RELAX= 
##$RELAX= 
$$ Bruker specific parameters
$$ --------------------------
##$DU= <F:/spectra>
##$EXPNO= 1
##$NAME= <H-C>
##$PROCNO= 1
##$TYPE= <nmr>
##$USER= <she>
##$AMP= (0..31)
100 100 100 100 100 100 100 100 100 100 100 100 100 100 100 100 100 100 
100 100 100 100 100 100 100 100 100 100 100 100 100 100 
##$AQSEQ= 0
##$AQ_mod= 1
##$AUNM= <au_zg>
##$AUTOPOS= <>
##$BF1= 200.13
##$BF2= 200.13
##$BF3= 200.13
##$BF4= 200.13
##$BF5= 200.13
##$BF6= 200.13
##$BF7= 200.13
##$BF8= 200.13
##$BYTORDA= 1
##$CFDGTYP= 0
##$CFRGTYP= 5
##$CHEMSTR= <none>
##$CNST= (0..31)
1 1 145 1 1 1 1 1 1 1 1 1 1 1 1 1 1 1 1 1 1 1 1 1 1 1 1 1 1 1 1 1 
##$CPDPRG= <>
##$CPDPRG1= <>
##$CPDPRG2= <>
##$CPDPRG3= <>
##$CPDPRG4= <mlev>
##$CPDPRG5= <mlev>
##$CPDPRG6= <mlev>
##$CPDPRG7= <mlev>
##$CPDPRG8= <mlev>
##$CPDPRGB= <>
##$CPDPRGT= <>
##$D= (0..31)
0 0.7 0 0 0 0 0 0 0 0 0 0.03 0 0 0 0 0 0 0 0 0 0 0 0 0 0 0 0 0 0 0 0 
##$DATE= 1738921622
##$DBL= (0..7)
120 120 120 120 120 120 120 120 
##$DBP= (0..7)
150 150 150 150 150 150 150 150 
##$DBP07= 0
##$DBPNAM0= <>
##$DBPNAM1= <>
##$DBPNAM2= <>
##$DBPNAM3= <>
##$DBPNAM4= <>
##$DBPNAM5= <>
$$ [...]
##$SUBNAM3= <"">
##$SUBNAM4= <"">
##$SUBNAM5= <"">
##$SUBNAM6= <"">
##$SUBNAM7= <"">
##$SUBNAM8= <"">
##$SUBNAM9= <"">
##$SW= 18.0517328524113
##$SWIBOX= (0..15)
0 0 2 0 0 0 0 0 0 0 0 0 0 0 0 0 
##$SW_h= 3612.71676300578
##$TD= 16384
##$TD0= 1
##$TE= 0
##$TE2= 300
##$TE3= 300
##$TEG= 300
##$TL= (0..7)
0 120 120 120 120 120 120 120 
##$TP= (0..7)
150 150 150 150 150 150 150 150 
##$TP07= 0
##$TPNAME0= <>
##$TPNAME1= <>
##$TPNAME2= <>
##$TPNAME3= <>
##$TPNAME4= <>
##$TPNAME5= <>
##$TPNAME6= <>
##$TPNAME7= <>
##$TPOAL= (0..7)
0.5 0.5 0.5 0.5 0.5 0.5 0.5 0.5 
##$TPOFFS= (0..7)
0 0 0 0 0 0 0 0 
##$TUNHIN= 0
##$TUNHOUT= 0
##$TUNXOUT= 0
##$USERA1= <user>
##$USERA2= <user>
##$USERA3= <user>
##$USERA4= <user>
##$USERA5= <user>
##$V9= 5
##$VALIST= <valist>
##$VCLIST= <CCCCCCCCCCCCCCC>
##$VD= 0
##$VDLIST= <DDDDDDDDDDDDDDD>
##$VPLIST= <PPPPPPPPPPPPPPP>
##$VTLIST= <TTTTTTTTTTTTTTT>
##$WBST= 1024
##$WBSW= 4
##$XGAIN= (0..3)
0 0 0 0 
##$XL= 0
##$YL= 0
##$YMAX_a= 531886
##$YMIN_a= -536634
##$ZGOPTNS= <>
##$ZL1= 120
##$ZL2= 120
##$ZL3= 120
##$ZL4= 120
##$ABSF1= 15.61247
##$ABSF2= -2.439382
##$ABSG= 5
##$ABSL= 3
##$ALPHA= 0
##$AQORDER= 0
##$ASSFAC= 0
##$ASSFACI= 0
##$ASSFACX= 0
##$ASSWID= 0
##$AUNMP= <proc_1d>
##$AZFE= 0.1
##$AZFW= 0.1
##$BCFW= 0
##$BC_mod= 2
##$BYTORDP= 0
##$COROFFS= 0
##$CY= -3
##$DATMOD= 1
##$DC= 0
##$DFILT= <>
##$DTYPP= 0
##$F1P= 0
##$F2P= 0
##$FCOR= 1
##$FTSIZE= 16384
##$FT_mod= 6
##$GAMMA= 0
##$GB= 0
##$INTBC= 1
##$INTSCL= 3.241238e-09
##$ISEN= 128
##$LB= 0.25
##$LEV0= 0
##$LPBIN= 0
##$MAXI= 10000
##$MC2= 0
##$MEAN= 0
##$ME_mod= 0
##$MI= 1.114404
##$NCOEF= 0
##$NC_proc= -6
##$NLEV= 6
##$NOISF1= 3.799351
##$NOISF2= 2.8
##$NSP= 0
##$NTH_PI= 0
##$NZP= 0
##$OFFSET= 15.48466
##$PC= 1
##$PHC0= -269.5074
##$PHC1= 14.19221
##$PH_mod= 1
##$PKNL= yes
##$PPARMOD= 0
##$PSCAL= 0
##$PSIGN= 0
##$REVERSE= no
##$SF= 200.130007412472
##$SI= 16384
##$SIGF1= 3
##$SIGF2= 2
##$SINO= 0.751879
##$SIOLD= 32768
##$SREGLST= <19F.Aceton>
##$SSB= 0
##$STSI= 16384
##$STSR= 0
##$SW_p= 3612.71676300578
##$SYMM= 0
##$S_DEV= 0
##$TDeff= 16384
##$TDoff= 0
##$TI= <>
##$TILT= no
##$TM1= 0
##$TM2= 0
##$TOPLEV= 0
##$USERP1= <user>
##$USERP2= <user>
##$USERP3= <user>
##$USERP4= <user>
##$USERP5= <user>
##$WDW= 1
##$XDIM= 16384
##$YMAX_p= 386806220
##$YMIN_p= -168359
$$ End of Bruker specific parameters
$$ ---------------------------------
##NTUPLES= NMR SPECTRUM
##VAR_NAME=  FREQUENCY,     SPECTRUM/REAL,   SPECTRUM/IMAG
##SYMBOL=    X,             R,               I
##VAR_TYPE=  INDEPENDENT,   DEPENDENT,       DEPENDENT
##VAR_FORM=  AFFN,          ASDF,            ASDF
##VAR_DIM=   16384,         16384,           16384
##UNITS=     HZ,            ARBITRARY UNITS, ARBITRARY UNITS
##FACTOR=    0.220516191357247, 1,           1
##FIRST=     3098.94515032305, 0,            0
##LAST=      -513.771612682729, 0,           0
##MIN=       -513.771612682729, -168359,     0
##MAX=       3098.94515032305, 386806220,    0
$$ Real data points
##PAGE= N=1
##DATA TABLE= (X++(R..R)), XYDATA
$$ [...]
6541A80294L0118N3700Q14J0424m1130K7225p229K3407j9665L6423k331L9792
6529C31842O530m7579L3062j1803R1r519O6730m930l8273K7545k777k4865N27
6516C26581K9660K7193n715p803j547j5189m18O1959J01138m341l7131l3974l195
6503D37218k3552O984l7832L1924j6475j5084L9538K5131J7884q3916m6179J08059
6491D43700M9k358K317M1416N247k1170l6079j0364m0157N3207o066n173k586
6478D21983q8114O2446L101m3516M9668R476K3542K6082O333k0219p789O0185
6466E03178n5924L8158N2137M392J1111P177p8175q9007N856J50780k0584m7225
6454D81874M6785j9311l9886R981O0392K3681m5774k4495Q1813J3056j00190K5476
$$ y = [180294, 210412, 264112, 264926, 275350, 234220, 261445, 254216, 277623, 257958, 294381, 292050, 331842, 338372, 290793, 323855, 312052, 312143, 302624, 369354, 364424, 326151, 353696, 350919, 326054, 326581, 356241, 383434, 377719, 369916, 368369, 353180, 352762, 414721, 515859, 511518, 474387, 440413, 437218, 413666, 420650, 382818, 414742, 398267, 383183, 422721, 447852, 465736, 381820, 335641, 443700, 443749, 441391, 443708, 485124, 490371, 469201, 433122, 422758, 382601, 435808, 429742, 424569, 421983, 333869, 396315, 399416, 355900, 405568, 415044, 438586, 464668, 471001, 450782, 442993, 503178, 447254, 485412, 537549, 541941, 553052, 560229, 482054, 393047, 398903, 549683, 529099, 481874, 528659, 509348, 469462, 479443, 539835, 563516, 517742, 493247, 575060, 588116, 487926, 513402]
6442E13402O3509j7182j4233j3778k1323N4680M4939J4379N5422L7694K2111l232
6430G36388k4036l8246p0097O468j5058K4589m400O5915O9571l7387o1382j3599
6418F38726J1684O1329m4350k9221J03918N5020L260j6635Q432M0353n29P466
6406H39453L3258p974L3527L6748o9639j4525K1615N3132l1520K3083O1205l9784
6394I38579k3280j0226P6389Q812M6545L9874P2624L592j4699P803J07317o6047
6382A187283n5626M0108K5142R5146O5880P113k4809N428N4335Q316M4512L684
6370A456512M8142L8741P408Q5772R474L5404L3596Q9168J08408L6853N7344Q66
6358B007688K2753J28425L9394J31273N1272Q8763Q3430K7602J19498J25533J22209
$$ y = [513402, 576911, 559729, 545496, 531718, 510395, 565075, 610014, 624393, 679815, 717509, 739620, 736388, 712352, 674106, 604009, 610477, 595419, 620008, 615608, 681523, 751094, 713707, 652325, 638726, 650410, 711739, 667389, 638168, 742086, 797106, 800366, 783731, 792163, 832516, 831987, 839453, 872711, 864737, 898264, 935012, 865373, 850848, 872463, 925595, 894075, 917158, 978363, 938579, 915299, 905073, 981462, 990274, 1036819, 1076693, 1149317, 1152909, 1138210, 1146013, 1253330, 1187283, 1131657, 1171765, 1196907, 1292053, 1357933, 1365046, 1340237, 1345665, 1400000, 1408316, 1452828, 1456512, 1504654, 1543395, 1550803, 1636575, 1646049, 1681453, 1715049, 1804217, 1912625, 1949478, 2006822, 2007688, 2030441, 2158866, 2198260, 2329533, 2380805, 2469568, 2552998, 2580600, 2700098, 2825631, 2947840]
6347B947840J74143K01036J44376J64536J42197L20237K79508J73216J43065J16725
6337D806879J56081J81320J60297J57145K04711L70226L82420L96610M17039M17720
6327G650448M61195M24827L19051L31643J49936p6497j18671j25442o0046J6229
6317H972673L2232J2076J60345J52999J71983K39198J66760P1763J11749R1427
6307A0183205Q4022R9544J06520J000j24187k18655j85890j55703k08030k54408
6297I327418j94980j97401k08158k05226j70529k72450j88288n9982m0926Q3162
6287G872640L2291M7384j11736l2827k50926m38960o09437o35030m75106m04828
6277D993465l64501l21065k93079k92828k03163j56932r9054j44243r0825j39801
$$ y = [2947840, 3121983, 3323019, 3467395, 3631931, 3774128, 4094365, 4373873, 4547089, 4690154, 4806879, 4962960, 5144280, 5304577, 5461722, 5666433, 6036659, 6419079, 6815689, 7232728, 7650448, 8111643, 8536470, 8855521, 9187164, 9337100, 9260603, 9141932, 9016490, 8956444, 8972673, 9004905, 9016981, 9177326, 9330325, 9502308, 9741506, 9908266, 9980029, 10091778, 10183205, 10267227, 10366771, 10473291, 10474291, 10350104, 10131449, 9945559, 9789856, 9581826, 9327418, 9132438, 8935037, 8726879, 8521653, 8351124, 8078674, 7890386, 7830404, 7789478, 7872640, 7904931, 7952315, 7840579, 7807752, 7556826, 7117866, 6508429, 5873399, 5398293, 4993465, 4628964, 4307899, 4014820, 3721992, 3518829, 3361897, 3262843, 3118600, 3027775, 2887974]
6267B887974j42822j04401j8368k689o1696j15318q1252j7937k1468n1347p9920
6256B190756o0786n2382j3005K358o7571l859p0857n1649m1768o1117l842K7325
6244A793603j19487O776m3704Q142O2177o1866j12822p913P681j9770L7691p5373
6232A475135N1994j7211p4086K2524L1999k2476j9587J6498n8096J9322o1902
6221A364114p4459k2595n2153L3414J4047L7707J1979P668m4986J8512l4048K775
6209A261975k557o0519M5914R62O0662K7075k8258p0632m3818m059L2842P0396
6197A289983L4721r9641n5101j3716k1925k6230J4179K4939K718L8606k326n3262
6185A132945p7579J1811o5710l224K2008M5343q5062K1153L9387N8398l7074o1766
$$ y = [2887974, 2745152, 2640751, 2622383, 2619694, 2557998, 2442680, 2361428, 2343491, 2322023, 2270676, 2190756, 2129970, 2077588, 2064583, 2066941, 1999370, 1995511, 1924654, 1873005, 1831237, 1770120, 1766278, 1793603, 1674116, 1680892, 1637188, 1645330, 1707507, 1645641, 1532819, 1524906, 1532587, 1512817, 1550508, 1475135, 1527129, 1509918, 1435832, 1458356, 1490355, 1467879, 1448292, 1464790, 1406694, 1426016, 1364114, 1289655, 1267060, 1214907, 1248321, 1262368, 1300075, 1312054, 1319722, 1274736, 1293248, 1259200, 1261975, 1259418, 1198899, 1244813, 1245775, 1306437, 1333512, 1305254, 1234622, 1190804, 1186745, 1219587, 1289983, 1324704, 1225063, 1169962, 1156246, 1134321, 1108091, 1122270, 1147209, 1149927, 1188533, 1186207, 1132945, 1055366, 1067177, 1001467, 998243, 1020251, 1065594, 980532, 1001685, 1041072, 1099470, 1062396, 1000630]
6173A000630m0875M4461Q6343n0148k9883j3732J5177L6962j3134l9091N6476
6162A053186m149m7142J1014p6063l0215J432L9065Q068k8710J280j2792m2394
6150H72580N313J6467L672O0195j4177o2310J4281m7573P9083Q6364n2813k4000
6138I37082J0821k2936K7170M2572j2423K3977Q946K220N2993J4345o8503M4837
6126A061101O8457n5353p0758J5766M1607m5602r8068p798P5383M1272R282k3379
6114A011910o5897L7819k7389l8121M3417M5702m3242L5488P404q8084j0375j0023
6102H98609j4154J05294l8882p5418j1782R5428r681q090q5155O4363K6109k10
6090I46431p947q431l3906r057K8539q571K9006Q3259q9625m5760O1526K0000
$$ y = [1000630, 959755, 1004216, 1090559, 1040411, 1010528, 996796, 1011973, 1048935, 1035801, 996710, 1053186, 1049037, 1001895, 1012909, 936846, 906631, 908063, 947128, 955196, 926486, 927766, 914974, 872580, 877893, 894360, 898032, 958227, 944050, 881740, 896021, 848448, 927531, 1013895, 961082, 937082, 947903, 924967, 952137, 994709, 982286, 1006263, 1015209, 1017429, 1070422, 1084767, 1016264, 1061101, 1129558, 1074205, 1003447, 1019213, 1060820, 1015218, 917150, 909352, 984735, 1026007, 1035289, 1011910, 946013, 983832, 956443, 918322, 961739, 1007441, 964199, 999687, 1007091, 919007, 908632, 898609, 884455, 989749, 950867, 875449, 863667, 959095, 949414, 941324, 856169, 920532, 946641, 946431, 938484, 930053, 896147, 887090, 915629, 907058, 936064, 1019323, 929698, 883938, 945464, 965464]
6078I65464N2812o7043N277m15J5347r5567O5362J4859m4352M7756J2482q4663
6066H87319o7J841N8797L7233k2676M362k7041k1810l071M2174m7348l6304p7576
6053G95833M0628K4865o322p302M5876O7674o9852O9199L746n977l2812Q468P7733
6040A011757n2186m4584M3094m3611N4607K1745M2467J8704k4020M4779k1028
6029A051724m1610k7544k7994P6205K4152j3952M7628k2332q1178m856Q11O426
6017I87480M4317q8532j3807P0670M1285j0977j6082L7951n4100j08557K1777
6006I11425Q5929r549o186P3247k280k7814j8829P359N2816N3638m7497K9868
5994A102127R4510P33J0721r0305m929R0299K6134M9252q7076j8938J4707r091
$$ y = [965464, 1018276, 951233, 956510, 956095, 971442, 875875, 941237, 956096, 911744, 959500, 971982, 887319, 887252, 889093, 947890, 985123, 962447, 966809, 939768, 917958, 914887, 957061, 909713, 873409, 795833, 836461, 861326, 855004, 847702, 893578, 961252, 891400, 960599, 964345, 958368, 925556, 934024, 1011757, 959571, 914987, 958081, 914470, 969077, 990822, 1033289, 1051993, 1027973, 1072752, 1051724, 1010114, 982570, 954576, 1030781, 1054933, 1040981, 1088609, 1066277, 985099, 980243, 981054, 987480, 1031797, 943265, 929458, 1000128, 1041413, 1030436, 1014354, 1052305, 998205, 889648, 911425, 997354, 987805, 981619, 1054866, 1052586, 1024772, 1005943, 1013302, 1066118, 1119756, 1072259, 1102127, 1196637, 1197370, 1208091, 1117786, 1112857, 1203156, 1229290, 1278542, 1191466, 1172528, 1187235, 1178144]
5982A178144J8456l9464m3296M3411K504O0091l5811p0J2301O7009K2623j5215
5970A270683L3482j5785K5522k0438O3197J5111n8287J5634j8546p9214O3320
5959A294679n62n641m2076J4795J2424J2889K4117M9975k3835n6820J6869L2739
5947A329553n2611K388R1804R4112k3076L4066N7035k4398j0181n4260K6523O3227
5935A534182r2226l8855L923L8346R787L9781O3043k988m460j1844J5269l1732
5923A522226J1817L8725K0575m9874l84O3757M6608o7716L3496K1723k8794K646
5911A614805J8022M0199n7667l3898P7835J8605j1080l1477N119J2376K8001K2445
5899A703285K0777m3129L2741Q2821n4377m1634J5392N843J4307O3343J3718j7525
$$ y = [1178144, 1196600, 1157136, 1113840, 1157251, 1159755, 1219846, 1184035, 1183965, 1196266, 1263275, 1285898, 1270683, 1304165, 1288380, 1313902, 1293464, 1356661, 1371772, 1313485, 1329119, 1310573, 1231359, 1294679, 1294117, 1288476, 1246400, 1261195, 1273619, 1286508, 1310625, 1360600, 1336765, 1279945, 1296814, 1329553, 1276942, 1279330, 1371134, 1465246, 1442170, 1476236, 1533271, 1508873, 1498692, 1444432, 1470955, 1534182, 1441956, 1403101, 1407024, 1445370, 1455157, 1494938, 1557981, 1554993, 1550533, 1538689, 1553958, 1522226, 1534043, 1572768, 1593343, 1543469, 1543085, 1606842, 1653450, 1585734, 1619230, 1640953, 1612159, 1614805, 1632827, 1673026, 1615359, 1581461, 1659296, 1677901, 1666821, 1635344, 1640463, 1652839, 1680840, 1703285, 1724062, 1680933, 1713674, 1796495, 1742118, 1700484, 1715876, 1721719, 1736026, 1799369, 1813087, 1795562]
5887A795562R402Q4447K1328q0228J7765k1479K5890J6445Q489k5053J6501L1662
5875A900731M0021R6114K8759L5852o010j1564j4823M0904M7960L7496J6106J
5863B211547J6236L7546J6123o5258K2219N1029n9835n6640m162R002K6467o3179
5851B141095m8486L3124N7154O8667K2441J0925O8381K6869k0168j5961J3627
5840B357668n2620P6495J1870l35Q4558N7861M5670l5980m0606j3231J17184M4412
5828B652946P443N85J18856q405J9830P5362P1045R4841Q5675N7824O9991O4464
5816C310457K9705J05890P6528N102P9390J49619J41885N6697J38437J92134O6485
5805D352329J29321K23037J66839J72584K24903J33707L15621L33920L83253M16934
$$ y = [1795562, 1804964, 1889411, 1910739, 1830511, 1848276, 1826797, 1852687, 1869132, 1877621, 1852568, 1869069, 1900731, 1940752, 2036866, 2065625, 2101477, 2095467, 2083903, 2069080, 2109984, 2157944, 2195440, 2211546, 2211547, 2227783, 2265329, 2281452, 2216194, 2238413, 2289442, 2229607, 2172967, 2168805, 2177807, 2204274, 2141095, 2092609, 2125733, 2182887, 2251554, 2273995, 2284920, 2353301, 2380170, 2360002, 2344041, 2357668, 2305048, 2381543, 2393413, 2393078, 2477636, 2535497, 2581167, 2545187, 2504581, 2491350, 2608534, 2652946, 2660389, 2660974, 2779830, 2771425, 2791255, 2866617, 2937662, 3032503, 3118178, 3176002, 3245993, 3310457, 3340162, 3446052, 3522580, 3527682, 3607072, 3756691, 3898576, 3955273, 4093710, 4285844, 4352329, 4481650, 4704687, 4871526, 5044110, 5269013, 5402720, 5718341, 6052261, 6435514, 6852448]
5795F852448M21079N14775O08977O16861O39753O45726M62414M46840K43814l2100
5785A1420587k66711k51802j14468l7529o4473L2420J59871K43726K73009J72182
5775A1566812J66000J49065R1178J26373K33578K69587L78076L59695K06816o569
5765A3540611o4937j87453k41279k26389k46013j20461k85004l41116l54630k14256
5755A1259073k32432o5248M067R00N0951L2309J17226L631m2529l98858n24781
5744A0204309m94616n08599l50369l85138l10450k24031j99554k95425k84706
5735G151421k34006k74357k31090k12074r3932j21896k10238j39911j50364j57705
5725E325848j15632j04244o9302o0230j28604r8301m6762l7607n5507O5757L9820
$$ y = [6852448, 7273527, 7788302, 8397279, 9014140, 9653893, 10299619, 10762033, 11208873, 11452687, 11420587, 11153876, 10902074, 10787606, 10750077, 10685604, 10718024, 10877895, 11121621, 11394630, 11566812, 11732812, 11881877, 11973055, 12099428, 12333006, 12602593, 12980669, 13340364, 13547180, 13540611, 13475674, 13288221, 13046942, 12820553, 12574540, 12454079, 12169075, 11827959, 11473329, 11259073, 11026641, 10961393, 10965460, 10966360, 11017311, 11049620, 11166846, 11170477, 11127948, 10729090, 10204309, 9709693, 9201094, 8850725, 8465587, 8155137, 7931106, 7731552, 7436127, 7151421, 6917415, 6643058, 6411968, 6199894, 6105962, 5984066, 5773828, 5633917, 5483553, 5325848, 5210216, 5105972, 5036670, 4976440, 4847836, 4749535, 4702773, 4665166, 4609659, 4675416, 4715236]
5714D715236j3388O7976P3985Q317l3892N7570L0586R5979R7479J55196J41523
5703E396567J84963J51440J62145R3499J46540J85906J48236P8742N6277l2507
5693F571808j14311j02546p7651p0698j8661j243O0879n9731P1086N7945J17989
5682F434866K84140J83945J80142K43912K78943K13160J55795J09235J2055j51937
5672G944256n9133o7357j59029j37698j85586j08812J2042l5276P45O1857N9951
5661G325960L6797J81581J22957Q4057Q9900M3835q173k7854j0524k6399r2453
5650G719684j98330l10999l74429k39732j60348j77233j72768j51315p2843r920
5640E851767l108n1029J4462o7136j47233n7589k5297j9344j25852j73987j59320
$$ y = [4715236, 4701848, 4769824, 4843809, 4852126, 4818234, 4875804, 4906390, 5002369, 5099848, 5255044, 5396567, 5581530, 5732970, 5895115, 5988614, 6135154, 6321060, 6469296, 6548038, 6604315, 6571808, 6457497, 6354951, 6277300, 6206602, 6187941, 6186698, 6247577, 6187846, 6258932, 6316877, 6434866, 6719006, 6902951, 7083093, 7327005, 7605948, 7819108, 7974903, 8084138, 8096193, 7944256, 7885123, 7817766, 7658737, 7521039, 7335453, 7226641, 7238683, 7203407, 7204152, 7266009, 7325960, 7362757, 7544338, 7667295, 7751352, 7841252, 7885087, 7876914, 7849060, 7838536, 7812137, 7719684, 7521354, 7210355, 6835926, 6596194, 6435846, 6258613, 6085845, 5934530, 5861687, 5851767, 5848659, 5797630, 5812092, 5744956, 5597723, 5540134, 5514837, 5495493, 5369641, 5195654, 5036334]
5629E036334j36686j57753k62307r0051l2535j11942r7199j43812m9978l4841
5619C919230j69894l0693p8368o513o6800J2293O2259o0960q1988j02453p7859
5608C318254m3430m9557j5880m5864r2707m0592n6564q2219j07379q2019n9505
5597B642538J9035Q4152n0781q5147j17861r4407P5296L2993r5084m3978L2027
5586B398783l3643l7129l1406j7697j3537k1532k85J3247p7842r2295L8917j0140
5574B115441k9356q0406K0125J1721m9056j6881l6840p203J4283p5422r449N9467
5562A916424j9661o353K7212j0259J6888K4668r3181r0167l8240O995l986J0569
5550A740909R554N9631n4622J4786L4789N838m2867j07J2392p383m6891m1022
$$ y = [5036334, 4899648, 4741895, 4479588, 4389537, 4357002, 4245060, 4147861, 4004049, 3954071, 3919230, 3749336, 3718643, 3640275, 3633762, 3566962, 3579255, 3641514, 3580554, 3498566, 3396113, 3318254, 3274824, 3225267, 3209387, 3163523, 3070816, 3030224, 2973660, 2891441, 2784062, 2702043, 2642538, 2661573, 2745725, 2694944, 2609797, 2491936, 2397529, 2472825, 2505818, 2410734, 2366756, 2398783, 2365140, 2328011, 2296605, 2278908, 2265371, 2243839, 2243554, 2256801, 2178959, 2086664, 2125581, 2115441, 2086085, 2005679, 2025804, 2037525, 1988469, 1971588, 1934748, 1927545, 1941828, 1866406, 1856957, 1916424, 1896763, 1890410, 1917622, 1907363, 1924251, 1948919, 1855738, 1765571, 1727331, 1734326, 1730340, 1740909, 1750463, 1810094, 1755472, 1770258, 1805047, 1810885, 1768018, 1767911, 1780303, 1772920, 1726029, 1685007]
5538A685007j9561M9026L0187Q782L0583k5855L8109l3573l6575M4966n3039n7306
5526A660751L3411O6241n3578l0343k1209m0772q543J4L6076r620k9557J9863
5514A622734M0778o730o574j1652n3865q6886k2594M3219N7523K358j9633n0263
5502A508415j654K809l2299R4465m010J156r378M9756J8537l9159m2510j0860
5490A535268K4391L3984k4653J2457P794L7185L2809P036M1619l3940J8715J15
5478A692780L1195J04247j4259k8078N4428O7041L2282P0279L0427M0307n493
5467B075156N0188L1945J19557R7308K5686J13068J65748O7504N5890J21863O3524
5456B987437J50284J51241J71024J18722K00597P8421J40995N1384J8367k5081
$$ y = [1685007, 1665446, 1714472, 1744659, 1753441, 1784024, 1758169, 1796278, 1762705, 1726130, 1771096, 1718057, 1660751, 1694162, 1760403, 1706825, 1676482, 1655273, 1614501, 1605958, 1605972, 1642048, 1632428, 1602871, 1622734, 1663512, 1656782, 1650208, 1638556, 1584691, 1497805, 1475211, 1518430, 1575953, 1578311, 1558678, 1508415, 1506761, 1509570, 1477271, 1571736, 1567726, 1568882, 1559504, 1609260, 1627797, 1588638, 1546128, 1535268, 1559659, 1593643, 1568990, 1581447, 1589241, 1626426, 1659235, 1666271, 1707890, 1673950, 1692665, 1692780, 1723975, 1828222, 1813963, 1785885, 1840313, 1907354, 1939636, 2009915, 2040342, 2080649, 2075156, 2125344, 2157289, 2276846, 2374154, 2399840, 2512908, 2678656, 2746160, 2802050, 2923913, 2987437, 3137721, 3288962, 3459986, 3578708, 3779305, 3857726, 3998721, 4050105, 4068472, 4043391]
5446D043391n1437q2603j05795p1116n9904p257Q307Q1665N8204M7976J41430
5435D002861L5644P2994J67895O4567J16347K18616N0535O6413l1767o0422j28597
5424D575086o8396j99051j49492j52909k02700j73073j40508r8251o9732m8886
5414C272088q9570J2413l764n979J08907N6662O049M0586J2178k4172p5974r9780
5402C209644n9271j51424k28886j52508r4597j06849j08671q4606r6990m1280
5392B084562j29811j43550k0646J1775p4726j08031q3648K6688n8775M2062K2921
5381A568821n253k7480o5402j2144O0913Q474m8529K5474o8850Q463K3179Q4653
5369A552319j8480J4483L3644J1923N9365j3815K0631J3959O8969P5284J09790
$$ y = [4043391, 3991954, 3909351, 3803556, 3732440, 3672536, 3665279, 3673586, 3755251, 3813455, 3861431, 4002861, 4038505, 4111499, 4279394, 4343961, 4460308, 4678924, 4729459, 4795872, 4764105, 4703683, 4575086, 4506690, 4307639, 4158147, 4005238, 3802538, 3629465, 3488957, 3390706, 3320974, 3272088, 3182518, 3194931, 3191167, 3185188, 3294095, 3350757, 3356806, 3397392, 3409570, 3385398, 3309424, 3209644, 3150373, 2998949, 2770063, 2617555, 2522958, 2416109, 2307438, 2222832, 2125842, 2084562, 1954751, 1811201, 1790555, 1802330, 1727604, 1619573, 1535925, 1562613, 1503838, 1545900, 1568821, 1563568, 1536088, 1470686, 1458542, 1519455, 1527929, 1479400, 1504874, 1436024, 1444487, 1467666, 1552319, 1533839, 1548322, 1581966, 1593889, 1653254, 1639439, 1660070, 1674029, 1742998, 1818282, 1928072]
5358A928072r521L5390Q7552N7222O0880k7679j35086n3378O6221O702o8044q2804
5346A865527n2578M1640n773O4264n370J6318m343o450l618K7569J08961P4551
5334B120698j8756O2526P9542J45961J27843K00516J78977J96976K07745K09389
5324C511417J47519P5588Q6539n1208j19336j42491j96257j77725j70584j45951
5314B817511r2920k7354r5649n2367r875L3569o8939o8842K5187j7323J8137j7516
5302B443619N2295O7910J14094J32160R9527J07788J53755J63871K24108J78020
5292C737147R4733M3695K7785j3687j15261j19796k18475k16263k06130k71438
5282B742310m4987o8918j02171p7920l0828o7663n581M304l7008m0892Q6536j0983
$$ y = [1928072, 1918551, 1953941, 2041493, 2098715, 2159595, 2131916, 1996830, 1943452, 2009673, 2016375, 1948331, 1865527, 1812949, 1854589, 1848816, 1913080, 1907710, 1924028, 1919685, 1913235, 1909617, 1937186, 2046147, 2120698, 2101942, 2164468, 2244010, 2389971, 2517814, 2718330, 2897307, 3094283, 3302028, 3511417, 3658936, 3734524, 3821063, 3769855, 3650519, 3508028, 3311771, 3134046, 2963462, 2817511, 2724591, 2697237, 2601588, 2549221, 2539346, 2572915, 2503976, 2435134, 2460321, 2442998, 2461135, 2443619, 2495914, 2563824, 2677918, 2810078, 2909605, 3017393, 3171148, 3335019, 3559127, 3737147, 3831880, 3875575, 3903360, 3889673, 3774412, 3654616, 3436141, 3219878, 3013748, 2742310, 2697323, 2628405, 2526234, 2448314, 2417486, 2349823, 2344242, 2348546, 2311538, 2270646, 2357182, 2346199]
5270B346199L76O3093l9073K5574K8540K3551J18745J2490P7636j2119M5502M4894
5258B735408O6928r4770j4881j8560q2J664p9946l6167l8000M7183j12098j9084
5246B437595K9859N0539J6329j6617m6769K3728o6307l6582k73n6099J6964Q5347
5234B437714J0399k9383k5482j2207k5180L3232j7811Q1877Q4308k9617O7122
5223B574972K6017O3660J1377O2222O3537J00353J43992J19549Q9544R1119Q699
5212C355041K5887J03142L002j5776K5460o2301K3110j5971p5786L1929N927J5614
5200C419278j895M5043P1871o0184M8908K5173M5332M5990n327Q7084P119J2199
5188C740591m0090L6688R7376k8542K3870P2948K5032L6671J03955M3821j265
$$ y = [2346199, 2346575, 2409668, 2370595, 2396169, 2424709, 2448260, 2567005, 2579495, 2657131, 2645012, 2690514, 2735408, 2802336, 2707566, 2692685, 2674125, 2674043, 2675707, 2595761, 2559594, 2521594, 2568777, 2456679, 2437595, 2467454, 2517993, 2534322, 2517705, 2470936, 2494664, 2428357, 2391775, 2391502, 2335403, 2352367, 2437714, 2448113, 2418730, 2393248, 2381041, 2355861, 2389093, 2371282, 2453159, 2537467, 2507850, 2574972, 2600989, 2664649, 2676026, 2738248, 2801785, 2902138, 3046130, 3165679, 3255223, 3346342, 3355041, 3380928, 3484070, 3487072, 3471296, 3496756, 3434455, 3457565, 3441594, 3365808, 3397737, 3403664, 3419278, 3417383, 3462426, 3534297, 3474113, 3523021, 3548194, 3593526, 3639516, 3634189, 3721273, 3728392, 3740591, 3700501, 3737189, 3834565, 3806023, 3829893, 3902841, 3927873, 3964544, 4068499, 4112320, 4111055]
5177D111055N3455P2477N1403K5584O8202O4044M554M1828L3117N5754O0844M5947
5165D688264P1608N4483J26123R9494J30719Q2033J34832K04013J63736J20985
5155E876290K15317J81504K38121O9344K58068K05043J89757K85175K25147K36098
5145G979864L32323L32290L09844M34056N11695N36804N94088N63578O57591P44622
5135A2996755Q69408R85158R65164R40881Q80473P39283M77054J63740j01387
5126A8916529q2490K63777L83696O94552J048100J416453J766287J824310J961078
5117B8192292J900379J716784J206005L97873j042759k716656l318517k918528
5109B3416873k452063j997300j742328j409150j063191r72993q04730p08794n50429
$$ y = [4111055, 4164510, 4236987, 4288390, 4313974, 4382176, 4446220, 4450774, 4492602, 4525719, 4581473, 4642317, 4688264, 4759872, 4814355, 4940478, 5039972, 5170691, 5252724, 5387556, 5591569, 5755305, 5876290, 6091607, 6273111, 6511232, 6580576, 6838644, 7043687, 7233444, 7518619, 7743766, 7979864, 8312187, 8644477, 8954321, 9388377, 9900072, 10436876, 11030964, 11594542, 12252133, 12996755, 13866163, 14851321, 15816485, 16757366, 17637839, 18377122, 18854176, 19017916, 18916529, 18834039, 19097816, 19481512, 20176064, 21224164, 22640617, 24406904, 26231214, 28192292, 30092671, 31809455, 33015460, 33413333, 32370574, 29653918, 26335401, 23416873, 20964810, 18967510, 17225182, 15816032, 14752841, 13779848, 12975118, 12266324, 11715895]
5100A1715895n21496m81595l47809l21423k25155k95016j67303j79764j94293
5091H982041r4756N0197p2371k2831j7280l5092Q707q921o1929j61487k12594
5080H353684j57422k35683k13892q8965j75396k29171m1041j7397n4434r2214
5070G048069q9164o0011P822o932l0957K4414p8243k4578R3697k1348Q7562P0948
5058G021279m2343k5508P8123K5972N7394M6954J0891K9760J04486M2097L1380
5047G380485J23864J61577J17590K8295J08592J16301J18525R9807J85304K13693
5037H654033J28429J41874K02724J81491K35977K12869K44454L13338L01342K92291
5027A0908822M47188L70264M50554N05270N20040N07059M93670O04497N84876
$$ y = [11715895, 11194399, 10712804, 10364995, 10043572, 9818417, 9523401, 9356098, 9176334, 8982041, 8887285, 8937482, 8865111, 8842280, 8825000, 8789908, 8798615, 8789694, 8727765, 8566278, 8353684, 8196262, 7960579, 7746687, 7657722, 7482326, 7253155, 7212114, 7194717, 7140283, 7048069, 6958905, 6898894, 6906716, 6899784, 6868827, 6893241, 6814998, 6790420, 6884117, 6862769, 6950331, 7021279, 6978936, 6953428, 7031551, 7057523, 7114917, 7161871, 7172762, 7202522, 7307008, 7349105, 7380485, 7504349, 7665926, 7783516, 7811811, 7920403, 8036704, 8155229, 8255036, 8440340, 8654033, 8782462, 8924336, 9127060, 9308551, 9544528, 9757397, 10001851, 10315189, 10616531, 10908822, 11356010, 11726274, 12176828, 12682098, 13202138, 13709197, 14202867, 14807364, 15392240]
5018A5392240O71035Q77135R62927R23735R35645Q24946O49628L69657k02291
5009B1404657o44839j018855j021631r70450o85755n47886m82637j75749o1387
5000A5795468j3318M6976Q4223K06355K91255J85207K20620L26312L01302L39025
4990A7783425L64828L59896M16105L98699M54102M56770N15747O35308P31799
4981B2116679P34297P89472Q93567Q73986J028180J172283J372817J583142J803189
4972C2367612K079822K483594K758635L329616L799027L931744M056956L902316
4964E8709322L402519K439205J094952j080665l398601m525364m391680l620669
4956D8629019k842870j969947j383595p82355k12688K61637M67916N44373M68154
$$ y = [15392240, 16063275, 16940410, 17903337, 18827072, 19762717, 20587663, 21237291, 21606948, 21404657, 20759818, 19740963, 18719332, 17748882, 17063127, 16515241, 16032604, 15856855, 15795468, 15782150, 15829126, 15913349, 16119704, 16410959, 16596166, 16816786, 17143098, 17444400, 17783425, 18148253, 18508149, 18924254, 19322953, 19777055, 20233825, 20749572, 21384880, 22116679, 22850976, 23640448, 24534015, 25408001, 26436181, 27608464, 28981281, 30564423, 32367612, 34447434, 36931028, 39689663, 43019279, 46818306, 50750050, 54807006, 58709322, 62111841, 64551046, 65645998, 64565333, 61166732, 56641368, 52249688, 48629019, 45786149, 43816202, 42432607, 41650252, 41437564, 41699201, 42167117, 42711490, 43179644]
4947D3179644Q5435o08219j233142j814964k425411k413051k122575j740690j390855
4938B9516172j181619r60809p05329n95177l83494k72919j77234k54279k05285
4929B4780027j16403k92892n19303n76199p62352o04947n33789m10631l12694
4920B0650817k76610k87372k94323k12569j04624j12414q2136O919M1861q1021
4910A9248528r0706m7076j29762k21705k39525q1197p5554L9668J05856J50952
4900A8659479J84400R2726J2201o8862m15246o36208o59107o92736o92080o51347
4890A5133220n64932n58746n01935l17871k05447k97287k31755j76374j78839
4881A2100034j94839j51792r6846j63088j50240q9624j76525k05519j57885q6799
$$ y = [43179644, 43265079, 42656860, 41423718, 39608754, 37183343, 34770292, 32647717, 30907027, 29516172, 28334553, 27373744, 26668415, 26073238, 25689744, 25416825, 25239591, 24985312, 24780027, 24663624, 24370732, 23851429, 23275230, 22512878, 21907931, 21374142, 20963511, 20650817, 20374207, 20086835, 19792512, 19579943, 19475319, 19362905, 19280769, 19287688, 19329549, 19248528, 19157822, 19110746, 18980984, 18759279, 18519754, 18438557, 18363003, 18402671, 18508527, 18659479, 18843879, 18936605, 18948806, 18879944, 18464698, 17828490, 17169383, 16476647, 15784567, 15133220, 14568288, 14009542, 13507607, 13189736, 12984289, 12687002, 12455247, 12278873, 12100034, 11905195, 11753403, 11656557, 11493469, 11343229, 11253605, 11077080, 10871561, 10713676, 10626877]
4871A0626877j51689j81513j02836j55753q3808j14196j61431o1617o477j31970
4861I475587j21990o0575r6631j09324M9567j4740j00786p1928j9462j4041q306
4850H907371Q2287p31K9387l0362k8820M7932l8729j22702q9160k7257L9878M47
4838H769541o4847L5188P8084P0658M3940J09802P7540J32547J96103L10612K55480
4827A0014648L04598M79263M23300N41219O59411P08042R14936J010754J203765
4818A6259936J474586J697291J832813J855469J772584J691903J217220O42812
4810B8444614l53218j617874k475131k688582k305220k022766j794327j484945
4802A3702551j177962r87472q97844p79931o55778m76574m62425m93475m30555
$$ y = [10626877, 10475188, 10293675, 10190839, 10035086, 9951278, 9837082, 9675651, 9614034, 9607557, 9475587, 9353597, 9293022, 9196391, 9087067, 9136634, 9121894, 9021108, 8949180, 8929718, 8915677, 8907371, 8989658, 8988927, 9018314, 8987952, 8959132, 9007064, 8968335, 8845633, 8756473, 8729216, 8769094, 8769541, 8704694, 8739882, 8817966, 8888624, 8932564, 9042366, 9119906, 9252453, 9448556, 9759168, 10014648, 10319246, 10798509, 11221809, 11763028, 12422439, 13130481, 14045417, 15056171, 16259936, 17734522, 19431813, 21264626, 23120095, 24892679, 26584582, 27801802, 28444614, 28091396, 26473522, 23998391, 21309809, 19004589, 16981823, 15187496, 13702551, 12524589, 11537117, 10639273, 9859342, 9203564, 8726990, 8264565, 7771090, 7340535]
4793G340535k65277l34155l71170l11200k12632j79248j64399k21329k17726j38691
4783D924708k47428j28810p3967j09791j63624j80376q8418n9887j21269p5156
4773C675982n0111o6718j07202l6230o6962n3469l7935n6152n1895o1694q6860
4762C000754j0880j4909L1201n0702m6239m7820P57K1057m373m9154j255L924
4750B832361M0405K8905l7858n0744R375n9240j6049O4898n0566p3583k6181M55
4738B662178M1529L88m9271p4384L305j2114l6818Q7556J524m0798k0353R920
4726B572662L5782N1656N347P721M9614r2938j5954l9655p3196o9503j7628k8787
4714B385121o2202n5450j1019L6312l9498l6152L5220O190q8713L042r2606j6838
$$ y = [7340535, 7075258, 6741103, 6369933, 6058733, 5846101, 5666853, 5502454, 5281125, 5063399, 4924708, 4677280, 4548470, 4474503, 4364712, 4201088, 4020712, 3932294, 3872407, 3751138, 3675982, 3625871, 3559153, 3451951, 3415721, 3348759, 3295290, 3257355, 3201203, 3149308, 3087614, 3000754, 2989874, 2974965, 3006166, 2955464, 2909225, 2861405, 2862162, 2883219, 2878846, 2829692, 2828437, 2832361, 2872766, 2901671, 2863813, 2813069, 2822444, 2763204, 2747155, 2812053, 2761487, 2687904, 2661723, 2662178, 2703707, 2704095, 2654824, 2580440, 2583745, 2571631, 2534813, 2622369, 2623893, 2583095, 2562742, 2572662, 2608444, 2660100, 2665447, 2673168, 2722782, 2629844, 2613890, 2574235, 2501039, 2431536, 2413908, 2385121, 2322919, 2267469, 2256450, 2292762, 2253264, 2217112, 2252332, 2258522, 2169809, 2172851, 2080245, 2063407]
4702B063407R634l9780o9207P148R663j0750k4440k1065j9348J2255q5021k5564
4690A806932M7622j05516K717P7801K1357m6265l0703m8957l5901K4297m2918
4679A670466l993j965O2066m4506p1779R624J1673N3792L8793p7404o0034p838
4667A578895M6725j1908j7396J761O2258M4426j00875n0932J12107K7145n725
4656A686481M7200K6341j780K1172p9281j8185K2722o8310k5129p1699M7881K1829
4644A609242j05891P88o333n7140j2526L769Q0713K7563j9130q7493l8998O3479
4632A458043K706J1246l7847M0722N6105m2382n8018K2266P776q5686L1439l6635
4620A369735l8207O6722N431m2664J1707k6538k6371K3087J3054K2731j0626p5586
$$ y = [2063407, 2073041, 2033261, 1964054, 1971202, 1980865, 1970115, 1945675, 1924610, 1905262, 1917517, 1832496, 1806932, 1854554, 1749038, 1751755, 1829556, 1850913, 1804648, 1773945, 1724988, 1689087, 1713384, 1670466, 1666473, 1664508, 1726574, 1682068, 1610289, 1619913, 1631586, 1685378, 1724171, 1646767, 1586733, 1578895, 1625620, 1613712, 1596316, 1598077, 1660335, 1704761, 1603886, 1552954, 1665061, 1692206, 1686481, 1733681, 1760022, 1758242, 1779414, 1700133, 1681948, 1704670, 1636360, 1611231, 1539532, 1587413, 1609242, 1503351, 1504139, 1497806, 1440666, 1428140, 1431909, 1512622, 1540185, 1521055, 1433562, 1394564, 1458043, 1460749, 1471995, 1434148, 1474870, 1530975, 1488593, 1430575, 1452841, 1460617, 1374931, 1406370, 1369735, 1331528, 1398250, 1403681, 1361017, 1372724, 1346186, 1319815, 1342902, 1355956, 1378687, 1368061, 1292475]
4608A292475O250k241L2797K2116j6567l5527K0778L4309k8176M5779l1212j7302
4596A323479l4955k3878K0244K3870J8600j2753L3649q008K1303m4229l8037J5385
4584A294670l5890J44j0855k9876Q517N014L0065k3823k2643O053j352l263P2209
4571A288970m1096j3188J6344K0592j6282O2445o8151n3348j1241k9123L2880
4560A188802j5669j2378l3259J7853k0001p7079j607J6872k1543M549Q2186P4533
4548A203259o2210l4170L1297o207p8152J6929M7551J9550J2934M8515n9231J81
4536A140246K1444p4683l5103K9465q836L2148O080K3130O2071j00577m7700R4191
4524A141876j5444J2793M098k2842K5488J5912K7101m5944r0733J7897K6338l1296
$$ y = [1292475, 1298725, 1296484, 1329281, 1351397, 1334830, 1299303, 1320081, 1354390, 1326214, 1371993, 1340781, 1323479, 1288524, 1264646, 1284890, 1308760, 1327360, 1314607, 1348256, 1340248, 1361551, 1317322, 1279285, 1294670, 1258780, 1258924, 1248069, 1218193, 1226710, 1231724, 1261789, 1237966, 1215323, 1221376, 1220024, 1216761, 1288970, 1247874, 1234686, 1251030, 1271622, 1255340, 1317785, 1249634, 1196286, 1185045, 1155922, 1188802, 1173133, 1160755, 1127496, 1145349, 1125348, 1048269, 1046662, 1063534, 1041991, 1046540, 1128726, 1203259, 1141049, 1106879, 1138176, 1131969, 1053817, 1070746, 1118297, 1137847, 1150781, 1199296, 1140065, 1140246, 1161690, 1087007, 1051904, 1081369, 1072533, 1104681, 1110761, 1133891, 1195962, 1095385, 1047685, 1141876, 1126432, 1139225, 1143323, 1120481, 1145969, 1161881, 1188982, 1143038, 1052305, 1070202, 1096540, 1065244]
4512A065244j598M8673l4213K6450M8567l3676L5275R8155n5892j8724k8171o3001
4500A087089J05691O7328N7019n9384m7660n1103J5592l4543K1989k0339j2257
4489A129422Q4317l2756J7195m2129j8398l7888r2408M0822P1736M8624k0023
4478A148514r978J12421k8948L3497m2718l7382l320k0369m068L088M8681n8617
4466A140801l8524P7201L5373m7822L7196j5459j441k1661O7970L5248j3743p8403
4454A176736M2770L140m8254M8105J1780N6671j3038R458l1605k905M2565J4311
4442A309734p30j269L2298K6832m341J7529J911L6595p9473j0492N1443M8457
4430A428494o1013k9897O5777O9779k7191L2139J02124j30o1758j1735N0691o180
$$ y = [1065244, 1063646, 1112319, 1078106, 1104556, 1153123, 1119447, 1154722, 1252877, 1196985, 1178261, 1150090, 1087089, 1192780, 1260108, 1317127, 1257743, 1210083, 1158980, 1174572, 1140029, 1162018, 1141679, 1129422, 1213739, 1180983, 1198178, 1156049, 1137651, 1099763, 1007355, 1048177, 1119913, 1168537, 1148514, 1138536, 1250957, 1222009, 1255506, 1212788, 1175406, 1172086, 1151717, 1147649, 1150737, 1199418, 1140801, 1102277, 1179478, 1214851, 1167029, 1204225, 1188766, 1187325, 1165664, 1233634, 1268882, 1255139, 1176736, 1219506, 1222646, 1174392, 1222497, 1234277, 1290948, 1277910, 1287368, 1255763, 1252858, 1295423, 1309734, 1309004, 1307735, 1340033, 1366865, 1362524, 1380053, 1381964, 1418559, 1339086, 1328594, 1380037, 1428494, 1367481, 1337584, 1403361, 1473140, 1445949, 1478088, 1580212, 1580082, 1518324, 1506589, 1557280, 1551100]
4418A551100p565K8798L7930M709R587K1099N8130K1164o6713J5515Q5287N4758
4406A813799k4835j0656K7619l147M7294J4769j7638J3535K1716j333L2790n7506
4394A856407J3133J6788j0968K7592L3600Q5274L5765K2223L3656K3024O2511
4383B199005J8696m9629j27828r3316M359p246n0347j4609l4942m2357j06389
4372A695397J4749j2971l1191n8705J8032k7533r6042K2309o8587R437L0019J888
4360A496802j7673q4918r429M7662N215n9934O976j4787L1901l6018j0384K6410
4348A381823L870r8590m1698j9183j4888L0247K6011J0711j909k04j05193J7456
4336A188453L9367N9431n6946K5347j9773k8834L2095m1888r946M3404l3895L905
$$ y = [1551100, 1543535, 1572333, 1610263, 1614972, 1624559, 1645658, 1703788, 1724952, 1658239, 1673754, 1759041, 1813799, 1788964, 1778308, 1805927, 1802780, 1850074, 1864843, 1847205, 1860740, 1882456, 1881123, 1913913, 1856407, 1869540, 1886328, 1875360, 1902952, 1936552, 2021826, 2057591, 2079814, 2113470, 2136494, 2199005, 2217701, 2168072, 2040244, 1946928, 1951287, 1944041, 1893694, 1879085, 1844143, 1801786, 1695397, 1710146, 1697175, 1665984, 1607279, 1625311, 1597778, 1501736, 1524045, 1455458, 1464895, 1494914, 1496802, 1479129, 1394211, 1384782, 1432444, 1437659, 1377725, 1384701, 1369914, 1401815, 1365797, 1355413, 1381823, 1385693, 1287103, 1245405, 1226222, 1211334, 1241581, 1267592, 1278303, 1276394, 1276190, 1170997, 1188453, 1227820, 1287251, 1230305, 1255652, 1235879, 1207045, 1239140, 1197252, 1187306, 1230710, 1196815, 1200720]
4324A200720o8698j6465O2694k8438j5677P5914M9917J9737N7931k3338l7084
4313A277213k3286q7354L3951N72M4315j3740m3050K5947O279K5157J8585k7393
4301A237196j5506L1445j3931j2978l0048J9663k0453j5610M1831K3681L0232
4290A275522k0892J3154r761r17o3260j7763P4002j6673j2761n4363O853P8042
4278A251183J6397K4642L9221q4291j6076Q3884J0326L041k1448r623l3037m921
4266A259298J0678j7840N8499J5316J7002O0586M374p3569j4112k979P2392p001
4254A382644R544l1152p2615J2413J09884J6840R292o9488M1120N3319L306J0852
4242A475959N1675K0190n4977L3584m1581k1368j4911P8446N0237K1059J0445
$$ y = [1200720, 1132022, 1115557, 1178251, 1149813, 1134136, 1210050, 1259967, 1279704, 1337635, 1314297, 1277213, 1253927, 1166573, 1200524, 1201096, 1245411, 1231671, 1188621, 1214568, 1220847, 1246004, 1264589, 1237196, 1221690, 1253135, 1239204, 1226226, 1196178, 1215841, 1195388, 1179778, 1221609, 1245290, 1275522, 1254630, 1267784, 1258023, 1257106, 1193846, 1176083, 1250085, 1233412, 1220651, 1166288, 1173141, 1251183, 1267580, 1292222, 1331443, 1247152, 1231076, 1314960, 1325286, 1328327, 1306879, 1297256, 1264219, 1259298, 1269976, 1252136, 1310635, 1325951, 1342953, 1403539, 1407913, 1334344, 1320232, 1317253, 1389645, 1382644, 1392188, 1361036, 1288421, 1300834, 1410718, 1427558, 1436850, 1367362, 1408482, 1461801, 1465107, 1475959, 1527634, 1547824, 1492847, 1526431, 1484850, 1463482, 1448571, 1527017, 1577254, 1598313, 1608758]
4231A608758Q3752n5028n8684M0116r4986J4645P3069N225L6063K3611K7528j3237
4219A690832O7232L8345R463O4147j2712L4047j8835k6605L2142p4195j013J9983
4207A822831K0849m2985Q396M8879Q8894O694N2855M3514r171K8014o8076k1663
4195A979031L1071J01051K7448n132K0640R62N3835P6149k4632j3360N840P6462
4183B329365j537j5003J51988J5339K8272k2379J8640l665J7554J12630N3492
4172B684696P9075j2498n9575j1950L8765P731N0576j828m0208L0856P0452Q89
4160B836981N5399P3623J7304J3983J0301L08N7415K4107N1060J3124M7924j3131
4148C188398N0479P8279o0711r245Q4946N7862P715O1670J1810K4211P7352L0862
$$ y = [1608758, 1692510, 1637482, 1578798, 1618914, 1523928, 1538573, 1611642, 1616867, 1652930, 1676541, 1704069, 1690832, 1758064, 1796409, 1805872, 1870019, 1857307, 1891354, 1872519, 1845914, 1878056, 1803861, 1802848, 1822831, 1843680, 1800695, 1809091, 1857970, 1946864, 1953558, 2006413, 2049927, 2040756, 2068770, 2000694, 1979031, 2010102, 2111153, 2138601, 2133469, 2154109, 2155071, 2208906, 2285055, 2260423, 2247063, 2252903, 2329365, 2327828, 2312825, 2464813, 2480152, 2508424, 2486045, 2504685, 2501020, 2518574, 2631204, 2684696, 2763771, 2751273, 2691698, 2679748, 2718513, 2726244, 2776820, 2774992, 2734784, 2765640, 2836092, 2836981, 2892380, 2966003, 2983307, 2997290, 3007591, 3007899, 3065314, 3089421, 3140481, 3153605, 3201529, 3188398, 3238877, 3317156, 3256445, 3247200, 3332146, 3390008, 3397723, 3459393, 3471203, 3495414, 3572766, 3603628]
4136C603628q322Q2164M3954K1026P0612o080L2956K3355K3262K3222N7395K4554
4124C991726M5391P281J2880N5960l0568L7627j7260L165P3473R6326P3755Q8561
4112D438317L7834K2299p477L6479P173K6373K0291K5728j8314M3422R2376J6599
4100D741100M2481P252k0920J9906M430P8501M0718K4576J8702Q0556k1067j4490
4088E001745m090j8625M9029j8818Q9570N6007j097M5984L6408j6048L9021k0779
4076E238307M1658K0781L2473K1663K8296M090N323n4675P8385P4197k8969Q850
4064E470379N919K0092Q7880j7305L1628m955j0807J5618M8188Q9220K92n261
4052E730888j4696k4770m5740Q5223M085N7779K0842M7169k6321J06029m5844
$$ y = [3603628, 3595306, 3677470, 3721424, 3742450, 3813062, 3806982, 3839938, 3863293, 3886555, 3909777, 3967172, 3991726, 4037117, 4044398, 4057278, 4113238, 4082670, 4120297, 4103037, 4106202, 4179675, 4276001, 4349756, 4438317, 4476151, 4498450, 4490973, 4527452, 4534625, 4560998, 4581289, 4607017, 4588703, 4632125, 4724501, 4741100, 4783581, 4790833, 4769913, 4789819, 4794249, 4872750, 4913468, 4938044, 4956746, 5037302, 5016235, 5001745, 4997655, 4979030, 5028059, 5009241, 5098811, 5154818, 5153721, 5199705, 5236113, 5220065, 5259086, 5238307, 5279965, 5300746, 5333219, 5354882, 5383178, 5387268, 5392591, 5337916, 5416301, 5490498, 5461529, 5470379, 5476298, 5496390, 5584270, 5566965, 5598593, 5593638, 5582831, 5598449, 5646637, 5735857, 5736149, 5730888, 5716192, 5691422, 5645682, 5730905, 5734990, 5792769, 5813611, 5860780, 5834459, 5940488, 5894644]
4041E894644l5944J00340j4616L6050M8648M3931M4401L4636L390k295j1005M7725
4029F189905K0337J470N8664k7560j6166J06468L4456J8884O7037R124R3260L7515
4017F593394l6257M8765p235O1542J7467P4096q094K2477O4574J8349k3487k3667
4005F801924M2440R8204o880N4698J16230q6306J9336L7924N9477M4766P1404
3994G253217J72861N3525l6291M8485M9357J9020k9275N0900J00036P1842N8105
3983G811782Q1109M5499P8895J10511N4612N6073M8065P1244j0432P4010M4445
3972H465813J53353L4691N1972J00364M9236J09352J07830M3054Q3840J16940
3962I316445L9172P6810R2988J36023K5484J72362Q7455J7173J21026J35535M8788
$$ y = [5894644, 5858700, 5959040, 5944424, 5980474, 6029122, 6073053, 6117454, 6152090, 6155480, 6153185, 6142180, 6189905, 6210242, 6211712, 6270376, 6242816, 6226650, 6333118, 6367574, 6386458, 6453495, 6462619, 6555879, 6593394, 6557137, 6605902, 6598667, 6660209, 6677676, 6751772, 6743678, 6766155, 6830729, 6849078, 6825591, 6801924, 6844364, 6942568, 6935688, 6990386, 7106616, 7020310, 7039646, 7077570, 7137047, 7181813, 7253217, 7426078, 7479603, 7443312, 7491797, 7541154, 7560174, 7530899, 7581799, 7681835, 7753677, 7811782, 7892891, 7938390, 8017285, 8127796, 8182408, 8238481, 8286546, 8357790, 8347358, 8421368, 8465813, 8619166, 8653857, 8705829, 8806193, 8855429, 8964781, 9072611, 9115665, 9199505, 9316445, 9355617, 9432427, 9525415, 9661438, 9686922, 9859284, 9946739, 9963912, 10084938, 10220473, 10269261]
3951A0269261O0763J62027R3445N4701R9564J23858J10352O7713J63217J60455
3941A1365356J01597O5504J32055Q0017Q3458J19752J72459J27939Q3259J14917
3931A2446313J23048J42430J01721J23383J72735J32281J05510J40075J36016
3922A3623512J69689J46815J33702J59239K75184K36544Q7299O5881J00456K30380
3912A5228701K48024J47067R5194J22315Q9948J12927K08007J04913J32206J35689
3902A6624991J01922M9269J60574J58919M3645P6349J43836P8277R0449J76501
3892A7704732L7356Q6803R7863l6504K04106O1576J6757Q4069J24368Q4946L8207
3881A8504279L4255O5851J07634K3556L9810r662K2460N1658J6542M544M3774
$$ y = [10269261, 10330024, 10492051, 10585496, 10640197, 10739761, 10863619, 10973971, 11041684, 11204901, 11365356, 11466953, 11532457, 11664512, 11744529, 11827987, 11947739, 12120198, 12248137, 12331396, 12446313, 12569361, 12711791, 12813512, 12936895, 13109630, 13241911, 13347421, 13487496, 13623512, 13793201, 13940016, 14073718, 14232957, 14508141, 14744685, 14831984, 14897865, 14998321, 15228701, 15476725, 15623792, 15718986, 15841301, 15931249, 16044176, 16252183, 16357096, 16489302, 16624991, 16726913, 16776182, 16936756, 17095675, 17139320, 17215669, 17359505, 17437782, 17528231, 17704732, 17742088, 17828891, 17926754, 17890250, 18094356, 18155932, 18172689, 18256758, 18381126, 18466072, 18504279, 18538534, 18604385, 18712019, 18735575, 18775385, 18765723, 18788183, 18839841, 18856383, 18860927, 18904701]
3870A8904701N9179N1857n525J8102J00454L6723J7085O710j0488N7303P6681
3859A9312782R6906M0870N4144Q5430j673O6673M3006P6613Q1453P2629M2886
3848A9971719L1199L5275M1622j4797L9573J31716n7443N5297M9077N9733o2520
3837B0280451r581O3988K488j30449l7754j2507J8929N648j33153o0895l4301
3826A9952864l150j70012p7512l8183j21681j7589k3442n0486n4693j16223j1968
3815A9267925l3397m3410r4312k137N761k7736q2713K837L4968j8415o6729q4735
3803A8857907N6626r0824N0244P7491M8475n0329l163O477M9287m0089L6598R779
3791A9008479p048L3865p829L8765J00219j4040M9363M0452J5910M2278J384J43247
$$ y = [18904701, 18963880, 19015737, 19010212, 19028314, 19128768, 19165491, 19182576, 19189286, 19178798, 19236101, 19312782, 19409688, 19450558, 19504702, 19590132, 19588459, 19655132, 19698138, 19774751, 19856204, 19928833, 19971719, 20002918, 20038193, 20079815, 20065018, 20104591, 20236307, 20178864, 20234161, 20283238, 20342971, 20280451, 20270870, 20334858, 20337346, 20206897, 20169143, 20156636, 20175565, 20181213, 20048060, 19987165, 19952864, 19949714, 19779702, 19702190, 19664007, 19542326, 19524737, 19501295, 19450809, 19396116, 19279893, 19267925, 19234528, 19191118, 19096806, 19094669, 19100430, 19072694, 18989981, 18992818, 19027786, 19009371, 18942642, 18857907, 18914533, 18823709, 18873953, 18951444, 18999919, 18949590, 18946427, 18952904, 19002191, 18962102, 18998700, 19008479, 19001431, 19035296, 19027467, 19066232, 19166451, 19152411, 19201774, 19242226, 19258136, 19300414, 19301798, 19445045]
3779A9445045J12975N8732M8354O6350N2691M8413Q6846J07322J01662N9427R2450
3768B0280267M9614P6980J02235k5892J32854O9146J5341J9188N5269K6146Q1116
3757B0882264M8885N8375M4798M8928P7106R4983P7493J9014J06580J20768O1567
3746B1640761J28421J41491J14666N1093Q8887J32741Q0131J28238J69460J32267
3736B2808156M1355N905J5798Q554P0477k3905o8804j63j1025J4458J0457R175
3724B2880438M3776L572L8467L7438L3078O4252P8979Q6148J1070L2790R7049
3713B3407057O4235N8457N8892Q5059o701P5212J44185N6548n8613M8431o9464
3702B3863298l5988m5378j9295Q0032k5724k6579n5323J6335N3484O2047n7676
$$ y = [19445045, 19558020, 19616752, 19665106, 19731456, 19784147, 19832560, 19919406, 20026728, 20128390, 20187817, 20280267, 20329881, 20406861, 20509096, 20483204, 20616058, 20685204, 20700545, 20719733, 20775002, 20801148, 20882264, 20931149, 20989524, 21034322, 21083250, 21160356, 21255339, 21332832, 21351846, 21458426, 21579194, 21640761, 21769182, 21910673, 22025339, 22076432, 22165319, 22298060, 22378191, 22506429, 22675889, 22808156, 22849511, 22855416, 22871214, 22879768, 22950245, 22926340, 22857536, 22857373, 22846348, 22860806, 22871263, 22880438, 22924214, 22927786, 22966253, 23003691, 23036769, 23101021, 23180000, 23266148, 23277218, 23310008, 23407057, 23471292, 23529749, 23588641, 23673700, 23666999, 23742211, 23886396, 23942944, 23884331, 23932762, 23863298, 23827310, 23781932, 23762637, 23842669, 23816945, 23790366, 23735043, 23751378, 23804862, 23866909, 23809233]
3691B3809233Q1140Q8175J02985L7665L9691J60782R9779N8088J20720M9455P0960
3680B4718673J64135J17258R6544L9199L723O2646J9603J9273K1951O6393L4040
3669B5363438K924O9056n7800L7222O8307P4020L5168P0768R4590J08727J20977
3658B5987397J36293L4542k7388R3889J33356K09763P3235J49965J07615Q8395
3648B6987062J22340Q0451Q8556J27021J2852M9515J51469R3765R4468O3272J63313
3637B8034084J57232J66779Q6084L4284J73311J29366J05468J21856J32916R6418
3627B9237798J88725J79819J67854K31197K59714J91044J86985J73098J80807
3618C0997041K33555K54703K04720K61243K14027L07558K03311K26664K80414
$$ y = [23809233, 23890373, 23978548, 24081533, 24119198, 24158889, 24319671, 24419450, 24477538, 24598258, 24647713, 24718673, 24882808, 25000066, 25096610, 25135809, 25139532, 25202178, 25221781, 25241054, 25263005, 25329398, 25363438, 25366362, 25435418, 25377618, 25414840, 25483147, 25557167, 25592335, 25663103, 25757693, 25866420, 25987397, 26123690, 26158232, 26130844, 26224733, 26358089, 26567852, 26641087, 26791052, 26898667, 26987062, 27109402, 27189853, 27278409, 27405430, 27418282, 27467797, 27619266, 27713031, 27807499, 27870771, 28034084, 28191316, 28358095, 28444179, 28478463, 28651774, 28781140, 28886608, 29008464, 29141380, 29237798, 29426523, 29606342, 29774196, 30005393, 30265107, 30456151, 30643136, 30816234, 30997041, 31230596, 31485299, 31690019, 31951262, 32165289, 32472847, 32676158, 32902822, 33183236]
3609C3183236K25108L31457K87425L02773K97905J95300L38067K65150K99043
3600C5725464K54950K41810M08872K24440K55080L28299L62135K84390L23686
3591C8409126K95665L04295L12197K83306L28482L69378L65983L43055L46783
3582D1358270M13915M36610M60954M25088M26073M82969M39554L46892M84879
3573D5275204M96628M76249M91840N61116M84955M32081N31697N90920M94449
3564D9835139N52502N81081N96825O58060O55382O87393O04583P22526P88883
3555E5682374O88942P33092P48225P92187Q04950Q47398Q33028P86586R01203
3546F2817985J011022R36797R26498R68095J061611J014133J047457J164198J175908
$$ y = [33183236, 33408344, 33739801, 34027226, 34329999, 34627904, 34823204, 35161271, 35426421, 35725464, 35980414, 36222224, 36631096, 36855536, 37110616, 37438915, 37801050, 38085440, 38409126, 38704791, 39009086, 39321283, 39604589, 39933071, 40302449, 40668432, 41011487, 41358270, 41772185, 42208795, 42669749, 43094837, 43520910, 44003879, 44443433, 44790325, 45275204, 45771832, 46248081, 46739921, 47301037, 47785992, 48218073, 48749770, 49340690, 49835139, 50387641, 50968722, 51565547, 52223607, 52878989, 53566382, 54170965, 54893491, 55682374, 56371316, 57104408, 57852633, 58644820, 59449770, 60297168, 61130196, 61916782, 62817985, 63829007, 64765804, 65692302, 66660397, 67722008, 68736141, 69783598, 70947796, 72123704]
3537G2123704J127716J209161J280599J282014J374395J457528J488597J579213
3529H2922927J536902J602277J711862J725045J841799J830233J882468J958890
3521I7012403J990229K090373K142172K180105K069642K234031K334522K344488
3513A14397965K443613K575338K657058K691926K745981K919674K999880L026744
3505A36458179L143333L188841L306089L341642L569270L584578L631114L864261
3497A64087307M048410M217824M479950M793869N088628N349281N804614O284354
3489B04154237O811198P355802P848274Q522710R207874R743148J0517233J1141192
3481B75301668J1935280J2276735J2582474J2845940J2704742J2256730J1291267
$$ y = [72123704, 73251420, 74460581, 75741180, 77023194, 78397589, 79855117, 81343714, 82922927, 84459829, 86062106, 87773968, 89499013, 91340812, 93171045, 95053513, 97012403, 99002632, 101093005, 103235177, 105415282, 107484924, 109718955, 112053477, 114397965, 116841578, 119416916, 122073974, 124765900, 127511881, 130431555, 133431435, 136458179, 139601512, 142790353, 146096442, 149438084, 153007354, 156591932, 160223046, 164087307, 168135717, 172353541, 176833491, 181627360, 186715988, 192065269, 197869883, 204154237, 210965435, 218321237, 226169511, 234692221, 243900095, 253643243, 264160476, 275301668, 287236948, 299513683, 312096157, 324942097, 337646839, 349903569, 361194836]
3474C61194836R803141P889715N407959K510569n79786l708154o611825q909245
3466C66997210j0529898j1508229j1838582j1683553j1363867j0980722j0275920
3459B88816439r685157r051635q472882p888372p293297o897348o391746n929897
3451B27206105n423679n041433m690919m378625m036363l798402l556760l386830
3443A92893094l120072k972929k986590k880320k847489k700521k681963k810808
3435A69892402k742247k773884k774184k783859k953909l041930l185594l326766
3427A46310029l373591l240060l230306l094453k988262k908745k847352k630466
3419A21996794k447928k155542k147467k013466j976696j866154j772593j598368
$$ y = [361194836, 370997977, 378887692, 384295651, 386806220, 386226434, 382518280, 375906455, 366997210, 356467312, 344959083, 333120501, 321436948, 310073081, 299092359, 288816439, 279131282, 270079647, 261606765, 253718393, 246425096, 239527748, 233136002, 227206105, 221782426, 216740993, 212050074, 207671449, 203635086, 199836684, 196279924, 192893094, 189773022, 186800093, 183813503, 180933183, 178085694, 175385173, 172703210, 169892402, 167150155, 164376271, 161602087, 158818228, 155864319, 152822389, 149636795, 146310029, 142936438, 139696378, 136466072, 133371619, 130383357, 127474612, 124627260, 121996794, 119548866, 117393324, 115245857, 113232391, 111255695, 109389541, 107616948, 106018580]
3411A06018580j574459j564957j474453j419551j272888j356872j282803j217133
3403I4855464j142124j029070r34926j000690r91008j018506j049706j098653
3395H6590781j074042j027598j041294j090703j026644r56595r65849r89689q70274
3386G7548093p96416q59216p66010o87579p22854p49626o22570n53852o44750
3377G1145220o45356o36629n48705o21861o05881o14401o42827n27328n58525
3368F5743707n94625n88581n13045n47959n48746o07043n38744n85293o01937
3359F0617734n04669m99949m98139n35566m55035n08276n00846n02356m78035
3350E6134863m44203l80893l92422l86376l25818m12040l73701l69621l54451
$$ y = [106018580, 104444121, 102879164, 101404711, 99985160, 98712272, 97355400, 96072597, 94855464, 93713340, 92684270, 91749344, 90748654, 89757646, 88739140, 87689434, 86590781, 85516739, 84489141, 83447847, 82357144, 81330500, 80373905, 79408056, 78418367, 77548093, 76751677, 75892461, 75126451, 74438872, 73716018, 72966392, 72343822, 71789970, 71145220, 70499864, 69863235, 69314530, 68692669, 68086788, 67472387, 66829560, 66302232, 65743707, 65149082, 64560501, 64047456, 63499497, 62950751, 62343708, 61804964, 61219671, 60617734, 60113065, 59613116, 59114977, 58579411, 58124376, 57616100, 57115254, 56612898, 56134863, 55690660, 55309767, 54917345, 54530969, 54205151, 53793111, 53419410, 53049789, 52695338]
3341E2695338l65434k82184l32092l67791l94471k68320k94448l03961k84795
3332D9801842l16766k70538k22627k75629k16091k91172k30095k15293k85271
3323D7478360k26207k68054j93867j34998j73944j96950j66568k19691j25484
3314D5772597n3415j49896j84707k40231k23114j95033j59862j68222k78301k35038
3304D3884778j98055l11965k33387j55927k85966k60259k53859k85834l16188
3295D1583338k24112k29105l31352k81528j82893k13734k66572k85620j65546
3286C9402876k34745j99960k53298k20479j80886j23786k16154j56046j39385
3277C7678137r9393j49184k22715k01727j16559k58226k94024k57446l36846k54034
$$ y = [52695338, 52329904, 52047720, 51715628, 51347837, 50953366, 50685046, 50390598, 50086637, 49801842, 49485076, 49214538, 48991911, 48716282, 48500191, 48209019, 47978924, 47763631, 47478360, 47252153, 46984099, 46790232, 46655234, 46481290, 46284340, 46117772, 45898081, 45772597, 45719182, 45569286, 45384579, 45144348, 44921234, 44726201, 44566339, 44398117, 44119816, 43884778, 43686723, 43374758, 43141371, 42985444, 42699478, 42439219, 42185360, 41899526, 41583338, 41359226, 41130121, 40798769, 40517241, 40334348, 40120614, 39854042, 39568422, 39402876, 39168131, 38968171, 38714873, 38494394, 38313508, 38189722, 37973568, 37817522, 37678137, 37578744, 37429560, 37206845, 37005118, 36888559, 36630333, 36336309, 36078863, 35742017, 35487983]
3267C5487983k71257k80728k37561k84385k44858k57404k44420j62371j67940
3258C3337059j32845k39251q9312j08961j54463j39042q4734l7489j297k9918
3248C2319747m3173m8007k7864j0814L8524L2370L3797J61143k5445o314P7624
3237C2501588K8052K9987O8968N4778j7376O4177J36525J34585J61485K13470
3227C3376239J52179K10756K77591K68423K30691K89014L19770K55486K62654
3218C5642803K13095K33983L45204K62397L28741L03122L04377L72070L80589
3209C8386381M11050M22639N16506M76389N00120M37514M38364L81700K46143
3200D2216806K78461L02242L12116L71000M44255L39161M42392N01558M88576
$$ y = [35487983, 35216726, 34935998, 34698437, 34414052, 34169194, 33911790, 33667370, 33504999, 33337059, 33204214, 32964963, 32875651, 32766690, 32612227, 32473185, 32388451, 32350962, 32349665, 32319747, 32276574, 32228567, 32200703, 32189889, 32228413, 32260783, 32294580, 32455723, 32430278, 32423964, 32501588, 32529640, 32559627, 32628595, 32683373, 32665997, 32730174, 32866699, 33001284, 33162769, 33376239, 33528418, 33739174, 34016765, 34285188, 34515879, 34804893, 35124663, 35380149, 35642803, 35855898, 36089881, 36435085, 36697482, 37026223, 37329345, 37633722, 38005792, 38386381, 38797431, 39220070, 39736576, 40212965, 40713085, 41150599, 41588963, 41970663, 42216806, 42495267, 42797509, 43109625, 43480625, 43924880, 44264041, 44706433, 45207991, 45696567]
3191D5696567N19363N65823N99217P41779O80946P12810Q71675Q55099P86899
3182E2030178Q73560R60584R79414J133190J149385J180779J247658J408363J315297
3173F2278408J386727J392971J517295J630046J663933J724748J807479J942406
3165G5344013K043058K091000K022250K101716K059656K019099J940727J774241
3157I1395760J642711J585641J475856J467411J307517J409449J412003J386441
3149A03082789J480438J590726J842178K174686K295032K528135K794537L058628
3141A20847149L506867L778387M075095M324942M611570M755783M955421M866379
3133A55721593M618600M245011L531309K615200J511925K78224r52415j959117
$$ y = [45696567, 46215930, 46781753, 47380970, 48122749, 48803695, 49516505, 50388180, 51243279, 52030178, 52903738, 53864322, 54843736, 55976926, 57126311, 58307090, 59554748, 60963111, 62278408, 63665135, 65058106, 66575401, 68205447, 69869380, 71594128, 73401607, 75344013, 77387071, 79478071, 81500321, 83602037, 85661693, 87680792, 89621519, 91395760, 93038471, 94624112, 96099968, 97567379, 98874896, 100284345, 101696348, 103082789, 104563227, 106153953, 107996131, 110170817, 112465849, 114993984, 117788521, 120847149, 124354016, 128132403, 132207498, 136532440, 141144010, 145899793, 150855214, 155721593, 160340193, 164585204, 168116513, 170731713, 172243638, 172521862, 171569447, 169610330]
3125A69610330k676846l037071l086672k813032k262998j659362r61676k86365
3117A52826308K59375Q23785J286932J792297K183663K546892K764703K863791
3109A67347746K955505K944590K729904K393564K057919J426270P25375J6385
3101A82597258r41887j914115k852474l476127m123959m625479m801543m922271
3093A54939403m659119m324950l799450l160551k732320k127399j686214j255251
3085A31194149q93215o99163n79865n42590n65848q40934j108061j555538j940564
3076A22468371k342286k772821l216075l495456l797473m008674m049591l995526
3068I4790469l890003l669963l480916l179267k935414k703367k541761k460423
$$ y = [169610330, 166933484, 163896413, 160809741, 157996709, 155733711, 154074349, 153112673, 152826308, 153085683, 153909468, 155196400, 156988697, 159172360, 161719252, 164483955, 167347746, 170303251, 173247841, 175977745, 178371309, 180429228, 181855498, 182580873, 182597258, 181655371, 179741256, 176888782, 173412655, 169288696, 164663217, 159861674, 154939403, 150280284, 145955334, 142155884, 138995333, 136263013, 134135614, 132449400, 131194149, 130300934, 129601771, 129021906, 128479316, 127913468, 127072534, 125964473, 124408935, 122468371, 120126085, 117353264, 114137189, 110641733, 106844260, 102835586, 98785995, 94790469, 90900466, 87230503, 83749587, 80570320, 77634906, 74931539, 72389778, 69929355]
3060F9929355k139494k004548j957855j692741j703674j587035j302335j253701
3052E6287972j354129j188919j247809j347279j230871j229465j374434j336858
3044D5978208j294108j230463j265409j130187j070023j068215r68190j020702
3036C6930911r67106q93532q31549q69026p95406p42711o97187p23120o99225
3027B9712049o07875n55351n57393m52719m48032m72393m17878l15472l85649
3018B5499287k97406l12761l84427l31741l21990l80164l09578l93038l55948
3009B2412234l93020l71934l88978l70303l49243m40907l83070l73581m06858
3000A8934340m00267l25874l23360k97672k80508k66658l11389j58559j81545
$$ y = [69929355, 67789861, 65785313, 63827458, 62134717, 60431043, 58844008, 57541673, 56287972, 54933843, 53744924, 52497115, 51149836, 49918965, 48689500, 47315066, 45978208, 44684100, 43453637, 42188228, 41058041, 39988018, 38919803, 37951613, 36930911, 35963805, 35070273, 34238724, 33369698, 32574292, 31831581, 31134394, 30411274, 29712049, 29104174, 28548823, 27991430, 27538711, 27090679, 26618286, 26200408, 25884936, 25499287, 25201881, 24889120, 24504693, 24172952, 23850962, 23470798, 23161220, 22768182, 22412234, 22019214, 21647280, 21258302, 20887999, 20538756, 20097849, 19714779, 19341198, 18934340, 18534073, 18208199, 17884839, 17587167, 17306659, 17040001, 16728612, 16570053, 16388508]
2991A6388508k04289j21085j98896j21918j01115k13398j79071k29003j99008
2982A4820725j92280k17823k31667k56935j78595l23545j37494l32661l22117
2973A2627608j60189k02408j58159j79967j37958k02872k21503j48125j63877
2964A1052550j82016j10710k31277j83035j03115j40622k19674j52286j07448
2955I622367j03466j44921o9294j22371j92291j03512j66094j06592m0826n1480
2945H521520q6239j20246j32433j02281j2545j04874j23143n9107m2681J1473
2935G749444r9828m5479q3890K2994r7546j31443n7447o5138N068j7342J065p9252
2923G101206J6541j14233q425m1997j05169l9053m0019j7828o0789m5621k7517
$$ y = [16388508, 16184219, 16063134, 15864238, 15742320, 15641205, 15427807, 15248736, 15019733, 14820725, 14628445, 14410622, 14178955, 13922020, 13743425, 13419880, 13282386, 12949725, 12627608, 12467419, 12265011, 12106852, 11926885, 11788927, 11586055, 11364552, 11216427, 11052550, 10870534, 10759824, 10528547, 10345512, 10242397, 10101775, 9882101, 9729815, 9622367, 9518901, 9373980, 9304686, 9182315, 8990024, 8886512, 8720418, 8613826, 8573000, 8521520, 8435281, 8315035, 8182602, 8080321, 8067776, 7962902, 7839759, 7780652, 7737971, 7749444, 7649616, 7604137, 7520247, 7543241, 7445695, 7314252, 7256805, 7191667, 7196735, 7179393, 7180458, 7101206, 7117747, 7003514, 6995089, 6953092, 6847923, 6808870, 6768851, 6751023, 6690234, 6644613, 6617096]
2912F617096l5025j70713P1007N1934j83303o9035p7148j4894k6261m2556o5045
2901F056057m8915r391q242N085j36184n4593Q487l8819k1311j8539M8951N716
2889E788302k6976j4600K5142j24228j17705M0980q0930j5847L5894o2948M0276
2878E487360m4349m3968p9825r429j3308l9261m0435q5931O007O3905M4727j03376
2866E142117p6654N8406k7536p856n0158o6512R7968p2972l232k4303m0419k1150
2854D907699L3388l9977l3803P838P7868j528Q43O9644j12032r6634k2868L1084
2842D821522m6183k8944p5539m8809j0322j4846j9325K647k6887j08533m4017
2831D400764O4010j5449O537l0611P601P4227m178P188m1563j6900n390k6775
$$ y = [6617096, 6582071, 6411358, 6482365, 6534299, 6350996, 6281961, 6204813, 6189919, 6163658, 6121102, 6056057, 6007142, 5997751, 5989509, 5994594, 5858410, 5803817, 5812304, 5773485, 5752174, 5733635, 5782586, 5788302, 5761326, 5746726, 5771868, 5647640, 5529935, 5570915, 5489985, 5474138, 5510032, 5447084, 5487360, 5443011, 5399043, 5319218, 5309789, 5296481, 5257220, 5216785, 5130854, 5136861, 5200766, 5245493, 5142117, 5065463, 5123869, 5096333, 5088477, 5038319, 4971807, 5069775, 4996803, 4993571, 4969268, 4928849, 4907699, 4941087, 4901110, 4867307, 4875145, 4953013, 4951485, 4952328, 5021972, 4909940, 4813306, 4790438, 4821522, 4775339, 4746395, 4670856, 4622047, 4611725, 4596879, 4577554, 4580201, 4553314, 4444781, 4400764, 4464774, 4449325, 4455862, 4425251, 4432852, 4507079, 4502901, 4510089, 4468526, 4451626, 4446236, 4419461]
2819D419461r2516L4352K8677k1640k9113k6991m1311j4436o6858j16278o483
2808D066864j1179r4401l696o0221m8498K7399J6110l6986p5356m855p225j4983
2796C752973k9954L362K449l1738r9680J7462k1376o4941n2667p9405m4044m9585
2784C302856l3087n7354j01765K3124K3940L2877o6968k789k2274j01965J7405
2773C014000M5263j4850J73K716r2429J5709K8685j17463L8845J3356m4096j4215
2761B875694j0048L504r961M8115l6555j9209l8833m5916r7952L0958j2634o090
2749B681073M0144l4808n7187n1549P61O684k2819J2731M0304k5111o3413p1280
2737B455530O2006j5071o6010Q480l1800n0940m72Q584n0213j2020n9990l8139
$$ y = [4419461, 4326945, 4361297, 4389974, 4368334, 4339221, 4312230, 4270919, 4256483, 4189625, 4073347, 4066864, 4055685, 3961284, 3957588, 3897367, 3848869, 3876268, 3892378, 3855392, 3780036, 3775181, 3767956, 3752973, 3723019, 3726381, 3728830, 3697092, 3597412, 3614874, 3593498, 3528557, 3475890, 3396485, 3352441, 3302856, 3269769, 3212415, 3110650, 3133774, 3157714, 3190591, 3123623, 3120834, 3098560, 2996595, 3014000, 3059263, 3044413, 3044586, 3047302, 2954873, 2970582, 2999267, 2881804, 2920649, 2934005, 2889909, 2875694, 2865646, 2869150, 2859189, 2907304, 2870749, 2851540, 2812707, 2766791, 2668839, 2699797, 2687163, 2681073, 2721217, 2686409, 2629222, 2577673, 2578434, 2585118, 2562299, 2575030, 2615334, 2590223, 2526810, 2455530, 2517536, 2502465, 2436455, 2444935, 2413135, 2362195, 2361723, 2370307, 2320094, 2308074, 2248084, 2209945]
2725B209945K4018K8363p3349k3078N8674J5439l0218r4682o8045K1053O7076
2714B135196j0994m7888o2495O3861p154p834m740r685k0271k5350N7316M1910
2702B101872l8013o7587j0585l9500L6869L6565o6416p743o7558n6200j0148l283
2690A808273N7436n9869l9737m2234r026n8060Q263j3094m4334l1376n4936N2096
2678A573402M5969m8312K7292J5794o9201n6010k3741j4476R2p9505j2337L4004
2666A392971m006j0931m6921m5019J6945M7153k0105m2556r3389j4483Q1811p4190
2654A187280l9965p445m7039O7090j8835l521m3270j2023N6247P3000p6281o0893
2642A074345q5307l7489J55352M8656q2948r4682N738J5818j1875n2009j9273
$$ y = [2209945, 2233963, 2262326, 2188977, 2165899, 2224573, 2240012, 2209794, 2115112, 2047067, 2068120, 2135196, 2124202, 2076314, 2013819, 2077680, 2070526, 2062692, 2057952, 2048267, 2027996, 2002646, 2059962, 2101872, 2063859, 1996272, 1985687, 1946187, 1983056, 2019621, 1953205, 1945462, 1877904, 1821704, 1811556, 1808273, 1865709, 1805840, 1766103, 1723869, 1714843, 1656783, 1665046, 1651952, 1607618, 1576242, 1521306, 1573402, 1619371, 1571059, 1598351, 1614145, 1544944, 1488934, 1465193, 1450717, 1450809, 1371304, 1358967, 1392971, 1388965, 1378034, 1331113, 1286094, 1303039, 1350192, 1330087, 1287531, 1194142, 1179659, 1261470, 1187280, 1147315, 1139870, 1092831, 1159921, 1141086, 1137565, 1094295, 1082272, 1138519, 1211519, 1135238, 1074345, 989038, 951549, 1106901, 1155557, 1072609, 977927, 983665, 999483, 987608, 935599, 916326]
2631I16326j1091m063n8874L3000K6356K6172j1079n3338j1997J0745k6950o1990
2619G73217j4525M3947N4447p8816N5921m3980j9898n8681m6157L1556K9482L3503
2607G60016o9992l2949j8853K0584L5354J1075J549J1917J6927j02786J9439K1606
2595F73887j9506l2988l3002n839R9826K9507p5730j7657l6496r3148M5632K9155
2583E63641l8812J8863l3515J5690L3290l3735j3014n4090j101R3068o9296m5305
2571D35684q507J3386N7852J8694l3445l4252j4729J3501m6960L4502L5185n22
2559D70389n1492q2202R6407n3935L5600Q4772p2093l1255r85l5729N935Q8659
2547D54071l0874r725K0420l5662K3540o4238r9580J00910k4455J9439L6576k5774
$$ y = [916326, 905235, 901172, 842298, 875298, 901654, 927826, 916747, 863409, 851412, 862157, 835207, 773217, 758692, 802639, 857086, 778270, 834191, 790211, 770313, 711632, 665475, 697031, 726513, 760016, 690024, 657075, 638222, 658806, 694160, 705235, 706784, 718701, 735628, 632842, 652281, 673887, 654381, 621393, 588391, 582552, 682378, 711885, 636155, 618498, 582002, 488854, 534486, 563641, 524829, 543692, 510177, 525867, 559157, 525422, 512408, 458318, 457217, 550285, 480989, 435684, 427177, 440563, 498415, 517109, 483664, 449412, 434683, 448184, 401224, 435726, 470911, 470389, 418897, 336695, 433102, 379167, 414767, 499539, 427446, 396191, 395206, 359477, 365412, 454071, 423197, 413472, 433892, 398230, 421770, 357532, 257952, 358862, 334407, 353846, 390422, 364648]
2535C64648n0812J9335j4888O642l0384n070k0515M3749j7827K6693J00516R69
2523D23056l5107r7398J6602j4979L6332j6216J0736P307P283L3039n1084j1588
2511C07983N9954k0545l5013n758L988M1655k7235l1225j5120J5735R9767q020
2499C86166k3303n3328L5436J556q9014O0136O8449m5535j5022M8542p1097k0381
2487B82605M8828j7753j2331L8536r3159l4693K7373J1071k8248m1513P9558Q3753
2475C44027m9214J8291j6383j5866L8135j0888k0015l0175p7262J4086K9288M2107
2463B66131j3018j6932k36j7848N5771n1717N6899l3414j5123n6936r279N1848
2451B16146p510q634l9904m831m659N9101M5355m5885q4591O1625O6230L2261
$$ y = [364648, 313836, 333171, 318283, 324925, 294541, 289471, 268956, 312705, 294878, 321571, 422087, 423056, 387949, 290551, 307153, 292174, 328506, 312290, 323026, 330333, 337616, 370655, 319571, 307983, 367937, 347392, 312379, 306621, 310609, 352264, 325029, 293804, 278684, 294419, 394186, 386166, 362863, 309535, 344971, 346527, 257513, 317649, 386098, 340563, 325541, 374083, 302986, 282605, 331433, 313680, 301349, 339885, 246726, 212033, 239406, 250477, 222229, 180716, 260274, 344027, 294813, 313104, 296721, 280855, 318990, 308102, 288087, 257912, 180650, 194736, 224024, 266131, 253113, 236181, 235945, 218097, 273868, 222151, 279050, 245636, 230513, 173577, 164298, 216146, 208636, 200002, 160098, 155267, 150608, 209709, 255064, 209179, 124588, 186213, 252443, 284704]
2439B84704n284p6604L1955L4928R57n9775j27j9336j4495P1049m786j4615J6362
2426B44933L1543q783j2094j6723P4309P5057p2409j9257l4380J0378J0083N172
2414B87829M5758J7480n7115J6425N3401l9063q3172k5949l173P0937k5310N5391
2402C13439N1144J379O4676j030p6811k3097M228m339O195k0193Q0326l1568K8035
2389C92384K2520l9372J8968k5061n01N5005l948O2117n455M079P7660M0214L2767
2376F31377L9605J9593n2343K3485R9770J12287R635K3293J9066Q8839O4664L5048
2364A114319j6559L8879N6825M0005J11589M3971P0054J08195N7357K7158O2621
2353A714414J44645J02416j575J57051J14934J60500K08129J70212J65311K26278
$$ y = [284704, 279420, 202816, 234771, 269699, 270656, 210881, 210754, 191418, 176923, 247972, 243186, 228571, 244933, 276476, 267693, 255599, 238876, 313185, 388242, 315833, 296576, 262196, 272574, 282657, 287829, 333587, 351067, 293952, 310377, 363778, 324715, 241543, 215594, 212421, 283358, 258048, 313439, 364583, 365962, 430638, 429608, 352797, 329700, 333928, 329589, 335784, 315591, 395917, 364349, 392384, 414904, 375532, 394500, 369439, 368938, 423943, 419995, 482112, 476657, 480736, 558396, 598610, 631377, 670982, 690575, 638232, 661717, 761487, 873774, 883409, 906702, 925768, 1014607, 1079271, 1114319, 1097760, 1136639, 1193464, 1233469, 1345058, 1389029, 1459083, 1567278, 1624635, 1651793, 1714414, 1859059, 1961475, 1959900, 2116951, 2231885, 2392385, 2600514, 2770726, 2936037, 3162315]
2343C162315K10534K60648L70170M11648M65295O33651P29531Q21973Q92798J020547
2333H979110J040776R29053O48580M69133n9770r79803j547111j385876j082035
2324G012057r95694q26765n98623m86728m31782l96440l05828k25701k05907j85747
2314B352842j61425j79881j72031r5585j27384p7018j50375q6527j41048p6815
2304A084753m3462p0732k6047o3677p0443n808k5258n2418j704l1818q219J2772
2292F97939m2157m7346j15623k1990m781l2628l1667N0993j07703L1350L7675
2281D14062r4667o474j0J06078m8908m3932J6211L7763o491n2689k9769L1223
2269C22397p32n9207n2897O2888k9290n8111J6725L2933m8473o0135j0879k828
$$ y = [3162315, 3372849, 3633497, 4003667, 4415315, 4880610, 5514261, 6243792, 7065765, 7958563, 8979110, 10019886, 10948939, 11597519, 12066652, 12006882, 11027079, 9479968, 8094092, 7012057, 6016363, 5189598, 4590975, 4104247, 3672465, 3276025, 2970197, 2744496, 2538589, 2352842, 2191417, 2011536, 1839505, 1743920, 1616536, 1539518, 1389143, 1302616, 1161568, 1084753, 1041291, 970559, 944512, 880835, 810392, 804584, 779326, 726908, 725204, 693386, 685167, 697939, 655782, 608436, 492813, 470823, 466042, 433414, 401747, 452740, 345037, 376387, 414062, 319395, 312921, 312911, 418989, 370081, 326149, 342360, 380123, 373632, 320943, 291174, 322397, 321665, 262458, 209561, 272449, 243159, 185048, 201773, 234706, 186233, 126098, 115219, 112391]
2257A12391K69M7545K9990n0960M6546m0496k1807K727m1158Q164M5736K5568
2245A64515o8805k5804J6586p989P993L4728L8363m9087j5819L0343L7029M4187
2233B06240j6140o8544M225J1525l8260R7205p55q571m0837j9129K8911j7406
2221A38464P11n1304k4275J2839N1803n0230k5571N7667k9057J669n620O3572
2209A40668L9659l9465L4853l5603m2732n8694J6417N1272M7636k8240l2330M3060
2197A36501k8618k4292L3726p587m4153K4527N2709l5740j9612l408j3383R922
2185H0592o1891N1915O3867K2383k5355j8770m9621q0847N2428p302m4841L3048
2173A5606Q8442J7787P449p0056j6008l9353l0257N1116L5489o265n3102K2928
$$ y = [112391, 112660, 160205, 190195, 139235, 185781, 145285, 123478, 126205, 85047, 93211, 138947, 164515, 95710, 69906, 86492, 78503, 86496, 121224, 159587, 110500, 94681, 125024, 162053, 206240, 190100, 121556, 125781, 137306, 99046, 196251, 195496, 186925, 146088, 126959, 155870, 138464, 139175, 87871, 63596, 76435, 128238, 78008, 52437, 110104, 81047, 82716, 77096, 140668, 180327, 140862, 175715, 140112, 97380, 38686, 55103, 106375, 154011, 125771, 93441, 136501, 107883, 83591, 117317, 109730, 65577, 90104, 142813, 107073, 87461, 84053, 70670, 80592, 18701, 70616, 134483, 156866, 131511, 112741, 63120, -17727, 34701, 27399, -17442, 15606, 104048, 121835, 129284, 59228, 43220, 3867, -26390, 24726, 60215, 53950, 848, 23776]
2161B3776m1595M800m059o830N7459j6254O1825j7827k7107N7660j01956j9230
2149b9338N3298Q6253p1749o9941R2915O1789o8514m5619M3257M4447m3985k1405
2137C1408P2139j6658N1698l3737j2396m4923K8339J0166J4923K0163o3162N6798
2125A14758J9387l2945k3900r012j3068K2341K3611r934o4244j632M6716J9285
2113I1363M1236k2652p2900j7840K9548J8728N330n3680l3645j4462L083K6962
2101A071J0403m828m8665J3210Q0213m785Q18J4598J7305N5786k0796J0435j4693
2088A10072k7272m6056n8487L9094R0750k7659p256J9222M475J4046P5321l3600
2076A52650k1885j6594n7724M2108j7111l2845L5803m7716j800N981k2315L599
$$ y = [23776, -17819, -13019, -17078, -23908, 33551, 17297, 79122, 61295, 34188, 91848, -10108, -29338, 23960, 110213, 38464, -31477, 61438, 123227, 54713, 9094, 52351, 96798, 52813, 31408, 103547, 86889, 138587, 104850, 92454, 47531, 75870, 86036, 100959, 121122, 57960, 114758, 134145, 101200, 77300, 68288, 55220, 77561, 101172, 91238, 26994, 25362, 72078, 91363, 132599, 109947, 37047, 19207, 48755, 67483, 72813, 19133, -14512, -28974, -25891, 1071, 11474, 6646, -42019, -28809, 51404, 46619, 47437, 62035, 79340, 135126, 114330, 124765, 110072, 82800, 36744, -21743, 17351, 108101, 80442, 73186, 92408, 96883, 110929, 186250, 152650, 130765, 114171, 56447, 98555, 81444, 48599, 84402, 36686, 34886, 40867, 18552, 22151]
2064B2151m0484L2070K5169Q9292j7908l3459m41q8215K6296L3075p0765L0787
2052G568O2779l4629l3246q543k7935K3963l9663N8977J5398M3716K5045l7347
2040E6083j0154j3713j5057j3693J2109L916J0252k7814M6276p56m3076J7634
2028B2007R42n03L1695L2605K1365r5630J3088j6767K2848j3646J733J8444o8330
2015c0149j8774P8217M099j7399J7752P567P096j6793m9939M9715n9835m4805
2003g3248Q3991k2787K6610k9011k7794K1806R381m6209n50M1650J4167L1374
1991B9380m4255K968N9205m0148J2085n52J1031L3148j5241J6366L1143j8111
1979G7019l5210r0284N2156N011J1563O4585q2726K3884k0143p4564k7393M4480
$$ y = [22151, -18333, 13737, 38906, 128198, 110290, 76831, 76390, -11825, 14471, 47546, -23219, 7568, 70347, 35718, 2472, -6071, -34006, -10043, -49706, 9271, 24669, 68385, 93430, 56083, 45929, 32216, 17159, 3466, 15575, 19491, 29743, 1929, 48205, 47449, 4373, 22007, 22949, 22446, 54141, 86746, 108111, 12481, 25569, 8802, 31650, 18004, 19737, 38181, -30149, -48923, 29294, 33393, 15994, 33746, 41313, 48409, 31616, -18323, 31392, -28443, -73248, 10743, -12044, 14566, -14445, -42239, -20433, -11052, -57261, -57811, -16161, -1994, 29380, -14875, -11907, 47298, 7150, 19235, 18683, 29714, 62862, 47621, 63987, 95130, 77019, 41809, -48475, 3681, 8692, 20255, 84840, 2114, 25998, 5855, -68709, -96102, -51622]
1967e1622O9138n9165M7280k785L5546J3090m4992m9341n36L166J2935p306P919
1954b6673l2396J7943J5629K1861K2981q0173M5485R7681q6507k8236P268J4473
1942a0664O5974J3935L3596j35139o933Q5743N8598k4494q4227l8427K2756R373
1930i909Q2849p7459k7757Q851L6406M9957k5321r552k0831K704J0442L9691m4885
1917A5186j0449k6532j9909P0647j379J0556p4910L7356O6267k4836L5296m7276
1905C0017m9986m3714K6391O5179J3824j0703j0437k2735K2615N667M3772p6702
1893f812N7879K4792j6779j072n5210n1873M1892K7635n721J20582k2282r9998
1881A3033O4997l5212j02346O067q709N3790O208L8993m1218K3355N5431k4620
$$ y = [-51622, 17516, -41649, 5631, 2846, 38392, 51482, 6490, -42851, -43387, -40221, -27286, -34592, -26673, -59069, -41126, -25497, -3636, 19345, -60828, -15343, 82338, -4169, -32405, -25137, -10664, 55310, 69245, 102841, -32298, -39231, 46512, 105110, 80616, -3611, -42038, -19282, -9909, 72940, -4519, -32276, -23425, 12981, 62938, 37617, 28065, 7234, 9938, 20380, 60071, 15186, 4737, -21795, -41704, 28943, 27564, 38120, -36790, 566, 66833, 41997, 77293, 30017, -19969, -63683, -37292, 27887, 41711, 31008, 20571, -2164, 20451, 26118, 69890, -6812, 51067, 75859, 59080, 58008, 2798, -49075, -7183, 20452, 14731, 135313, 113031, 13033, 78030, 42818, -59528, -53461, -62170, -8380, -2172, 36821, -4397, 18958, 74389, 49769]
1869D9769m2851J792P189N3338p7328q8084M4680M4263J0273K6448l1880Q01n1791
1856e3381k0660N3899M5343m7615M1934P2399r4599J0563K4641l4907n4458n298
1844f2139n5956o337K5179J14852l4346K3738o6764j0991K8524r121O9522n004
1832A1157J8307N1136m701p352L6802k4248J9741o1286m2420N1334O9591K6290
1820A44351p79r7317j1782J9037j199L1068J0217K7857m4697r5648M7804p597
1808B1315k8722J991p2426L3474P6558m9798O6209J04459q1839n5484L941k5713
1796f035m2468K2628Q8823K7756j4277p9329n8468O8243J2824m0965J339J2918
1784g011o363M925J00810m911m5311J2587p1608n5361J9423L1523J30600m6852
$$ y = [49769, 6918, 8710, 15899, 69237, -8091, -96175, -51495, -7232, 3041, 29489, -2391, -1590, -53381, -74041, -20142, 25201, -22414, 19520, 91919, -2680, 7883, 32524, -2383, -56841, -62139, -118095, -124432, -99253, 15599, -18747, 4991, -61773, -72764, -44240, -53361, 16161, 11157, 29464, 80600, 75899, 68547, 105349, 81101, 100842, 39556, -2864, 48470, 118061, 144351, 143572, 46255, 34473, 53510, 52311, 83379, 93596, 121453, 76756, -18892, 28912, 21315, -7407, -5416, -77842, -44368, 32190, -17608, 48601, 153060, 71221, 15737, 19678, -6035, -48503, -25875, 62948, 90704, 76427, -2902, -61370, 6873, 19697, -21268, -19929, -7011, -13374, -8449, 92361, 87450, 42139, 54726, -16882, -72243, -52820, -21297, 109303, 62451]
1772F2451r1184P3947m0326l3583K2126l5015O246R4688J6674k5924j8130n0963
1760a8993J0833Q6205l0922r2955K7936L8415O2451k6605L0407L315m2696m490
1748D2901n4048J6847k6831q303K1371J5837k8082k6213p431O9620L4327o260
1736D3735n1355Q3683M1849q5131p2145L2806m2904M8486R8396k5126j58064k7691
1724a13461Q7779p1603Q722Q7902J6908P675n302q903J6209M1373M4554j614q9401
1711B0838p9190p921P3920J4822J2473m0949m8420K8748R277M7934o1857r2505
1699a22830j1952L5012J0634L8154Q6528m7952j7320P8774K3406k9717L422N6009
1687A02168k6362o1443K8277M5934k8060O845r4602r844o716Q0136j2274q971
$$ y = [62451, -28733, 45214, 4888, -28695, -6569, -41584, -35338, 59350, 76024, 50100, 31970, -18993, -8160, 78045, 47123, -45832, -17896, 20519, 82970, 56365, 86772, 90087, 47391, 42901, -11147, 5700, -21131, -29434, -8063, 7774, -20308, -46521, -53952, 15668, 49995, 43735, -7620, 76063, 117912, 32781, -39364, -6558, -49462, -976, 97420, 72294, -85770, -113461, -25682, -97285, -88563, -661, 16247, 23922, 18620, 9717, 25926, 67299, 111853, 110239, 20838, -58352, -66273, 7647, 22469, 34942, -6007, -54427, -25679, -16402, 31532, -30325, -122830, -134782, -99770, -89136, -50982, 35546, -12406, -29726, 49048, 72454, 42737, 46159, 102168, 75806, 14363, 42640, 88574, 60514, 67359, -27243, -37087, -43803, 36333, 24059, 15088]
1675A5088l0329j6413j1648P084Q3425k3988k5090K7863J8220m2421j06316J05488
1663I63K5505M3808k3990p2452m1357J9057K2624K9985J7173p0657O8811l0575
1651a1105M3365K4223o6479M5096L5798m2941K1033n6549L220K3250P8171j35141
1639c8059L7924J3861K4934j3417k7378K9746m125p9020M4964P3667m4089O138
1627B5146M5815M5078q2551k9188r437k3569J7533O6304k2502L0593q9373n328
1615c1479M7283l9112L2666j5657Q6404k385j09700O498O394P005l7187L4919
1603a4351K329m380j2264O4237n3767m3738O1571M0166K1963o3069p4983N2402
1591b3884O3181N113k3959k8738K8596N0329n3998j829l572J040J4500l0987L7245
$$ y = [15088, -15241, -31654, -43302, -36218, 47207, 23219, -1871, 25992, 44212, 1791, -104525, 963, 26468, 70276, 46286, -26166, -67523, -48466, -25842, 4143, 21316, -49341, 19470, -11105, 32260, 56483, -9996, 35100, 70898, 27957, 48990, -7559, -4339, 18911, 97082, -38059, -135, 13726, 38660, 25243, -2135, 27611, 23486, -55534, -10570, 63097, 19008, 25146, 70961, 116039, 33488, 4300, -5137, -28706, -11173, 55131, 32629, 63222, -26151, -31479, 15804, -23308, 9358, -6299, 80105, 77720, -31980, -25482, -19088, -12083, -49270, -14351, -12022, -16402, -28666, 35571, -18196, -61934, -363, 39803, 61766, -1303, -76286, -23884, 39297, 44410, 20451, -8287, 20309, 70638, 16640, 14811, 11239, 12279, 26779, -4208, 33037]
1578C3037J7970K0259j7366m9389j3608J0518n0609o6857m1038M9489J01721Q4664
1566G8791j0503m0806j8028m5099J3247J5754N2670l6896P0166L7265p7076L176
1554D2661j2186m7719Q459J9816l3729O128J7829P035L4476j6878m9063k9169
1542e2340N6919K0474L5590J031m2405P1120p811m1274k9227m6760R499K507k8459
1529e1136O0834p9802k0852M3558O1919k8435M4835J6715K9680n076k9447k9045
1517A3748J4056J4857o0925P598l0702M0321j6762j2373q924k7369J27222q166
1505E2581q9351J3358K8881q1680K2591N8479L258n054k0682L4737l4281q873
1493b6036n0976J11916l8038p6499J6096K9401L4582M6949m0806o6232L9517j1542
$$ y = [33037, 51007, 71266, 53900, 4511, -9097, 1421, -49188, -116045, -157083, -107594, -5873, 78791, 68288, 27482, 9454, -35645, -22398, -6644, 46026, 9130, 79296, 116561, 39485, 42661, 30475, -17244, -8785, 11031, -22698, -16570, 1259, 8294, 42770, 25892, -23171, -52340, 4579, 25053, 60643, 61674, 19269, 90389, 82578, 41304, 12077, -34683, -25184, -22677, -51136, 9698, -70104, -90956, -47398, 14521, -13914, 30921, 47636, 77316, 72240, 42793, 13748, 27804, 42661, -18264, -10666, -41368, -1047, -17809, -30182, -39106, -66475, 60747, 52581, -36770, -23412, 5469, -76211, -53620, 4859, 8117, 3063, -17619, 17118, -17163, -26036, -77012, 34904, -3134, -79633, -63537, -34136, 446, 47395, 6589, -59643, -20126, -31668]
1481c1668O1830o4681O8587q27k0498m6481O1641R328M2063n2785m5969L9559
1469B0099k5579K6260j4049n6511O4085J4634L453L0056k3730J2581j5472k3683
1457A2144n3792K0135l2223o323l8432L8466M2182n172k0559O3093m0096j5759
1445c6336N3743L4608j744k7648j8019j0962l765K86n1778P5341l842J6724l6494
1432i886m0580O3327k5628L7709l3965j9970K8687K1494L3463K0489m2940m9562
1420a7362k9959K1295J04422O726j18925l0518K8487l1741M8316L0145l702K5308
1408C2492L879j8509j8136q4230P6596j6623Q3926J0235j45582J1929K5565J9593
1396a8865j7542O5034L6135J954l5790k4716n0395m854L6100L1070J8354p8646
$$ y = [-31668, 30162, -34519, 34068, 33241, 12743, -33738, 27903, 37231, 79294, 26509, -19460, 20099, -5480, 20780, 6731, -49780, 14305, 28939, 32392, 62448, 38718, 51299, 35827, 12144, -41648, -21513, -53736, -60059, -98491, -60025, -17843, -23015, -43574, 19519, -20577, -36336, 17407, 52015, 50271, 22623, 4604, -6358, -10123, -9837, -61615, 13726, 9884, 26608, -9886, -50466, 12861, -12767, 24942, -9023, -28993, -306, 21188, 54651, 75140, 32200, -17362, -47321, -26026, 78396, 85122, -33803, -64321, -35834, -67575, -19259, 10886, 7184, 32492, 36371, 17862, -274, -84504, -7908, -24531, 59395, 69630, -75952, -64023, -38458, -18865, -36407, 28627, 64762, 66716, 30926, 6210, -44185, -49039, -12939, 18131, 36485, -42161]
1384d2161O974L9755J0415K4651O384n8188R311n806L4367J6526k805m1176k1959
1371b3712j8623R728K9372j6064N6797o547M401j9270k6781j16078L8909K1628
1359f6240p881j7871Q3157Q6972m8738j5549J0759j5042q3903L8115L7453m2546
1347d1314L8784N0489Q706m2056o671O2275n7756m1071J5032k5777K050l6121
1335g3430k1920K3819M2469l1636O1455N2662K9720n0472o1170L5774J7797q390
1323A6678q520l6763O792K0808O427M8827j10197n4991J08039K4131q253K4215
1311C7193J0860p420K3578o856j15358J77J18111m8847l4865p617l6417r085K7572
1298d8974M6379L2051l3869r608M8341O70K3157r325m0135l9664q803l83N8569
$$ y = [-42161, -35187, 4568, 14983, 39634, 46018, -12170, -2859, -8665, 25702, 42228, 39423, -1753, -23712, -42335, -32607, -3235, -19299, 37498, 30951, 35352, 16082, -10699, -126777, -87868, -66240, -74121, -91992, -8835, 78137, 29399, 13850, 24609, 9567, -74336, -36221, 1232, -41314, -2530, 47959, 56665, 14609, 7938, 70213, 12457, -28614, -13582, -39359, -37309, -73430, -95350, -71531, -29062, -60698, 757, 53419, 83139, 32667, -28503, 7271, 25068, 16678, 8158, -28605, -21813, -1005, 5422, 54249, -55948, -110939, -2900, 21231, 12978, 37193, 48053, 40633, 64211, 57355, -58003, -57826, 60285, 11438, -23427, -31044, -67461, -76546, -48974, -2595, 29456, -4413, -14021, 34320, 34990, 58147, 48822, 8687, -30977, -39780, -40163, 18406]
1285A8406q1089L0463J6218m6124j9108M542M5799m102k7914P0173k7069k6248
1273d6053N1762L6212j395n5822K4801j9265J6855l0411q703R837J5155M9566
1261D2539K2444o698n2027n8307j4051J9201L8121O931O126j4192K3925K7079
1249D1091q076N9173K4009p6210L0222k377K4981k2547l4525n4989k9079j5389
1237f3716K0775j6394J3628j516j7600K2577L9710k9869M5435j6457N3256L5008
1225H4837p1470J537l4196M273j9053J13025k7981j25719k0827O8305m0485M4401
1213b3353O6854N4534L550k0619J7512L082q4998l7055j5803J6275k7560k3228
1201g0809K6665K9760k827N368J8406q149m5758P677k9548L5138j075L0864j4803
$$ y = [18406, -62683, -32220, -16002, -62126, -81234, -76692, -30893, -34995, -62909, 7264, -19805, -46053, 5709, 41921, 40526, -15296, 9505, -9760, 7095, -23316, -32019, -22182, -7027, 42539, 64983, 58285, 6258, -52049, -66100, -46899, -8778, -1847, 4279, -9913, 14012, 41091, 33015, 92188, 116197, 39987, 70209, 67832, 92813, 70266, 35741, -19248, -48327, -63716, -42941, -59335, -45707, -47223, -64823, -42246, -2536, -32405, 13030, -3427, 49829, 84837, 13367, 14904, -19292, -15019, -34072, 78953, 50972, -74747, -95574, -27269, -67754, -23353, 43501, 98035, 101585, 80966, 98478, 101560, 16562, -20493, -36296, -20021, -47581, -70809, -44144, -14384, -17211, -11843, 6563, -1586, -47344, -39667, -69215, -34077, -35152, -4288, -19091]
1188a9091p6673L84K7053O2342K3188N2172M6171r5011n0289O545l712n005O6752
1175C4826K7078l8266K027o4194n984K7064N5057L6834q2522J287j0783m5551
1163f3127M7651l4891J8116N0122k5660n585j2992j0529k757P3154M1310p8408
1151c596j2958m132K4371n6532l5117k1710J1117M414N2993J3381R263L9640M038
1138B5172j2760o34k8177l8097l3538K7552l0507M353K8302p698N1122j9491k2902
1125e7303l2131Q2128L5743K3114k5907m8808N6941j2454K049q95L438M64K194
1112B8573P121q6874m2218O9247R199P571J4900J7890K41l4158R837l9m1174P6559
1098C6675L8897q0080l0341O8853J7902j8020L5314L3802q2635N368k4837j28923
$$ y = [-19091, -95764, -95380, -68327, -5985, 17203, 69375, 115546, 20535, -29754, -23209, -26921, -31926, 34826, 61904, 23638, 25665, -38529, -44513, -17449, 37608, 74442, -8080, -6793, -17576, -63127, -15476, -50367, -32251, 17871, -7789, -13374, -26366, -36895, -39652, 33502, 74812, -3596, -16554, -20686, 3685, -52847, -87964, -109674, -98557, -94143, -41150, -27769, -18506, 21134, 25172, 12412, 11778, -16399, -54496, -88034, -60482, -90989, -86636, -58334, -66032, -14910, -34401, -57303, -89434, -7306, 28437, 51551, 25644, -23164, 33777, 21323, 23372, 22477, 25915, 26379, 28573, 35694, -51180, -93398, -24151, -14952, -7381, 7519, 25409, 25650, -8508, 1329, 1290, -39884, 36675, 75572, -4508, -34849, 34004, 51906, 33886, 69200, 103002, 20367, 25735, 898, -128025]
1086a28025j1738N1964Q7988p811O908q4499J7346N3249J8340K1077k393j3707
1074H699j2969j4390k1889P643M7870K1336Q279k9137O263P0501n1473k2860j2372
1061E501N6773m0351j420k1229K9118M7991n3692q0781O4720O0599n9469K2413
1049C0173O3072m577q450m5802l2896L4343m8436j4539M6246M8981m5237n0281
1037b7403J3672K8749j1268L5744m6710j4544K1340P6481N170j17538J1153N155
1025a9999n148M2766K1513q6317M6226j5295r7289K8091L53L2322N1242K2340
1013B0805J0772k0070m7833m6834J0341O5779l5905O7437j5542L2013n6628K8341
1001A2676N8876j0084O8170o4519m5026l8913l8295R989K3176l057L4141l0636
$$ y = [-128025, -139763, -87799, 189, -7622, -714, -85213, -67867, -14618, 3722, 24799, 22406, 8699, -4270, -18660, -40549, -32906, 14964, 36300, 44579, 15442, 21705, 92206, 40733, 17873, 5501, 62274, 21923, 20503, -726, 28392, 76383, 22691, -58090, 6630, 67229, 7760, 30173, 93245, 88668, 80218, 34416, 1520, 35863, -12573, -27112, 19134, 68115, 22878, -27403, -13731, 15018, 3750, 39494, -7216, -21760, -420, 76061, 81231, -36307, -25154, -19999, -25147, 17619, 39132, -47185, -959, -16254, -113543, -85452, -85099, -52777, -1535, 20805, 31577, 11507, -36326, -83160, -72819, -7040, -42945, 24492, 8950, 40963, -15665, 12676, 71552, 61468, 129638, 65119, 20093, -18820, -57115, -47126, -23950, -27007, 7134, -23502]
989b3502N4237K259k5744K6181j2666Q2355m3809j7778q9323P4025Q4130p5953
977C4412l1066k5372N2534k5591j3734Q152l050q4044L3173J3773L4178L8832
965C2197k3046n2006K8482N9491j9866P310j2352n6436k4642Q2223K8724o6528
953a6449m5260m9852O0796Q6426o5450j0937K6887J3108J8038j5902J0369J5583
941B7357J442k7750K5808J4481j1031P513j5310j2276l3234j7015M3215N2448
929E5648J3131l3340M9725n2091o5161M0750J3586J8852j8882l9016m4154K414
917e8538L1384J9217J3680J2761n7967L702N546n4452N8228K8940o7604L5094
905c0009l5049m477M7819K9850K1550l4581n7680P4820j0069L7402R226m2709
$$ y = [-23502, 30735, 32994, 7250, 33431, 20765, 103120, 59311, 41533, -47790, 26235, 110365, 34412, 3346, -22026, 30508, 4917, -8817, -665, -3715, -87759, -54586, -40813, -6635, 32197, 9151, -42855, -14373, 45118, 25252, 32562, 20210, -36226, -60868, 21355, 50079, -16449, -61709, -111561, -50765, 35661, -29789, -40726, -13839, -731, 17307, 1405, 11774, 27357, 28799, 1049, 26857, 41338, 30307, 37820, 22510, 10234, -23000, -40015, 3200, 55648, 68779, 35439, 85164, 33073, -32088, 8662, 22248, 41100, 22218, -16798, -60952, -58538, -27154, -7937, 5743, 18504, -39463, -35761, -30215, -84667, -26439, 2501, -65103, -30009, -65058, -69535, -21716, 8134, 29684, -4897, -62577, 12243, 2174, 39576, 48802, 6093]
893F093k295m3303k1549N681L0598J2506M6715M4596K3140j1209q5695O087L9358
880E0723l5632m5233m5378K4679J4164P2169o4556p5829N5406k0262J5102M2610
868a2037R74J6395j517o342Q898J2828j9365o242k3114P98l6246L934m090J6978
854d8148Q9211j6303q7147K9620J4562P379O9606J2764m1887j9367l6491m817
842c1018L0093k317M022J0934r506l9228m7161J06605m3316o0742L3762L1930
830a5942p94p5015N3856K7352M4777J5506L7193k2751K7068L1941p5904N5439
818A02726p2224j8075N0797q1658m0541K1271L3397L7859n642m7165l5071k5135
806g9461J081O6413J1431o4486J1215J5236l9783J9484p577M9840M5876J9273
$$ y = [6093, 3798, -39505, -61054, -55373, -24775, -12269, 34446, 79042, 102182, 90973, 5278, 11365, 50723, 15091, -30142, -75520, -50841, -36677, 35492, -29064, -104893, -49487, -69749, -54647, -12037, -11063, 5332, 3815, -2527, 6371, 19199, -166, -6408, -29522, -28724, -64970, -61036, -65126, -48148, 41063, 24760, -62387, -32767, -18205, -10826, 58780, 71544, 29657, 10290, -26201, -31018, -925, -3242, 780, 11714, 2208, -37020, -84181, 22424, -20892, -81634, -47872, -15942, -16736, -91751, -37895, -10543, 34234, 49740, 86933, 64182, 91250, 123191, 47287, 102726, 30502, 12427, 63224, -18434, -58975, -37704, -4307, 33552, 27910, -19255, -54326, -79461, -78380, -11967, -536, -65022, -53807, -38571, -78354, -58870, -66447, -16607, 29269, 48542]
794D8542M1151k7530l2908j39466P3261L6620j0090L6857n9111M6729Q806n4916
782c2055p8826J9818O6294L1584M7581O6074j0973k2395j9131l7182k4829J7810
770B3770k1064N802k0692m6415P5411r1190Q7588J8682q6753K9241K4016m5518
758d7122n0388R1086L5248o7816J0607J08758m1566o3505p278O2663O2492k2790
746G0389l5924j4414%o1285k092J8155m4932R3281L4343J048j1477n7587j5159
733b5654L0816n383M305k1898P8305j9875r8316O5524J8615q293l5464M0458m7054
720b3914K658q797P864N690R92k8901L0383l2145j9751k7788J9451M2700k437
707c3995N339L6073L8976k3362n4186L0717K9975J6289L3373o7773j2116K6175
$$ y = [48542, 89693, 62163, 29255, -110211, -36950, -330, -10420, 26437, -32674, 14055, 22861, -32055, -110881, -91063, -24769, 6815, 54396, 120470, 109497, 87102, 67971, 30789, 5960, 23770, 2706, 8508, -12184, -58599, 16812, -74378, 13210, 31892, -54861, -25620, -1604, -47122, -97510, -6424, 28824, -38992, -28385, 80373, 38807, -24698, -31976, 30687, 93179, 70389, 34465, 20051, 20051, -41234, -43326, -25171, -70103, 23178, 57521, 58569, 47092, -10495, -25654, 5162, -221, 4084, -17814, 60491, 40616, -57700, 7824, 26439, 18146, -17318, 23140, -23914, -21256, -30053, -22189, -16499, -15507, -44408, -14025, -46170, -65921, -93709, -74258, -31558, -33995, -28656, 7417, 46393, 23031, -31155, -438, 29537, 45826, 79199, 11426, -690, 25485]
695B5485n37N734n5287l3180O7076K7747p9166Q055j5807K138P6541K9235n1706
682F328K0649n4645n8249M1492O182J1902K3481N544n5393N8302J8404r107n3741
669c8851r381M0351P100m7410N536j9579l900L3432O6051j7120L0090l5578r181
656A560J1270L234j398k2404J8893k6964j6894K8541R6334N460j5549l7009j2483
643C2591m111n4042N4944J2637l345k9900o7510O973L1154k867o171k9531j1453
630g0631L9664J7360k1142L6287k039K2250l5159J6910L6391l4737l6126K0454
618a0518P185L0060k4242J0086m6202n376L3719m1317L7697J3510J8941k3853
606c10j2999k4425J7355m7125K335N3206k9023l3311M3444J6038j2362M224P616
$$ y = [25485, 24948, 30682, -24605, -57785, 9291, 37038, -42128, -34073, -49880, -47742, 28799, 58034, 6328, 26977, -27668, -85917, -44425, -38243, -26341, -2860, 2684, -52709, 5593, 23997, 14890, -38851, -48232, -7881, -781, -48191, -42655, -62234, -66134, -32702, 33349, 16229, 46319, 10741, 1560, 12830, 16064, 14666, -7738, 11155, -15809, -32703, -4162, 92172, 97632, 82083, 45074, 32591, 28480, -25562, 29382, 42019, 38674, 8774, -58736, -51763, -20609, -23476, -29647, -59178, -70631, -30967, -13607, -34749, 1538, -501, 21749, -13410, 3500, 39891, 5154, -30972, -10518, -3333, 26727, 2485, 12571, -33631, -39007, -5288, -46605, -8908, 4602, 23543, -310, -13309, -37734, -20379, -67504, -65169, -11963, -40986, -74297, -30853, -14815, -27177, -22953, -15337]
593a5337K1850m2942K487L8523n0776n8853L9911M1016K3194J1712K5514K3343
581E9642o1295n0718L9062R3124K8516k5866m4217n2375K6445L3262n6518m3650
569e4588M7838K0349l4789o0774M2691K4447n8113N4564o2225L4335k7843O1993
557a2115J5r0628L0219M1914j5942k1009O4831k3385K0967o3173n129J4750K173
544e6512P4932o0122J5984K7237K0489j9300J9790l356m0977L2845L7804L2453
532H1267p8195o8140M4380K0380L5384R623R416l210k1133j6009m1957L984K6001
519A791j7162l8347J5161O2666m3677M617Q641m8160M8655m8841L2044L0815m7117
506c8914N6736k11n87j3153o736j6085J2875K2895O7890J8921j7466R116j4279
$$ y = [-15337, 6513, -36429, -33942, 4581, -46195, -105048, -65137, -24121, -927, 10785, 36299, 59642, -1653, -52371, -13309, 79815, 108331, 82465, 38248, -14127, 12318, 45580, -10938, -54588, -6750, 13599, -21190, -81964, -39273, -14826, -72939, -18375, -80600, -46265, -74108, -12115, -12100, -102728, -72509, -30595, -46537, -67546, -2715, -26100, -5133, -68306, -73435, -58685, -56512, 18420, -41702, -25718, 1519, 22008, 2708, 22498, 19142, -21835, 11010, 48814, 81267, 3072, -65068, -20688, -308, 35076, 44699, 54115, 50905, 29772, 13763, -28194, -24210, 1791, -15371, -53718, -38557, 24109, -19568, -14951, -6310, -54470, -5815, -54656, -22612, 8203, -38914, 17822, 17611, 17024, 3871, -2865, -18950, -6075, 16820, 84710, 103631, 86165, 95281, 81002]
493H1002r1821o1003O3726P1137P959j11108M6313M0751l137m2983m7197P6952
481C0591M2771l9060j2106K3434r7738m8637N6677O5618M043n4356L2862J6895
469B0994l2149l0679L5907j7972j053m6556P6393K7033o2528M6335K5062l8850
457A937o333N5044j23556m1566J27420M154l0650L7598m9572M0648N4676k421
445F7379m0458o1315J1862M1339j3232j2135J2144K7398P9544o0803n4647j5745
433a8669m1270P3098k453N0708L4279r9388l090K7002k0359n9753K7312L784K7518
420a281J9194k0815M2782m5666J2349N1690j6961j7303m7879k4157j1405k8684
408h8136O0858R2466k5754k131o9400R279k5131P916j6918L2730q216N418j1952
$$ y = [81002, -10819, -71822, -8096, 63041, 71000, -40108, 6205, 46956, 43819, 836, -46361, 30591, 73362, 34302, 22196, 45630, -52108, -100745, -44068, 21550, 25593, -28763, 4099, 20994, -11155, -41834, -5927, -23899, -24952, -71508, 4885, 31918, -30610, 15725, 40787, 1937, -4396, 50648, -72908, -114474, 12946, 17100, -13550, 24048, -25524, 15124, 69800, 67379, 26921, -34394, -22532, 18807, 5575, -6560, 5584, 32982, 112526, 51723, -2924, -18669, -59939, 13159, 10706, 61414, 95693, -3695, -6785, 20217, -142, -59895, -32583, -28799, -1281, 17913, -2902, 39880, -5786, 6563, 58253, 41292, 23989, -23890, -48047, -59452, -88136, -27278, 65188, 39434, 37303, -32097, -22818, -47949, -40033, -56951, -24221, -32437, -27019, -38971]
395c8971m4222M1805K6048j2753L2119o6542K5553j594j52k6258m5839K1217n338
382i4927l0811L6168J06870L0231j7436n0504j2804K0690J2930l7186R8n731n4422
369i6834m2324J09031k4061j04392r961J37685K279O778k6510j7589M1722m666
357b8842N704K9570o9504l1919M1812N0980j4922k3463L277j31k6653J20450j8921
344C7438l1748M4629j1866m7241n4176j4402O3696R24Kk295J4558N3533o5549
331a2497l1391j8371M9398J8444m7804L6002P189o291j371m9291Q432M2918J375
318c258n1498k0846Q7108l877k2870N5466o5402m5115J8289M8267k1122o1419
306h6277L3050j2811K8509O2578l0813m2696J595K4903K8052N4044l5977r7429
$$ y = [-38971, -83193, -41388, -15340, -28093, 4026, -62516, -36963, -38557, -38709, -64967, -110806, -89589, -94927, -125738, -89570, 17300, 47531, 30095, -20409, -33213, -12523, 407, -36779, -36681, -42412, -96834, -139158, -30127, -54188, -158580, -168541, -30856, -28577, -21799, -48309, -65898, -24176, -28842, -23138, 6432, -63072, -94991, -53179, -2199, -17121, -40584, -37307, -37438, -64091, 56359, 37438, 5690, 50319, 38453, -8788, -62964, -77366, -13670, -12746, -12744, -15039, -481, 53052, -12497, -43888, -62259, -12861, 5583, -42221, -6219, 970, -5321, -6692, -55983, -47551, -4633, -3258, -54756, -75602, 11506, 7629, -15241, 40225, -25177, -70292, -52003, -3736, -24858, -86277, -53227, -66038, -37529, 25049, -5764, -48460, -46865, -21962, 6090, 60134, 24157, -73272]
294g3272L1278l1344k4735K8338l3903N8490N2554J4475m7396M6160l4939k9776
282d4070l3898o296R4128l4928k3792K098o4035M9777K0655r035m400k3225N1379
269b5642m529J6413k6781J783J2029l2906O1304J2813k8370j9878j3102j9125
257f5991l0629j419J9616M1756P1865P268j1740p7447K055N3382J3200J9447p2874
$$ y = [-73272, -41994, -73338, -98073, -69735, -103638, -45148, 7406, 21881, -25515, 20645, -14294, -44070, -77968, -84264, 9864, -25064, -48856, -46758, -110793, -61016, -40361, -49396, -53796, -77021, -25642, -30171, -13758, -40539, -38756, -26727, -59633, 1671, 14484, -13886, -33764, -46866, -65991, -96620, -98039, -78423, -36667, 35198, 42466, 30726, -46721, -44666, 8716, 21916, 41363, -31511]
$$ [...]
##END NTUPLES=NMR SPECTRUM
##END=
