##TITLE=1H_EC-3342(1)
 200.13MHz, CDCl3,
 8 sc
 
 3.2.2025
##JCAMPDX= 6.0         $$ Bruker NMR JCAMP-DX V2.0
##DATA TYPE= NMR SPECTRUM
##DATA CLASS= NTUPLES
##ORIGIN= UXNMR, Bruker Analytische Messtechnik GmbH
##OWNER= pz
$$ XWIN-NMR		Version 3.5
$$ Mon Feb  3 13:54:43 2025 Russian Standard Time (UT+4h)  she@DPX200
##.OBSERVE FREQUENCY= 200.1313
##.OBSERVE NUCLEUS= ^1H
##.ACQUISITION MODE= SIMULTANEOUS
##.ACQUISITION SCHEME= undefined
##.AVERAGES= 8
##.DIGITISER RES= 18
##SPECTROMETER/DATA SYSTEM= spect
##.PULSE SEQUENCE= zg30
##.SOLVENT NAME= CDCl3
##.SHIFT REFERENCE= (INTERNAL, CDCl3, 0, 15.4803)
##AUDIT TRAIL= $$ (NUMBER, WHEN, WHO, WHERE, WHAT)
$$ ##TITLE= Audit trail, XWIN-NMR		Version 3.5
$$ ##JCAMPDX= 5.01
$$ ##ORIGIN= Bruker BioSpin GmbH
$$ ##OWNER= she
$$ F:/spectra/data/she/nmr/H-C/1/pdata/1/auditp.txt
$$ ##AUDIT TRAIL=  $$ (NUMBER, WHEN, WHO, WHERE, WHAT)
(   1,<2025-02-03 13:53:28.09 +0400>,<she>,<DPX200>,
      <created by zg, POWCHK disabled, PULCHK disabled
       configuration hash MD5:
       00 E9 B6 7A A2 85 ED C7 34 08 36 98 17 FE 4E 26
       data hash MD5: 16K
       D5 FF C6 0A 73 CF 4B 08 6A 5A 98 59 3D B9 A3 44>)
(   2,<2025-02-03 13:53:31.21 +0400>,<she>,<DPX200>,
      <Start of raw data processing
       efp BC_mod = 2 LB = 0.25 FT_mod = 6 PKNL = 1 PHC0 = 90.71405 PHC1 = 15.19223 SI = 16K 
       data hash MD5: 16K
       98 DE 45 71 FF C0 E3 24 D7 A5 92 06 FB 0C 11 2A>)
(   3,<2025-02-03 13:53:50.70 +0400>,<she>,<DPX200>,
      <pk PHC0 = 156.8584 PHC1 = 2.8 
       data hash MD5: 16K
       EF 6C D6 5D A0 C4 6C 3F 56 A3 79 49 5E C0 77 1C>)
(   4,<2025-02-03 13:53:54.12 +0400>,<she>,<DPX200>,
      <abs ABSG = 5 
       data hash MD5: 16K
       31 D6 F0 07 F1 15 57 06 72 BE 92 15 5C 2E EF B9>)
$$ ##END=
$$ 
$$ hash MD5
$$ C5 D4 66 98 02 BC 73 96 24 DD E3 2F 63 B0 BD D9
##$RELAX= 
##$RELAX= 
##$RELAX= 
##$RELAX= 
##$RELAX= 
##$RELAX= 
$$ Bruker specific parameters
$$ --------------------------
##$DU= <F:/spectra>
##$EXPNO= 1
##$NAME= <H-C>
##$PROCNO= 1
##$TYPE= <nmr>
##$USER= <she>
##$AMP= (0..31)
100 100 100 100 100 100 100 100 100 100 100 100 100 100 100 100 100 100 
100 100 100 100 100 100 100 100 100 100 100 100 100 100 
##$AQSEQ= 0
##$AQ_mod= 1
##$AUNM= <au_zg>
##$AUTOPOS= <>
##$BF1= 200.13
##$BF2= 200.13
##$BF3= 200.13
##$BF4= 200.13
##$BF5= 200.13
##$BF6= 200.13
##$BF7= 200.13
##$BF8= 200.13
##$BYTORDA= 1
##$CFDGTYP= 0
##$CFRGTYP= 5
##$CHEMSTR= <none>
##$CNST= (0..31)
1 1 145 1 1 1 1 1 1 1 1 1 1 1 1 1 1 1 1 1 1 1 1 1 1 1 1 1 1 1 1 1 
##$CPDPRG= <>
##$CPDPRG1= <>
##$CPDPRG2= <>
##$CPDPRG3= <>
##$CPDPRG4= <mlev>
##$CPDPRG5= <mlev>
##$CPDPRG6= <mlev>
##$CPDPRG7= <mlev>
##$CPDPRG8= <mlev>
##$CPDPRGB= <>
##$CPDPRGT= <>
##$D= (0..31)
0 0.7 0 0 0 0 0 0 0 0 0 0.03 0 0 0 0 0 0 0 0 0 0 0 0 0 0 0 0 0 0 0 0 
##$DATE= 1738576407
##$DBL= (0..7)
120 120 120 120 120 120 120 120 
##$DBP= (0..7)
150 150 150 150 150 150 150 150 
##$DBP07= 0
##$DBPNAM0= <>
##$DBPNAM1= <>
##$DBPNAM2= <>
##$DBPNAM3= <>
##$DBPNAM4= <>
$$ [...]
##$SUBNAM3= <"">
##$SUBNAM4= <"">
##$SUBNAM5= <"">
##$SUBNAM6= <"">
##$SUBNAM7= <"">
##$SUBNAM8= <"">
##$SUBNAM9= <"">
##$SW= 18.0517328524113
##$SWIBOX= (0..15)
0 0 2 0 0 0 0 0 0 0 0 0 0 0 0 0 
##$SW_h= 3612.71676300578
##$TD= 16384
##$TD0= 1
##$TE= 0
##$TE2= 300
##$TE3= 300
##$TEG= 300
##$TL= (0..7)
0 120 120 120 120 120 120 120 
##$TP= (0..7)
150 150 150 150 150 150 150 150 
##$TP07= 0
##$TPNAME0= <>
##$TPNAME1= <>
##$TPNAME2= <>
##$TPNAME3= <>
##$TPNAME4= <>
##$TPNAME5= <>
##$TPNAME6= <>
##$TPNAME7= <>
##$TPOAL= (0..7)
0.5 0.5 0.5 0.5 0.5 0.5 0.5 0.5 
##$TPOFFS= (0..7)
0 0 0 0 0 0 0 0 
##$TUNHIN= 0
##$TUNHOUT= 0
##$TUNXOUT= 0
##$USERA1= <user>
##$USERA2= <user>
##$USERA3= <user>
##$USERA4= <user>
##$USERA5= <user>
##$V9= 5
##$VALIST= <valist>
##$VCLIST= <CCCCCCCCCCCCCCC>
##$VD= 0
##$VDLIST= <DDDDDDDDDDDDDDD>
##$VPLIST= <PPPPPPPPPPPPPPP>
##$VTLIST= <TTTTTTTTTTTTTTT>
##$WBST= 1024
##$WBSW= 4
##$XGAIN= (0..3)
0 0 0 0 
##$XL= 0
##$YL= 0
##$YMAX_a= 777768
##$YMIN_a= -834788
##$ZGOPTNS= <>
##$ZL1= 120
##$ZL2= 120
##$ZL3= 120
##$ZL4= 120
##$ABSF1= 15.50229
##$ABSF2= -2.54956
##$ABSG= 5
##$ABSL= 3
##$ALPHA= 0
##$AQORDER= 0
##$ASSFAC= 0
##$ASSFACI= 0
##$ASSFACX= 0
##$ASSWID= 0
##$AUNMP= <proc_1d>
##$AZFE= 0.1
##$AZFW= 0.1
##$BCFW= 0
##$BC_mod= 2
##$BYTORDP= 0
##$COROFFS= 0
##$CY= -3
##$DATMOD= 1
##$DC= 0
##$DFILT= <>
##$DTYPP= 0
##$F1P= 0
##$F2P= 0
##$FCOR= 1
##$FTSIZE= 16384
##$FT_mod= 6
##$GAMMA= 0
##$GB= 0
##$INTBC= 1
##$INTSCL= 3.241238e-09
##$ISEN= 128
##$LB= 0.25
##$LEV0= 0
##$LPBIN= 0
##$MAXI= 10000
##$MC2= 0
##$MEAN= 0
##$ME_mod= 0
##$MI= 1.114404
##$NCOEF= 0
##$NC_proc= -5
##$NLEV= 6
##$NOISF1= 3.799351
##$NOISF2= 2.8
##$NSP= 0
##$NTH_PI= 0
##$NZP= 0
##$OFFSET= 15.48025
##$PC= 1
##$PHC0= 247.5724
##$PHC1= 17.99223
##$PH_mod= 1
##$PKNL= yes
##$PPARMOD= 0
##$PSCAL= 0
##$PSIGN= 0
##$REVERSE= no
##$SF= 200.130008294216
##$SI= 16384
##$SIGF1= 3
##$SIGF2= 2
##$SINO= 0.751879
##$SIOLD= 32768
##$SREGLST= <19F.Aceton>
##$SSB= 0
##$STSI= 16384
##$STSR= 0
##$SW_p= 3612.71676300578
##$SYMM= 0
##$S_DEV= 0
##$TDeff= 16384
##$TDoff= 0
##$TI= <>
##$TILT= no
##$TM1= 0
##$TM2= 0
##$TOPLEV= 0
##$USERP1= <user>
##$USERP2= <user>
##$USERP3= <user>
##$USERP4= <user>
##$USERP5= <user>
##$WDW= 1
##$XDIM= 16384
##$YMAX_p= 344189444
##$YMIN_p= -177284
$$ End of Bruker specific parameters
$$ ---------------------------------
##NTUPLES= NMR SPECTRUM
##VAR_NAME=  FREQUENCY,     SPECTRUM/REAL,   SPECTRUM/IMAG
##SYMBOL=    X,             R,               I
##VAR_TYPE=  INDEPENDENT,   DEPENDENT,       DEPENDENT
##VAR_FORM=  AFFN,          ASDF,            ASDF
##VAR_DIM=   16384,         16384,           16384
##UNITS=     HZ,            ARBITRARY UNITS, ARBITRARY UNITS
##FACTOR=    0.220516191357247, 1,           1
##FIRST=     3098.06263265946, 0,            0
##LAST=      -514.654130346316, 0,           0
##MIN=       -514.654130346316, -177284,     0
##MAX=       3098.06263265946, 344189444,    0
$$ Real data points
##PAGE= N=1
##DATA TABLE= (X++(R..R)), XYDATA
$$ [...]
9182 303213 324267 321962 320535 380519 415235 379789 294492 337631 364752 364536 362211 411887 407509
9169 407509 356848 363606 281693 285787 337543 365226 406852 415511 381495 371737 362092 390350 389829
9156 389829 342509 324287 280148 255416 336841 371826 335514 417361 429391 404228 314831 280651
9144 280651 334716 341011 366487 406229 356794 279832 251546 313078 322727 322016 321350 276526 212491
9131 212491 246136 335152 323156 301590 315832 246093 240300 237532 232119 242094 248948 283248 262556
9118 262556 232708 282414 280583 288567 266086 210388 204822 239575 265265 322552 254603 258382
9106 258382 300783 340721 292266 230131 277185 253527 262946 219051 240940 273631 256938 279815
9094 279815 253302 239598 273911 280751 334143 311792 260351 228035 267737 258574 244666 198466
9082 198466 243960 318090 324862 332283 326782 346692 270413 234932 327283 338223 289550 283220
9070 283220 246309 224903 215736 219356 268082 319476 312061 324489 373141 298307 295042 290963 291982
9057 291982 333252 351194 341159 361053 388196 380982 364901 400180 365292 332807 315586 282160
9045 282160 351110 404857 404149 363183 317350 318336 337737 332155 403036 339264 321603 390903 354255
9032 354255 333145 378423 341559 318545 321577 367082 382153 378584 422465 415026 416596 448513
9020 448513 418827 393475 389384 461229 512868 461723 462621 459862 459648 453270 428339 477872 503269
9007 503269 497865 508419 529198 554858 514232 504018 483466 506699 536168 492459 478687 482970
8995 482970 520464 490499 496168 512734 585087 624685 584880 574956 557777 609802 633963 638246
8983 638246 686334 665712 632473 733716 764499 765383 838132 848271 772198 794275 853611 861483
8971 861483 880719 915695 878469 860615 905198 1012983 1124593 1223393 1272115 1412535 1559425
8960 1559425 1721415 1873171 1894532 1946600 1904334 1922996 1957569 2023241 2158135 2168895 2247609
8949 2247609 2339226 2429205 2530807 2591126 2737110 2893697 3145890 3375000 3635070 3808830
8939 3808830 4048356 4321880 4530573 4919858 5253299 5699539 6211931 6808195 7496115 8500258
8929 8500258 9814948 11480019 13245972 15579849 18662996 21065893 21533375 19844653
8921 19844653 16546458 13414110 11034235 9235707 7866233 6668049 5717607 4978039
8913 4978039 4368440 3827186 3414761 3056821 2749090 2510582 2333008 2121195 1990800 1887744
8903 1887744 1829916 1728727 1612437 1479236 1426965 1297124 1174966 1157729 1121161 1114004 1044415
8892 1044415 965837 964751 934637 885984 852834 858090 852728 868413 843546 781332 742283 738042
8880 738042 653669 636800 612818 609928 701016 680473 649472 637396 631960 657228 664799 629070
8868 629070 599667 613564 569897 610561 664892 697339 648694 701962 677705 594229 572965 558086
8856 558086 515570 540672 582053 542218 497530 565345 610475 571127 573711 575048 553067 525982
8844 525982 532128 570727 555658 504678 561706 641466 637360 669304 603532 586897 617953 641004
8832 641004 697857 725386 720941 814722 822307 727370 751794 733049 721661 775945 801100 791541
8820 791541 790009 816452 842795 789184 820374 812223 813828 792931 757273 770901 868851 857323
8808 857323 935363 936160 912617 984941 988376 1045201 1120293 1165921 1191210 1291169 1307571 1355035
8796 1355035 1384071 1376884 1407248 1395485 1378545 1411842 1415390 1365698 1369512 1310344 1202996 1146874
8784 1146874 1080307 965479 904790 836324 818927 770920 761349 743723 682000 601763 631015
8773 631015 613655 604943 547343 522427 537755 540303 563125 502229 463019 512676 450913 405759
8761 405759 386440 418815 440033 464362 446974 385532 390087 359537 330594 374696 384347 345860
8749 345860 393927 425686 400065 399839 406748 394711 335797 343335 357333 343822 359352 370522
8737 370522 362055 334627 233583 192102 335405 369497 441361 407505 362439 335208 335872 307003
8725 307003 301822 263650 332841 317629 336049 287189 299425 377046 354966 346517 332512 302165
8713 302165 306099 355599 334674 337615 331327 326668 273830 303183 367711 393894 363810 361176 378140
8700 378140 369500 326399 350537 359926 390715 393707 401850 393006 354317 372082 411738 407491 354184
8687 354184 363098 373714 352958 365301 313839 419200 462453 429245 458921 424294 363049 452091
8675 452091 529457 444145 383549 362143 421110 420806 420888 355926 353327 372470 377073 346551 360761
8662 360761 320138 313924 386274 380473 379228 411696 363532 329858 360364 347045 320273 330231
8650 330231 315877 325453 333323 321814 331992 358567 355184 299611 278622 269262 303587 291276
8638 291276 261007 301767 337274 336262 298003 249096 225890 270886 253457 204918 236227 215965
8626 215965 189312 226275 223362 142825 170053 238432 246476 260693 205565 245885 174183 199797
8614 199797 236007 201279 205199 196968 208257 193695 205401 203222 219918 224046 205778 205872 163768
8601 163768 66653 154182 182280 122226 152298 148190 157766 150272 197165 252050 221675 257489
8589 257489 225320 173533 192137 179858 154572 250485 279079 215781 158558 143949 122986 148152
8577 148152 202129 221513 181629 121938 167669 212905 210886 172019 149808 137074 167908 179350
8565 179350 145414 153320 152772 122157 150911 165931 176381 173343 163814 158545 113137 129055 98538
8552 98538 91584 108125 172787 135924 119413 113966 112902 207153 174892 166040 141926 152169 179371
8539 179371 176217 159753 124982 174052 190130 230424 226010 154587 132448 190815 196336 244521
8527 244521 213083 168436 147277 217185 201300 189953 220265 202841 145198 56785 88566 97910
8515 97910 179588 228887 197328 137432 121728 220074 240012 157254 125408 112523 128294 174675
8503 174675 201074 152730 88417 121169 135383 144999 152953 157116 143088 141408 147604 134096 184231
8490 184231 181817 132622 104746 148960 149630 73047 81351 87639 30419 48141 83348 101200 150305
8477 150305 131234 79144 65775 109397 146485 116177 110662 106802 123843 107086 78732 105955
8465 105955 147309 116502 51515 96695 115429 130124 94724 10876 77133 173243 190898 168495
8453 168495 161252 202389 152578 164559 242814 166795 177639 201847 179215 153151 234760 216357
8441 216357 219648 170389 155543 135069 111694 101642 44664 97855 122702 160045 171074 115712
8429 115712 94269 113985 147746 118805 91921 43493 96339 137675 137638 126494 183739 216515
8417 216515 211656 127968 177259 152071 153785 253758 297683 258832 244644 248478 200038 223628
8405 223628 253031 268197 263673 325536 325248 324804 351250 414986 411824 441871 372451 324881 314154
8392 314154 259072 225096 263354 316823 355029 356138 406520 375375 317208 299462 334529 312753
8380 312753 315231 322940 278529 283168 235972 185051 149767 254091 230505 204688 233355 186609
8368 186609 195317 190337 226304 203224 250652 239578 279919 322204 262587 277136 293083 281491
8356 281491 307896 291129 329872 299112 296909 279568 322865 252455 295606 367119 337295 345441
8344 345441 387162 365100 372488 377476 358151 416451 362243 345223 293743 268878 246906 316595
8332 316595 287618 311870 331271 257113 296134 356570 289607 265911 310264 296364 274011 260776
8320 260776 283126 321726 320757 296849 298503 301611 301885 316211 318280 333778 323360 298032 338912
8307 338912 287998 318910 379879 348106 398057 448096 420101 432514 478724 394588 346641 331556
8295 331556 491688 449073 400794 418083 426953 476827 434591 400725 323215 339243 306505 270006
8283 270006 278605 260378 255516 250647 280871 217669 201027 233099 176880 142856 173689 237076
8271 237076 193123 174805 235554 238366 173496 145243 186660 218233 184029 213544 252498 243973
8259 243973 244585 272383 317591 349006 326624 242533 243882 247664 149579 145106 141835 118704 177990
8246 177990 185877 178720 173327 148632 194300 159666 171110 77239 102385 126885 96835 113633
8234 113633 82590 105832 127434 121801 163059 199602 133715 127428 160094 212393 168892 217085
8222 217085 243197 162345 127752 223674 164123 247614 217876 181356 102913 90647 103437 131544
8210 131544 210037 235294 192434 214220 245800 214851 140996 145496 153704 217831 130055 99909
8198 99909 140966 117982 161272 215375 187268 469103 1383582 759339 311991 301956 346358
8187 346358 290692 170469 180767 184740 194837 128075 176680 92301 188857 146034 112598 127494
8175 127494 114974 139227 137400 149690 162933 107430 129282 95550 99276 85526 81232 94769
8163 94769 144493 167648 210484 135523 94829 89359 133430 78333 47377 13226 -32545 81712
8151 81712 100157 95056 36297 38796 79490 69350 108991 118671 116138 82789 91060 96818 28764
8138 28764 70519 140238 128802 137026 114248 118023 115942 84561 2892 -84368 2430 35179
8126 35179 -32155 -71476 -47422 17160 58780 61388 85699 80872 47030 6539 19460 -150
8114 -150 75519 115560 121740 -13250 -50031 18386 45535 98304 94347 69950 62968 87201 45704
8101 45704 -37465 -1023 26602 55297 90133 79619 104089 189102 183209 122691 193579 146893
8089 146893 159036 203054 238187 166040 78181 105388 117769 119611 136840 173004 137622 152656
8077 152656 45422 39462 108686 120160 80602 89961 133373 124101 86294 55975 72630 26464
8065 26464 -3244 12934 39989 40236 95201 49894 34591 -64014 -40181 -16072 28507 61611
8053 61611 35607 -10065 7348 37248 23100 63768 79919 54098 -9711 -7857 -37043 -15530
8041 -15530 -7833 25025 -10947 -580 7440 -9387 25905 72098 64323 19685 34692 57053
8029 57053 12018 -25219 -61750 -27972 29619 51930 19995 3255 21838 -28532 5638 7478
8017 7478 90663 119764 90015 65110 -13187 -82438 -65930 -16781 -7972 -50062 -10141 3036
8005 3036 -9981 -19308 -61006 -68011 -92108 -81244 -58460 -33517 -86508 -80648 -64573 -85619 -121728
7992 -121728 -114647 -18327 37531 -20305 -52383 -45869 -42243 985 31776 35318 2692 31891
7980 31891 16736 12852 11741 9599 48423 21169 46640 46065 49416 26529 -7786 -62048 -85656
7967 -85656 -92925 -99172 -68644 -69674 -54467 -60840 -84389 -68434 7747 60168 9308 58109 103800
7954 103800 31620 41414 9500 -9178 -23082 -735 23178 -8832 2448 -35151 -17521 46284
7942 46284 10596 -25396 -29439 -60729 -70462 -81795 -77763 -51369 -31368 38655 19750 -39564
7930 -39564 -44137 -40973 -54429 -83641 -25654 -44117 -61609 -82142 -42050 31045 -5787 -22632
7918 -22632 -17938 -46421 -22295 49443 37456 40269 -8158 -15412 13728 41047 66479 15320
7906 15320 -2910 -30325 -47906 -56255 -65345 -36058 5382 35963 -56276 -80909 -36061 -13740
7894 -13740 14828 19351 -9931 14157 -49016 -16157 -15827 -18879 -40563 -23478 -59727 -70625 -40390
7881 -40390 -44391 -32082 -15834 25624 31761 30482 -39481 -48725 -55297 22409 3427 13428 13968
7868 13968 20399 -9792 -24086 9886 -9723 -26104 -38702 -45141 -69472 -79683 -44994 -61767
7856 -61767 -9857 -25633 31513 10180 -21466 -39274 -92703 -22741 32075 24764 13040 -3572
7844 -3572 -7496 33188 13511 -26409 -39385 -30174 23059 6674 -15865 -34792 -47953 -27049
7832 -27049 -33278 -17972 -59805 -71440 -61749 -93232 -101760 -55188 -103231 -93287 -56258 -54979 -61320
7819 -61320 -38972 -32655 -49072 -49175 23830 -10588 -56496 -50396 -57457 -35348 -83500 -75467 -59877
7806 -59877 -68714 -77572 -115799 -134817 -174732 -158657 -46433 -53300 -83591 -95992 -66598 -98786
7794 -98786 -96658 -14926 19349 -73171 -117007 -87294 25455 56712 -52765 -53243 -67955 -102086
7782 -102086 -60127 16438 45244 22372 1419 -4622 -25112 -47230 -27517 -16712 41017 35185
7770 35185 1402 21790 -40104 -63476 -45209 -35522 -47583 1921 -45806 -34685 -29913 -81398
7758 -81398 -110805 -117955 -42353 -24812 -36780 -40618 -90748 -48814 -34352 -102021 -68588 -44731
7746 -44731 -100056 -68846 -29288 -53712 -35570 34202 30212 28272 -16083 -29514 -41369 4108
7734 4108 -13615 -45476 -45143 -41795 -65808 -83374 -32426 -29067 -62050 -75341 -5644 54612 39050
7721 39050 -40118 -32789 -19716 -7336 -29420 -53001 -15838 -35196 -2133 25708 24018 17014
7709 17014 -98304 -61387 -57757 -77357 21839 83981 59546 51629 64990 -24872 -44015 1603
7697 1603 -15610 4245 8710 -80101 -35998 11871 -1384 14142 30912 19230 -10852 -35150
7685 -35150 3777 -17456 -78123 -106897 -91635 -41917 -7859 3154 -30355 -10725 3702 38153
7673 38153 -39879 -99650 -59704 -42051 -13298 16458 7951 -23222 -42837 -69115 -123839 -150259
7661 -150259 -121013 -96398 -85922 -73431 -70323 -83616 -100606 -53016 -41170 -1447 -59398 -9957
7649 -9957 4337 3699 -81275 -102305 -110162 -92383 -73948 -13256 -22031 -24753 -62045 -108773 -25956
7636 -25956 -9381 27486 39759 -15131 -60763 -52918 -22386 -57043 -56975 -32753 -41446 31433 8683
7623 8683 9270 -68939 -96882 -89839 -70737 -105347 -96702 -108246 -52723 -12628 -13569 -23883 9793
7610 9793 -61940 -75015 -61208 -32285 -91735 -43667 -31562 -119362 -54504 25091 14982 15673
7598 15673 -58890 -99452 -70928 -39405 -39620 -67678 -67932 -86478 -44977 -33937 -36677 -63484 -38603
7585 -38603 22323 19531 -7778 -42219 -44604 49138 20947 51602 -93866 -112800 -61629 9311
7573 9311 -11398 -55008 -87602 -126391 -70378 -66652 -114832 -96826 -59920 -13797 -6854 4902
7561 4902 9976 -4810 11602 -36426 -7509 -13609 11670 5164 -3671 -49997 -50776 896 -45482
7548 -45482 -9343 -33010 -57759 -79527 -47175 -39128 -44144 -35397 25368 -4892 -38475 -8282
7536 -8282 -5773 6273 -48500 -10675 -14655 44914 2294 7708 7400 10763 10282 -19132 -41964 -15985
7522 -15985 -31217 2041 1638 29378 9122 5919 -22214 -20289 22150 40909 29171 -15816 19142
7509 19142 -38384 -20917 -11760 -25059 44466 -10062 -23034 -20854 -22341 -34699 -37944 -68930 -114955
7496 -114955 -42144 -59588 -119992 -143849 -43432 -42980 4964 -18065 -63898 -57671 -79577 -109416
7484 -109416 -104130 -106893 -2846 18398 24036 12576 -35061 3906 -13696 -55980 -31504 -24858
7472 -24858 -40663 -64493 -111830 -62059 -40187 -15382 -12294 -36483 -16062 -45558 -81466 -83652
7460 -83652 -68600 -17005 -7421 -9059 -27901 -96637 -90649 3046 -39417 -142266 -64637 -62254
7448 -62254 -76771 -33925 -78271 -37883 -54777 -105846 -107048 -106396 -38040 -91535 -111523 -108431 -76302
7435 -76302 -42373 -69855 -44732 -70847 -47903 -67077 -42437 -21478 -79772 -63505 -30127 -48025
7423 -48025 -76769 -177284 -109021 -30790 -11153 -68468 -118884 -95009 -79301 -83159 -93708 -72879
7411 -72879 -37655 -47975 -64354 -13609 -25805 -24948 -58976 -21883 12423 17038 -894 -85975
7399 -85975 -66254 -34576 -42482 -34038 14324 93 -19821 -25558 -52460 -44519 -77884 -44900 -807
7386 -807 -82922 -99134 -107093 -40708 -20278 -56746 21589 -39567 -103174 -105554 -40910 14449 18148
7373 18148 41313 29656 18008 17687 -50433 5567 -34923 -81599 -85376 -32264 18965 41745
7361 41745 23365 -18615 -5453 22833 -4146 10479 -28602 -59339 6483 -3063 -2413 -14954
7349 -14954 6296 54989 14024 -23629 -24257 -41611 -48175 -21997 -46828 -54954 4611 -25098 14679
7336 14679 8996 -42920 5549 45372 -5376 -10910 3055 2450 -19900 -65679 -2043 -21507 -23751
7323 -23751 -13774 -39224 -58590 -73520 16116 29487 -66467 -19230 -20292 -4657 19524 -4924
7311 -4924 27447 -11250 825 -14900 -20420 8680 6704 -10259 29509 27634 39603 6685 -6497
7298 -6497 -18794 79365 45513 -51604 -41865 26904 39920 82186 24711 -48004 -27466 -40217
7286 -40217 -14447 -55420 -34069 92 -40010 3002 -36926 41387 46186 -49440 2146 3978
7274 3978 -67667 -76934 -84854 -56068 3952 -54810 -26383 6133 -35652 -28207 -8561 3060 14669
7261 14669 -6815 28173 22119 -32372 -24046 22766 6834 52379 51131 -3862 9454 -18244
7249 -18244 1954 -4465 30677 28224 26368 63830 -8479 -9358 -34299 -32063 -7174 -45454 -21155
7236 -21155 -23552 -13776 55920 35984 -22806 3368 71732 112932 114145 47030 -3099 -50652
7224 -50652 -32264 3147 52044 36749 34381 50953 90650 92548 72447 38341 13848 -17335
7212 -17335 35287 72085 43497 80807 92059 38221 77363 58623 64116 94460 113677 63628
7200 63628 -49923 -32469 -7897 -16772 15358 -38304 23348 41286 32956 38528 -27830 -59054
7188 -59054 -4706 10007 -38825 14377 29875 34564 -27408 30898 41790 14880 3670 -22780
7176 -22780 -46065 -35978 63011 50516 53567 93504 70845 92880 87181 107700 138951 95399
7164 95399 62066 36370 76308 106376 123468 119746 129238 141999 90938 75726 191593 218842
7152 218842 233033 249811 270199 295886 356637 493938 579331 658701 717405 708538 591390
7141 591390 577509 406768 258539 301898 272367 165251 185139 257185 229530 209271 214059
7130 214059 92963 88288 66479 39672 56959 80817 121848 28908 -42575 45536 24701 25773
7118 25773 19279 -67224 -10108 11980 51333 50402 30546 43150 -15659 -19668 -49772 -4405 -45306
7105 -45306 -54927 -18926 -80170 -69598 -63616 -73502 -9815 6726 16261 10647 -12641 56012 22988
7092 22988 -13998 37720 -27520 -42381 -68743 -10576 -26634 -19027 6211 -84099 -90975 -12161
7080 -12161 28664 9847 7109 -17019 -42824 -32871 27618 -20746 -9272 -32745 -27201 4084
7068 4084 -4791 -18320 24947 23392 34996 3273 5 4234 -3154 -92544 -109241 -110773 -89810
7055 -89810 -1416 -8023 57804 57181 37095 20377 -8155 -18780 57846 72684 -12239 -39733
7043 -39733 -77958 -5674 18356 5403 -7184 -62113 -53346 -29375 -16521 -15441 -85252 -110906
7031 -110906 -121968 -31033 -43043 11200 -60725 -115454 5614 38567 -5825 -28632 -3443
7020 -3443 -21193 -20145 -7497 24564 -2705 -15633 16822 72392 -19860 -83162 -62550 -39599
7008 -39599 -17993 55445 85286 14418 -9733 19823 34162 38079 1780 -67328 -35819 -27316
6996 -27316 -31743 35835 24048 -8768 -34704 12886 -3972 -7112 -41592 -67085 -52863 -63091
6984 -63091 -3645 -65489 -108114 -92517 -56335 -31381 -12024 884 -20765 20867 54421 28201
6972 28201 -18811 -2469 12338 -7252 -30831 5188 26106 34531 38235 -5477 19711 1450
6960 1450 -42182 -4411 -14761 -22668 -13953 -2538 10487 -479 64522 18728 -405 60751
6948 60751 26965 -3828 8633 11617 -32953 -14189 -61580 -11681 -12365 -24382 -41046 -91499
6936 -91499 -30500 -39300 -23260 27024 -32583 -20385 -15194 -37802 -5774 -56178 -137795 -101003
6924 -101003 -52032 -45502 10166 38672 23730 14187 74714 59488 11797 -41975 -42120 -72794
6912 -72794 -69577 639 36474 4882 -22729 -44710 -55233 49842 89918 40290 -28812 25228
6900 25228 22538 -46990 -26416 26144 34925 -55555 -60568 -67496 -117101 -121499 -103661 -119387 -75380
6887 -75380 -30007 -45070 -49435 -9803 -54482 -63432 -35027 -43619 -22011 36964 40823 -15758 -33453
6874 -33453 -12021 -42598 -71222 -50810 -97095 -3268 61252 21781 -29690 -9757 -26400 -93894
6862 -93894 -41616 12498 -41643 -78264 -89034 -49821 -3422 -30846 -75834 -129757 -132972 -102962
6850 -102962 -8458 20012 39858 24883 13839 -49910 -70749 -27863 -58168 -56645 -53964 -69656
6838 -69656 -99603 -68529 -38653 13931 -13518 -72118 -69334 -46820 18545 -8269 -61962 -36868
6826 -36868 -25343 -53207 -89484 -51444 -61520 -33468 -133961 -114196 -9237 2225 3868 -35828
6814 -35828 29743 -7341 8601 45415 6968 -134745 -98850 -48766 -78776 -10727 16183 -3329
6802 -3329 13975 3763 -87918 -65762 -76551 -39653 2151 29361 16637 17507 15131 -67838 -32810
6789 -32810 -12507 -58174 -40457 -23975 -112315 -105977 -54875 -93369 -104725 -78309 -30748 -31878
6777 -31878 -3720 -4124 -50454 -1205 -39825 -73515 -102914 -74938 -104928 -159702 -62369 -31373
6765 -31373 16825 15132 -32157 45219 -2146 -48590 -8177 -31688 -95634 -107909 -122300 -80573
6753 -80573 -28437 -37587 -89208 -72914 -20835 -6323 -8138 7288 35097 35349 22680 5466 -21041
6740 -21041 -78534 -9188 -82989 -110944 -84309 -30947 -2585 -71008 -89291 -106526 -63459 -43953
6728 -43953 -28680 -47408 -52218 -91016 -74158 -38533 -64471 -36941 -42871 -2268 -33399 -46370
6716 -46370 -49155 -13746 -44193 -94002 -53045 -24996 -40701 -114090 -125264 -34247 -7147 -50817
6704 -50817 -71683 -67582 -19994 49401 -16258 -33795 -28438 -24303 10370 10822 -7755 -26050 -43664
6691 -43664 -8042 -6736 -83570 -82144 -68815 -64919 -33177 32541 41643 -6815 -54005 -47923 -7246
6678 -7246 27079 -24262 16886 -33686 -73743 -119647 -65609 -59089 -91539 -41737 -97668 -74431
6666 -74431 -55612 -89576 -53147 -16591 -45752 -26504 -16659 30139 -6856 -12454 -1965 -24757
6654 -24757 5302 8495 19926 32137 89557 50292 53739 -8297 4275 -46699 -43753 10804
6642 10804 5946 3960 11700 -5775 -18067 -8428 -6763 19189 -43209 -18217 -17059 -52078 15994
6629 15994 9774 -14510 17814 30897 52256 3331 11325 -55498 -68526 -67446 -65159 -28742 -42178
6616 -42178 8562 3279 50423 73901 22104 -57601 -48053 23546 13109 -37378 -38422 1782
6604 1782 -89853 -45433 36251 -30273 -134879 -83811 -34490 23587 7872 6904 -43550 -54816
6592 -54816 -17075 -46024 -78299 -66676 -128056 -105178 -85024 -98719 -68329 -64023 -12962 48068
6580 48068 24955 31374 46124 -50553 -41426 -104637 -55416 -38592 -60673 -74847 -58893 -42292
6568 -42292 -51422 -25552 -25826 -42568 -48074 -69401 -118637 -117366 -102179 -57132 -53113 8626 14812
6555 14812 57122 46467 -27070 -5546 -27016 -9727 -48699 -69296 -29881 -74359 -42974 1751
6543 1751 -14041 -16585 15365 20751 21934 53526 19472 5855 -10228 -28924 -93563 -76184 -34826
6530 -34826 -27420 -73811 -39293 -43157 -1137 21514 -102524 -54527 -18325 -13064 15331 19261
6518 19261 -30433 -79841 -16724 -6140 -56764 -51190 -44680 -49309 -78389 -108537 -65360 -115062
6506 -115062 -100371 -65668 -63358 -40321 -56580 -66896 -90244 -60970 -23722 3860 7804 -43131
6494 -43131 -40066 -36716 -43569 -63584 -72586 -60478 -44025 -53710 -20238 -6057 -25900 -22533 -39729
6481 -39729 -9302 31893 36333 -12956 -35634 -71589 -30780 1454 12741 -19506 -39549 -6290
6469 -6290 -18619 -65706 -63734 -69615 -39020 -66721 -127729 -71512 -59134 -57002 -15759 -14401 -51099
6456 -51099 -40188 -57815 -62269 -46235 -51986 18511 -13842 -103315 -30630 -10901 -35920 -60172
6444 -60172 -49024 -43271 -68526 -70276 -59296 -51646 -45219 10769 70804 -33946 -36725 -84907 -113888
6431 -113888 -121065 -89762 -80801 -107952 -27056 -30775 -64652 -95123 -48646 -103428 -122425 -48047
6419 -48047 -49431 -49838 -44854 -64343 -7254 -47063 -29698 -16711 4052 -20965 -73166 10995 26923
6406 26923 19333 -30481 -75479 -123187 -110995 -61342 -108382 -89318 -6033 -1294 -64806 -5061
6394 -5061 -42679 -62863 -52024 -16475 -18017 23816 83689 60486 -13638 -4629 -7550 2850 34993
6381 34993 18826 -9276 -108018 -97583 -6366 36130 80452 50211 34544 96521 94603 88510
6369 88510 45778 42589 58002 83945 75706 93043 105121 119341 95803 37021 53641 16482
6357 16482 48464 123132 115868 148827 176075 254800 293083 253043 214761 231062 223911 212638
6345 212638 308287 364902 331408 349791 445654 510882 534496 626502 660691 674499 754924 794615
6333 794615 674402 681828 660364 647654 596192 615650 588003 622390 744931 762474 790259
6322 790259 769723 772941 753896 817724 813739 834492 900907 871220 859786 797954 785241 805481
6310 805481 800432 790499 738403 727159 671216 619902 632779 612067 519126 541922 539635 583684
6298 583684 673649 726553 719310 748794 688285 633042 527349 512135 459791 421249 392648 248169
6286 248169 202725 197012 231186 257385 246165 148252 145947 161141 149356 216474 227974 226282
6274 226282 183399 172368 179920 161460 164442 184823 168562 95229 157165 188249 124811 91512
6262 91512 139624 144951 150861 158087 153544 103429 115338 188575 204536 116047 74245 66812 63647
6249 63647 55087 109867 177420 206428 229084 257539 184916 156546 170701 130115 126939 127040 97344
6236 97344 124638 142322 164437 89223 54758 44779 123953 96413 24707 72917 61013 110301
6224 110301 16868 -16107 61920 159007 173012 125064 124294 149913 127630 134322 138197 147376 128125
6211 128125 96311 87368 103984 94281 102910 117862 105662 103931 100842 80002 73324 80580 49487
6198 49487 24156 56427 122758 102134 92256 103861 134143 112525 61372 91224 116223 90534
6186 90534 35494 93894 22521 78297 110666 72601 26957 81422 121501 76793 118772 54415
6174 54415 16187 46542 48953 48666 51626 131327 83876 41480 84083 96961 73006 60363 111686
6161 111686 116076 84184 79700 87301 96893 62858 44391 31147 -47263 -34221 69751 136396
6149 136396 73786 72850 119869 176663 81792 100279 119850 43287 43569 30395 4923 -12911
6137 -12911 6271 52681 74062 115809 83035 29385 10985 -3816 78379 110863 144632 151356
6125 151356 44334 26473 37776 54531 61567 32317 40733 26443 63738 37804 20402 41347
6113 41347 44630 7720 -58991 2555 46432 58374 108044 82436 16150 -36165 -17907 48654
6101 48654 87102 58512 86210 131158 69275 33428 40198 77466 85343 16388 69980 53207
6089 53207 -19332 20972 57163 68785 75363 92041 123709 159698 156848 157133 108819 112669 129319
6076 129319 157769 159778 122694 46703 40818 52454 125966 140071 113509 94801 122086 126769
6064 126769 120115 97873 36097 55549 66112 66238 101843 86551 77466 91109 123757 109394
6052 109394 94106 99679 62780 117063 163110 128183 69639 70930 67737 149776 136316 74163
6040 74163 14858 59889 116469 75180 134263 122522 80342 77491 125692 162255 113313 110703
6028 110703 110683 72934 92204 105255 44089 38761 33181 -724 73141 81445 49592 45992 77159
6015 77159 61484 36452 -3303 48982 110045 112001 109431 97892 74789 14276 47093 12633
6003 12633 25980 84980 -15578 18890 184297 113745 98224 81303 110225 123956 100685
5992 100685 103794 95888 96002 98296 133386 157888 81060 96687 155859 117194 71684 91898 114006
5979 114006 129058 115071 68018 73722 81687 89867 89648 135513 124796 113947 46800 68027 70456
5966 70456 46177 84032 82551 145523 152663 177265 94877 61572 41002 87414 103713 104698 147064
5953 147064 141474 88294 88974 72980 74204 106477 64951 110301 147339 97480 85470 116079
5941 116079 95832 142163 117004 104789 131730 129465 68157 59859 158396 132644 92344 140830
5929 140830 68063 97673 124219 128211 119130 101361 120897 155359 169477 131962 91281 61977
5917 61977 126769 161438 108791 111364 110188 123971 106451 126267 135963 87935 146419 161331
5905 161331 93789 161927 176078 164328 205209 212180 228855 116677 160212 116582 95867 122199
5893 122199 138331 153307 128164 178345 164488 197855 215238 214405 184949 275959 263924 210589
5881 210589 254995 187529 211561 177749 187661 209418 242478 245763 216164 248603 188904 187457
5869 187457 245417 275848 280836 267003 218403 260571 266188 261430 267952 286222 272326 268549 310415
5856 310415 299476 392894 407370 340150 281282 364299 373052 384750 392771 344845 355097 360453
5844 360453 387345 407253 439904 437132 467667 510695 477430 366242 431002 469073 540883 555551
5832 555551 561588 619602 607333 620327 666005 672629 689213 656588 767723 775854 739163 855219
5820 855219 821977 738768 788141 876432 945506 914333 949083 955262 1017396 1050918 1114926 1174097
5808 1174097 1278197 1356157 1392832 1488102 1579239 1725168 1840087 1930656 1992073 2064513 2052409
5797 2052409 2084654 2060422 2079699 2130333 2239657 2358474 2381515 2446910 2652897 2739804 2842026
5786 2842026 2964376 3073367 3189103 3316233 3457214 3656362 3807440 3999224 4129335 4276835
5776 4276835 4464884 4715235 5026034 5385394 5607425 5890882 6280992 6687548 7128036 7356617
5766 7356617 7369482 7428163 7434895 7428996 7396446 7283839 7272073 7356437 7416813 7541301 7627052
5755 7627052 7735043 7884170 7955626 8148179 8356187 8580949 8862475 9111059 9297917 9464558
5745 9464558 9698040 10061133 10515330 11033428 11567668 12181683 12900752 13648619 13910509 13566868
5735 13566868 12823339 12011229 11262475 10746018 10280131 9729398 9310617 8985102 8765798
5726 8765798 8560079 8248684 7790487 7528871 7268107 7056070 6883032 6750589 6552286 6359883
5716 6359883 6198708 6071196 6043878 6111811 6218124 6305564 6381823 6401705 6404138 6300237 5966620
5705 5966620 5441110 4886104 4365008 4133286 3907805 3641071 3366064 3032804 2716890 2522038
5695 2522038 2362332 2277180 2193865 2051961 1872424 1854486 1800083 1715771 1701403 1572098 1389128
5684 1389128 1352540 1289484 1238397 1248562 1247681 1156345 1135462 1077811 1005910 979536 890093 878424
5672 878424 884573 863069 866892 836029 847983 830700 819825 746934 689157 715929 723062 726549
5660 726549 770027 662624 606197 618763 578435 632104 623670 671357 688169 569169 546340
5649 546340 574683 552285 515602 471833 508687 537298 452341 412524 363596 371624 468270 414688
5637 414688 381253 392352 395161 386646 371289 353886 352341 353566 376410 311226 313318 329555 342556
5624 342556 303115 246473 254260 267402 253955 239951 232682 157239 186792 160303 152558 219414
5612 219414 222724 224166 267764 240337 159286 227695 261674 243095 196782 197814 246998 260238
5600 260238 246615 237221 141359 86173 146193 144764 85882 98460 74322 127668 143889 187431
5588 187431 275050 212107 161598 158676 123701 138927 176588 138654 111587 131160 73385 77281
5576 77281 43375 108872 118374 92646 112058 124079 115228 90450 153752 109281 84326 147317
5564 147317 144719 105394 71460 64461 101764 137118 118818 172523 167273 182014 132381 113406
5552 113406 22892 15513 67312 97799 149495 94946 152766 195919 251503 176019 145111 122244
5540 122244 155623 157605 154428 150484 117051 109407 106934 142785 124696 49390 79309 83588 71325
5527 71325 78101 158717 105901 119320 94190 48594 58786 85105 135549 148138 23314 9713
5515 9713 89143 108971 100390 92171 97317 110937 38968 50181 99200 61120 39462 97778 139493
5502 139493 82701 77210 66226 86065 22291 -21196 14712 47078 105915 64665 48286 77499
5490 77499 64448 46642 -19644 -8865 10448 72694 74512 100245 79616 104346 96516 76689
5478 76689 77628 101186 165044 165174 78660 79903 65219 78320 91897 120329 104275 111429 80324
5465 80324 125780 99751 22252 21376 47161 57886 46997 60470 103735 131531 34019 51335
5453 51335 105690 114344 95395 95143 42639 17102 55967 88612 17716 65541 72955 86424 85174
5440 85174 116880 81293 56128 109340 193247 58381 63692 141843 131537 126417 180083 181496
5428 181496 173699 155073 77129 47258 53847 87612 80046 88422 95226 84483 57602 51738 7460
5415 7460 37571 69595 146649 82496 90178 99728 101680 87511 84217 117442 122395 181336 163758
5402 163758 124642 142737 146440 175042 175591 136545 128445 110528 165160 138277 96991 97317 153385
5389 153385 134699 58923 10028 -8203 49334 57600 94239 62253 91270 132122 193276 181261
5377 181261 151645 101632 81671 126072 118848 105234 81770 88811 116508 223805 278340 268399
5365 268399 257709 266324 240066 251859 301607 259422 232890 268401 249642 243853 205259 123192
5353 123192 157196 157671 114965 177059 187189 166544 177975 172138 255885 223109 187404 220932
5341 220932 293430 262059 266988 250562 344126 348761 379158 431065 468081 523535 561104 538777
5329 538777 508226 457377 419276 400120 366055 362716 364532 314139 254352 271218 214932 249960
5317 249960 261130 280464 218550 254339 253376 236085 258230 373519 357537 284450 275298 312396
5305 312396 343280 398610 400547 402184 457978 512931 541358 532500 592152 551210 504620 499478
5293 499478 412935 442811 384195 379413 363182 326871 335575 290958 262606 205473 154225 156055
5281 156055 152587 154736 79569 75873 209431 219206 210665 244599 166333 200719 294127 289042 287664
5268 287664 286794 283240 307438 368361 384637 368027 371999 354333 345952 347141 335049 334453 352255
5255 352255 300966 288668 322631 313539 331233 374492 408837 385942 344652 299202 324298 293554
5243 293554 317361 283885 245487 218955 253626 250427 229187 263518 282228 299932 309278 288318
5231 288318 295158 292054 341146 345490 317744 329370 342951 350566 353542 365409 396182 402078 428929
5218 428929 406789 416339 437404 506722 506088 478317 462228 486420 517965 509875 536140 532388 568212
5205 568212 604823 616336 553713 569084 564024 481687 423685 453141 447784 423279 343993 369216
5193 369216 365765 312078 293797 323377 308329 262058 318253 334838 362065 380280 414236 458697
5181 458697 391993 466216 466907 358812 381458 416531 390010 351294 369263 329046 338931 333992
5169 333992 369829 390436 362268 345462 376037 419351 429076 461072 460556 528507 522967 530139 553149
5156 553149 560607 573672 542297 538272 571140 590741 625177 604088 551208 604241 690432 816848
5144 816848 858890 849659 892607 986844 1111748 1129911 1233642 1318426 1335478 1338750 1328541 1414568
5132 1414568 1483104 1552734 1673705 1841602 2032522 2312747 2683561 3113931 3552735 3839172
5122 3839172 3789251 3506105 2971031 2613818 2258943 1915989 1649321 1438401 1333579 1207399
5112 1207399 1090438 991638 925849 791497 677464 676546 705487 627292 589830 605649 593050
5101 593050 588317 581495 564917 551134 566589 534495 495980 531506 501075 485666 472648 488603
5089 488603 454895 403378 406441 506743 495880 453739 429704 451871 423913 414536 496732 459424
5077 459424 454178 427154 390846 484407 512232 491504 508992 484293 464638 549934 553590 521962
5065 521962 544842 586935 604518 646144 660069 619047 671168 687187 639918 598101 566457 575057
5053 575057 564908 543504 498585 539450 616695 607532 542869 459304 439572 449981 478772 480847
5041 480847 437992 464634 511256 515070 512894 517214 622431 648405 604962 621047 672694 662171
5029 662171 665394 754185 771336 766033 870452 857250 871106 919865 951732 988891 1056069 1083769
5017 1083769 1071288 1099848 1166996 1217065 1170285 1123425 1131376 1166020 1198607 1248579 1264823 1336334
5005 1336334 1379468 1365444 1351400 1332854 1257367 1103777 1056975 1015150 1002215 959477 965366
4994 965366 1001454 968224 980163 1010656 958723 960633 946887 931234 1032054 1067469 1076401 1049471
4982 1049471 1041853 962621 928112 881490 913974 883975 813321 930502 917510 960200 1007720
4971 1007720 1008643 1035618 1066052 1049441 1060597 991106 969645 1081090 995464 1001375 1049739 1028012
4959 1028012 974981 969772 1031458 1075018 1125798 1106758 1117138 1169181 1207501 1304477 1355862 1414279
4947 1414279 1500686 1609725 1750003 1783437 1911235 2029876 2182041 2391370 2664246 2968370
4937 2968370 3182175 3357343 3321297 3154663 3010096 2977861 2932465 2976203 3043324 3141494 3272629
4926 3272629 3410795 3621851 3666795 3515910 3269460 3096247 2973943 2864057 2854494 2897826
4916 2897826 2938178 3014451 3170824 3356021 3431236 3424980 3340036 3163765 3059351 3022502 3033194
4905 3033194 3005649 2906096 2780813 2537929 2375288 2228742 2029670 1818889 1670248 1545301
4895 1545301 1424919 1331312 1245798 1177365 1153216 1121945 1080377 960928 917428 944055 855549
4884 855549 825664 810931 835558 779601 778962 778504 825834 827584 719689 676370 657091 706210
4872 706210 688121 599577 569350 540455 542785 515616 549647 572100 557207 624821 587311 488583
4860 488583 489808 526925 545083 506449 544820 569176 570312 494855 519034 540603 521723 527853
4848 527853 452940 503452 501942 511087 534102 490664 522155 548316 515579 497819 450457 423993
4836 423993 413487 402603 449442 427448 447811 448869 424972 383363 389321 418332 459024 450504
4824 450504 383758 395148 451833 463766 492892 554721 533221 546165 514697 559762 514689 501492
4812 501492 489604 434019 423004 417308 342537 370304 405899 425093 323665 320184 400381 418168
4800 418168 477264 447839 414299 380466 325678 312612 337613 376921 338899 323620 313546 368153
4788 368153 364221 266478 325256 358666 352235 365682 408319 372820 366303 369653 403190 385060
4776 385060 344388 297959 362944 434742 417206 349053 343275 433144 431977 414995 387513 428938
4764 428938 468209 438293 365572 378143 388946 495546 445173 401330 387122 387234 404312 424417
4752 424417 424124 378250 403156 463833 456228 438894 478368 456864 476061 441108 407253 426865
4740 426865 426617 441675 405039 462588 436801 413834 555452 532892 530191 515789 587360 546908
4728 546908 549605 491444 458669 560108 563983 531202 539377 542696 525855 551978 613191 584042
4716 584042 613320 591269 538409 487036 495559 546446 588477 605299 598679 499087 481631 540224
4704 540224 522020 548666 544004 500848 478505 523824 553155 573039 591908 661152 678797 617171
4692 617171 586140 651589 657809 624039 631988 584202 583869 600942 560057 599682 588476 579163 607131
4679 607131 624360 606063 626331 652744 668428 672719 624049 624311 649512 670656 630274 627127
4667 627127 680993 682414 683144 605528 594261 631326 597691 635491 647051 622020 612737 567635
4655 567635 518917 519676 499951 493842 569121 584069 591965 609516 570414 627540 599704 581413
4643 581413 629187 653955 641476 632553 717862 743560 658696 632967 558181 529382 574189 593495
4631 593495 616102 601927 610245 632860 683822 642545 594625 564447 582746 595028 649905 609544
4619 609544 581013 554522 598311 617194 650243 650551 649060 686784 614800 627009 603488 595326
4607 595326 619391 616965 612744 625460 654669 675676 685388 709652 693982 658484 712253 743013
4595 743013 674283 705358 688500 644377 724571 775393 730064 701337 743516 690278 692696 720995
4583 720995 724470 710705 655446 637646 667910 604395 593492 692348 733108 715153 686590 643152
4571 643152 578386 531600 546320 593914 592401 563297 532539 598611 570898 542175 535449 548290
4559 548290 567062 567899 574803 595602 579891 583881 549636 558105 537793 522721 553962 521244 539031
4546 539031 583297 543519 649739 636730 636983 575071 557390 632649 558016 536044 523861 546968
4534 546968 572016 636373 574111 598545 603399 574585 534035 583944 576517 545451 547567 580187
4522 580187 635613 674979 582505 545579 552104 531259 576702 572345 562069 608596 622779 617198
4510 617198 505526 522972 528365 522265 578291 575559 594799 589968 552678 595232 638620 649718
4498 649718 667419 633305 588995 596435 650113 632994 616561 585049 569299 579245 642236 537773
4486 537773 595799 596411 645448 643603 625651 645147 615428 642977 683200 691476 660682 645114
4474 645114 653574 609897 531104 638800 689318 679791 669526 641585 639164 668069 770104 755301
4462 755301 783750 823278 768952 743275 767271 792536 748971 777361 852537 905033 897664 881148
4450 881148 922818 973781 929572 875958 885411 914130 1018220 1029802 1000330 1022779 1020055 1071831
4438 1071831 1115807 1098056 1107239 1107537 1086909 1106114 1116927 1204841 1235726 1233251 1214990 1254860
4426 1254860 1329189 1340945 1361077 1380443 1388539 1362238 1374154 1376933 1438620 1404802 1420195 1449096
4414 1449096 1532530 1485735 1474662 1516562 1528754 1566837 1622609 1658812 1657133 1674919 1752695 1811694
4402 1811694 1848956 1998937 2034648 2109041 2219139 2308407 2442774 2659106 2908522 3203278
4392 3203278 3566487 4066014 4436052 4468346 4102020 3677625 3232446 2913993 2611527 2356248
4382 2356248 2089370 1902257 1778762 1730520 1644211 1578524 1536255 1447711 1367098 1304327 1316125
4371 1316125 1264708 1225299 1196075 1212959 1209505 1136740 1116309 1071389 1079584 1089211 1101520 1107551
4359 1107551 1062570 1007984 1006791 1052208 1016497 1001498 1026693 1016955 1029569 1023691 951183 984069
4347 984069 1021411 1006611 967733 1000117 914737 924848 1008018 966327 915328 967090 959135 958187
4335 958187 970555 925665 870452 843708 927803 913876 902520 844993 844619 890446 932495 909572
4323 909572 896618 893764 938656 948685 921628 924616 874604 925726 886044 916605 885075 863704
4311 863704 885496 887169 873782 857499 872016 868882 862196 933307 894841 855529 884272 868811
4299 868811 829310 836720 873888 842641 879977 878738 878666 867823 867228 890345 855180 905759 944596
4286 944596 951568 923194 859743 875054 909536 928380 871231 872352 886225 919148 956334 966639
4274 966639 959419 963466 985101 1039551 988290 923069 920754 905866 961920 955306 952339 935749 976854
4261 976854 985992 1013573 1009445 993450 957155 1005616 1065345 1053319 1038935 1046919 1079804 1064944
4249 1064944 1018946 1005235 1039492 1141481 1129869 1170404 1114264 1102481 1174841 1201292 1185469
4238 1185469 1148261 1162889 1170284 1173856 1168766 1303313 1292989 1241809 1251696 1186650 1289733 1369815
4226 1369815 1341090 1325662 1353735 1418950 1405347 1423880 1405293 1424842 1427451 1451545 1473649 1488203
4214 1488203 1482196 1536965 1557472 1549133 1522520 1564383 1566387 1570495 1630019 1691973 1737033 1724178
4202 1724178 1780252 1817496 1814631 1834328 1862632 1872440 1891086 1957412 2050048 2041992 1994675 2031408
4190 2031408 2016345 2061013 2081276 2119302 2142698 2177091 2162423 2095884 2110926 2185488 2195807
4179 2195807 2231852 2323929 2348260 2334475 2369317 2404894 2437959 2464036 2446658 2510240 2524901
4168 2524901 2532593 2605028 2637280 2641698 2683381 2704038 2749269 2839602 2846039 2830343 2865708 2830496
4156 2830496 2802666 2873617 2938495 2930537 2913763 2953844 3033215 3089948 3072198 3065000 3088418 3115548
4144 3115548 3140988 3200367 3255977 3241382 3312902 3392788 3368299 3381583 3382138 3413791 3497303 3499546
4132 3499546 3534794 3564930 3640004 3673560 3666548 3688257 3697226 3689727 3712507 3758725 3810622 3839765
4120 3839765 3851745 3903512 3956402 3981110 4062657 4100024 4113760 4179997 4205320 4254661 4259674 4291425
4108 4291425 4376814 4421955 4462038 4516380 4577357 4611372 4669748 4708493 4696565 4708606 4763491
4097 4763491 4810287 4921387 4948351 4918764 4926216 4955085 5000899 4995448 5037303 5108832 5184771 5293020
4085 5293020 5283911 5362457 5472224 5533111 5617417 5713454 5761282 5810306 5840853 5891331 5991765
4074 5991765 5980314 6027605 6040502 6151640 6235761 6277859 6335606 6490756 6607876 6681821 6786158
4063 6786158 6882798 7051537 7210773 7404335 7609368 7833004 8056094 8326556 8673195 8962596
4053 8962596 9257117 9616666 9956254 10424847 10983746 11464625 11711164 11833122 11783340 11665039
4043 11665039 11475169 11376319 11342612 11464123 11709020 12031750 12422886 12796706 13264711 13668474
4033 13668474 13998432 14171397 14228922 14240588 14277629 14349966 14445354 14507317 14644011 14905797
4023 14905797 15203445 15767401 16529039 17463729 18607211 19535915 19845725 19411695 18499589
4014 18499589 17358624 16300127 15550008 15021743 14654495 14454186 14306339 14186162 14128506
4005 14128506 14051299 14081560 14168925 14065345 13947848 13734413 13429557 12991788 12539484 12099908
3995 12099908 11844226 11731930 11723087 11849884 12002573 12123763 12250991 12391486 12348453 12121271
3985 12121271 11715228 11250587 10866599 10583642 10333600 10147827 9953478 9835190 9663189
3976 9663189 9502941 9406585 9266372 9241364 9185038 9146242 9167513 9217346 9203842 9207538 9226687
3965 9226687 9335730 9450943 9442926 9464041 9501269 9553776 9626165 9709490 9736650 9827526 9864794
3954 9864794 9933340 9992810 9984998 10024814 10081812 10136098 10171492 10240470 10393706 10456755 10517303
3943 10517303 10584861 10678397 10726638 10868596 11036983 11126036 11184360 11204880 11273525 11383712 11536821
3932 11536821 11673308 11807848 11918292 12038161 12121389 12185405 12310943 12451261 12513421 12635620
3922 12635620 12786473 12948428 13073766 13246553 13427132 13517264 13584815 13738807 13833224 13829780
3912 13829780 13970820 14211942 14381201 14458769 14477771 14558652 14693739 14771408 14870050 15004091
3902 15004091 15138802 15231057 15302492 15408806 15443312 15531568 15576994 15694032 15820674 15843302
3892 15843302 15877937 15916957 16050190 16074392 16123121 16133098 16252906 16315575 16315707 16333266 16373193
3881 16373193 16424880 16498532 16511078 16459947 16582293 16634152 16602473 16612764 16685048 16722226 16703655
3870 16703655 16657739 16666536 16765489 16809762 16799832 16868312 16912381 16979787 17002324 17075790 17136535 17214659
3858 17214659 17291242 17319221 17302570 17320783 17433227 17500291 17565767 17609626 17615940 17646649 17690343
3847 17690343 17703488 17767463 17799766 17755151 17783616 17759471 17771038 17768435 17706279 17711787 17677493 17639144
3835 17639144 17617617 17537959 17476125 17390467 17257880 17230080 17164615 17181653 17137422 17080929 16997583
3824 16997583 16962233 16914097 16834772 16892727 16780426 16676662 16657323 16661000 16534451 16510432 16544754
3813 16544754 16526178 16480651 16433156 16392513 16341557 16327360 16299710 16303304 16264670 16307559 16324352
3802 16324352 16332414 16332107 16381458 16352004 16335221 16358307 16367689 16369474 16375002 16481194 16481016 16468086 16512487
3789 16512487 16587922 16652205 16738356 16768439 16847188 16886702 16813373 16842406 16888131 16941823 17021056
3778 17021056 17166308 17135049 17179450 17224094 17319370 17400216 17518329 17561747 17620543 17687010 17643557
3767 17643557 17657797 17680549 17713405 17747540 17846125 17900605 17897516 17892902 17887581 17911122 17992036 18136494
3755 18136494 18209482 18238739 18341558 18488556 18620371 18705153 18821643 18931076 19036785 19107509
3745 19107509 19185214 19314934 19399219 19469420 19499878 19503902 19507864 19482610 19532417 19577124 19576424 19531156
3733 19531156 19483241 19468764 19520132 19478949 19386581 19434863 19472784 19520637 19561015 19577034 19657918
3722 19657918 19692675 19811905 19862101 19950560 19999698 20109424 20175443 20280283 20346863 20377708 20372215
3711 20372215 20448173 20486355 20465534 20469833 20439916 20350873 20320294 20295102 20260352 20270711 20242904
3700 20242904 20288087 20262537 20272279 20354433 20384137 20386482 20412476 20483722 20553535 20581093 20655975 20746437
3688 20746437 20824155 20847197 20923153 21005502 21101259 21105385 21123015 21247430 21217413 21266600 21357001
3677 21357001 21337573 21369966 21349981 21292345 21271897 21322464 21406930 21356128 21403786 21492732 21557735
3666 21557735 21626469 21649753 21750812 21839375 21878902 21933735 22083900 22155503 22245981 22324837 22461962
3655 22461962 22569081 22642736 22722251 22825213 22930151 22988323 23130070 23214035 23238902 23289668
3645 23289668 23407165 23508542 23519911 23564832 23587116 23698360 23782359 23878837 23964388 24079082
3635 24079082 24223527 24356663 24439995 24535868 24622564 24715534 24930657 25089515 25304239 25489357
3625 25489357 25702139 25814169 26026235 26229131 26363366 26504505 26670579 26785220 27006393
3616 27006393 27247255 27363678 27529379 27755675 27941326 28071586 28337995 28569356 28798059
3607 28798059 29011820 29287277 29510397 29759263 30072261 30300004 30498175 30761135 30999975
3598 30999975 31243448 31516830 31824949 32098679 32291144 32469454 32730632 33072869 33367833
3589 33367833 33613609 33937529 34202821 34488976 34877230 35219606 35488081 35857268 36211704
3580 36211704 36569486 36855698 37195878 37565066 37992102 38368379 38674618 39071747 39497965
3571 39497965 39923421 40327941 40752845 41148159 41626818 42208959 42719685 43177626 43697287
3562 43697287 44245102 44841257 45423991 46020583 46614667 47223288 47836916 48495101 49080851
3553 49080851 49651401 50367375 51180174 51991586 52782331 53594762 54482530 55429226 56359555
3544 56359555 57218333 58058120 58953199 59922665 60930153 61914442 62911373 64139035 65266821
3535 65266821 66432278 67668181 69019454 70366429 71795240 73207332 74726004 76287171
3527 76287171 77886495 79549370 81254774 82957409 84673602 86466454 88297603 90255674
3519 90255674 92274925 94348531 96465734 98765533 101032440 103337447 105779182 108362609
3511 108362609 110918834 113436835 116005628 118600807 121202036 123890615 126681264 129570854
3503 129570854 132575362 135761256 139175657 142709268 146327829 150226994 154414799 158942411
3495 158942411 163785761 169101916 174698082 180734113 187200914 194183262 201719591 209815836
3487 209815836 218435011 227762497 237727098 248364330 259638797 271417137 283565316
3480 283565316 295830370 307922256 319240136 329260426 337227739 342421353 344189444
3473 344189444 342345915 336785161 328246697 317670212 305918959 293877965 282020450
3466 282020450 270613591 259893880 249830812 240553879 231973428 224051847 216620695 209891575
3458 209891575 203604564 197870862 192589360 187733296 183247943 179133496 175373903 171859745
3450 171859745 168625539 165627981 162771198 160027513 157540357 155089830 152683871 150349063
3442 150349063 148058870 145705723 143354491 141044812 138607320 136074393 133491447 130820591
3434 130820591 128150626 125501033 122935500 120270311 117608457 115003831 112525296 110090864
3426 110090864 107791086 105662765 103611122 101589698 99718618 97907642 96168117 94589552
3418 94589552 93117822 91662109 90240509 88897420 87631309 86433750 85159052 83889724
3410 83889724 82737472 81666589 80593877 79589153 78714446 77739940 76751092 75879672 74991692
3401 74991692 74155702 73263669 72396335 71667294 70891298 70099689 69293661 68588095 67835060
3392 67835060 67088823 66406714 65705454 65093716 64466823 63876833 63300490 62681929 62086628
3383 62086628 61501447 60841989 60277754 59741844 59210063 58758968 58307432 57808127 57353007
3374 57353007 56897460 56369564 55912307 55439729 54937019 54452184 54008918 53462572 52920066
3365 52920066 52464473 51987602 51522196 51088761 50650078 50225678 49735615 49325390 48919821
3356 48919821 48510694 48096727 47711906 47326220 46933252 46638905 46310211 45992872 45634769
3347 45634769 45370974 45084806 44844166 44575010 44250187 43998945 43707211 43512706 43256497
3338 43256497 42970376 42673528 42404811 42178789 41910296 41642802 41401080 41168850 40854331
3329 40854331 40669353 40515204 40282934 40049710 39845862 39763318 39634353 39469579 39342684 39227801
3319 39227801 39115521 38995229 38831658 38679604 38506869 38439195 38222362 37997275 37889436 37692865
3309 37692865 37570857 37354500 37181030 37020932 36796071 36555405 36321765 36086020 35892986
3300 35892986 35703311 35511802 35194912 34905525 34749052 34543817 34244309 34026609 33857533
3291 33857533 33646152 33462443 33248035 33058064 33025018 32933939 32813002 32671487 32522467 32404219
3281 32404219 32297913 32170095 31971950 31844241 31713619 31531027 31270250 31120773 30872595
3272 30872595 30622135 30313315 29986644 29724648 29466981 29245846 29006244 28726553 28549187
3263 28549187 28357368 28182325 28051258 27861066 27719962 27648895 27548369 27481095 27391125 27294761
3253 27294761 27261318 27205117 27222777 27160297 27268419 27236163 27216504 27258483 27331761 27362058 27389679
3242 27389679 27440199 27460844 27510816 27483723 27483541 27545510 27540867 27612750 27650713 27738892 27931287 28155420
3230 28155420 28298340 28458848 28693683 28941215 29140651 29300135 29469829 29651445 29774694
3221 29774694 29875301 30081034 30303841 30486448 30710240 30952127 31246418 31570395 31977650
3212 31977650 32477464 32889108 33394224 33858890 34243554 34570119 34909264 35219749 35464702
3203 35464702 35645765 35850112 36120799 36483460 36784287 37103749 37467129 37773481 38182320
3194 38182320 38622416 39023059 39482419 39977493 40494573 41068077 41772582 42487290 43160519
3185 43160519 43993458 44917483 45881248 46879923 47955008 49128618 50304234 51497347 52711134
3176 52711134 53965081 55321952 56735012 58275993 59856656 61476941 63252579 65050364
3168 65050364 66945246 68789870 70670225 72489857 74217424 75859099 77449312 78894581
3160 78894581 80282448 81456390 82584268 83713651 84834926 85955360 87232064 88536675
3152 88536675 89915816 91487221 93177952 95050606 97110621 99494342 102133218 105065097
3144 105065097 108294056 111777546 115666762 119847082 124242433 128936700 133809269 138719903
3136 138719903 143602853 148037223 151358750 153293615 153654452 152468159 149966832 146669729
3128 146669729 142955101 139359391 136120464 133568822 131739825 130549232 130058051 130072674
3120 130072674 130645629 131691151 133157562 135017478 137204323 139863542 142728617 145686228
3112 145686228 148697049 151683189 154558914 157190015 159420714 160986751 161749737 161502398
3104 161502398 160270593 158031460 154897940 150964402 146253771 141138509 135963884 130991663
3096 130991663 126469023 122745515 119632148 116982809 114889816 113318971 112226547 111495163
3088 111495163 111092539 110905623 110920898 110875530 110684861 110240373 109378129 108149187 106437572
3079 106437572 104257420 101621221 98541144 95010969 91215306 87387056 83655254 80095149
3071 80095149 76763467 73630265 70742603 68037777 65518027 63220044 61100459 59118576
3063 59118576 57276113 55649038 54162493 52773055 51503832 50320557 49273170 48287843
3055 48287843 47290911 46291177 45238079 44160659 43032109 41909339 40734154 39502779
3047 39502779 38350684 37208733 36173335 35229921 34298339 33422698 32559134 31764291 30997858
3038 30997858 30335596 29698162 28977167 28302472 27619895 27025589 26440609 25841216 25268880
3029 25268880 24755159 24291040 23918280 23481603 23095094 22770561 22442830 22159916 21852500
3020 21852500 21625485 21466341 21171903 20885735 20608787 20284423 19905475 19517036 19148074
3011 19148074 18810569 18406304 18097877 17753295 17389387 17105148 16814099 16488882 16223256
3002 16223256 16010194 15705169 15403468 15173553 14875432 14671029 14482110 14252568 14124858
2993 14124858 14003612 13882085 13743099 13605980 13443237 13310572 13074289 12913961 12775631
2984 12775631 12562025 12323600 12141257 11923761 11714613 11546842 11337865 11118987 11010859
2975 11010859 10868684 10646419 10453488 10274131 10121801 9942071 9734957 9631751 9477348
2966 9477348 9393074 9187509 9042565 8906711 8800881 8685741 8527490 8323809 8271475 8254059
2956 8254059 8159035 8072168 7940026 7865661 7834290 7700870 7573548 7494305 7434395 7393673 7293923
2945 7293923 7242146 7203532 7082136 7017285 6964142 6901263 6878978 6825797 6676940 6649365 6620081
2934 6620081 6532646 6499639 6514321 6485292 6353712 6313441 6290548 6292561 6181250 6148387 6136144
2923 6136144 6169953 6118264 6098049 6070155 5995093 5884572 5782002 5745079 5759648 5725787 5646402
2912 5646402 5653426 5606681 5600666 5480915 5405450 5407976 5397067 5389726 5367159 5286589 5243468 5288969
2900 5288969 5229891 5196779 5174608 5176022 5071444 5034532 5004560 4977144 4986592 4968664 4965372 4922612
2888 4922612 4933675 4903455 4902412 4909287 4871632 4831637 4783317 4781580 4749188 4784543 4794252 4659013
2876 4659013 4608624 4639930 4625138 4581861 4553542 4525939 4488062 4495663 4542494 4466764 4415808 4413004
2864 4413004 4427964 4421015 4371961 4349759 4272242 4284027 4353081 4327862 4271599 4273896 4276933 4267938
2852 4267938 4288460 4337347 4352414 4305789 4278319 4260203 4201581 4191165 4138590 4092974 4067926
2841 4067926 4066114 4046394 4050412 4000728 3968689 3945358 3836324 3766893 3772454 3797878 3829223 3817792
2829 3817792 3867090 3911251 3912160 3871770 3824796 3840008 3872315 3891249 3896096 3901178 3777134 3744697
2817 3744697 3712835 3684303 3666999 3642078 3574464 3521871 3499336 3464356 3467862 3477801 3469122 3439671
2805 3439671 3428752 3389811 3361124 3316739 3354785 3313387 3226777 3263014 3288379 3223347 3095140
2794 3095140 3045962 3103613 3039667 2953302 2925802 2948530 2950417 2911929 2875306 2777952 2747550 2785745
2782 2785745 2771711 2731836 2738486 2726717 2755615 2743170 2689483 2655504 2612609 2552875 2586185 2588120
2770 2588120 2586233 2598389 2583047 2581826 2549966 2513308 2546888 2493041 2458135 2496470 2437693 2429578
2758 2429578 2415720 2450368 2417333 2364948 2348066 2339836 2318950 2322281 2288558 2265922 2282765 2280448
2746 2280448 2286355 2248820 2233273 2239635 2255196 2260653 2254202 2157970 2153089 2156685 2133505 2082886 2058237
2733 2058237 2053084 2104678 2076165 2019872 2001001 1940799 1914279 1922029 1909096 1933325 1921990 1941210
2721 1941210 1999123 1965480 1878884 1870356 1932867 1934406 1892281 1829341 1872527 1911545 1879701 1856406
2709 1856406 1819080 1814445 1758188 1778470 1781069 1791252 1767289 1693473 1705585 1694100 1674947 1691636
2697 1691636 1662410 1607279 1585630 1561257 1603205 1636497 1612690 1563676 1535231 1506139 1492571
2686 1492571 1513630 1492014 1479137 1440760 1441982 1427776 1390891 1332426 1285005 1353658 1369570 1336269
2674 1336269 1281633 1324210 1359821 1343504 1202283 1210886 1258415 1247800 1250622 1220227 1186689 1221256
2662 1221256 1132664 1122323 1093608 1035111 1056538 1050587 1133149 1150938 1148490 1116915 1080723 1047993
2650 1047993 1005763 1028262 1011498 987654 1028603 1002955 1052179 1023325 1014737 970645 936202 929933
2638 929933 951498 935946 982817 957544 878998 866262 847588 836617 840248 874836 873106 852252
2626 852252 765944 806537 780037 750214 723553 768623 784477 745582 730267 771140 745447 683978
2614 683978 664010 708483 722391 741424 725736 736749 683577 683129 658524 663595 646488 626937
2602 626937 664724 698406 721419 646950 719754 737499 665945 629606 589349 548054 603497 559382
2590 559382 546190 622577 619731 548117 531719 563050 530922 436421 464860 515588 455841 483328
2578 483328 492853 549119 577468 559286 549678 513629 530254 514413 457256 471161 469280 438720
2566 438720 450452 384226 406834 433690 444979 450819 440526 425943 404124 340629 338329 379223
2554 379223 455008 431397 382096 405868 409526 367368 402114 400762 359626 313076 381399 397570
2542 397570 387766 370864 386645 400735 389435 341301 365624 361218 285619 303290 329748 358495
2530 358495 362823 331201 318646 298118 350201 336341 316849 381492 338952 379536 300920 259975
2518 259975 261632 265279 237574 277819 331146 262639 341276 333565 318929 307669 283713 364953
2506 364953 335722 320799 207837 192690 216603 252616 283383 267998 279162 284359 302784 299520
2494 299520 266018 293891 286914 324683 348885 338484 242515 270689 273147 279600 297543 306494
2482 306494 291102 271962 285069 258202 257929 303416 304201 302320 334422 286235 248195 253744 258590
2469 258590 266216 268018 272729 195086 208480 311555 284466 324140 307946 276975 255652 298566
2457 298566 293273 256246 230611 270520 252146 188995 234884 282349 241317 222216 229571 284457
2445 284457 290079 239156 208770 206781 221162 223445 127524 193066 284433 268251 259699 206897
2433 206897 229103 220304 193091 171181 193531 270973 231312 217846 175788 234269 233558 214625
2421 214625 214967 247690 228197 287741 290470 252348 241865 291975 331540 346299 267152 268594
2409 268594 246434 312543 340117 295247 328412 354932 385032 322740 333952 299520 355854 378915
2397 378915 387919 366297 405093 368658 338229 356881 418845 458205 456590 389855 413907 470255
2385 470255 518369 485478 450765 439241 494439 529330 603119 622740 669479 610561 677985 824581
2373 824581 922378 927078 1053776 1142547 1164915 1176316 1172964 1219740 1243174 1256914 1233551 1309032
2361 1309032 1417150 1446078 1476329 1529916 1555632 1655044 1859480 1978014 2148573 2385598
2351 2385598 2574516 2765781 2957406 3120954 3242442 3441157 3687436 4031451 4449493 4823687
2341 4823687 5347041 6048275 7086837 8358081 9769757 11774871 13886019 14895940 14497321
2332 14497321 12596455 10280904 8529989 7277355 6362744 5404239 4642542 4053022 3612071
2323 3612071 3247107 2938122 2747774 2547363 2324102 2305532 2121068 1989346 1716643 1555950
2313 1555950 1453418 1342264 1295130 1232993 1155587 1134297 1046903 952590 972892 934849 863053
2302 863053 843556 797392 755871 716363 717951 769343 700490 583753 586827 625431 599028 527427
2290 527427 534939 519954 537690 523389 490812 406152 402983 410393 394050 330936 384571 423446
2278 423446 340843 335985 387118 391740 342704 362315 337813 386245 376715 335161 376892 272568
2266 272568 264589 314212 309151 319004 293217 241805 148419 219439 254314 258978 340154 344795 250749
2253 250749 191243 152897 225534 215459 239967 276731 290792 295981 265879 278212 208842 153661
2241 153661 183825 187410 222989 151285 135361 147648 209819 202019 120556 157186 174020 150700
2229 150700 137357 158931 234794 209918 198568 176317 169462 181452 156608 121054 124872 118390
2217 118390 120572 100422 67498 56961 44713 94527 111949 162091 180978 67072 78501 93287
2205 93287 114482 111968 147999 100788 139867 186826 150324 149525 161761 236557 241784 200048 144650
2192 144650 140935 148118 69375 125803 155331 149453 158135 152185 120150 97561 26712 71091 128481
2179 128481 152464 169178 104514 143501 188317 125803 100918 84046 127340 140169 109751 138918
2167 138918 63177 91476 186887 236208 186304 182133 179634 157165 81423 52744 63913 162629
2155 162629 157116 167934 127449 108001 58192 105606 141798 119571 124912 127790 82619 94173
2143 94173 70472 76985 72770 173494 157546 119980 116385 151008 119229 127473 185275 133048
2131 133048 130052 120179 94006 192304 212624 155390 155242 98897 110084 135503 102696 90815
2119 90815 90984 93755 100424 114183 78144 102811 166710 57269 12900 -25252 13983 43514
2107 43514 73830 107046 104652 86808 64946 50225 61714 35108 72948 44233 37781 84614
2095 84614 70249 82215 71547 126427 83540 66571 103545 48294 96084 78027 53905 48842
2083 48842 -4898 -12954 36261 59515 87074 113226 175778 148058 138364 44105 48686 94107
2071 94107 116495 101419 67106 137946 182190 206930 196292 207967 211684 187165 72106 46555
2059 46555 55597 39743 36945 59459 142943 84297 88190 42529 -8386 19875 19364 49473 125997
2046 125997 93378 13813 29965 41588 1990 7544 18042 37029 72420 104681 94546 86651
2034 86651 50069 85633 44560 26215 78352 123468 78935 40512 91316 110757 99970 40231
2022 40231 36001 59865 64389 19315 29319 61914 93008 38620 54153 82858 78355 75866 99045
2009 99045 70672 62844 61265 59514 99451 91553 131747 92228 57414 96678 129110 125679 102697
1996 102697 59088 19452 117618 79817 122549 106272 70295 88766 34448 63228 60177 61192
1984 61192 44012 66521 153250 70952 31836 8796 35631 61412 104684 72410 60442 117618
1972 117618 72339 41238 66367 31799 7786 34312 81071 147016 165856 94462 69685 76463
1960 76463 38995 -7764 27222 67312 77021 82707 25808 -31151 -23739 -25 4846 17090 -1697
1947 -1697 48217 50953 70510 81635 88561 95715 38074 61040 106166 106397 116091 67944 29898
1934 29898 45001 75358 41552 40290 80153 40761 -53919 -37480 8805 61536 101885 56798
1922 56798 40779 9042 2253 -10831 28952 43569 -7964 25537 11484 35193 60634 25156
1910 25156 52670 22127 8053 10539 23692 22374 33604 8035 -33896 -21974 11484 58592
1898 58592 5387 4654 68314 74497 13894 -1121 34631 102419 76185 59556 78305 8380
1886 8380 28730 75299 64148 93503 23564 -74164 -83078 -47804 -3586 9295 2063 44326
1874 44326 44911 98729 26989 20854 49832 9109 21242 40036 45790 70778 93056 54198 5450
1861 5450 -22519 -15771 -8984 -21416 7442 66050 4665 11347 -2989 -71555 -49504 -50517 -39879
1848 -39879 -51135 7333 31777 -9619 -48859 12247 81069 42913 -45177 -5302 61337 36245
1836 36245 35519 129502 78182 -23245 -24163 -19130 -9667 560 1904 -64991 -17193 -2858 -48087
1823 -48087 -59127 -33297 -23197 55687 4899 9186 50408 46604 69495 90200 37433 76472
1811 76472 12996 -61649 -16212 789 45467 92090 20313 -61925 -98139 -52252 588 49260
1799 49260 52262 9188 13210 36465 35157 -65407 -28620 72085 87175 1474 -7935 -15399
1787 -15399 -24883 50193 28530 31685 13679 24939 72292 4684 -41299 -72480 -69410 12541
1775 12541 22811 29971 67825 90742 42452 -6702 -5948 -9673 24772 -69337 -46687 -21241 -90823
1762 -90823 -38222 -32670 -45400 -29217 -64462 718 45694 64786 30651 19171 54288 49681
1750 49681 -6197 -12992 35932 64345 61610 9245 -23514 -9729 -2088 7302 42450 10642 8866
1737 8866 37312 58434 43026 21358 924 15931 20468 26072 37550 50257 57384 44094 27582
1724 27582 62991 86479 4727 -35117 -2612 6854 29733 41050 21288 7045 11934 -24112
1712 -24112 18666 17130 8495 31643 -20792 -85424 -48231 -66549 -90370 -93997 -41250 -43019 -63200
1699 -63200 -47395 -14946 46445 23945 -47600 -90553 -44977 6056 17026 22324 22048 10189
1687 10189 28224 -3227 18038 61929 27595 -24315 17104 10144 44704 57224 40154 13464
1675 13464 60230 52105 95759 68014 -16336 12945 30889 -10629 49955 96378 2785 -6272
1663 -6272 -20230 8594 -8470 -34286 2536 -27901 6535 -4643 -31220 -14890 -20292 -23176
1651 -23176 26104 69407 50692 3990 -62307 -84468 -36576 3306 72165 64754 -39295 -39504
1639 -39504 39978 -7074 28856 -2173 -19470 -47598 -7416 -4623 35663 39109 32891 38589 25711
1626 25711 -21462 -29661 -7849 -63655 -33129 -59943 -51088 -75369 6660 -8582 -38444 -77733
1614 -77733 -28711 6080 4496 33926 15205 -36972 -33382 -6053 41753 -58169 -3446 1245
1602 1245 18339 14315 65290 12649 -381 23290 20470 153 11604 -6575 -38173 -4298
1590 -4298 -47268 47246 85353 104410 47543 -33356 -86851 -4960 10657 -56109 -18097 -25292
1578 -25292 -23658 74309 41348 -15928 31107 70034 47514 58917 8934 -8445 34341 54952
1566 54952 12733 6672 10205 -20245 -8595 9919 1037 -1012 38765 109979 108680 18934 -89191
1553 -89191 -42557 -36795 -100016 -90338 -107541 -118283 -66331 -61093 -4494 -46061 -45062 14448 -56190
1540 -56190 -36021 -31109 -58585 -56422 -8825 -35564 -6090 32623 -4516 -19092 23816 27776
1528 27776 16529 -13812 -28181 12753 30366 -15045 -37040 45123 51958 -49905 -5408 25052
1516 25052 20359 -17689 -16062 20415 10903 6155 29230 28258 -19728 -62783 -60095 -47969 -17441
1503 -17441 45669 49343 -17364 -62839 -61438 -62323 -23242 -54758 -10239 -2815 -72826 -40076 -19937
1490 -19937 -32497 -16143 -34514 -28438 -6291 27067 39119 12635 12241 67770 39465 37704 29273
1477 29273 -13344 -70943 -89893 -91488 -78826 -138019 -134905 12741 71112 85359 33354 23675
1465 23675 5651 24394 55616 -27612 -139 -13071 -19744 42500 38065 -30429 -11073 -67325
1453 -67325 -38108 4161 29524 53738 -11808 74129 20832 -15647 -2426 -4395 8044 4207
1441 4207 6208 -76508 -62043 -13586 13321 -23539 -11798 -37131 -59141 -29969 -17476 94591
1429 94591 44497 43804 7673 23011 71666 45755 6102 61810 84026 80365 26438 18072 -41122
1416 -41122 -24386 -59509 -27124 72171 -555 -49199 -67367 -11620 -33413 6248 16318 -45477
1404 -45477 -24954 29491 37418 1102 -61031 -44232 27396 24151 31169 -8528 -39522 -11157
1392 -11157 -6220 -16005 10651 6888 28395 39252 22898 27209 -6632 48341 85850 6746 -600
1379 -600 21813 -10386 -19849 25204 2709 -15362 21748 22031 67737 32839 32792 68511 47960
1366 47960 -15561 -42313 -70124 -68568 -55463 -23189 -84070 6230 4248 -20146 7632 20156
1354 20156 27835 -20725 -22066 -20585 -46243 -37130 -29049 -9181 -19949 -21995 -25658 -80438 -44302
1341 -44302 -29808 32944 53066 39325 -675 -20176 -31947 -9445 20363 54277 65594 -26335
1329 -26335 -26706 -19757 -38928 -12131 -30851 25323 37419 52476 53860 -40853 41133 98054 103267
1316 103267 92662 -13164 10677 78836 63421 -8993 -51848 1346 27841 45561 31733
1305 31733 -60613 7921 58005 66721 68376 28481 19380 -10451 -1213 17853 20454 39467 -19392
1292 -19392 -64318 -20803 63398 63081 14173 28622 15887 -6840 -13970 4560 -52806 -51240 -25144
1279 -25144 -24363 -2251 6343 26752 1091 17440 -11882 -14947 -45575 -27372 12362 -34914 -43618
1266 -43618 -56532 7014 48142 -24170 5462 39729 29366 22984 -54145 504 66880 29324
1254 29324 8667 5934 25252 7906 8581 26502 4419 -28233 -37102 -36637 81 42619 777
1241 777 -53879 -55787 -23903 -51501 7280 -332 -73390 955 13241 -31030 -31437 10395 -22524
1228 -22524 30791 -514 7058 45793 15236 8381 -55751 -62008 10262 67502 36684 22638
1216 22638 76546 38082 14938 21993 33490 15287 5061 -32843 11794 21854 38761 115954
1204 115954 15424 6444 -27966 -17146 -12785 -18646 -71458 -46138 -12686 -59017 -59105 -35058 -25883
1191 -25883 10028 3031 26859 43676 27317 -5906 -1159 25785 4120 -21058 -88886 -43904
1179 -43904 -85506 -64314 -25678 48572 84018 20105 27554 17140 -2081 -56579 -23996 -53064
1167 -53064 -12778 -7106 16073 14769 38379 48792 68960 35712 -5281 -685 -63512 -13465
1155 -13465 59712 15837 -54573 -53385 -44296 6376 -5005 -24832 -11401 -42225 -32755 -33885 -86349
1142 -86349 -75467 -134374 -118595 -57124 -27915 12680 9771 -31567 -40184 34096 -1105 -63296
1130 -63296 -30706 -58069 -66155 -26132 47689 25890 13891 50423 66306 35473 1288 -1945
1118 -1945 -25539 39753 52190 11824 8948 19087 1237 -4564 -58447 -19679 -29638 -46262 -28029
1105 -28029 16040 63294 62468 54497 38229 19634 -11456 -10769 14705 -4955 16924 -34158 -65569
1092 -65569 -122932 -85421 41772 53816 11458 -21263 -42504 -32785 18429 17716 -8779 -33055
1080 -33055 9887 -16541 -14718 19310 42464 -32408 -37402 3591 -38448 -86095 -10029 -2482
1068 -2482 14387 39982 58955 31941 -8781 -23026 18279 -44283 -83046 -40449 -17598 7985
1056 7985 -23912 -105315 -78785 -58534 -82056 -81971 -4978 31428 43050 46453 42095 10400 -28528
1043 -28528 -85271 -50090 -27072 8778 -31541 -54585 -26181 -7662 -863 -39886 -51603 -22908
1031 -22908 -56410 -88656 -33471 -43129 -42261 -13716 12120 -61939 -86934 -80815 -34261 -65434 -41779
1018 -41779 -10702 -17714 -34890 -15704 659 -7188 -25432 -46951 -35049 -14554 -8458 2220
1006 2220 42864 56177 16510 -36481 -4462 16144 -9294 14358 -62052 -36120 -55630 -69790
994 -69790 -7932 -18749 33451 -17945 -27552 38659 59583 22680 -12164 -7139 21414 15232 -96605
981 -96605 -48676 -53555 -52107 -69195 -63286 -71354 -36982 -94005 -54544 -28198 -39109 -22566 -33315
968 -33315 -36456 -98587 -31579 71841 48532 14661 17563 24732 40398 81983 29477 -4434
956 -4434 5433 42489 13742 30284 59241 43614 52414 491 -30794 -34997 30027 24348 76603
943 76603 25295 47697 96130 48061 40892 -38859 -13271 -7763 -33867 61709 39838 58229
931 58229 45525 18905 20072 26603 30102 19384 -16140 -37481 -7402 11419 5740 -19211 21130
918 21130 35243 48571 -12688 -52228 -31552 29504 38792 32300 36636 -54625 -34644 7907 50391
905 50391 -21474 -16928 13204 27843 56491 6223 3401 -13535 -45304 -17430 23937 10868
893 10868 -13218 -2990 -20419 -9195 -57565 -40774 -37653 -27450 -45954 -31882 -22491 -20617 -7178
880 -7178 31276 -38629 -69015 13050 -22029 -88792 -109012 -60571 -69707 -71756 -37953 -99437 -13806
867 -13806 4680 4180 51083 58932 64415 36324 50815 9616 42016 44605 -2961 -61445 -102101
854 -102101 -79883 -42547 1533 70677 51633 37406 41510 29333 15891 60687 42626 43015
842 43015 6229 7341 57439 94083 58941 86057 102822 21776 -35202 -10322 1250 18923
830 18923 53221 60633 -18301 -50165 -57359 -18988 -33079 -35757 -1239 -37600 -1068 18332 8329
817 8329 15489 31494 40367 54247 9935 -5257 10961 2277 42415 119045 58892 11965 8507
804 8507 -13606 -74309 -34832 -22808 55449 59233 48570 30731 33391 18411 -13108 -20637 -6784
791 -6784 -16971 66440 90570 58354 41775 -14971 846 4340 -12387 21751 6291 -12265
779 -12265 -51245 -58829 -8970 -20564 3679 -15858 25411 24305 18409 12450 -3973 31144 19069
766 19069 -52386 -48971 -24823 -44914 -77026 -36891 10203 16095 -28832 -26039 -46236 -62170 -54961
753 -54961 1388 -47293 -47603 -48975 -10091 -14167 43322 3451 -10587 -14974 -43217 -47264 -66446
740 -66446 -24470 -25054 -33869 -23587 40568 60011 41463 -58240 -23172 3843 -47391 11362 6267
727 6267 -39051 -95049 -55065 -40208 -16682 63145 -9708 -4635 -21329 -28233 -3057 -9818 -29482
714 -29482 -21202 -57945 -72206 -59928 -65279 -42651 -76501 -55033 287 -16974 -6800 -11360 -43618
701 -43618 -109619 -55077 -11744 -39464 -10793 7864 -34197 -19389 -40950 -47622 -50815 28869
689 28869 34978 -65099 -59688 -34274 2584 17312 15356 -5950 20837 51813 8725 72 -44068
676 -44068 -123198 -165256 -121050 -72750 -30346 -43817 -1754 8728 -45189 -4879 -10617 -811
664 -811 -21997 -32053 -10273 -2675 -16642 -30781 -1643 52509 47700 58014 31994 19920 -55903
651 -55903 -51712 -66807 -87543 -28989 6900 -9264 -8024 8874 25076 68765 52932 13886
639 13886 42443 -14038 -33067 -25912 26703 10282 1428 -19813 -99950 -52950 -44836 -41850 -24777
626 -24777 -55064 -23004 -14540 -22320 -23193 -52923 15327 23593 42836 65562 65297 8691 -7006
613 -7006 -48568 7549 3971 -19390 -76069 1787 25842 37135 34303 67073 99185 77652 43309
600 43309 28286 -39681 -28345 30456 26931 63979 79188 6888 -14160 -25190 13246 -5343
588 -5343 -27939 -41866 -86823 -54391 -52262 38729 31812 91561 67347 21118 -39027 35562 55997
575 55997 -25251 -19104 16300 45630 59010 9663 16245 9406 24756 -2350 -23927 39151 -24413
562 -24413 -89021 -86706 -19539 -64811 -125612 -111410 -72556 -93256 -4973 7277 -60796 -6148
550 -6148 5808 -20017 -51687 -36125 -59983 -32601 -13230 -5471 2029 -12961 -79892 -66115 -66818
537 -66818 -63654 -76415 6284 28901 21135 40050 25236 38151 41075 -149 -23544 -26860 -9428
524 -9428 -33183 2701 37009 3656 -28275 -38523 59573 60290 23716 -13148 -58719 11470 7960
511 7960 42104 129317 111145 104149 58474 46971 -30526 -29814 41018 17492 10756 18098 -2209
498 -2209 43054 -4757 18171 -32669 -57621 -9189 -5474 -31107 -31166 -42652 -42155 41305 43643 41243
484 41243 -44200 31152 14752 5202 -1981 -15302 -24369 -54910 -42936 -85826 -108717 -96939 -52761
471 -52761 -29506 -75142 -56059 -33536 -72357 -65751 -57633 -19079 15529 31139 55 53146
459 53146 87383 12654 31116 47472 6815 -8086 -45928 39348 -26373 -46425 -1815 -39929
447 -39929 -24112 -8865 10546 -18224 14634 56466 32173 -33696 -63312 -41167 13466 46617
435 46617 38941 66223 98258 53968 18127 59868 12372 18383 51447 42091 6634 -46919 -22755
422 -22755 52080 22892 -25743 -35821 37106 72983 -23424 -71773 2059 23956 7350 -8854
410 -8854 -61852 -39080 -3142 -87834 -82183 29109 28677 -39810 -55969 -9555 41730 32116 32775
397 32775 57860 80073 18164 -42325 -22414 11515 -35956 5448 -7461 -11470 25522 35141
385 35141 -9475 -59418 -13301 33057 27264 3875 68036 36932 55915 12263 6697 101659
373 101659 10708 -49585 -88 -358 -1879 -27482 14574 -26016 -25012 -10853 4335 -10437 -15216
360 -15216 -48823 -7798 91586 105358 11183 -5791 7416 -1470 25716 -37323 -22706 13426
348 13426 3289 18493 12074 -16805 -11985 49030 43790 25332 50136 -20707 -54342 -50599 -46495
335 -46495 -59053 -85914 -22826 -28233 5399 -7079 -94280 -9356 31797 8419 27183 26566 -9388
322 -9388 10620 1761 57036 -17580 -68124 -33720 16071 53663 6307 15318 43252 53723 4097
309 4097 -10534 758 -28548 -9261 16972 -22542 -12636 40793 23013 31465 -11377 25922 74440
296 74440 66105 48047 -24182 -59972 -48090 -23561 -64208 -31054 -8429 -12193 -33315 65051
284 65051 -27189 -8640 -38152 -38837 -10781 -32546 17902 -43148 -43589 3283 42933 42457 17313
271 17313 -6855 13798 8469 4744 9618 -18172 -63681 -27457 -25986 -41565 -34312 -16886 -20010
258 -20010 5111 12994 44297 -2559 49982 86796 84138 72512 12473 59268 54572 -30059 -52666
245 -52666 -50421 -65061 -31918 -19360 20821 30506 49458 -3006 -5390 21390 32155 -3611 -72451
232 -72451 -14605 -7261 -64096 -26503 21987 -7862 -46932 -16607 73704 33991 6992 31732
220 31732 49144 29178 27143 58141 55518 24993 -13741 -102804 -90526 -17643 78876 43475
208 43475 6059 25516 41962 89182 16284 55570 80620 45622 36264 -34338 -27644 31206
196 31206 31278 41967 61071 15920 37986 66807 39615 89158 9894 -2426 -10475 -37879 -60530
183 -60530 -79238 -38672 8249 26846 29441 6622 -22259 16292 13346 -2338 -63055 -6396
171 -6396 21823 -7161 -66761 -22876 -11450 -4546 -23102 -89151 -27010 8038 29017 31928 -3978
158 -3978 16970 11659 6574 51837 34997 17626 -14792 18334 -3557 -30886 -36309 24739 -28160
145 -28160 -71041 -19797 -23341 -26413 -36561 -9767 -47454 -11898 -37945 -14293 9641 -44573
133 -44573 -55737 -34710 -14556 -31000 -7814 5826 11576 61232 72454 59514 88274 48524
121 48524 67200 53255 51020 -12202 -102793 -49932 -11888 15305 -17173 -23363 19437 23494 4965
108 4965 434 28661 -26143 13031 -6455 -17213 7272 10402 23293 3228 -92028 -54926 3159
95 3159 -18210 14992 16737 49660 11981 13385 -23754 -7327 -8918 46000 50946 -507 27117
82 27117 -11953 -3265 9212 69560 70514 -372 44802 70120 22450 3171 13028 16793 23954
69 23954 70187 57412 47662 40306 -12763 -44590 16594 -10476 -91224 -65247 -6611 695 -39870
56 -39870 -40252 15632 20690 -14423 41749 43748 -23085 -8678 35012 25065 8590 1052 25430
43 25430 4030 28368 38809 17923 -805 -53141 -48704 -7077 -2822 -11895 15092 64792 69817
30 69817 15930 -19170 18308 17564 -14290 13803 11797 -39895 -15203 90 -31039 -37023 -18987
17 -18987 14396 43954 -19786 -20621 3025 39803 109030 33960 -30409 -52200 -472 7299 -7940
4 -7940 -479 45962 25591 15024
0 15024
$$ Imaginary data points
##PAGE= N=2
##DATA TABLE= (X++(I..I)), XYDATA
16383 -1870446 -1841647 -1851678 -1804045 -1764561 -1776197 -1742147 -1692878 -1676396 -1645914 -1601285 -1554259
16372 -1554259 -1587452 -1576060 -1540956 -1504246 -1455066 -1432028 -1476142 -1469297 -1424507 -1347795 -1329760
16361 -1329760 -1331054 -1303995 -1309057 -1290767 -1247798 -1253083 -1227674 -1165421 -1116029 -1136924 -1076449 -1102128
16349 -1102128 -1099549 -1069101 -1054392 -1003843 -1010370 -999914 -956441 -908312 -894342 -879417 -870327 -859078
16337 -859078 -832919 -783850 -783841 -780586 -809521 -728643 -730884 -731829 -718393 -689266 -691005 -663451 -629210
16324 -629210 -580750 -510305 -530023 -537991 -551903 -529973 -443763 -448453 -465053 -432465 -411998 -422691
16312 -422691 -440554 -341831 -349151 -292550 -216774 -236209 -240687 -187578 -169384 -168931 -183396 -200763
16300 -200763 -166737 -153528 -114302 -92210 -75230 -21550 -54824 -11430 41254 65062 49841
16289 49841 -8309 98376 153184 128868 107423 145703 153487 185588 188368 180318 182379 216097
16277 216097 214339 232269 261278 270062 324764 348878 393107 376086 342776 314812 287690 366537
16265 366537 443401 438444 418619 432552 475612 457716 443201 491850 501982 543034 592558 566812
16253 566812 523651 564380 599370 597824 647746 607652 667823 688841 650112 683771 681338 673405
16241 673405 713688 674575 674949 703147 727749 784865 799408 811899 776615 857974 852651 848281
16229 848281 887000 917369 961991 951328 976064 938526 953462 933608 951730 970829 969423 986924
16217 986924 980805 969996 1020480 991468 1024483 1083418 1044868 1073885 1063059 1041692 1033760 1058694
16205 1058694 1057910 1054218 1066650 1049012 1110682 1186896 1185383 1169844 1145631 1203118 1197569 1158841
16193 1158841 1181768 1231827 1286650 1239153 1250406 1232608 1209348 1234167 1200495 1237434 1234887
16182 1234887 1284457 1260913 1265309 1265921 1322542 1277489 1269539 1259315 1287580 1310990 1262825 1294378
16170 1294378 1245087 1257198 1312365 1304309 1253805 1355323 1403335 1349131 1375170 1331812 1328131
16159 1328131 1381945 1384579 1374072 1376062 1375356 1427220 1466457 1410782 1371070 1386587 1337792 1395882
16147 1395882 1448791 1399701 1444577 1488812 1499687 1459826 1427393 1410343 1419379 1409527 1382466 1416528
16135 1416528 1435854 1419605 1465998 1427190 1464574 1491704 1464497 1445932 1494052 1466135 1460743
16124 1460743 1458092 1452633 1466469 1519741 1621806 1603807 1614365 1586712 1540259 1503787 1565366
16113 1565366 1531068 1502909 1549967 1526245 1493215 1476031 1551587 1546910 1497884 1481302 1551438
16102 1551438 1502699 1484168 1513393 1569597 1597211 1525350 1499977 1565357 1506240 1494078 1549663
16091 1549663 1567537 1551073 1560313 1567354 1585668 1605727 1589073 1627019 1664303 1616963 1644619 1625401
16079 1625401 1598842 1601956 1586140 1536801 1515198 1633878 1613604 1547466 1545387 1516491 1557411
16068 1557411 1545296 1521973 1575634 1599369 1572977 1579343 1599161 1595202 1588068 1581158 1595563 1638269
16056 1638269 1666695 1657035 1622060 1573445 1570828 1553092 1570534 1492919 1542947 1589176 1549674 1479094
16044 1479094 1537851 1590503 1595207 1575572 1609534 1624836 1579206 1600372 1554524 1541513 1559877
16033 1559877 1558335 1603639 1604765 1578601 1637021 1619060 1562709 1600081 1565222 1575570 1574674 1609722
16021 1609722 1661426 1643800 1576755 1521273 1492505 1539851 1571574 1573439 1596742 1684706 1631106
16010 1631106 1632836 1655223 1695818 1633284 1549119 1533233 1590864 1611092 1616886 1589352 1590950 1637566
15998 1637566 1615716 1605829 1581929 1599538 1608778 1575039 1608471 1673319 1683085 1692325 1644133 1667847
15986 1667847 1615634 1577271 1581104 1589829 1548303 1591721 1606815 1637943 1669960 1650813 1625763 1655514
15974 1655514 1623337 1555805 1558532 1585178 1637899 1610846 1550235 1579936 1528402 1587175 1657768
15963 1657768 1624270 1612422 1627127 1633386 1665969 1642860 1615916 1668855 1627002 1594739 1562418
15952 1562418 1543889 1519015 1523485 1540558 1569996 1570722 1542194 1535937 1619615 1630566 1606199 1607121
15940 1607121 1594174 1639065 1677721 1646751 1616670 1639849 1541985 1576365 1600855 1562918 1590175
15929 1590175 1678758 1648682 1621615 1646798 1654078 1614307 1657718 1641876 1651286 1694124 1667450 1618681
15917 1618681 1593766 1661971 1615001 1588113 1561724 1603064 1612597 1626947 1632855 1628537 1707302 1663406
15905 1663406 1626037 1547505 1612674 1635098 1567373 1561702 1615528 1648383 1695722 1659594 1675286
15894 1675286 1709908 1610784 1634164 1642539 1586499 1622231 1712601 1685660 1661693 1613928 1596267
15883 1596267 1648123 1693381 1629274 1630994 1644218 1602563 1553116 1572203 1631178 1614307 1625295
15872 1625295 1645400 1653275 1639708 1634587 1625324 1650039 1617774 1591818 1608827 1554047 1593814 1615952
15860 1615952 1648975 1656304 1675562 1664164 1652398 1629272 1622905 1576469 1564052 1562691 1673774 1712370
15848 1712370 1695686 1686930 1644584 1666754 1656373 1599023 1587566 1643926 1641954 1607202 1678124 1708954
15836 1708954 1664988 1659862 1624381 1614324 1584606 1622590 1626419 1633901 1595206 1555783 1584647 1636077
15824 1636077 1611288 1582165 1650252 1635866 1639689 1688305 1643300 1662392 1643946 1632661 1654986
15813 1654986 1616825 1668205 1669460 1647691 1559660 1579985 1635422 1602643 1572209 1575257 1684697
15802 1684697 1683077 1676299 1651437 1622297 1616791 1649250 1609114 1571762 1589158 1635225 1634097 1722204
15790 1722204 1725245 1642365 1675318 1661384 1653595 1654045 1651319 1603243 1651515 1670241 1605601 1579888
15778 1579888 1598432 1645923 1671619 1661990 1660557 1586664 1584182 1604943 1603031 1616582 1638800 1630308
15766 1630308 1636884 1567914 1573314 1581615 1591691 1618367 1658531 1691142 1662218 1644283 1594189 1582702
15754 1582702 1612032 1618799 1609205 1660996 1674454 1615519 1592197 1671481 1665476 1629333 1646322 1690072
15742 1690072 1724374 1665468 1674670 1702558 1716024 1770244 1745250 1728187 1711341 1644721 1626501
15731 1626501 1589389 1557969 1609855 1606214 1585815 1615627 1619921 1589233 1598225 1646245 1676411 1712550
15719 1712550 1741712 1689283 1643767 1643122 1693484 1678933 1638233 1630847 1622488 1622056 1597760 1611067
15707 1611067 1553948 1536969 1541257 1545760 1591808 1668455 1665875 1644262 1652249 1666003 1634959 1528781
15695 1528781 1519050 1632135 1647206 1592717 1607116 1559307 1548734 1537502 1533366 1568679 1601809
15684 1601809 1566078 1508214 1543641 1695579 1667583 1615526 1570353 1553738 1596053 1623540 1603895
15673 1603895 1595029 1587677 1624954 1640357 1631704 1607018 1588049 1634786 1659869 1635235 1573713 1542172
15661 1542172 1547825 1517415 1583837 1585048 1552433 1639635 1682660 1670569 1722440 1702120 1667979 1680000
15649 1680000 1678499 1610464 1639595 1701916 1659362 1652310 1654617 1688499 1719676 1718023 1718508 1703444
15637 1703444 1715005 1743962 1720296 1682245 1674102 1705661 1692986 1685936 1656320 1640809 1629467 1615139
15625 1615139 1690343 1633767 1602082 1603669 1612609 1627295 1594263 1616060 1596335 1603081 1659890 1676146
15613 1676146 1663730 1667673 1649151 1690384 1682056 1678521 1676334 1722798 1675352 1660588 1614097 1671567
15601 1671567 1653814 1616046 1663016 1620931 1622971 1663040 1673497 1665063 1633256 1609044 1592566 1685470
15589 1685470 1679368 1681645 1708344 1692222 1653702 1630880 1615353 1583113 1632482 1657770 1616300 1654775
15577 1654775 1608319 1550829 1623653 1593380 1604988 1624752 1644077 1647797 1606092 1604777 1621585 1621424
15565 1621424 1599589 1596100 1615728 1651418 1701855 1634455 1651592 1714559 1694660 1674819 1648784
15554 1648784 1635957 1622447 1675001 1717955 1715121 1613539 1561374 1633067 1760035 1710566 1652635
15543 1652635 1605497 1617144 1632623 1675468 1660682 1590900 1570455 1637214 1661506 1607789 1609301
15532 1609301 1596416 1657780 1651806 1654636 1690682 1659795 1639945 1649422 1632500 1685712 1670923 1667287
15520 1667287 1661092 1635288 1586002 1607573 1664392 1671487 1689938 1760168 1725646 1752714 1733908 1753548
15508 1753548 1642341 1641106 1657458 1675641 1669711 1591487 1620643 1598952 1601391 1642473 1683448 1725784
15496 1725784 1773279 1720660 1607251 1628912 1678637 1700551 1675829 1672163 1569590 1662917 1725042
15485 1725042 1712894 1723691 1710407 1635631 1591001 1600603 1608220 1676931 1710073 1719423 1707390 1709712
15473 1709712 1684117 1701822 1625751 1631223 1686132 1713053 1760991 1773407 1694611 1677841 1676553 1679286
15461 1679286 1644316 1615305 1638535 1676388 1653206 1662193 1675983 1649326 1620596 1680383 1574840
15450 1574840 1552062 1640615 1684388 1670779 1536310 1559123 1631840 1634097 1664492 1674947 1629085
15439 1629085 1613098 1666825 1652673 1662732 1645215 1630077 1673973 1709586 1712359 1638798 1648036 1653322
15427 1653322 1697857 1723482 1722218 1669722 1671131 1679034 1656071 1665011 1633175 1634237 1617852 1656426
15415 1656426 1676460 1688337 1590723 1607304 1664216 1640555 1706107 1668271 1658773 1640477 1601935
15404 1601935 1639811 1707239 1741045 1712987 1730317 1658778 1665258 1695713 1612294 1586143 1684508
15393 1684508 1673782 1671992 1665272 1640424 1665768 1713442 1751999 1730402 1761106 1711708 1724639 1829711
15381 1829711 1811398 1714693 1674444 1749331 1736538 1734929 1753327 1710963 1765702 1737249 1692186
15370 1692186 1694058 1652890 1601719 1594963 1599369 1660586 1619913 1621763 1650397 1615952 1620125 1661764
15358 1661764 1648526 1685058 1715471 1689404 1658246 1599327 1574077 1621759 1677646 1640767 1709645
15347 1709645 1750479 1729305 1750613 1722122 1656057 1654460 1654801 1674644 1677220 1712290 1731537 1723158
15335 1723158 1754346 1752725 1723349 1717608 1752238 1827948 1760177 1691755 1677295 1698814 1757092 1695845
15323 1695845 1746768 1755957 1699863 1660033 1716101 1724508 1679945 1675625 1700709 1664052 1708764 1739163
15311 1739163 1769616 1775297 1707013 1700248 1697628 1681610 1733724 1721681 1693254 1749551 1736842 1723176
15299 1723176 1703802 1729076 1787518 1759796 1733911 1719698 1752042 1715871 1657454 1697499 1728003
15288 1728003 1745010 1710972 1693265 1699106 1663224 1662241 1702038 1708770 1654325 1628680 1595991 1612631
15276 1612631 1697317 1737262 1689746 1668303 1677379 1709856 1750073 1676031 1719058 1697057 1648078
15265 1648078 1698677 1705489 1686019 1706510 1705522 1672320 1665686 1677893 1679724 1727528 1628348 1718062
15253 1718062 1790640 1801257 1810022 1713289 1618623 1615718 1608751 1658036 1675556 1696393 1650140 1664341
15241 1664341 1639185 1608826 1702557 1762711 1747538 1728596 1745963 1727543 1719124 1733414 1696386
15230 1696386 1691233 1741036 1787643 1759354 1701860 1685612 1608353 1657385 1671761 1750519 1734027
15219 1734027 1701823 1786670 1819589 1789785 1773372 1784815 1783081 1718094 1728508 1745264 1770793
15208 1770793 1685753 1669021 1692977 1688441 1664044 1695440 1690099 1669022 1711947 1685949 1689502 1648536
15196 1648536 1630132 1701479 1707327 1625921 1616422 1641638 1656809 1700711 1715940 1715171 1655469 1675567
15184 1675567 1623197 1659377 1625281 1623193 1683140 1720929 1716303 1728378 1713829 1663639 1705173 1774740
15172 1774740 1732580 1700417 1716233 1753316 1785771 1699162 1707210 1709185 1655446 1670399 1682891 1684867
15160 1684867 1714528 1777146 1723199 1738168 1745026 1695142 1693364 1702540 1757317 1752402 1700085 1686731
15148 1686731 1726585 1738977 1756432 1704347 1727771 1753218 1697954 1708540 1773288 1718431 1775010
15137 1775010 1712021 1718569 1752971 1723624 1712146 1722014 1672234 1721971 1773599 1765570 1757949 1741239
15125 1741239 1720907 1797985 1832125 1735213 1715536 1767273 1735678 1729561 1717226 1716458 1756909 1796835
15113 1796835 1752531 1678775 1702917 1713903 1678840 1625264 1650485 1661769 1676736 1719561 1789897
15102 1789897 1766525 1755974 1744302 1701153 1752177 1731789 1710829 1770414 1794003 1700468 1705012
15091 1705012 1756284 1765665 1760292 1753262 1731146 1678686 1696787 1690642 1677046 1678565 1728941 1756477
15079 1756477 1743236 1726127 1763933 1715671 1671267 1656566 1685872 1641489 1629419 1701668 1663638
15068 1663638 1692975 1669545 1704349 1725539 1697941 1738247 1726157 1719055 1758435 1713501 1715072 1729640
15056 1729640 1745910 1729598 1773604 1767250 1761970 1737226 1758423 1758725 1775549 1784948 1775832 1726716
15044 1726716 1697899 1783699 1755333 1783471 1762833 1772573 1755399 1794188 1803103 1744163 1731678 1689461
15032 1689461 1680796 1726568 1785755 1785097 1778730 1820050 1779912 1680845 1711445 1770443 1717962 1768148
15020 1768148 1756869 1752017 1740538 1712129 1679257 1730576 1734059 1738841 1759124 1774346 1770987 1739685
15008 1739685 1792399 1786376 1721594 1735566 1760802 1775795 1733371 1739162 1734949 1736908 1729769 1737268
14996 1737268 1754674 1773196 1774650 1763942 1772155 1801765 1818765 1757320 1772131 1800616 1762997 1794932
14984 1794932 1759493 1785483 1763891 1799863 1774358 1717864 1731819 1738205 1757563 1796103 1768678
14973 1768678 1776162 1824326 1755274 1733772 1786433 1783623 1798070 1762670 1733105 1690636 1719991 1740342
14961 1740342 1711485 1741496 1727611 1740446 1750713 1765054 1705063 1767870 1765907 1788292 1766482
14950 1766482 1744845 1730039 1717511 1711452 1773035 1774876 1724566 1754225 1819410 1847683 1839032 1801328
14938 1801328 1768715 1761967 1806281 1746652 1742731 1686548 1726864 1803765 1795772 1751511 1740032 1737841
14926 1737841 1679863 1714351 1743170 1729475 1714665 1759133 1755736 1719818 1752171 1717370 1757728
14915 1757728 1794699 1767683 1729606 1738373 1788094 1735733 1703034 1778248 1779685 1685587 1687533 1805830
14903 1805830 1821367 1806128 1724862 1727915 1734339 1724299 1741366 1740970 1735824 1747258 1743106 1759194
14891 1759194 1799125 1827692 1814347 1697377 1599829 1628110 1676539 1747857 1732768 1715780 1710198
14880 1710198 1723788 1731240 1746502 1762720 1744860 1753869 1762991 1841703 1774609 1765891 1786985 1816793
14868 1816793 1852522 1839936 1771194 1772521 1832384 1798048 1784360 1817590 1744928 1777116 1824463
14857 1824463 1731044 1737575 1812230 1796312 1805748 1751244 1713365 1717910 1793976 1775673 1807429 1834455
14845 1834455 1772504 1772160 1786242 1713597 1685246 1737185 1726443 1725257 1801872 1776517 1744195 1763158
14833 1763158 1752869 1799577 1788684 1807486 1788367 1796287 1879590 1822654 1780780 1777336 1752521 1715199
14821 1715199 1716999 1717950 1705905 1753356 1747783 1752407 1774500 1808452 1814017 1855731 1861151 1830490 1777682
14808 1777682 1708391 1717851 1716568 1788693 1778057 1816755 1780479 1776848 1758447 1799308 1766099 1777552
14796 1777552 1765495 1732608 1738562 1749567 1778091 1784049 1751992 1788174 1768436 1725130 1713701 1715846
14784 1715846 1713126 1741833 1768163 1758210 1730313 1719849 1733412 1737280 1793502 1797107 1796494 1757728
14772 1757728 1808489 1779875 1756165 1795686 1792534 1778656 1745523 1712123 1742683 1743460 1783662 1724880
14760 1724880 1762482 1787082 1752571 1705513 1719627 1721763 1755264 1766573 1779598 1733067 1758275
14749 1758275 1755071 1712449 1736774 1752890 1748358 1769649 1785305 1810205 1837582 1762442 1736559 1754386
14737 1754386 1774973 1750371 1749855 1747552 1829479 1864644 1769027 1718629 1702282 1755338 1763940 1810171
14725 1810171 1791100 1785762 1784393 1768750 1693324 1713734 1717647 1770381 1831691 1786678 1698664 1716780
14713 1716780 1723796 1751507 1776657 1735548 1749179 1755799 1797388 1775716 1747553 1749486 1801329 1801724
14701 1801724 1780660 1757294 1757058 1773525 1723981 1775519 1779624 1774216 1772708 1774285 1815257 1794272
14689 1794272 1779278 1747090 1776889 1769829 1735426 1741300 1799084 1804709 1790174 1753893 1725433 1693020
14677 1693020 1711815 1675530 1672994 1785192 1787344 1749768 1788259 1791711 1787187 1794684 1812199 1789227
14665 1789227 1795509 1753106 1793973 1790431 1779628 1786027 1774948 1801263 1812222 1787891 1767691 1711305
14653 1711305 1708058 1759654 1775263 1753853 1699231 1718023 1736351 1724007 1809313 1789391 1770516
14642 1770516 1778759 1796447 1777742 1805373 1808213 1806037 1826630 1807394 1766241 1755112 1765568 1813344
14630 1813344 1789428 1796085 1847804 1825560 1833218 1816507 1817462 1849094 1849938 1839360 1845925 1821647 1830012
14617 1830012 1811157 1838154 1775625 1737433 1795619 1790840 1806216 1816139 1831065 1870017 1846778 1862842
14605 1862842 1835246 1832203 1778672 1737519 1695752 1757917 1774730 1778424 1773943 1754475 1819564 1803996
14593 1803996 1878619 1883275 1826355 1865657 1836956 1777639 1770190 1789973 1792282 1809853 1800766 1763936
14581 1763936 1755584 1828410 1904864 1826371 1810048 1783132 1824089 1834846 1807901 1823437 1812072
14570 1812072 1775604 1819403 1869665 1852418 1861329 1872288 1837284 1838388 1830236 1785883 1806412 1797069
14558 1797069 1812081 1814178 1877413 1799440 1792693 1747811 1770748 1770056 1772333 1822088 1803780 1732149
14546 1732149 1694908 1771140 1845639 1828778 1829314 1824898 1798323 1864308 1876235 1857753 1820578 1828605
14534 1828605 1828550 1800981 1807186 1866691 1789468 1774833 1809349 1815673 1824355 1872282 1863342 1838564 1850796
14521 1850796 1809826 1832047 1801218 1793049 1831479 1796631 1779266 1803906 1784279 1759559 1799158
14510 1799158 1892027 1853344 1841332 1887208 1851617 1796846 1779272 1774762 1803090 1854269 1844602 1901957
14498 1901957 1902448 1865767 1873274 1887367 1853070 1837021 1809934 1706058 1754130 1832226 1848386 1817990
14486 1817990 1785358 1769594 1741153 1766075 1764085 1827250 1815568 1751077 1836509 1910662 1900453
14475 1900453 1886776 1856640 1818593 1817175 1820733 1821061 1807583 1829382 1813344 1802527 1825019 1898586
14463 1898586 1944595 1923566 1923234 1896795 1792601 1764004 1808232 1776285 1807568 1796400 1814357
14452 1814357 1825549 1826096 1853980 1921200 1889480 1890012 1899622 1903762 1868361 1867451 1898840 1878767 1812176
14439 1812176 1742938 1799569 1805867 1774007 1770828 1802854 1796857 1822185 1835772 1818256 1824902 1813910
14427 1813910 1803177 1822221 1802661 1829443 1910638 1873652 1868485 1889032 1822551 1792392 1861961
14416 1861961 1825454 1814530 1774639 1824581 1870627 1821048 1829359 1854187 1848177 1870268 1821590 1884159
14404 1884159 1881672 1843134 1862752 1796060 1809818 1781450 1814948 1907834 1927696 1891379 1893359 1850654
14392 1850654 1855529 1811714 1816784 1812944 1863663 1835390 1808626 1847424 1856885 1867802 1861922 1884810
14380 1884810 1832607 1848234 1863715 1831981 1874858 1831056 1763252 1776867 1865170 1812606 1829735
14369 1829735 1892007 1878533 1893768 1851307 1790054 1807652 1834615 1914281 1905838 1889980 1844080
14358 1844080 1813838 1830391 1854060 1822031 1824911 1890476 1875847 1862427 1845366 1799104 1782917
14347 1782917 1895306 1917125 1794783 1743835 1802097 1807115 1832703 1849582 1871301 1848897 1839342
14336 1839342 1853988 1875735 1848516 1787895 1876684 1889970 1900814 1895047 1871905 1861201 1810526
14325 1810526 1822800 1862730 1890253 1888673 1830750 1765329 1807397 1882527 1888879 1877435 1877825 1909663
14313 1909663 1867372 1822070 1825009 1829046 1883490 1837221 1812937 1844841 1868202 1868110 1814851 1806295
14301 1806295 1822745 1845845 1942144 1983231 1955907 1896309 1794982 1814577 1887601 1917141 1885601
14290 1885601 1818026 1848963 1837542 1915837 1849716 1803666 1809860 1803243 1845922 1873593 1890567 1851372
14278 1851372 1879213 1832211 1831625 1864465 1865881 1871259 1802392 1787204 1798865 1823642 1883286 1867679
$$ [...]
##END NTUPLES=NMR SPECTRUM
##END=
