##TITLE=1H_EC-3341
 200.13MHz, CDCl3+DMSO,
 8 sc
 
 30.1.2025
##JCAMPDX= 6.0         $$ Bruker NMR JCAMP-DX V2.0
##DATA TYPE= NMR SPECTRUM
##DATA CLASS= NTUPLES
##ORIGIN= UXNMR, Bruker Analytische Messtechnik GmbH
##OWNER= pz
$$ XWIN-NMR		Version 3.5
$$ Thu Jan 30 14:26:29 2025 Russian Standard Time (UT+4h)  she@DPX200
##.OBSERVE FREQUENCY= 200.1313
##.OBSERVE NUCLEUS= ^1H
##.ACQUISITION MODE= SIMULTANEOUS
##.ACQUISITION SCHEME= undefined
##.AVERAGES= 8
##.DIGITISER RES= 18
##SPECTROMETER/DATA SYSTEM= spect
##.PULSE SEQUENCE= zg30
##.SOLVENT NAME= CDCl3
##.SHIFT REFERENCE= (INTERNAL, CDCl3, 0, 15.6312)
##AUDIT TRAIL= $$ (NUMBER, WHEN, WHO, WHERE, WHAT)
$$ ##TITLE= Audit trail, XWIN-NMR		Version 3.5
$$ ##JCAMPDX= 5.01
$$ ##ORIGIN= Bruker BioSpin GmbH
$$ ##OWNER= she
$$ F:/spectra/data/she/nmr/H-C/1/pdata/1/auditp.txt
$$ ##AUDIT TRAIL=  $$ (NUMBER, WHEN, WHO, WHERE, WHAT)
(   1,<2025-01-30 14:25:11.03 +0400>,<she>,<DPX200>,
      <created by zg, POWCHK disabled, PULCHK disabled
       configuration hash MD5:
       00 E9 B6 7A A2 85 ED C7 34 08 36 98 17 FE 4E 26
       data hash MD5: 16K
       0F 17 72 80 7E C0 DC 28 C1 9B 88 8A 95 F9 F5 2B>)
(   2,<2025-01-30 14:25:12.40 +0400>,<she>,<DPX200>,
      <Start of raw data processing
       efp BC_mod = 2 LB = 0.25 FT_mod = 6 PKNL = 1 PHC0 = 78.53519 PHC1 = 31.39222 SI = 16K 
       data hash MD5: 16K
       14 FA AC B8 20 43 68 72 A8 17 1D 44 47 3C 5E 8D>)
(   3,<2025-01-30 14:25:36.60 +0400>,<she>,<DPX200>,
      <pk PHC0 = 173.5978 PHC1 = -21.6 
       data hash MD5: 16K
       1C 45 1D C6 CB DB 12 3F 6A 2D E9 CA 07 66 E0 50>)
(   4,<2025-01-30 14:25:40.17 +0400>,<she>,<DPX200>,
      <abs ABSG = 5 
       data hash MD5: 16K
       AC 60 06 98 92 F9 51 E1 6B 03 C7 FA 47 3D 36 D6>)
$$ ##END=
$$ 
$$ hash MD5
$$ 71 B9 4A 1F E7 73 E0 0F 53 AE 92 E9 B5 88 63 28
##$RELAX= 
##$RELAX= 
##$RELAX= 
##$RELAX= 
##$RELAX= 
##$RELAX= 
$$ Bruker specific parameters
$$ --------------------------
##$DU= <F:/spectra>
##$EXPNO= 1
##$NAME= <H-C>
##$PROCNO= 1
##$TYPE= <nmr>
##$USER= <she>
##$AMP= (0..31)
100 100 100 100 100 100 100 100 100 100 100 100 100 100 100 100 100 100 
100 100 100 100 100 100 100 100 100 100 100 100 100 100 
##$AQSEQ= 0
##$AQ_mod= 1
##$AUNM= <au_zg>
##$AUTOPOS= <>
##$BF1= 200.13
##$BF2= 200.13
##$BF3= 200.13
##$BF4= 200.13
##$BF5= 200.13
##$BF6= 200.13
##$BF7= 200.13
##$BF8= 200.13
##$BYTORDA= 1
##$CFDGTYP= 0
##$CFRGTYP= 5
##$CHEMSTR= <none>
##$CNST= (0..31)
1 1 145 1 1 1 1 1 1 1 1 1 1 1 1 1 1 1 1 1 1 1 1 1 1 1 1 1 1 1 1 1 
##$CPDPRG= <>
##$CPDPRG1= <>
##$CPDPRG2= <>
##$CPDPRG3= <>
##$CPDPRG4= <mlev>
##$CPDPRG5= <mlev>
##$CPDPRG6= <mlev>
##$CPDPRG7= <mlev>
##$CPDPRG8= <mlev>
##$CPDPRGB= <>
##$CPDPRGT= <>
##$D= (0..31)
0 0.7 0 0 0 0 0 0 0 0 0 0.03 0 0 0 0 0 0 0 0 0 0 0 0 0 0 0 0 0 0 0 0 
##$DATE= 1738232710
##$DBL= (0..7)
120 120 120 120 120 120 120 120 
##$DBP= (0..7)
150 150 150 150 150 150 150 150 
##$DBP07= 0
##$DBPNAM0= <>
##$DBPNAM1= <>
##$DBPNAM2= <>
##$DBPNAM3= <>
##$DBPNAM4= <>
$$ [...]
##$SUBNAM3= <"">
##$SUBNAM4= <"">
##$SUBNAM5= <"">
##$SUBNAM6= <"">
##$SUBNAM7= <"">
##$SUBNAM8= <"">
##$SUBNAM9= <"">
##$SW= 18.0517328524113
##$SWIBOX= (0..15)
0 0 2 0 0 0 0 0 0 0 0 0 0 0 0 0 
##$SW_h= 3612.71676300578
##$TD= 16384
##$TD0= 1
##$TE= 0
##$TE2= 300
##$TE3= 300
##$TEG= 300
##$TL= (0..7)
0 120 120 120 120 120 120 120 
##$TP= (0..7)
150 150 150 150 150 150 150 150 
##$TP07= 0
##$TPNAME0= <>
##$TPNAME1= <>
##$TPNAME2= <>
##$TPNAME3= <>
##$TPNAME4= <>
##$TPNAME5= <>
##$TPNAME6= <>
##$TPNAME7= <>
##$TPOAL= (0..7)
0.5 0.5 0.5 0.5 0.5 0.5 0.5 0.5 
##$TPOFFS= (0..7)
0 0 0 0 0 0 0 0 
##$TUNHIN= 0
##$TUNHOUT= 0
##$TUNXOUT= 0
##$USERA1= <user>
##$USERA2= <user>
##$USERA3= <user>
##$USERA4= <user>
##$USERA5= <user>
##$V9= 5
##$VALIST= <valist>
##$VCLIST= <CCCCCCCCCCCCCCC>
##$VD= 0
##$VDLIST= <DDDDDDDDDDDDDDD>
##$VPLIST= <PPPPPPPPPPPPPPP>
##$VTLIST= <TTTTTTTTTTTTTTT>
##$WBST= 1024
##$WBSW= 4
##$XGAIN= (0..3)
0 0 0 0 
##$XL= 0
##$YL= 0
##$YMAX_a= 148295
##$YMIN_a= -218162
##$ZGOPTNS= <>
##$ZL1= 120
##$ZL2= 120
##$ZL3= 120
##$ZL4= 120
##$ABSF1= 15.46043
##$ABSF2= -2.591419
##$ABSG= 5
##$ABSL= 3
##$ALPHA= 0
##$AQORDER= 0
##$ASSFAC= 0
##$ASSFACI= 0
##$ASSFACX= 0
##$ASSWID= 0
##$AUNMP= <proc_1d>
##$AZFE= 0.1
##$AZFW= 0.1
##$BCFW= 0
##$BC_mod= 2
##$BYTORDP= 0
##$COROFFS= 0
##$CY= -3
##$DATMOD= 1
##$DC= 0
##$DFILT= <>
##$DTYPP= 0
##$F1P= 0
##$F2P= 0
##$FCOR= 1
##$FTSIZE= 16384
##$FT_mod= 6
##$GAMMA= 0
##$GB= 0
##$INTBC= 1
##$INTSCL= 3.241238e-09
##$ISEN= 128
##$LB= 0.25
##$LEV0= 0
##$LPBIN= 0
##$MAXI= 10000
##$MC2= 0
##$MEAN= 0
##$ME_mod= 0
##$MI= 1.114404
##$NCOEF= 0
##$NC_proc= -8
##$NLEV= 6
##$NOISF1= 3.799351
##$NOISF2= 2.8
##$NSP= 0
##$NTH_PI= 0
##$NZP= 0
##$OFFSET= 15.6312
##$PC= 1
##$PHC0= 252.133
##$PHC1= 9.792219
##$PH_mod= 1
##$PKNL= yes
##$PPARMOD= 0
##$PSCAL= 0
##$PSIGN= 0
##$REVERSE= no
##$SF= 200.129978086866
##$SI= 16384
##$SIGF1= 3
##$SIGF2= 2
##$SINO= 0.751879
##$SIOLD= 32768
##$SREGLST= <19F.Aceton>
##$SSB= 0
##$STSI= 16384
##$STSR= 0
##$SW_p= 3612.71676300578
##$SYMM= 0
##$S_DEV= 0
##$TDeff= 16384
##$TDoff= 0
##$TI= <>
##$TILT= no
##$TM1= 0
##$TM2= 0
##$TOPLEV= 0
##$USERP1= <user>
##$USERP2= <user>
##$USERP3= <user>
##$USERP4= <user>
##$USERP5= <user>
##$WDW= 1
##$XDIM= 16384
##$YMAX_p= 560295470
##$YMIN_p= -1566375
$$ End of Bruker specific parameters
$$ ---------------------------------
##NTUPLES= NMR SPECTRUM
##VAR_NAME=  FREQUENCY,     SPECTRUM/REAL,   SPECTRUM/IMAG
##SYMBOL=    X,             R,               I
##VAR_TYPE=  INDEPENDENT,   DEPENDENT,       DEPENDENT
##VAR_FORM=  AFFN,          ASDF,            ASDF
##VAR_DIM=   16384,         16384,           16384
##UNITS=     HZ,            ARBITRARY UNITS, ARBITRARY UNITS
##FACTOR=    0.220516191357247, 1,           1
##FIRST=     3128.27168079639, 0,            0
##LAST=      -484.44508220939, 0,            0
##MIN=       -484.44508220939, -1566375,     0
##MAX=       3128.27168079639, 560295470,    0
$$ Real data points
##PAGE= N=1
##DATA TABLE= (X++(R..R)), XYDATA
$$ [...]
11807G3841R231L48665k84568j95682j2277N16092K58365n03107j50076M38593
11797D99077k79133j52766J46598p563l03642O3574L95265J50494K09360q03457
11787h2193J39225Q5622J56207L44399r1649k10601J19869K99461K9365l46261
11777D43444R7714L03614k16358k01860m28088r1456K25283m37381j24585J91401
11767b38272j41466L15597k43959j22259J14172K60023L17796n91764j48550L51795
11757a26887m16690L69136L18638J8358l81888m6901J89279J82261K02157J48536
11747D55999R0523j21283J93626m83676O2833L01832N51341k37496n40740j47243
11737A25716j31233k20067R1900J18009L05474J89996L07647j22332n79555N8142
$$ y = [73841, 83072, 431737, 147169, -48513, -60790, 455302, 713667, 210560, 60484, 499077, 219944, 67178, 213776, 206213, -97429, -33855, 361410, 511904, 721264, -82193, 57032, 142654, 298861, 643260, 551611, 341010, 460879, 760340, 789705, 443444, 541158, 844772, 628414, 426554, -1534, -92990, 132293, -305088, -429673, -238272, -379738, -64141, -308100, -430359, -316187, -56164, 261632, -330132, -478682, -126887, -543577, -174441, 144197, 162555, -219333, -266234, -76955, 105306, 307463, 455999, 546522, 425239, 618865, 135189, 198022, 499854, 1051195, 813699, 272959, 125716, -5517, -225584, -133684, -15675, 289799, 479795, 787442, 665110, 85555, 143697]
11727A43697p3652M18863J36370k25431j00849j75008l31236m08002K30726L09140
11717g5382j79833N5519M06363m4240l63516o3394M65536L26227j79303M00049
11707G48026k70858K7207l55974j20379J9028P00185J12066l99111j76798N43502
11697H26894m09961o54483L79068j08973K81403J52771N66315j23633l1373n85647
11687B92381m05827j21005L15378L27948N7322L62862j72562k82056q2224P8779
11677C70996L95106L01667m9437k04241j17405n96158j11870M59885L72161J1394
11667H32098j35033j91460j05099p06162L34485M15884n7101M17369l49395n58184
11657a02598n6740J70004N62317J8318K05055j19331o68624J23508M44264j38053
$$ y = [143697, 70045, 488908, 625278, 399847, 298998, 123990, -207246, -615248, -384522, -75382, -255215, -199696, 206667, 162427, -201089, -264483, 201053, 527280, 347977, 748026, 477168, 504375, 148401, 28022, 47050, 747235, 859301, 460190, 283392, 826894, 416933, -237550, 141518, 32545, 313948, 466719, 1033034, 909401, 878028, 292381, -113446, -234451, 80927, 408875, 466197, 829059, 656497, 374441, 292217, 370996, 766102, 1067769, 1018332, 814091, 696686, 100528, -11342, 448543, 820704, 832098, 697065, 505605, 400506, -305656, 28829, 444713, 387612, 804981, 455586, -102598, -159338, 10666, 572983, 591301, 796356, 677025, 8401, 131909, 576173, 438120]
11647D38120l4200R6103L49313l66715m51860J70646M86440K1921K01430k07577
11637G03621l8980K01516n5278l25196l72712k55086j23779J035817l99507J09876
11627D80292J69211m2499K63419m95388j00893K88761j96604M50243k10755l21586
11617B84201j40817M2367M72001o2032O4108J55001r8385L86321P211J59010m40698
11606H28288p1432R3286N70247m915J22512k19827k37871j11445k80527M55097
11596A143413J09208k52208l08065L22841K79492M97813l38337K65664n4407J97616
11586A863030k76195l25211m7614k34760M80930K09768m38204k32853L86345J08960
11576A494196k47420j94621M07279J53501n74089K90394J04164l41603m23989
$$ y = [438120, 403920, 500023, 849336, 482621, 30761, 201407, 687847, 709768, 911198, 703621, 664641, 866157, 810879, 485683, 112971, -142115, -265894, 769923, 370416, 480292, 649503, 607004, 870423, 375035, 274142, 562903, 366299, 816542, 605787, 284201, 143384, 185751, 657752, 595720, 659828, 814829, 716444, 1102765, 1109976, 1268986, 828288, 756856, 850142, 1420389, 1415474, 1537986, 1318159, 1080288, 968843, 688316, 1143413, 1252621, 1000413, 692348, 1015189, 1294681, 1792494, 1454157, 1719821, 1665414, 1863030, 1586835, 1261624, 1214010, 979250, 1460180, 1669948, 1231744, 998891, 1385236, 1494196, 1246776, 1052155, 1459434, 1612935, 1038846, 1329240, 1433404, 1091801, 667812]
11567F67812L31595M87089p6639k02909O7969K79784l71210M09343p7603k17124
11557A298107m46J13971l93111k73072j3308K37218k80083K31180O9484J24373
11547A114313L9143p7430p641k68071O764N85641O22308n47230l20687J45859
11537A292969M57866K33946m01785l53552l15868p2505N09480q0212L02638Q1325
11527A654302R2026j56865j43452L05395L02522J43468J7783j41324J1512k0379
11517B064988n55695m4954N71130l64001j64461M54661J61215K42455O6481l46556
11507B085263j67802J82355K24618r7479M31866k77831L92247m61205J29830K03778
11497B645640j72070J99611m77396M86673k06546O21801k49607k83841J25519
$$ y = [667812, 999407, 1486496, 1409857, 1206948, 1274917, 1554701, 1183491, 1592834, 1515231, 1298107, 1297661, 1411632, 1018521, 745449, 732141, 969359, 689276, 920456, 989940, 1114313, 1153456, 1076026, 1068385, 800314, 807078, 1392719, 2015027, 1467797, 1147110, 1292969, 1750835, 1984781, 1582996, 1229444, 913576, 841071, 1350551, 1270339, 1572977, 1654302, 1746328, 1589463, 1446011, 1751406, 2053928, 2197396, 2215179, 2073855, 2085367, 2064988, 1509293, 1464339, 2035469, 1671468, 1507007, 1961668, 2122883, 2365338, 2431819, 2085263, 1917461, 2099816, 2324434, 2226955, 2658821, 2380990, 2773237, 2312032, 2441862, 2645640, 2473570, 2673181, 2195785, 2682458, 2475912, 3097713, 2848106, 2564265, 2689784]
11488B689784j15015k25360L02704j71159K04376p9165J69155o5904k04692K41518
11478B746242L38021l49920m97589J92500j26818K98418K75102J51766r7894l83578
11468B546250l21551J0367q972R3503M67530k60712j43986L64592j34905Q9544
11458B701660k67154M01965K73657L98538k98323m25463j7459j37739J89275K93662
11448C112619l36969N4715j64688J57942J61637j74653K46786M0947R8874O56013
11438C853223l868L57260k00309l64066N08710n46499l72503O87650r8989j49719
11428C670890L67331j56774K74072J77320k9242o9545L843K03618m20k1070N9814
11417D479837P4415M5533k72608J00215N00736J57227J6678O25380j00942l35163
$$ y = [2689784, 2574769, 2349409, 2652113, 2480954, 2685330, 2606165, 2775320, 2709416, 2504724, 2746242, 3084263, 2734343, 2236754, 2429254, 2302436, 2600854, 2875956, 3027722, 2929828, 2546250, 2224699, 2235066, 2226094, 2319597, 2787127, 2526415, 2382429, 2747021, 2612116, 2701660, 2434506, 2836471, 3110128, 3508666, 3210343, 2784880, 2767421, 2629682, 2818957, 3112619, 2775650, 2830365, 2665677, 2823619, 2985256, 2810603, 3057389, 3098336, 3197210, 3853223, 3849355, 4206615, 4006306, 3642240, 4150950, 3604451, 3231948, 3919598, 3820609, 3670890, 4038221, 3881447, 4155519, 4332839, 4303597, 4234052, 4237895, 4441513, 4441093, 4420023, 4479837, 4554252, 4599785, 4327177, 4427392, 4928128, 5085355, 5102033, 5727413, 5626471, 5291308]
11407E291308k26351L76378O86587n27182j56678K64850J60420L10696k45466
11398E934562j91979L2851L98891k70262J20828J3741j80242N71867J72013L82679
11388F984949N71450J30567R650K57180o7470J82197j63740m87770N53763M0057
11378H010833m44528O06119m25729M14727L42831M95610O41562j10251L0553o8218
11368I493509P87054L71381m77914J03169K87511M92950K91244l46474P28500
11359A1730930N66406R4858j18486K21225L30693M03353M64574M05917K920K07506
11349A4309896J200400J83725M6048R12635L86914M14702L37667N12036L46205
11340A8650228N66856L73761J41372R91073O86341L75999P82500K15391J079561
$$ y = [5291308, 5064957, 5441335, 6127922, 5600740, 5444062, 5708912, 5869332, 6180028, 5934562, 5742583, 5775434, 6174325, 5904063, 6024891, 6038632, 5858390, 6430257, 6602270, 6984949, 7556399, 7686966, 7696616, 7953796, 7886326, 8068523, 7904783, 7417013, 7970776, 8010833, 7566305, 8172424, 7746695, 8161422, 8504253, 8999863, 9641425, 9531174, 9561727, 9493509, 10280563, 10651944, 10174030, 10277199, 10564710, 11057660, 11348904, 11002430, 11730930, 12297336, 12392194, 12273708, 12494933, 12825626, 13228979, 13693553, 14099470, 14102390, 14309896, 15510296, 15694021, 15740069, 16652704, 17039618, 17454320, 17791987, 18304023, 18650228, 19217084, 19590845, 19732217, 20723290, 21409631, 21785630, 22568130, 22783521, 23863082]
11331B3863082Q94085K25050Q70476R50242Q10374J025215Q95944P78537R64222
11322C1277227J132416N41508J702313J072203Q79636R52254J530453J658096
11314D0746106J570620J236233J846373J142891J523839J921678J746449J712955
11306E3447144J944454J607515J636727K561763J962867K503442K200586K045499
11298F9909997K048243K703811L020031K451905K419558K696879K784682K999075
11290I1034181K492454K366709L000349L247105K348135K772656K182689K230422
11282A11674700J885163K062561J428262J282846N33892J088611L81814l71493
11274A19966356n12893j133637j407742r27720j179414j866895k506237k397875
$$ y = [23863082, 24757167, 24982217, 25852693, 26802935, 27613309, 28638524, 29534468, 30313005, 31277227, 32409643, 32951151, 34653464, 35725667, 36605303, 37557557, 39088010, 40746106, 42316726, 43552959, 45399332, 46542223, 48066062, 49987740, 51734189, 53447144, 55391598, 56999113, 58635840, 61197603, 63160470, 65663912, 67864498, 69909997, 71958240, 74662051, 77682082, 80133987, 82553545, 85250424, 88035106, 91034181, 93526635, 95893344, 98893693, 102140798, 104488933, 107261589, 109444278, 111674700, 113559863, 115622424, 117050686, 118333532, 118867424, 119956035, 120337849, 119966356, 119453463, 118319826, 116912084, 115984364, 114804950, 112938055, 110431818, 108033943]
11266A08033943k559826k849070k421638l067191k866904k763006l621048k566468
11258H5318792k627017l233868l088362k697138k495420k416442k675286k538497
11250F3546762k191736k037193k337939j760727k396721j852912j880678k168144
11242D6920712j949548j139344j380987j400728j145977j478293j383817j301675
11234C5740343j195183j545432o10919j354298r41680p81455r99742o25106r65014
11225B6721514j113575q78530r09617j29018j015512n10163q51468k51193n66522
11216B0495916r20445o21765r0591n36847j339166J3564l18071n13269q3054m52493
11206A5633779J42355K45006p45026l48983l16288n94872r31067k39029N0912
$$ y = [108033943, 105474117, 102625047, 100203409, 97136218, 94269314, 91506308, 87885260, 85318792, 82691775, 79457907, 76369545, 73672407, 71176987, 68760545, 66085259, 63546762, 61355026, 59317833, 56979894, 55219167, 52822446, 50969534, 49088856, 46920712, 44971164, 43831820, 42450833, 41050105, 39904128, 38425835, 37042018, 35740343, 34545160, 32999728, 32388809, 31034511, 30092831, 29311376, 28311634, 27686528, 26721514, 25607939, 24729409, 23819792, 23690774, 22675262, 22165099, 21313631, 21062438, 20495916, 19575471, 18953706, 18863115, 18326268, 16987102, 17000666, 16682595, 16169326, 16086272, 15633779, 15776134, 16021140, 15276114, 14927131, 14610843, 14015971, 13084904, 12845875, 12896787]
11197A2896787L8985n47518m42332k80686J68549R3485l14518j97639o53516q1572
11187A0680025J84132n35738m90485k84077j83892J21620k90175K73930m77567
11178H997773j48235m09470m08432J01271M00653K70714k54089n51251k960j40903
11168G855071n73186l31113J04245p08107k0792K01971m8556k17369J89176j47121
11158F304219j91615j35948L1360k25053L64645k32150k88219k58161J0107r7844
11148E281341L18434m4690l46832K73319n22665J9784j12603n0261J82603Q084
11138E006514j78810l87019j44756L09751K1001m91806K73751J29227n17276k34255
11128C786322m67791L96113j53960J65557j11716l33141N9336M50185M020k87516
$$ y = [12896787, 12935772, 12388254, 11945922, 11665236, 11833785, 11927270, 11612752, 11415113, 10761597, 10680025, 10864157, 10328419, 9837934, 9553857, 9369965, 9491585, 9201410, 9475340, 8997773, 8849538, 8440068, 8031636, 8132907, 8533560, 8804274, 8550185, 7998934, 7995974, 7855071, 7281885, 6950772, 7055017, 6346910, 6326118, 6528089, 6479533, 6262164, 6451340, 6304219, 6112604, 5976656, 6008016, 5782963, 6147608, 5915458, 5627239, 5369078, 5379185, 5281341, 5599775, 5555085, 5208253, 5481572, 4958907, 4978691, 4866088, 4815827, 4998430, 5006514, 4827704, 4440685, 4295929, 4605680, 4626681, 4134875, 4408626, 4537853, 4020577, 3786322, 3318531, 3714644, 3560684, 3726241, 3614525, 3281384, 3340720, 3790905, 3794925, 3507409]
11118C507409m15509M41698k85484K34457m35034L55350K31929l01148P4807r0838
11108C317637N1518j185o35470l25321J04243j10728L61321O7614L4036J66773
11098C030438n11894K05054l42668k36191L92239J54134L50763m02644Q7892M8151
11088B775274p2572K03418j70528k45830q4380r2375N39851L80910l89534j7785
11078B826449m65470J0184M65194N9059j79053q29008j6172j60561J76632L63387
11068B250641J72002p7061k03197J61103r7977L72466p5223m23768R3936k15038
11058A957884J47910L18120J32325k85511k8160K92619j725m41570m40163K50617
11048A902346J29298K96535K3533p18686J04582L33197k97551j58355J03537J60640
$$ y = [3507409, 3091900, 3533598, 3248114, 3482571, 3047537, 3402887, 3634816, 3333668, 3408475, 3317637, 3369155, 3367970, 2732500, 2407179, 2511422, 2400694, 2762015, 2829629, 2863665, 3030438, 2518544, 2723598, 2380930, 2144739, 2536978, 2691112, 3041875, 2639231, 2727123, 2775274, 2702702, 2906120, 2735592, 2489762, 2405382, 2313007, 2852858, 3233768, 2844234, 2826449, 2360979, 2371163, 2836357, 2895416, 2716363, 1887355, 1871183, 1710622, 1887254, 2250641, 2422643, 2345582, 2142385, 2303488, 2205511, 2577977, 2502754, 2078986, 2172922, 1957884, 2105794, 2423914, 2556239, 2270728, 2242568, 2535187, 2533462, 2091892, 1651729, 1902346, 2031644, 2328179, 2351712, 1633026, 1737608, 2070805, 1773254, 1614899, 1718436, 1879076]
11038A879076J6764m436j44428k86299k73145j41719K66544j96409J10701M53849
11028A680498J17435m01493o02222k0736M27638K4961R7310J37155M56099j30448
11018A786197q06300J3766K55786k84158K4138p7003J8050L08651J76096N36865
11008A952088K88350l74360R9795m182j50230J37784j09317R2775j66765j83790
10998A582148l53877m12371J53933J46430k97713J6408j2734n6787k65004N1721
10988E52154J80588K83688j96859n0065L02854J81563P8311m20717m717M475N8136
10977I69411j05382L42303K18742q8442k13455k62832J78105l67176J16407J19592
10967I07273k8932j77619J58916J45756o45623m7179N74624M46793L11585j56047
$$ y = [1879076, 1895840, 1891404, 1746976, 1460677, 1187532, 1045813, 1312357, 1115948, 1226649, 1680498, 1797933, 1396440, 794218, 773482, 1201120, 1226081, 1323391, 1460546, 1916645, 1786197, 979897, 993663, 1249449, 965291, 989429, 912426, 930476, 1239127, 1415223, 1952088, 2240438, 1866078, 1965873, 1961691, 1811461, 1949245, 1839928, 1932703, 1765938, 1582148, 1228271, 815900, 969833, 1116263, 818550, 834958, 822224, 765437, 500433, 552154, 732742, 1016430, 819571, 769506, 1072360, 1253923, 1332234, 911517, 906800, 911275, 969411, 864029, 1206332, 1425074, 1336632, 1123177, 860345, 1038450, 671274, 787681, 907273, 878341, 700722, 859638, 1005394, 359771, 312592, 887216, 1334009, 1645594, 1489547]
10957A489547l84193k62508n1515k7618j36658J93757K56508J9103q1315K52102
10947A267210K87803l0681q32117o01109m7258k4713M09372p7331L24436k17723
10937D57889k96024J38734j67697K69429L04887k589o78634M12994K1645J71501
10927F32135j59290m00382K84749l27049l59505M25177J93861L37755J2816l60826
10917B79441j44010K66605P8477k81588Q515L89576K28941k06394j96646j78880
10907B44037L88625L29044l37831J11781m16802N55157j55722m08881K10623J37397
10897F57428k25585j88092J90621J56386j0885p00569J56936Q3563L6317M70948
10887F27068J37380l87943m0585m67343M25177J44729k58134L33589J02131k31378
$$ y = [1489547, 1105354, 842846, 791331, 763713, 627055, 820812, 1077320, 1096423, 1015108, 1267210, 1555013, 1524332, 692215, 91106, 43848, 19135, 428507, 351176, 675612, 457889, 161865, 300599, 132902, 402331, 707218, 704629, 25995, 438989, 460634, 632135, 472845, 72463, 357212, 30163, -329342, 95835, 289696, 627451, 640267, 279441, 135431, 402036, 480513, 198925, 207440, 597016, 825957, 619563, 422917, 244037, 632662, 961706, 623875, 735656, 318854, 874011, 718289, 309408, 520031, 657428, 431843, 243751, 434372, 590758, 579873, -120696, 36240, 119803, 156120, 627068, 764448, 376505, 335920, -131423, 293754, 438483, 180349, 513938, 616069, 384691]
10877C84691N0133P3044J93984L13433k69865m94175r3035r539L47489M99098
10867I95258J28215k26574P744l38003N99747o02523K03767J36039j73020q0229
10857F50421K55743j67462n60126K60865J21533J37735l1719m97816Q0891R06374
10847A156439l05469l62612k08917j20679l68585N22088K31345k85353R3059M88229
10837H39545r6453m70556n35402K15414o2120L82671P4226j55948k22120L3072
10827B329K84338o9682k48091K16079N30980N78371m26175j033724K41679J11325
10817A87429L13089K39614l6401n3137M12439k63543j9915J76995J72034j89845
10807I38759k12097m34812J10202J70208k72153O3482L0713j25163k20271Q5752
$$ y = [384691, 434824, 507868, 701852, 1015285, 745420, 251245, 158210, 148671, 496160, 995258, 1123473, 896899, 904643, 566640, 1166387, 563864, 767631, 903670, 730650, 650421, 906164, 738702, 178576, 439441, 560974, 698709, 666990, 169174, 250065, 1156439, 850970, 488358, 279441, 158762, -209823, 312265, 543610, 258257, 351316, 839545, 743092, 272536, -262866, -47452, -109572, 273099, 347325, 191377, -30743, 2329, 286667, 216985, -31106, 184973, 715953, 1294324, 868149, -165575, 76104, 187429, 500518, 740132, 703731, 650594, 1063033, 799490, 779575, 956570, 1128604, 938759, 726662, 291850, 402052, 572260, 300107, 363589, 394302, 269139, 48868, 134620]
10797A34620K67878J35639j06828j26740l05074M8070p7537K42686p8858K39959
10787C73815j96368n51736Q5169m8689K80012J19547J36553j58526k92799j31213
10777c84235M82891k0004k94828M12773q7015k59351P70728o3245m16641n713
10767A35360l40163L95854M2725k99119m2993j40359J00612K06927L88480o43997
10757a96673q87M84111j73634P0142m83561L73398O08496M16601m70977m17627
10747B09389n16997K35979L82089J61875p4231p6632r6282m78692o68009L51079
10737e70432P68931j26331k60084j13408P27784J38193K14855q95943L74544M96170
10727G54279m91552L2459m0742r8759P7233N9752m05985k00034P6665j06487M1399
$$ y = [134620, 402498, 538137, 431309, 304569, -505, 47565, -29972, 212714, 133856, 373815, 177447, -374289, -289120, -337809, -57797, 61750, 198303, 39777, -253022, -384235, 98656, 78652, -216176, 196597, 109582, -149769, 620959, 557714, 141073, 135360, -204803, 191051, 233776, -65343, -108336, -248695, -148083, 58844, 447324, -196673, -197560, 286551, 112917, 183059, -300502, 72896, 681392, 1097993, 627016, 209389, -307608, -71629, 310460, 472335, 398104, 321472, 225190, -253502, -921511, -570432, 198499, 72168, -187916, -301324, 426460, 564653, 779508, -116435, 258109, 754279, 262727, 295186, 254444, 155685, 232918, 292670, -113315, -313349, -236684, -343171, -301772]
10716c01772k17174M90330j49053j31136N05916o0052J23664l60260j28514j32242
10706c60293J48902j89264K95779j69022r1244L16669J36235m68860J64100N05452
10696B88454O8259J36306M95460p13352j97769j70775r6919K15967r2326o3016
10686a29711m89061L2684N72085M54585J29553k52471k51580J61081K16732J07032
10676E50929n02097k33775l4587M00799J40634m08738K75468k0353M3093n83195
10666c71822m78811Q13919J08405m97851l93470J77618J50467K83890n7128K47830
10656a6953l90957K09348N66895l68998L2514l51420o95032K82729K39845Q8611
10646d03418R4383k7070J44389j64345L86302J15705k08123P17968j04703l65859
$$ y = [-301772, -518946, -28616, -177669, -308805, 197111, 137059, 260723, -99537, -228051, -360293, -211391, -400655, -104876, -273898, -365142, -48473, 87762, -381098, -216998, 288454, 356713, 493019, 988479, 275127, 77358, -93417, -190336, 25631, -66695, -129711, -618772, -586088, -14003, 440582, 570135, 317664, 66084, 227165, 443897, 550929, 48832, -184943, -219530, 181269, 321903, -86835, 188633, 168280, 211373, -371822, -850633, -36714, 71691, -426160, -819630, -642012, -491545, -207655, -264783, -16953, -407910, -198562, 368333, -665, 31849, -319571, -1014603, -731874, -492029, -403418, -309035, -336105, -191716, -356061, 30241, 145946, -62177, 655791, 551088, 185229]
10636A85229k10488j44314J87645j41460l9057J55280M81416N28403m46912k51731
10626C04011o8018l14277N73617N3683l36839L08540j54883k70416K14390N34159
10616H43967l85345m73296j7274k9839L39728K67704K19824j6515l70642o00864
10606b22552P3555r1254l3358J80705k51811K42995j48684L28277N07753J2949
10596E98575n63356l20975K98938J15303r5784K99854j99513l45306l48895K3682
10586e37477R09284n0879m43768M34951J36272l33729k47797L54442j45392M26220
10576E02127O0442m22792n24107n36805Q37392J37173J37204j490J05823n90335
10566b95368J19919j6806Q8224R133O2781L85049n55989k3939j6721o3414N57088
$$ y = [185229, -25259, -169573, 18072, -123388, -162445, -7165, 474251, 1002654, 555742, 304011, 235993, -78284, 495333, 549016, 212177, 520717, 365834, 95418, 309808, 843967, 458622, -14674, -31948, -61787, 277941, 545645, 765469, 748954, 378312, -222552, -148997, -240251, -273609, -92904, -344715, -101720, -250404, 77873, 585626, 598575, 35219, -285756, 13182, 128485, 32701, 332555, 133042, -212264, -561159, -537477, 371807, 320928, -122840, 312111, 448383, 114654, -133143, 221299, 75907, 502127, 562569, 139777, -384330, -921135, -83743, 53430, 190634, 189144, 294967, -295368, -175449, -192255, -104031, -94898, -32117, 352932, -203057, -226996, -243717, -307131, 249957]
10555B49957J3415k49897K84705j09473j6015m96698j57549j17282L85896N84192
10545C71251K5803j04080p3616J76998j12479L67939m29633j48151L94220l43906
10535A24346k85350O5065K51775k26429j2049k28143K59048J20577l48709K19930
10525e9939K62112j91878k77632j39083l0361l38537j28079R9689m02195M68921
10515g36982N22734l19583j99205N06422K48459l55905p3871M26170J56822k44332
10505f9271N0098N08793m77192K80289j67024n82898M45065j10662P8208l56602
10495d01196K11057L32181k26004k25202J51871L70189q5775J01892j4417l9586
10485A75010K7205J98607O8098j84515M5215M54383J1688r46o47509N3121M5941
$$ y = [249957, 263372, 13475, 298180, 188707, 172692, -324006, -481555, -598837, -212941, 371251, 397054, 292974, 219358, 396356, 283877, 651816, 222183, 74032, 468252, 124346, -161004, -95939, 155836, -70593, -82642, -310785, -51737, 68840, -279869, -59939, 202173, 10295, -267337, -406420, -436781, -775318, -903397, -803708, -1205903, -736982, -214248, -533831, -733036, -226614, 21845, -334060, -407931, 18239, 175061, -69271, -19173, 489620, 12428, 292717, 125693, -457205, -12140, -122802, -44594, -401196, -190139, 142042, -83962, -309164, -157293, 212896, 127121, 229013, 214596, 175010, 202215, 400822, 468920, 284405, 329620, 784003, 795691, 794745, 147236, 200357, 246298]
10474B46298L00501k06626j90419M69622L70048o89746l11776K50068r6280L6156
10464A77846L48415l88869j62149l22970r9328M98058L73707q4453m70967k8523
10454a59233K55624M7958n42741O1623P678N72656K1828j70177m68565n26300
10444h99649L64589L15483N8450j11957j59676O3376M16998J25581k74403P6932
10434b4276p3202K76522N7771l1531M0907j97815l79856J03218n1084K53098L12025
10423B85777J82522k10171J15880Q3538j50364J87889l27020k78905J63304J899
10413E4349p31296R4121N85077k75639j50395K90620j72164J69742L20099m20433
10403b35919K64443L50812O6072l49593o8155j39145j96426L02087K81514n49066
$$ y = [246298, 546799, 340173, 149754, 619376, 989424, 299678, -12098, 237970, 141690, 177846, 526261, 137392, -24757, -347727, -447055, 51003, 424710, 340257, -130710, -159233, 96391, 144349, -398392, -336769, -329091, 243565, 265393, 95216, -373349, -899649, -535060, -219577, -161127, -273084, -432760, -369384, 47614, 173195, -101208, -24276, -97478, 179044, 236815, 205284, 246191, 48376, -331480, -228262, -279346, -26248, 285777, 468299, 258128, 374008, 457546, 307182, 495071, 168051, -110854, 52450, 54349, -676947, -582826, 2251, -273388, -423783, -133163, -305327, -135585, 184514, -235919, 28524, 379336, 445408, 95815, 27660, -111485, -307911, -5824, 275690, -273376]
10393b73376l69719M25126l6343j64899R1640J5378j6214J23712P41619r01151
10383c64227l27494M33100P4397k67931K77138O71338n61783l59359P5139L68318
10373A8636k5610n9289L51966n55276K41003K16226l4502k33281J4491l8816k86546
10362c90998j57248M58666N85995m46684p4216K62580k30865k30572j72618J54644
10352b41316M01006K91098j72154l36144L79687k51823N28491J59366j36950q73137
10342b51876r1557J62522J00584L62380l89941Q7105j086j83493j9721J79027
10332d6056O16708l56058m34825J09053J86421J28085J03409k82151k65527j09278
10322c50219N03320L44013k87505m45479r1031l7818J46524J5802N915M91667
$$ y = [-273376, -643095, -217969, -254312, -419211, -327571, -312193, -328407, -204695, 536924, -364227, -691721, -258621, -184224, -452155, -175017, 496321, -65462, -424821, -349682, 18636, -6974, -66263, 285703, -269573, -28570, 187656, 153154, -80127, -65636, -104452, -390998, -548246, -89580, 496415, 49731, -24485, 238095, 7230, -223342, -395960, -241316, 159690, 450788, 278634, -57510, 322177, 70354, 598845, 758211, 621261, -251876, -343433, -180911, -80327, 282053, -107888, -20783, -21869, -205362, -225083, -46056, 570652, 214594, -220231, -111178, 75243, 203328, 306737, 24586, -240941, -350219, 153101, 497114, 209609, -235870, -326901, -364719, -218195, -202393, -196478, 295189]
10312B95189j50664j32393r0942k47933q7293J29944J6190O2689K9016J02418
10302g3779J29319p8978j14850K32973k07896l71188L0793M48756M4635j61900
10292a22115n04061L27649N24601o05988O9164l91198j66889j19470N96351J28274
10282b63682R3463K38776L58359J62025m3148k13626Q2158J90308l47777K88001
10272E44857m9209m05427K73579j2122k06219n7682J42517K32952o71891p4756
10262b83401O20861Q3729k32794O3562K2629j29860J73056M9659o03541q1509
10252c17609J17222J82047k20946J55388N74787j68241j37171K55917O7002n11521
10242c125K52917m09061j23068Q6133k83265L6329O22026N17406O7843j56141
$$ y = [295189, 144525, 12132, -78810, -326743, -414036, -284092, -267902, -205213, -176197, -73779, 55540, -23438, -138288, 94685, -113211, -484399, -453606, -4850, 39785, -122115, -626176, -298527, 226074, -379914, -310750, -701948, -868837, -988307, -391956, -263682, -170219, 68557, 426916, 588941, 545793, 332167, 414325, 604633, 256856, 544857, 495648, 90221, 363800, 351678, 145459, 87777, 230294, 463246, -208645, -283401, 337460, 421189, 188395, 251957, 274586, 144726, 317782, 367441, -236100, -317609, -200387, -18340, -239286, -83898, 490889, 322648, 185477, 441394, 508396, -3125, 249792, -159269, -282337, -196204, -479469, -443140, 178886, 696292, 764135, 607994]
10232F07994n18208L31949l02777J64299N63826p50441J70833L22711J56458K44845
10222I91489m08356m16752K75839l23911m23699l59087O48875M19426k0841k66594
10212A16389M4808K17660m61222o6351N80629N00487j85904J7278l66838k07428
10202A89508j11965m8266m28776K29451m56490K97684l3716O98614L02461l16182
10192C22323r7733k81102N01861j36357K57756M48995n34938l70966j23319K02194
10182A88714n1899Q17904K76097k40924k63241n48730K26296M2118l89336Q5991
10172A42990m49349K78125R96429m98565K59481L49928o83919J98038m67742J76215
10162C01631r1027N00241r2573l80775J71031j50372j54862L99162K09662o47788
$$ y = [607994, 89786, 421735, 118958, 283257, 847083, 96642, 267475, 590186, 746644, 991489, 583133, 166381, 442220, 118309, -305390, -664477, -15602, 403824, 382983, 116389, 161197, 378857, -82365, -148716, 431913, 932400, 746496, 763774, 396936, 189508, 77543, 29277, -399499, -170048, -626538, -328854, -362570, 336044, 638505, 322323, 224590, -56512, 445349, 308992, 566748, 1015743, 480805, 109839, -13480, 188714, 136815, 954719, 1230816, 989892, 726651, 177921, 404217, 446335, 56999, 142990, -306359, -28234, 968195, 469630, 729111, 1079039, 395120, 593158, 125416, 301631, 210604, 710845, 618272, 237497, 408528, 258156, 103294, 502456, 712118, 64330]
10152F4330k10183M51069J09752P2501K6834k16807K17291p4940N25302P6784
10142A041933j45918o45771Q6722M14724k23267J69860j03861k05079p0809J51293
10132D69827l73623j60281K96219k44276J13024P9093n3294J78137J79138m26885
10122E7079J8104Q4663K01070j20811K87469L58931l23976l22728O61272O1233
10112I62306j57229k01175n0248l01991M95457k96846k71798J38403l91520L19812
10102B45171K02847j34599n32784J63041L34117J90755M60343L8669m31594o6562
10092D69404L68331k80800L37514q5039M11033o7017o06286k90282L12068M704
10082E73630N0836l30834k27109R21117L35269k27101K92474k1589r69285j38624
$$ y = [64330, -145853, 305216, 414968, 487469, 514303, 297496, 514787, 439847, 965149, 1041933, 896015, 250244, 336966, 751690, 528423, 698283, 594422, 389343, 318534, 469827, 96204, -64077, 232142, -12134, 100890, 179983, 126689, 304826, 483964, 57079, 75183, 159846, 360916, 240105, 527574, 886505, 562529, 239801, 901073, 962306, 805077, 603902, 553654, 251663, 747120, 450274, 178476, 316879, -74641, 245171, 448018, 313419, -219365, -56324, 277793, 468548, 928891, 967560, 535966, 469404, 837735, 556935, 894449, 809410, 1220443, 1153426, 547140, 256858, 568926, 573630, 624466, 293632, 66523, 987640, 1322909, 1095808, 1388282, 1366693, 397408, 258784]
10072B58784l56510K41790P29065M6868O7180k20542n08547P0164k4405N48915
10062H52762J2557m12505N46656M25527l514l8671J44280p5829k27159m6116l21431
10051H56557P4211j95640J78945J42573j2099l5885l30068K22289l3542M9215
10041I16556n31256n27815L18260o4899j33798N8427O67461j79402M94761j95373
10031H22922k75963P6356M58547j65045n30094j49159q3847q2099P2896O10022
10021G54536K03761J34981m38609k0206O8915J3485n50417p3664K45294N37262
10011H75338n52318q8222N31806k11904o29777K16057K27125M34586M71311j60562
10001A113440n59681P4064r3960M91550L91812n71232l97481K63300Q20886j77963
$$ y = [258784, -97726, 144064, 873129, 919997, 987177, 766635, 258088, 328252, 303847, 852762, 865319, 452814, 999470, 1424997, 1421483, 1382812, 1527092, 1451263, 1224104, 1177988, 856557, 930768, 735128, 914073, 1056646, 1044547, 1008662, 678594, 900883, 867341, 916556, 385300, -142515, 175745, 110846, -22952, 35475, 702936, 523534, 1018295, 822922, 546959, 623315, 1081862, 916817, 386723, 237564, 153717, 71618, 144514, 754536, 958297, 1093278, 654669, 634463, 703378, 716863, 166446, 92782, 338076, 875338, 323020, 234798, 766604, 554700, -75077, 140980, 368105, 802691, 1274002, 1113440, 553759, 627823, 533863, 1025413, 1417225, 845993, 448512, 711812, 1532698, 1354735]
9991A354735p19409k80517L04731l36676J4042J85930L40250M03263j94295l61970
9981G10084J95185m01639O2949O9409J24031J20437M76640r2223p95350j43006
9971C26517K24213M32211J82436l54665j13896o0835l05742J85835O26481k78817
9961H63738o5875l91861j1285K94120L29028M92380j10038m59929Q911J36601
9951A085790J10168o10265k84782N06011J45444J07941o06157n94733O79963M81272
9941A020652J07587L07475l24475k7522n6011n14314q3077K22890O84954K89286
9931A627445m99243l52583M35294j44107l02497J03144j58317K68243j90011l3522
9921G53846l0232r752O43752O2078n73628K78430K06928N0545j32989p0444r2387
$$ y = [1354735, 635326, 354809, 659540, 322864, 336906, 522836, 863086, 1266349, 1072054, 710084, 905269, 503630, 566579, 635988, 760019, 880456, 1357096, 1264873, 469523, 326517, 550730, 982941, 1165377, 810712, 696816, 635981, 330239, 516074, 1142555, 863738, 797863, 406002, 394717, 688837, 1017865, 1510245, 1400207, 940278, 949189, 1085790, 1195958, 585693, 300911, 806922, 952366, 1060307, 454150, -140583, 539380, 1020652, 1128239, 1435714, 1111239, 1083717, 1027706, 513392, 430315, 653205, 1338159, 1627445, 1128202, 775619, 1210913, 1066806, 764309, 867453, 709136, 977379, 787368, 753846, 723614, 713862, 1357614, 1419692, 846064, 1124494, 1331422, 1381967, 1248978, 1178534, 1086147]
9910A086147j0469N29929q9722K4033P6671K14119l24438K89232q6418n69847
9900A139237Q3865r330N29453J82616J3748r4286o22031J21086K68172L96494
9890B009024l23313J68512L46858M20067K95409n29635K61502n16843j06459O83092
9880B708214M28133j73931M68619J89915k66172K45930k66748o96850l81158P32753
9870B988705M59331j20218L60641o22787k84877n10696L4355P63340P24511O8700
9860C861005m0585j228780L65865L77181K55515O63844J31000Q2327M04652k52278
9850D619746j38954P86689L01311K34504K61586L6488M22261O46168j34599P06173
9840G741373L18353J73773J267522P07971N77796m86779j04736p2167J21565J6176
$$ y = [1086147, 1075678, 1605607, 1515885, 1539918, 1616589, 1830708, 1506270, 1795502, 1709084, 1139237, 1223102, 1213772, 1743225, 1925841, 1939589, 1845303, 1223272, 1344358, 1612530, 2009024, 1685711, 1854223, 2201081, 2621148, 2916557, 2386922, 2648424, 2131581, 2025122, 2708214, 3136347, 2962416, 3431035, 3620950, 3354778, 3600708, 3333960, 2637110, 2255952, 2988705, 3448036, 3327818, 3688459, 3065672, 2780795, 2270099, 2304454, 3067794, 3792305, 3861005, 3820420, 2591640, 2957505, 3334686, 3590201, 4254045, 4385045, 4467372, 4872024, 4619746, 4480792, 5267481, 5568792, 5803296, 6064882, 6101370, 6523631, 7169799, 7035200, 7741373, 8059726, 8233499, 9501021, 10208992, 10786788, 10300009, 10195273, 10123106, 10244671, 10260847]
9830A0260847l58868p21840p25437p94597p42714k34614l70696n50765l98372
9821E362944p21555m08548J3737l82428m56393n99488J50950n57447L05484K15100
9811B922356j1178k40237o04083k90166K61205R553L46568k36253o4264O02494
9801B695995l78462J99895L50809r9906J30504l91671L4021k13100J78784j85445
9791B321424m11236O22823o2611m4973n71877l74051N461j46184J022084j79426
9781B181434l96188P35263J85669j05802l5600J06461o70997j94855K06419J24213
9771B136017j38889k88554o7083j09141L77187M8585P98078m84541j04358L0918
9761B198219M37221l44837J86821j59751l17961J44636J70833m19424l87554J84038
$$ y = [10260847, 9901979, 9180139, 8454702, 7660105, 6917391, 6682777, 6312081, 5761316, 5362944, 4641389, 4232841, 4246578, 3864150, 3407757, 2808269, 2959219, 2401772, 2707256, 2922356, 2911178, 2670941, 2066858, 1776692, 2037897, 2047450, 2394018, 2157765, 2093501, 2695995, 2317533, 2517428, 2868237, 2768331, 2898835, 2507164, 2541185, 2328085, 2506869, 2321424, 1910188, 2533011, 2470400, 2425427, 1853550, 1479499, 1484960, 1338776, 2360860, 2181434, 1785246, 2520509, 2706178, 2600376, 2564776, 2671237, 2000240, 1805385, 2011804, 2136017, 1997128, 1708574, 1641491, 1532350, 1909537, 1958122, 2756200, 2271659, 2167301, 2198219, 2635440, 2290603, 2477424, 2317673, 1999712, 2144348, 2315181, 1895757, 1508203, 1692241]
9751A692241j53216O2743K94279K78147o1113N256l13142O0504L51119J68579
9741B385397M0730l335j25887k3043L36979J58651K4511j65165M51797j49956
9731B930679O2684j33408o21121L60661m77801J14389L25363M47537j13684n90786
9721B304513p394P69297k83301k88492J55175k30012J97024k07198n084o6481
9711B338047j58179K38376q2420K23005r6343k4268O6735M2416K56683k47699
9701B556353J29134j3298J1030K56804r9953P72062n8666m65804k6098M68065
9691C529629L23305k65486j60805K40228l12264M64038m18120k86516J93967K75486
9681C583462K08124L22226l10344k66057K24851L65514k35981l49734M63188k93578
$$ y = [1692241, 1539025, 1601768, 1896047, 2174194, 2113081, 2118337, 1805195, 1865699, 2216818, 2385397, 2426127, 2422792, 2296905, 2273862, 2610841, 2769492, 2794003, 2628838, 3080635, 2930679, 2993363, 2859955, 2238834, 2599495, 2121694, 2236083, 2561446, 3008983, 2895299, 2304513, 2297119, 3066416, 2783115, 2494623, 2649798, 2419786, 2616810, 2409612, 2404528, 2338047, 2179868, 2418244, 2335824, 2558829, 2462486, 2438218, 2504953, 2547369, 2804052, 2556353, 2685487, 2672189, 2683219, 2940023, 2840070, 3612132, 3553466, 3087662, 3061564, 3529629, 3852934, 3587448, 3426643, 3666871, 3354607, 3818645, 3400525, 3114009, 3307976, 3583462, 3791586, 4113812, 3803468, 3537411, 3762262, 4127776, 3891795, 3542061, 4005249, 3711671]
9671C711671k37020L18852J6308j37173J07017M2223O07271L98929l72881j16520
9661D338677N46105R8736N93485l34077k29490p3486J12560J5624K69843k08946
9651E129031r2194K13829n7021J02689j03116l4459P15397J37690j74231J72957
9641F010572j27849L74516J03682q2458L53456J89932P6507m1217p47480K32930
9631F342591M71643N09191j39460l40900Q58827l15269l0435M34044q7236p6863
9621G626133J72952N47039L586J71512l5019M38156l89982k70319L74565M59399
9611I098022l1337L15667k46047L01994Q27330L13363j9454K77694M29285l32065
9601A0934452j87527Q70155K16825L00117K99993L77116M46460L49504j4755O70828
$$ y = [3711671, 3474651, 3793503, 3809811, 3672638, 3779655, 3821878, 4429149, 4828078, 4455197, 4338677, 4884782, 4983518, 5577003, 5242926, 5013436, 4939950, 5052510, 5068134, 5337977, 5129031, 5036837, 5250666, 5193645, 5296334, 5193218, 5158759, 5874156, 6011846, 5837615, 6010572, 5882723, 6257239, 6360921, 6278463, 6631919, 6821851, 6898358, 6857141, 6109661, 6342591, 6814234, 7323425, 7183965, 6843065, 7701892, 7386623, 7356188, 7790232, 7702996, 7626133, 7799085, 8346124, 8349710, 8521222, 8486203, 8924359, 8534377, 8264058, 8638623, 9098022, 9066685, 9382352, 9136305, 9438299, 10265629, 10578992, 10559538, 10837232, 11266517, 10934452, 10746925, 11617080, 11833905, 12134022, 12434015, 12811131, 13257591, 13607095, 13592340, 14263168]
9591A4263168L4072O62085O32814o1492Q33372m9015N84580J120171N69912L05438
9581A8895105N84231M8231J372593R05294Q5436P15008R69971M85587J233768
9572B5295224J289631Q54704J095798Q32218J049652J600619J626495J755344
9564C5399685J919681J962552K580675K456407J806008K211462K794274L348343
9556E4479087K579504M059697L199201L168111M190825M301881M989625M816533
9548H5784464L677768L969315M212183M214717L941569L089747L095813K928263
9540A14913839L103215L239710L583234M814760N764242O555491Q071548R845466
9532A59891505J1494086J3734002J5312727J8106008J9607289K0299317J9933574
$$ y = [14263168, 14297240, 14959325, 15592139, 15530647, 16364019, 16315004, 16899584, 18019755, 18589667, 18895105, 19479336, 19527567, 20900160, 21805454, 21890890, 22605898, 23575869, 24061456, 25295224, 26584855, 27439559, 28535357, 29367575, 30417227, 32017846, 33644341, 35399685, 37319366, 39281918, 41862593, 44319000, 46125008, 48336470, 51130744, 54479087, 57058591, 61118288, 64317489, 67485600, 71676425, 75978306, 80967931, 85784464, 89462232, 93431547, 97643730, 101858447, 105800016, 108889763, 111985576, 114913839, 118017054, 121256764, 124839998, 129654758, 135419000, 141974491, 150046039, 159891505, 171385591, 185119593, 200432320, 218538328, 238145617, 258444934, 278378508]
9525B78378508J9200417J7115679J3693858R146518M677776K88188l799704q227774
9517C30473466j1675173j4333132j5246459j5425761j6489523j4858287j3222959
9510B29222172j1425243r594689q093375p375803n248245l510045l292351k009862
9502A78672559o17294J108903K300648M230286O040524P770652J0121615J2815399
9494B22443292J5365189J7585355J8452420J7849696J7372765J4619019J1272298
9487C34960034O905586K605468l553336p445239j2312362j7101826k0038473k2084095
9479B61935757k2493528k2786521k1227074j8990579j7199254j5231030j2651213
9472A31356558j0872394r621353q962687p028898o134867n835171n027429m195702
$$ y = [278378508, 297578925, 314694604, 328388462, 337534980, 342212756, 342500944, 338701240, 330473466, 318798293, 304465161, 289218702, 273792941, 257303418, 242445131, 229222172, 217796929, 208202240, 200108865, 192733062, 187484817, 183974772, 180682421, 178672559, 178055265, 179164168, 181464816, 185695102, 191735626, 199506278, 209627893, 222443292, 237808481, 255393836, 273846256, 291695952, 309068717, 323687736, 334960034, 341865620, 344471088, 340917752, 333472513, 321160151, 304058325, 284019852, 261935757, 239442229, 216655708, 195428634, 176438055, 159238801, 144007771, 131356558, 120484164, 110862811, 101900124, 94871226, 88736359, 82901188, 77873759, 73678057]
9464G3678057l876094l551913l044482l265134k902931k004915k269579k503140
9456E0259869j923811k092157j343880j715812j632264j964640j669634j231280
9448C6686391o89253n20927p68899j007916p00699j096570r02196j190256j114673
9439B8695002j006998j54857j032798o42023n51408j85012K64514j15699o60696
9430B4610025m09190l60076r01159j131096j304601m83398n97808j228927m95442
9421A7698328J03609K55488n75128q58807o24999q11720p28668o80935j69704
9412A3607464l91551k32345j05606Q557o44484k40261l83083J99032J60781o89774
9402A1288730l43579k03117J8867j05208p920Q0449k70876n56838J08146k37183
$$ y = [73678057, 69801963, 66250050, 63205568, 59940434, 57037503, 55032588, 52763009, 50259869, 48336058, 46243901, 44900021, 43184209, 41551945, 39587305, 37917671, 36686391, 35997138, 35476211, 34707312, 33699396, 32998697, 31902127, 30999931, 29809675, 28695002, 27688004, 27533147, 26500349, 25858326, 25306918, 25121906, 25386420, 25270721, 24610025, 24200835, 23840759, 22939600, 21808504, 20503903, 20020505, 19422697, 18193770, 17698328, 17801937, 18057425, 17482297, 16623490, 15998491, 15186771, 14458103, 13777168, 13607464, 13215913, 12983568, 12877962, 12886519, 12242035, 12001774, 11618691, 11817723, 11978504, 11288730, 10945151, 10742034, 10760901, 10655693, 10647773, 10728222, 10457346, 9900508, 10008654, 9771471]
9392I771471k29594m91145l69878R2217m20365K65481o80806L17937N7791k11613
9382H101496k70969N2110m1886l10495j44215M39447K02607J71611j51740p84436
9372G263530m081J76111p9450k96939L23739J73655K82309j55516k4754n06900
9362G151704L543K95962m85692l60880k86290M09376O1955Q909n46163j31318
9352F121106M10358O61377L73674j2756p06761P49039O16029o19389k46560j5005
9342G331112Q1906O00048k32874K13227n25825l22150K1332j18456M00137O6078
9332G514535k73179p89008n7906o4183j65868j20866l06945Q9337M7959k98331
9322E575545j06579N02305J09885j16302P1576J85252l750k63595N18191N0104
$$ y = [9771471, 9541877, 9050732, 8680854, 8773071, 8352706, 8618187, 7937381, 8255318, 8313109, 8101496, 7830527, 7882637, 7840751, 7530256, 7386041, 7825488, 8028095, 8199706, 8047966, 7263530, 7259449, 7435560, 7356110, 7059171, 7382910, 7556565, 7838874, 7683358, 7658604, 7151704, 7155247, 7451209, 6965517, 6604637, 6318347, 6727723, 6789678, 6798587, 6252424, 6121106, 6531464, 7192841, 7566515, 7553759, 6846998, 7596037, 8212066, 7592677, 7346117, 7331112, 7413018, 8013066, 7780192, 7993419, 7467594, 7145444, 7166776, 7048320, 7448457, 7514535, 7241356, 6452348, 6394442, 6330259, 6164391, 6043525, 5736580, 5825917, 5873876, 5575545, 5468966, 5971271, 6081156, 5964854, 6036430, 6221682, 6217932, 5954337, 6472528, 6522632]
9312F522632m19765N2055R8794K77637j54605K50715j91508r0945M56291j97831
9302F603470K89683j10545l12963p9008Q1056J42460M69223j5194m8327k78645
9292F741210N06565K23586o07345l5820j71531J8864j19921m95911L1271K6061
9282F117029j9534L677M13198m43273J2793L62234L70252l4110L30248L553k51775
9271F864292K24239l05320L30185k61665j64827L13984N62073l13539n67568k26962
9261F454892l1548N08964M83763J42962K41940j23451m10636J4298k5864P27183
9251G982503k33978j00836J39150o7261l87152q3481l43112N03875J26544M8489
9241G584741L43121n75326N1817O13017j89364N8212k51070J93280m1643m95499
$$ y = [6522632, 6102867, 6154922, 6253716, 6531353, 6376748, 6627463, 6435955, 6345010, 6801301, 6603470, 6893153, 6782608, 6469645, 6390637, 6471693, 6614153, 7083376, 7068182, 7019855, 6741210, 7247775, 7471361, 6864016, 6828196, 6656665, 6675529, 6555608, 6059697, 6090968, 6117029, 6097495, 6101172, 6514370, 6071097, 6083890, 6446124, 6816376, 6782266, 7112514, 7116067, 6864292, 7088531, 6783211, 7113396, 6851731, 6686904, 7000888, 7562961, 7249422, 6681854, 6454892, 6423344, 6932308, 7416071, 7559033, 7800973, 7677522, 7266886, 7281184, 7255320, 7982503, 7748525, 7647689, 7786839, 7719578, 7332426, 7248945, 6905833, 7409708, 7536252, 7584741, 7927862, 7352536, 7404353, 8017370, 7828006, 7886218, 7635148, 7828428, 7786785, 7291286]
9231G291286j9737m13865M52533m41578K56157L38807k75765K19740N34718j92918
9221G749378k06519N19361m17703l43502j56393q6351k95526l10746k83675L51052
9211F519376L49210l87984l63013k20052n555K76905J16492m52436l4510k71753
9201E526680L42096j71885j63003R4113j10327j15338p4713M46142K21920n6732
9191E938953L9439n18742r8674O64268L46599K74211n10055k4227L56582M2557
9181F510911K04197j04665p51692K29286J27872M27398M16564k68873J68813k2499
9171F937312L47752K16829N3694l8142j79186P3616k0677J1918N56529L02716
9161H262361M0421m75952J8441L08421j20504J57565N6458J09134K02814L07708
$$ y = [7291286, 7271549, 6857684, 7310217, 6868639, 7124796, 7463603, 7187838, 7407578, 7942296, 7749378, 7542859, 8062220, 7644517, 7301015, 7144622, 7058271, 6762745, 6451999, 6168324, 6519376, 6868586, 6480602, 6117589, 5897537, 5891982, 6168887, 6285379, 5832943, 5798433, 5526680, 5868776, 5696891, 5533888, 5628001, 5517674, 5402336, 5327623, 5773765, 5995685, 5938953, 5978392, 5459650, 5360976, 6025244, 6371843, 6646054, 6135999, 6111772, 6468354, 6510911, 6715108, 6610443, 5858751, 6088037, 6215909, 6643307, 7059871, 6790998, 6959811, 6937312, 7285064, 7501893, 7555587, 7517445, 7338259, 7411875, 7391198, 7403116, 7959645, 8262361, 8302782, 7826830, 7845271, 8153692, 8033188, 8190753, 8247211, 8356345, 8559159, 8866867]
9151H866867l51032p18404o9185K43720L51585l31114k0739J03717K63994j29864
9141H209545m8485j14382K63741K83654m5494j73801N33866k33748j21173j44981
9131H408742M75084J094143r2197M43751M62952k38278N63848K47754n10284m57093
9121A0398422K92296M53220j30684o96169K23107M5604M3464K60071n4238K66131
9111A1101224O69713k4231j24880K58164l59055J45653J79981k22015k48639O68182
9101A2044097l27812K16947O26358M7028k57015j67034j59739M49405p7516Q6832
9091A2481551l07147M17732L31451O04518K33799K63372k23561m3362J014994
9082A4773347J89981M15379J7582q2383J48206M58068M4471J14202M8857L4935
$$ y = [8866867, 8515835, 7797431, 7728246, 7971966, 8323551, 7992437, 7971698, 8075415, 8339409, 8209545, 8161060, 8046678, 8310419, 8594073, 8548579, 8374778, 8908644, 8674896, 8553723, 8408742, 8883826, 9977969, 9885772, 10329523, 10792475, 10554197, 11118045, 11365799, 10855515, 10398422, 10690718, 11143938, 11013254, 10317085, 10540192, 10585796, 10629260, 10889331, 10835093, 11101224, 11770937, 11746706, 11621826, 11879990, 11520935, 11666588, 11846569, 11624554, 11375915, 12044097, 11716285, 11933232, 12559590, 12606618, 12349603, 12182569, 12022830, 12472235, 12394719, 12481551, 12174404, 12592136, 12923587, 13528105, 13761904, 14025276, 13801715, 13758353, 14773347, 14963328, 15378707, 15396289, 15313906, 15462112, 15920180, 15964651, 16078853, 16127710, 16162645]
9072A6162645j46874O56607O15173N67782M653j18171L92344N56726M48059K62808
9062A9401752L98707M93546Q5K12251K67722r8756N57191M94872L49607O37808
9052B2714785M50783q695M05425N16639L08690M76915K05965J273997Q45137M25636
9042B7615277P67473K12613P49072R00510J012491O08708J080728J105444P38284
9033C4790600J015152J534246N21990J572632J541174O80247J325004J330805
9025D4311850J456448K036218J889653J836192K066280K165820J890430K504478
9017F0157369K109480K530343K652166K775947K946151L140833L646951L942044
9009H3901284M134591M669406N857764N771758O066168P173164Q032459Q152647
$$ y = [16162645, 16015771, 16672378, 17287551, 17855333, 17859986, 17741815, 18134159, 18690885, 19138944, 19401752, 19800459, 20294005, 20294090, 20506341, 20774063, 20675307, 21232498, 21727370, 22076977, 22714785, 23165568, 23156873, 23562298, 24078937, 24387627, 24864542, 25070507, 26344504, 27189641, 27615277, 28382750, 28595363, 29344435, 30244945, 31257436, 31866144, 32946872, 34052316, 34790600, 35805752, 37339998, 37861988, 39434620, 40975794, 41656041, 42981045, 44311850, 45768298, 47804516, 49694169, 51530361, 53596641, 55762461, 57652891, 60157369, 62266849, 64797192, 67449358, 70225305, 73171456, 76312289, 79959240, 83901284, 88035875, 92705281, 98563045, 104334803, 110400971, 117574135, 125606594, 133759241]
9001A33759241P084164O482138N175184M498739M552712L584080K978880K949666
8993A71064804M180524N591008P528845R783778J1888568J2098587J2614676J2569901
8985B47320691J1662375J1046519R339498P130740M882482J584598j786013n236372
8977B85944518o893500r712258j1218747j2002911j0774219r416937p254568o336940
8969B12334438l999631j543247O30127K011528L151654M708196N740539P992566
8961B31026170R019509J0731299J3141982J4905064J6508313J9030023K1920807
8954C36283167K5988502K9488856L2095673L2373821K8639292K3671997K0415129
8947E28956437J6392726J0330248M616059j49652o228186j1465221j5186121j7454071
$$ y = [133759241, 140843405, 147325543, 152500727, 156999466, 161552178, 165136258, 168115138, 171064804, 175245328, 180836336, 188365181, 198148959, 210037527, 222136114, 234750790, 247320691, 258983066, 270029585, 279369083, 286499823, 291382305, 292966903, 291180890, 285944518, 279051018, 269338760, 258120013, 246117102, 235342883, 225925946, 218671378, 212334438, 208334807, 206791560, 207421687, 209433215, 212584869, 217293065, 223033604, 231026170, 240045679, 250776978, 263918960, 278824024, 295332337, 314362360, 336283167, 362271669, 391760525, 423856198, 456230019, 484869311, 508541308, 528956437, 545349163, 555679411, 560295470, 560145818, 553917632, 542452411, 527266290, 509812219]
8939E09812219k2248145k3294879k1207843j7088080j1702059n216165n66896
8932D08488152K518667M062597J664584j360562l437818m343528m762677p197296
8924C95632119j2665232j7339473k1774623k2606039k1439428j9992975j6864888
8917B62949461j4184916j1339403q511621o373179m089633k666506p36773J259463
8909B16306893K993443M877028P560315R532070J2306073J5359724J8118240J9476823
8901C06530609J8957211J5227655Q892303L097986P70878j222457l922427q983767
8893C39347991j6707891k1278108k1908590k1328068j9527422j7774027j6584872
8886B04239013j5459769j3668068j1571445j0281336q109626p294221n941736
$$ y = [509812219, 487564074, 464269195, 443061352, 425973272, 414271213, 409055048, 408488152, 411006819, 415069416, 416734000, 415373438, 411935620, 407592092, 402829415, 395632119, 382966887, 365627414, 343852791, 321246752, 299807324, 279814349, 262949461, 248764545, 237425142, 228913521, 222540342, 218450709, 215784203, 215047430, 216306893, 219300336, 224177364, 231737679, 241269749, 253575822, 268935546, 287053786, 306530609, 325487820, 340715475, 349607778, 352705764, 353476642, 352254185, 348331758, 339347991, 322640100, 301361992, 279453402, 258125334, 238597912, 220823885, 204239013, 188779244, 175111176, 163539731, 153258395, 145148769, 137854548, 131912812]
8879A31912812n141077l673058l299545k795949j962150j055927o76745J092429
8871A14400790J669234J993199L434746L827433O028135O597529O650572N797718
8863A50399356M293031J417381o22862j949790k583637l685949n718022q358136
8855A33191372j0588729r456051r028338q155709p142850o492165n432596m716175
8847G2178759l700371l131718l039556k710840k256617j439477j683678j667591
8839E2548911j371020j423897j086963q17890q80223j163863j110694p59320p06173
8830D3228868p90078n94751k92074o6988k46918M13246N38043N97734l0020M67255
8820D3224317J223336R78186R24167J431324Q40145P97008p1566p15727q03362
$$ y = [131912812, 126771735, 123098677, 119799132, 117003183, 115041033, 113985106, 113308361, 114400790, 116070024, 118063223, 121497969, 125325402, 131353537, 137951066, 144601638, 150399356, 154692387, 156109768, 155486906, 153537116, 150953479, 147267530, 141549508, 133191372, 122602643, 113146592, 104118254, 95962545, 88819695, 82327530, 76894934, 72178759, 68478388, 65346670, 62307114, 59596274, 57339657, 55900180, 54216502, 52548911, 51177891, 49753994, 48667031, 47849141, 46968918, 45805055, 44694361, 43935041, 43228868, 42438790, 41844039, 41551965, 41484977, 41238059, 41651305, 42189348, 42787082, 42757062, 43224317, 44447653, 45425839, 46350006, 47781330, 48621475, 49418483, 49346917, 48631190, 47827828]
8811D7827828p1162m85713p19580o4186O6067M20332M74402J668147J235958J144505
8801E1496598J022196R99931R77182J450869K25534K66088K48083m09975r02513
8792E5373993j046576m07283K17412Q47291P96130J210670J714103J894259J890518
8783F2490517K799060K953798K572691J972660J592579J389305Q08405L54633
8775G6933648M58677P07095J402855J499672J551748K411080L064889L591434
8767I1621098L561969M318230M595208M950891N563217O378354N883744P562744
8759A34435455P714100R064714J0781061J2584370J4323743J4874397J5031753
8752B18809593J1873100O269266K037043J35615l32007J212470L29512k112031
$$ y = [47827828, 47756666, 47270953, 46551373, 46487187, 46553254, 46973586, 47447988, 49116135, 50352093, 51496598, 52518794, 53518725, 54495907, 55946776, 56172310, 56438398, 56686481, 56276506, 55373993, 54327417, 53920134, 54137546, 54984837, 55780967, 56991637, 58705740, 60599999, 62490517, 65289577, 68243375, 70816066, 72788726, 74381305, 75770610, 76579015, 76933648, 77392325, 78099420, 79502275, 81001947, 82553695, 84964775, 88029664, 91621098, 95183067, 99501297, 104096505, 109047396, 114610613, 120988967, 126872711, 134435455, 142149555, 151214269, 161995330, 174579700, 188903443, 203777840, 218809593, 230682693, 236951959, 238989002, 239124617, 238792610, 240005080, 240334592, 238222561]
8744B38222561p111215j2110973j3764493j3143995j1355452r397213p352304
8737A63986916n785190l883757k610765j120710J059742K399925L383814M328033
8729A61758008N312087O859459R119892J1515152J4191378J5738631J6712179
8722B41206786J6922532J5707107J3422626J2400834J0961610R488018M172361
8715C24281874j417119o023215r549168j1129215j2583297j3418889j7026156
8708B53134815j9986984j9944343j8151905j5882301j4044415j1589479r738204
8701A43797184q630894n897840m765379l846948k392441j228031l19457R54552
8693A17670746J720095K424855L998027N308865O887277P340632O952638M799672
$$ y = [238222561, 231111346, 219000373, 205235880, 192091885, 180736433, 171339220, 163986916, 158201726, 154317969, 151707204, 150586494, 151646236, 154046161, 157429975, 161758008, 167070095, 173929554, 183049446, 194564598, 208755976, 224494607, 241206786, 258129318, 273836425, 287259051, 299659885, 310621495, 320109513, 324281874, 322864755, 316841540, 307292372, 296163157, 283579860, 270160971, 253134815, 233147831, 213203488, 195051583, 179169282, 165124867, 153535388, 143797184, 135166290, 129268450, 124503071, 120656123, 118263682, 117035651, 116716194, 117670746, 119390841, 121815696, 125813723, 131122588, 138009865, 145350497, 152303135, 157102807]
8685A57102807J212294j188444k306819l004177k240330k842784n467130q859258
8677A32406159j1138763j1959857j0307065r331954q205844p434994o399559n589595
8669F2038528m587241l722711l852857k708797k098720k606136k553229k035208
8661C7873629j917657j911264j261452j336546j245055j100236j478114r90884
8653B6632421o83696n93072j226025j008248o94397p58081m14576j094818n43205
8644A9616303n07527q55432m72970J99193m71766q25096k99917o77227n64848
8635A5140713k97579J36037j4116m0909n77278m62593m73656l61672l24507J45362
8625A2869802n23960K80324n08j52064m92314p8708K59737l98034J06791K47230
$$ y = [157102807, 158315101, 157126657, 154819838, 151815661, 149575331, 146732547, 141265417, 132406159, 121267396, 109307539, 99000474, 89668520, 81462676, 74027682, 67628123, 62038528, 57451287, 53728576, 49875719, 47166922, 45068202, 42462066, 39908837, 37873629, 35955972, 34044708, 32783256, 31446710, 30201655, 29101419, 27623305, 26632421, 25948725, 25355653, 24129628, 23121380, 22426983, 21668902, 21254326, 20159508, 19616303, 19108776, 18253344, 17780374, 17979567, 17507801, 16682705, 16382788, 15705561, 15140713, 14843134, 14979171, 14965055, 14924146, 14346868, 13884275, 13410619, 13048947, 12724440, 12869802, 12345842, 12626166, 12625658, 12473594, 11981280, 11902572, 12162309, 11764275, 11871066, 12118296]
8615A2118296m78266k80655M66391K150l53657m93020o27714l16002k64116k95645
8605I477762Q39107m28892j84314l49367n96022m61188j09829J49538K815k61033
8595H078577m56912J27597l68938k3087K79052P2367m48603k85990K8248M13357
8585G415668j55233K21977l04410l72490K96063K87391k06355N87117k17452J05105
8575G657381O16614l89965n61635Q3942K48571k34031o3342l54678l70425K88584
8565F921016m32673k40202N8289m31784O4244n48150R1451l34847m76692O9277
8555D739929k0517L70341M08904N9921k35656j28882j00885m92234j51209j67186
8545D282526O42930J0856K25928M33592J65917j03424o96505J90690K20581m27306
$$ y = [12118296, 11640030, 11359375, 11825766, 11827916, 11474259, 10981239, 10353525, 10037523, 9773407, 9477762, 10316869, 9887977, 9703663, 9354296, 8758274, 8297086, 8187257, 8336795, 8339610, 8078577, 7621665, 7749262, 7380324, 7357237, 7636289, 7708656, 7260053, 6974063, 7002311, 7415668, 7260435, 7482412, 7178002, 6805512, 7101575, 7388966, 7182611, 7769728, 7552276, 7657381, 8273995, 7884030, 7322395, 7406337, 7654908, 7420877, 7357535, 7002857, 6632432, 6921016, 6488343, 6248141, 6306430, 5874646, 5938890, 5390740, 5482191, 5147344, 4670652, 4739929, 4719412, 5089753, 5498657, 5558578, 5322922, 5194040, 5093155, 4600921, 4449712, 4282526, 4925456, 4936312, 5162240, 5595832, 5761749, 5658325, 4961820, 5152510, 5373091, 4945785]
8535D945785k04513J17211J85559K77715N1554m04315j42946m26852n88525l27547
8525C483126M80504J40862l00547L71540l84405o22826K89881K95253j2489J8333
8515C759232J17790l37830m99088J18615J80838M28798J50711k527j39221o71996
8505C105322j21272M44319j55364m27680J03348M22733K55696O1026p76915n41222
8495B369991L05718p9032K1600J23081o9541K37269J92931l04097o75664R8055
8485B220311j49872P6278j3972M3314r9137o11809K56936O4340M5046L6192K13571
8474B081198P2479l14591o543l06454j19801N19190l11807k92074L94454l9732
8464A676319l8996O00000L44976o3243m93658L32586l61199n84941m8580l43416
$$ y = [4945785, 4741272, 4858483, 5044042, 5321757, 5373311, 4968996, 4826050, 4399198, 3810673, 3483126, 3963630, 4104492, 3803945, 4175485, 3791080, 3168254, 3458135, 3753388, 3740899, 3759232, 3877022, 3539192, 3040104, 3158719, 3339557, 3768355, 3919066, 3916539, 3777318, 3105322, 2984050, 3428369, 3273005, 2845325, 2948673, 3371406, 3627102, 3688128, 2911213, 2369991, 2675709, 2596677, 2618277, 2741358, 2671817, 2909086, 3102017, 2797920, 2122256, 2220311, 2070439, 2146717, 2132745, 2176059, 2076922, 1465113, 1722049, 1786389, 1831435, 1867627, 2081198, 2153677, 1839086, 1832543, 1526089, 1406288, 1925478, 1613671, 1321597, 1716051, 1676319, 1637323, 2237323, 2582299, 2519056, 2025398, 2357984, 1996785, 1411844, 1363264, 1019848]
8454A019848K68781M19424l7384L08611L21994N4385o79823m28671k15529k99530
8444G32106P64028M0176k77159m7026K56191J8241L18561M93705p23654k21820
8434A353349K26142N07014m4918o1745j88792j44817K81718n76713J20644j03682
8424A368200o04481N97352n6828J48899J10251l22937M2341K17686m1493l59528
8414A099462p5361P0446K52648J11882n5342l1788l69887K87171M70267L07824
8404B067322k41722m40141J07215J25095K37404k42867J1678l71389R7575j62062
8394A188108J183001j34355l47798K54231Q1628M10302m58187m86211M85322R5675
8384B271716q6015k50452j42275n7188M44132j81269p37381j2636K01939K34615
$$ y = [1019848, 1288629, 1708053, 1670669, 1979280, 2301274, 2355659, 1675836, 1247165, 1031636, 732106, 1496134, 1536310, 1259151, 1212125, 1468316, 1486557, 1805118, 2298823, 1575169, 1353349, 1579491, 2086505, 2041587, 1979842, 1791050, 1646233, 1927951, 1351238, 1471882, 1368200, 763719, 1361071, 1304243, 1453142, 1563393, 1240456, 1282797, 1500483, 1458990, 1099462, 1024101, 1094547, 1347195, 1459077, 1403735, 1371947, 1002060, 1289231, 1759498, 2067322, 1825600, 1385459, 1492674, 1617769, 1855173, 1612306, 1623984, 1252595, 1350170, 1188108, 2371109, 2236754, 1888956, 2143187, 2224815, 2635117, 2176930, 1690719, 2176041, 2271716, 2185701, 1935249, 1792974, 1735786, 2179918, 1998649, 1261268, 1248632, 1450571, 1685186]
8374A685186j49650O51463K74641m08749j9450M71510k18884m85660l83419M53127
8364A870115k67260M39314M90783M13263J13396q5728Q6914l94824k11507m15029
8354B039437M38529J06452l42178j3801l01069K3771j6011J42485k44857j08183
8344A724575L59586m08284n18989M3961M5851k8921L75825k27236k83569j55829
8334I26970K52855K38172K94715n00469j53214m2662N83130K32734k10113o00598
8324A021520K00424K86066J23952L28223j48698j097n44742j17028o7583J17301
8314A198338j82064o20424L14428J15430N554M5037k0848j02384k6202j14967
8304F11898m75238L62571J71015j07959q7000K12252K23479P9540l71067Q3809
$$ y = [1685186, 1535536, 2186999, 2461640, 2052891, 2033441, 2504951, 2286067, 1800407, 1416988, 1870115, 1602855, 2042169, 2532952, 2946215, 3059611, 2973883, 3060797, 2665973, 2454466, 2039437, 2477966, 2584418, 2242240, 2228439, 1927370, 1951141, 1935130, 2077615, 1832758, 1724575, 2084161, 1675877, 1156888, 1200849, 1246700, 1217779, 1593604, 1366368, 1082799, 926970, 1179825, 1417997, 1712712, 1212243, 1059029, 1016367, 1599497, 1832231, 1622118, 1021520, 1221944, 1508010, 1631962, 1960185, 1811487, 1810390, 1265648, 1148620, 1081037, 1198338, 1016274, 395850, 710278, 825708, 831262, 876299, 855451, 753067, 726865, 611898, 136660, 499231, 670246, 562287, 475287, 687539, 911018, 990558, 619491, 703300]
8294G03300q0876M46146m9767l49981j38451K65158n94567K25583L6667m85676
8284b2464m7127O87193l11078j7996j04869K22432O1885j44602L12355L4205K74245
8273I44179k79242K52066j57847L50558k79221k28071l74131l83085l74921L90689
8263a39026q7922L79355K58150J41413P8388k69201j78880J47106L07220J32244
8253G68847p4941m21647k46598k4185o3844K61643j28527k6663L33901m08303
8243c0317K98450n99791j22747K42082N55523j04924j14458J61474p8941m6774
8233A59577j873n20364k48380M60321N7662R4993k438l9340m7157N07005K1765
8222D41771k75143K3974J5585K18956J14489n00260M37218q3994K83720J98502
$$ y = [703300, 622424, 1068570, 1018803, 668822, 530371, 795529, 200962, 426545, 463212, -22464, -69591, 617602, 306524, 288528, 183659, 406091, 467976, 323374, 635729, 669934, 944179, 664937, 917003, 759156, 1109714, 830493, 602422, 228291, -154794, -529715, -139026, -226948, 152407, 410557, 551970, 630358, 361157, 182277, 329383, 636603, 768847, 693906, 272259, 25661, 1476, -62368, 199275, 70748, 44085, 377986, -30317, 268133, -331658, -454405, -212323, 343200, 238276, 123818, 285292, 206351, 159577, 157704, -362660, -611040, -150719, -93057, 1936, -502, -39842, -86999, 420006, 441771, 166628, 190602, 206187, 425143, 539632, 39372, 476590, 392596, 676316, 874818]
8212H74818P0261j2595n1065k51989o26635O65676n7964n0638m8433k79425j11133
8201A20878N90004n16092k45105K97833k09042L99266O83089k82022N71556j477316
8191f6951j499424J029063K14395L37310q0837L720R9847M05859l62544j69943
8181h9505k97059L58069K11068j84243j76213m65005k39252N61648r6941o05847
8171a023280P1696N22662O22567n58653j64833J24937m2415K7835L98717J7770
8161b997k44410L85944p16700m60575M63632J46119J53761M502K08471L02198
8151B39945l74370J94110m78685K43661J23000l36957N25946R2119J02823j04366
8141B27226K46602J5991m28912J559J9182k2444K19955n6801Q9444P1855n602
$$ y = [874818, 945079, 932484, 881419, 629430, 2795, 668471, 610507, 559869, 511436, 232011, 120878, 710882, 194790, -50315, 247518, 38476, 437742, 1120831, 838809, 1410365, -66951, -1566375, -537312, -322917, 14393, -66444, -62724, 37123, 442982, 80438, -89505, -386564, -28495, 182573, -1670, -177883, -642888, -882140, -320492, -417433, -1023280, -951584, -428922, 193645, -365008, -529841, -404904, -447319, -419484, -20767, -2997, -247407, 138537, -578163, -1038738, -575106, -428987, -275226, -270724, -62253, 239945, -134425, 59685, -419000, -175339, -52339, -389296, 136650, 228769, 331592, 227226, 473828, 489819, 60907, 62466, 81648, 59204, 279159, 222358, 311802, 383657, 378055]
8130C78055m49097l11354m3561M6486J05178N88568m11013k28918L27890K06284
8120B08518k16960r4634K45073l14459q7184L30208o52451O6004N21724n66547
8110e60708K56607j52059K88298P3018k04587j78006L15530J30502q7068J83618
8100F5145J22943k53007l034o7105O0326J22825j74514l85544l18029L87034n48278
8089i91238K6034L34140K33058O36491k00452l09266J47259M68863l97010J7275
8079c4846K25824o52250M37842J68009o04913N03415o7170O0025k4659k36680
8069b25403N04015L9456Q2513k37647k79056J07220m56365j40950J32055o3390
8059e37552k25128K24756J86807O1963j2051j27801l16787K44630K0242P6899
$$ y = [378055, -71042, -382396, -425957, -379471, -274293, 314275, -96738, -325656, 2234, 208518, -8442, -103076, 141997, -172462, -259646, 70562, -581889, -515885, 5839, -560708, -304101, -456160, -167862, -94844, -299431, -477437, -161907, -31405, -118473, 65145, 188088, -64919, -67953, -135058, -74732, 48093, -126421, -511965, -829994, -442960, -991238, -965204, -631064, -398006, 238485, 38033, -271233, -123974, 344889, -52121, -34846, 190978, -461272, -23430, 144579, -460334, 43081, -24089, 35936, 11277, -225403, 278612, 318068, 400581, 162934, -116122, -8902, -465267, -606217, -474162, -537552, -762680, -537924, -351117, -289154, -301205, -429006, -745793, -501163, -480921, -404022]
8049d04022M91428k66308K16049n51156Q7777p7192K19560K9453K33471o4050
8039h4990L17875j34951p201l85335j11194N52124j17570L93913r9390J23146
8029D46427j77053l58569k69198k11763L17681K30174k06416o73402Q1668N89084
8019b31367k45398J6924J39761m28579M82237N19528k95884m3939M1838j31819
8009a76698j49797J23109J65083o9316n67271J25743L37496j49460J63488j77100
7999c74723k99442L17639k10696J07709K53347P0824K57531m83492J54852L9213
7989a67238j11295J25347J46237o414O2796K80806J36384k06199O4245J4348l65455
7978b6438N4163n4777k63615j44277N4432l57325R6427N60163j92418k24813k4480
$$ y = [-404022, 87406, -178902, 37147, -514009, -426232, -503424, -283864, -254411, -20940, -84990, 232885, 97934, 90733, -294602, -405796, 146328, 28758, 422671, 323281, 446427, 269374, -89195, -358393, -570156, -252475, -22301, -228717, -902119, -820451, -231367, -476765, -459841, -320080, -748659, -266422, 253106, -42778, -86717, -44879, -176698, -326495, -203386, -38303, -107619, -674890, -549147, -211651, -361111, -197623, -374723, -674165, -356526, -567222, -459513, -206166, -135342, 122189, -361303, -206451, -167238, -278533, -153186, -6949, -13363, 49433, 330239, 466623, 260424, 324669, 339017, -26438, 27725, -27052, -290667, -434944, -380512, -737837, -641410, -81247, -273665, -498478, -522958]
7967e22958L23997N5468Q4388j60079P6634M38750k10187R1931l96090K78929
7957F0783J35042m46631J31980L96671l63978l15193J134413j82747j35136R6258
7947E11462p24223N9718o1266j2157R3075n8909J16973j7522j6957J04600p8768
7936h3974J27732r7039O6521m80132j85372K8618J46220p0213L55558P1802j57634
7925b77913n750M2133K22291M82548J30321n15207N6794J42370o16560j27058
7915d66031K1871L10712J56232M49595l78651k82344J31487J35390N57167l23442
7905C11986n41423O0040M1130j16672J83203K62060m34342R8443k51657l46227
7895g33459J64991J97525K19100J41165o6944m96719M134J14318M63738J15556
$$ y = [-522958, -198961, -143493, -59105, -219184, -142550, 296200, 86013, 177944, -218146, 60783, 195825, -250806, -118826, 277845, -86133, -401326, 733087, 550340, 415204, 511462, -212761, -153043, -214309, -226466, -133391, -192300, -75327, -92849, -109806, -5206, -83974, 43758, -53281, 13240, -466892, -652264, -623646, -477426, -547639, -192081, -120279, -277913, -283663, -241530, -19239, 463309, 593630, 78423, 135217, 277587, -338973, -466031, -444160, -133448, 22784, 472379, 93728, -188616, -57129, 78261, 635428, 311986, -229437, -169397, -128267, -244939, -61736, 200324, -234018, -135575, -387232, -733459, -568468, -370943, -151843, -10678, -77622, -574341, -570207, -455889, 7849, 123405]
7885A23405K55220k97427l91374p7965k0184L78389M76064j77261k34055K21735
7875B56547L56715n44381m21839J47767n7693J84135j94733J92964K82523m82624
7865b80619O10623n80141J97165M99990o4294m50988l08963K56750J6261K34401
7855A30185m86722j74401j31073J63979K03546r0885L02451n69030J80523K16740
7845b54687j71106J18690j52514R4513k47608J12387J71079K63691K51753l04302
7835a18104j00957n0556m7271J60100R20o89164k0756J04084K10240M06049l8541
7824a83956j6034R4369j012138l2178Q01860K37614j2682k72539J81474J64190
7814e0020l08153l56611Q7881M97344m4119O4000j55816m63636j4133R5004k5818
$$ y = [123405, 378625, 81198, -310176, -388141, -408325, -29936, 446128, 268867, 34812, 256547, 613262, 68881, -352958, -205191, -262884, -78749, -273482, -80518, 202005, -280619, 330004, -250137, -52972, 447018, 382724, -68264, -377227, -120477, -104216, 130185, -356537, -530938, -662011, -498032, -294486, -385371, -82920, -651950, -471427, -254687, -425793, -307103, -459617, -365104, -612712, -500325, -329246, -65555, 186198, -118104, -219061, -269617, -316888, -156788, -155868, -845032, -865788, -761704, -551464, -145415, -183956, -199990, -105621, -1117759, -1149937, -348077, -110463, -123145, -395684, -214210, -50020, -358173, -714784, -626903, -129559, -173678, -109678, -265494, -729130, -743263, -648259, -674077]
7803f74077O0294n64585k87771Q10384j03955l7954L82442K87229M86589j75179
7793A83417m44543K33194K77795l38925O1799o0505J18086k08633k93085K57158
7783b14242J53656l40767p5784K21002K54472l56163l79382N28696K33705R8530
7773A23723m82799N64272j93971k32017j29815l12561K73186J12316L07691j50628
7763a20603j8303K72085k10660r878L37421j20036j07376j9092O9569m45166j1582
7752c83621J91389j21492k7204n58208K95451K8227l2746n8486M52555m51386
7742f65521k42856O30762M26486J47478m59087k03850K44943J40371K06057n77236
7732c52453L2159k64004M44710p1051k69132O12011M16133o75053j12691m6842
$$ y = [-674077, -613783, -1178368, -1466139, -655755, -759710, -797664, -415222, -127993, 358596, 183417, -261126, -27932, 249863, -89062, -27263, -87768, 30318, -178315, -471400, -214242, -60586, -401353, -477137, -256135, -1663, -357826, -737208, -208512, 25193, 123723, -359076, 205196, 11225, -220792, -350607, -663168, -389982, -277666, 30025, -120603, -138906, 133179, -77481, -87359, 250062, 130026, 22650, 3558, 73127, -372039, -383621, -192232, -313724, -340928, -899136, -603685, -575458, -608204, -666690, -214135, -665521, -908377, -277615, 148871, 296349, -162738, -366588, -121645, 18726, 224783, -352453, -320294, -584298, -139588, -210639, -479771, 132240, 548373, -126680, -239371, -286213]
7722b86213n7130L43427J19157Q9755N254n48006K01106p6661j60590l06986Q14619
7711A37732M31240m95040J83198K8610l08223m47308O02355m42237j55520J49861
7701c15332r151J42922K31736j84109J15376j34181Q5518K59280N0710n18692
7691b75923Q5466L38712l48447l40623M86820P4677o265l47565R4903J33255M76833
7680C71843k5571k22051j80097l87018j19533P9823J25027J42565j77201m3562
7670d35775P920K66644J396j36950n2816j558p6185K20515R1384K9801P7856O9027
7658F1259K19771q7599l21937M49661o91978j3188M63206K79287m83671o4672
7648a89861o3651l88787K05394L22689k07186j25723M25778k38449j62805L79795
$$ y = [-286213, -343343, 84, 119241, 208996, 214250, -333756, -132650, -209311, -369901, -676887, 137732, 568972, 73932, 257130, 285740, -22483, -469791, 132564, -309673, -465193, -315332, -324483, -181561, 50175, -133934, -18558, -152739, -67221, 192059, 242769, -275923, -190457, 148255, -200192, -540815, -53995, 20682, 14417, -333148, -238245, -104990, 371843, 346272, 124221, -55876, -442894, -562427, -482604, -357577, -215012, -392213, -435775, -427855, -161211, -159815, -296765, -349581, -351139, -427324, -206809, -115425, -85624, -7768, 61259, 281030, 193431, -128506, 321155, -370823, -384011, 79195, 358482, -125189, -189861, -253512, -642299, -436905, -114216, -321402, -447125, -21347, -259796, -422601, -42806]
7638d2806n22927l36817Q42793k41568L03905o0680L40977K56466n56113m48887
7628d65657K66729l79524j32815P60501J50043J40063P3191k24213K26753k10066
7618B05005k59362k07519l28054O1861M82596m35131K07960K14536j53545m16238
7608f27891M07481J26320J02684l41343L687K18704k18930J45953L85074m257
7598A97482m66010k54037L39540n32423j2569L80815k00268L64492L32332o5182
7588H4172n46268K69562L22315j76638k21697o1127j68101J61168K02752L97136
7578B63274r1158l43182m69226N03662O9493n84714J96045M216l87232J366L00473
7567e36983L60288J39670l51406o8706L14291J73401M44489k24389k82227J52005
$$ y = [-42806, -565733, -902550, -59757, -301325, 2580, -58100, 282877, 539343, -16770, -465657, -198928, -578452, -711267, 49234, 199277, 339340, 412531, 188318, 415071, 205005, -54357, -261876, -589930, -528069, -45473, -480604, -272644, -58108, -211653, -627891, -220410, -94090, 8594, -332749, -329062, -110358, -329288, -183335, 201739, 197482, -268528, -522565, -183025, -715448, -728017, -347202, -547470, -182978, 149354, 84172, -462096, -192534, 129781, -46857, -268554, -329681, -497782, -336614, -133862, 263274, 172116, -171066, -640292, -136630, -67137, -651851, -455806, -451590, -838822, -837456, -536983, -176695, -37025, -388431, -457137, -142846, 30555, 475044, 250655, -31572, 120433]
7557A20433j47257p2173J93380j83268K76742j76897o16884L72657j57484L54131
7547c6620L36496k94658k01146k57964M92175k32830J19677m08810K79207L17706
7537A13233l80715L09225j15946K88364J12619o41075J03145K82290q0302Q8654
7527G9492k78234K02034n76255L2176K21620J15148K04977k88857k51323M10393
7517a28829J1142n13912j24080M19161M75458K67813j56143m21575k35315m97280
7507i03560k16087L30021O13987N20794j58834M32589j4481k62248n53136k05809
7497d16764j75061J25428Q08658j82539m73281j25787L26600n89547M26902J29573
7487a45818j90775j71990J50287j06751j63170O58680k67353o181J35018k88727
$$ y = [120433, -26824, -98997, 94383, -88885, 187857, 10960, -605924, -233267, -390751, -36620, 299876, 5218, -195928, -453892, 38283, -194547, -74870, -483680, -204473, 113233, -267482, 41743, -74203, 214161, 326780, -314295, -211150, 71140, -9162, 79492, -198742, 3292, -572963, -540787, -319167, -204019, 958, -287899, -539222, -128829, -117687, -631599, -755679, -336518, 138940, 406753, 250610, -170965, -406280, -903560, -1119647, -789626, -175639, 345155, 186321, 618910, 604429, 342181, -210955, -416764, -591825, -466397, 342261, 159722, -313559, -439346, -112746, -702293, -275391, -145818, -336593, -508583, -358296, -465047, -628217, 30463, -236890, -243071, -108053, -396780]
7477c96780l9931k16485K148N1138K3821K92619J43326J62711k02638K72960j0307
7466H2582j30102k76338l73437M72645l53704k90815M59273R2850L51352o4343
7456c0037J29862J6113l03733J00490J58447k91599J58865n087n4161k71475k82959
7445f75274M11971M90459N18474n43006o19425l73951R2832K79079K86179l19462
7435d52124o41340K5691N62033r1942N02198Q8513l16123r5833M2333l2100J43909
7424b64785L62046l39656n78691R14702j55731J93797L9838k37331j32686k72264
7414d70761n0798j04549O7197M13828M17012k67172N3597p63876M88229l48617
7404e65910J00736J39937j22577j61192K53983j28219J71318J29699k42247M04154
$$ y = [-396780, -436711, -653196, -651048, -599910, -576089, -283470, -140144, 22567, -180071, 92889, 82582, -47520, -323858, -697295, -224650, -578354, -869169, -409896, -317046, 34306, -30037, 99825, 115938, -187795, -87305, 71142, -220457, -61592, -66679, -120840, -392315, -675274, -263303, 227156, 745630, 202624, -416801, -790752, -697920, -418841, -132662, -452124, -1093464, -1067773, -505740, -597682, -95484, -6971, -323094, -418927, -376594, -408694, -264785, 97261, -242395, -821086, 93616, -62115, 131682, 171520, -65811, -198497, -470761, -521559, -626108, -558911, -145083, 271929, 4757, 58354, -705522, -217293, -565910, -465174, -325237, -447814, -609006, -355023, -483242, -311924, -182225, -424472, -20318]
7394b0318R7273l88653j3981J59197m30137J8915J45798J30332j72417l06739
7384g80730L01323l41489k0055K62658L1083M9639K43700m0193r0331q5087J18672
7373c50810J30343J59474p3665J22108L73302k7904k04153N0286N50679j41357
7363E88303k37925k11202j11986k15343J07077j74549j21490o8649R53011l9109
7353D68138o31400j22328R4419j86933K14302K161j77927J57696P3390j33832
7343b42314j36393j10568K55257j33765l23274O119J57836k21089j6537L99638
7333c65090O12904N68971n29246K8555N8268m55203m7613l51850k75273J99587
7323e55990K01679j10648J59241j30234J98458L35120r1770J62713o3630k1476
$$ y = [-20318, 76955, -311698, -325679, -166482, -596619, -577704, -431906, -301574, -473991, -780730, -479407, -820896, -840951, -578293, -547210, -497571, -253871, -294064, -384395, -469482, -350810, -220467, -60993, -134658, -12550, 360752, 332848, 128695, 178981, 729660, 588303, 350378, 139176, 27190, -188153, -81076, -255625, -377115, -445764, 507247, 468138, -163262, -285590, -191171, -378104, -163802, -161641, -339568, -181872, -108482, -242314, -378707, -489275, -234018, -367783, -691057, -684938, -527102, -748191, -764728, -365090, 247814, 816785, 287539, 316094, 374362, -80841, -128454, -480304, -755577, -555990, -354311, -464959, -305718, -435952, -237494, 97626, 5856, 168569, 104939, 83463]
7313H3463j6610l92323m64249p5094J68499O8440M09604K13521J30613j2429o10134
7302d96699l27528j90395L76795L23094L3108j91956k9440K21390p7281l15387
7292f74299L98274J48230K72550n29452Q6711J20948k61486j21913j97229K5626
7282g32040N84887j27400k55259j87696N61462N32501j89183j26033j4463k88540
7272b41764k56799K93865K06982j95715J88707K77848k94972J86973r8131k68470
7262b01476K9349k4432J06072K94188l39881m17447p9069m56801J48614N26200
7252d14683J96984K49735Q2088m9808L9141l58058J32971J83997l02822K53647
7242A3192l91595n06899J43569K1739K92163o1343k45572N3385M18277l84362
$$ y = [83463, 66853, -325470, -789719, -864813, -696314, -627874, -218270, -4749, 125864, 113435, -496699, -824227, -1014622, -637827, -314733, -281625, -473581, -503021, -281631, -358912, -674299, -276025, -127795, 144755, -384697, -297986, -177038, -438524, -560437, -757666, -732040, -147153, -274553, -529812, -717508, -156046, 376455, 187272, 61239, 46776, -241764, -498563, -204698, 2284, -193431, -4724, 273124, -21848, 165125, 66994, -201476, -172127, -196559, -90487, 203701, -136180, -553627, -632696, -1089497, -940883, -414683, -217699, 32036, 114124, 64316, 103457, -254601, -121630, 62367, -240455, 13192, -378403, -885302, -741733, -719994, -427831, -489174, -734746, -681361, -263084, -647446]
7232f47446k15174N16105k36600n90799N40175P59799j95982L09592K21259J08336
7222E69265k66920k22331R4867M93377o17976m7920l74123p6234J92750k12548
7212d67793J11606r1081M51829j41736L52577k07069o15434J9798q5237N38524
7202a34016O8113L32066q8579j49819M44357l3467m87350k95479J97120J028329
7192H81275k65275p41459k22567J54002l19792K01212k2123J71079j00316o84085
7182i48049k4952P19487j14043l022P9472l8284R4331J35091j06456k88077k8283
7171e22785R2367M47300q2169j6433k82781J78614Q9397J49276k72826j58024
7161c78064j56149L06542m8809m66276J07918J091809j21341q31693j85152L91924
$$ y = [-647446, -862620, -346515, -583115, -1173914, -633739, 126060, -69922, 239670, 460929, 569265, 302345, 80014, 174881, 668258, 50282, 2362, -371761, -447995, -255245, -467793, -356187, -447268, 4561, -137175, 215402, 8333, -607101, -587303, -672540, -134016, -65903, 266163, 177584, 27765, 472122, 438655, -48695, -344174, -147054, 881275, 616000, -125459, -348026, -194024, -513816, -312604, -334727, -163648, -263964, -948049, -973001, -253514, -367557, -370579, -291107, -329391, -235060, -99969, -206425, -494502, -522785, -430418, 16882, -65287, -81720, -364501, -185887, -96490, 52786, -220040, -378064, -534213, -227671, -276480, -742756, -634838, 456971, 335630, -496063, -681215, -289291]
7151b89291J71571k71578M77748k16275l09988p562j12837K28476J94531L75401
7141B40196r4190r1105m6998K13606l45799k06642K78944J80k27144L8816J22201
7130a17935L39087k19541p0962K86544m04823Q9897M16971k57938N0429l81658
7120b69929j14086J35509j53346J55215L30448k1420j67991j4149l4448L22203
7110A68006m157j11648L46909m18978k12200J98151q3320J92467K3767k06342
7100a07345N17879M54956p53835j29402j45539j51607j90602L37428L27544k3922
7090A35555l16356R8061L92596k56937l76046l1734n1263O22339j64821m22089
7080c70695N08976J24645o17315n6732M21043m68058r1572k1741P26765J8367
$$ y = [-289291, -117720, -389298, 88450, -127825, -437813, -445375, -558212, -329736, -135205, 240196, 146006, 54901, 7903, 221509, -124290, -330932, -51988, -51808, -278952, -240136, -117935, 221152, 1611, -69351, 217193, -187630, -97733, 319238, 61300, 111729, -269929, -384015, -248506, -401852, -246637, 83811, 62391, -105600, -119749, -154197, 168006, 163849, 52201, 399110, -19868, -232068, -33917, -117237, 75230, 98997, -107345, 410534, 865490, 111655, -17747, -163286, -314893, -505495, -168067, 159477, 135555, -180801, -82740, 309856, 52919, -323127, -354861, -406124, 216215, 51394, -370695, 138281, 262926, -354389, -411121, 9922, -458136, -549708, -571449, 155316, 173683]
7070A73683l54102m13795L49451R8408K51976l27116J13922K84629n32380J43703
7060b11621K97501j81549J21513N30262l13004N2006k3062P13521m11861o60834
7050h7128m59474K90705j61598O7611L48051j30282k58849J44050M68229m02199
7040a80884k83956k72540N43501K61507J5224l34477J27781K31769n2747k61562
7030b06384k46197L06838l69326M52240N58431l41489l22008Q3438J92076k55777
7020a48158m67935K96602j92379j9449L93246j07502L96101J53545j44839k66938
7010a07706l97908K55235K90877J37357J72161k88167p67161L14638j5322L28053
7000g7943J58022q6809j75978O06374k07619m38655j28803l55526J87543J80697
$$ y = [173683, -180419, -594214, -244763, -146355, 105621, -221495, -107573, 177056, -355324, -211621, 85880, -95669, 25844, 556106, 243102, 295108, 272046, 985567, 573706, -87128, -546602, -255897, -417495, -349884, -1833, -132115, -390964, -246914, 221315, -180884, -464840, -737380, -193879, 67628, 82852, -251625, -123844, 107925, 55178, -206384, -452581, -145743, -515069, -62829, 495602, 154113, -167895, -84457, 107619, -148158, -616093, -319491, -511870, -531319, -138073, -245575, 150526, 304071, 159232, -107706, -505614, -250379, 40498, 177855, 350016, 61849, -705312, -390674, -405996, -77943, 80079, -6730, -182708, 423666, 216047, -222608, -351411, -706937, -519394, -338697]
6990c38697J07741P1092Q3809k63007N2758K17841k11925r7830N66962j34364
6980E4380o7045L37854l8784l26846N8866L55224p4076l66704j71523l1497R9133
6969a71018P9803P2771j05783M887J55508m975l98112l20206l55807N11356P08621
6958A77045P6748n81225J96939j86888O4272O39480n14500l5065L82654m44763
6948b25303k90322L81112N12577m31814L7992j08064l64037M5163N39752j96990
6938i9934K0576L70669J30041j32036l0935q9621m47920k993M28116J12734R7890
6927C56587J11317j05134l01429k02678N88339m46632R3733M60093m80598K5084
6917I8682L42064n39980n6299q6552l24494J000266k93527l66281P12260J89499
$$ y = [-338697, -230956, -159864, -76055, -339062, -286304, -68463, -280388, -378218, 188744, 54380, -12665, 325189, 286405, -40441, 18425, 373649, 299573, -67131, -238654, -270151, -171018, -91215, -18444, -124227, -119340, 36168, 31193, -366919, -687125, -1042932, -531576, 177045, 253793, -327432, -130493, -317381, -253109, 386371, -128129, -163194, 219460, -225303, -515625, -134513, 378064, -53750, -15758, -123822, -487859, -442696, 97056, -99934, -79358, 291311, 421352, 289316, 258381, 168760, -279160, -282153, 145963, 258697, 356587, 467904, 362770, 61341, -141337, 447002, 370, 94103, 554196, 73598, 98682, 440746, -99234, -155533, -242085, -566579, 433687, 140160, -226121, 486139, 675638]
6907F75638l88715j002409L05821J016884m05618l10800M02217J0498k08403M21023
6897E16136K92581j7949O956j24803l86992l6809K45784j87464N32059n14722
6887C24777L6840N07203J89968Q9755k66113l21213O8278n17377J80383J53519
6877D46020j16215J86127j47177R0298N4689N24928K65000m52090j90566J47580
6867H08594l0108j37864J77763L55609j26455J05818j44759p34673j21876P39922
6857H91971j531J1597J80884n77523J02701L59861n1551k18849q0209Q3166P1900
6846G72417J83902N55910n32537K7362R4603M72667K67724l06064J52214L3048
6836A721246J32229R8185k6154n36746J36204J92820N10238J85998j43893K83248
$$ y = [675638, 286923, -715486, -409665, 607219, 201601, -109199, 293018, 303516, 95113, 516136, 808717, 790768, 797724, 672921, 285929, 249120, 494904, 307440, 839499, 324777, 361617, 868820, 1058788, 1148543, 882430, 561217, 629495, 112118, 292501, 446020, 329805, 515932, 368755, 459053, 513742, 1038670, 1303670, 851580, 661014, 808594, 778486, 640622, 818385, 1173994, 1047539, 1153357, 1008598, 273925, 152049, 891971, 890440, 902037, 1082921, 505398, 608099, 967960, 916409, 697560, 617351, 700517, 772417, 956319, 1512229, 979692, 1007054, 1101657, 1574324, 1842048, 1535984, 1688198, 1721246, 1853475, 1951660, 1925506, 1388760, 1524964, 1717784, 2228022, 2414020, 2270127, 2553375]
6826B553375L58684j6112n45244N00855J76063q28275N00403Q71261L48789J23334
6816D043133M6848N20093N84268K35612L33382j22445Q3626P20074N02157q2240
6806F864508M06429J20245M09560m37037O07223J139812M45930O16764Q47515
6797A1020949P32085K43005J74417P37598J518593P04684O62359J213235J771409
6788A8778334J072229J231847J665435J877161K389334K202702K853886L131476
6780C5202404L565621M173121L691553L210792J608815L5536p49124j896287j747367
6771D7095064r79657r04284P74561J158984J433510O03999k51227j269672l542938
6762D4118340m257830m199976l901464l173836l648017k557685k551928k111374
$$ y = [2553375, 2912059, 2895947, 2350703, 2851558, 3027621, 2199346, 2699749, 3571010, 3919799, 4043133, 4089981, 4610074, 5194342, 5429954, 5763336, 5640891, 5724517, 6444591, 6946748, 6864508, 7270937, 7391182, 7800742, 7363705, 7970928, 9110740, 9556670, 10173434, 11020949, 11753034, 11996039, 12170456, 12908054, 14426647, 15131331, 15793690, 17006925, 18778334, 19850563, 21082410, 22747845, 24625006, 27014340, 29217042, 32070928, 35202404, 38768025, 42941146, 46632699, 49843491, 51452306, 51487842, 50738718, 48842431, 47095064, 46115407, 45211123, 45985684, 47144668, 48578178, 49182177, 48930950, 47661278, 44118340, 39860510, 35660534, 31759070, 28585234, 24937217, 22379532, 19827604, 17716230]
6754A7716230j082032j626400j351199j094726r68915q81272r06484q79669m75280
6745H450253j54921m95463o39435k28663k83171o52635m51063k69204n26264K18536
6735D967970n88735j95261O4627m10477K67590J79143j18972l12992p0737l53130
6725C429026n36663J92189l66169L4335j13855N6957l86804p5136L65530k98495
6715B300915n08107P1590M22904l08347k17610M56929o24531k30601P8082k6343
6705A414881J40181l52810K14080k38730J82619j07266l07679J57062O6047J10857
6695A279242L40194l91009o33451K15048M5025p9721J6721R3082k76815J46255
6685G54571M08834n97621j36194J68833M88521Q4585l85918n8844J01817q7513
$$ y = [17716230, 16634198, 15007798, 13656599, 12561873, 11592958, 10711686, 9805202, 8925533, 8450253, 8295332, 7799869, 7160434, 6931771, 6648600, 5995965, 5544902, 5275698, 4749434, 4967970, 4379235, 4183974, 4248601, 3838124, 4105714, 4284857, 4165885, 3852893, 3782156, 3429026, 2892363, 3084552, 2718383, 2752718, 2638863, 2695820, 2309016, 2233880, 2599410, 2300915, 1792808, 1864398, 2287302, 1978955, 1761345, 2218274, 1593743, 1363142, 1441224, 1414881, 1555062, 1202252, 1416332, 1177602, 1360221, 1252955, 945276, 1102338, 1168385, 1279242, 1619436, 1228427, 594976, 810024, 855049, 775328, 792049, 885131, 608316, 754571, 1163405, 565784, 429590, 598423, 1086944, 1171529, 785611, 726767, 828584, 741071]
6675G41071n83810J2741Q08753J94281j31639m16938j228J12773o46377O57986
6665G47613Q3350j24911l49682J95640m78482N85441N70683n84121l79505m71107
6655b05081N56787j97783l59738O9704Q59154R3430l1510k97374l24220k02258
6645c8889n60346J74783P53487M5520N2932m14342k38394j26727L28286N8458
6635C4768K0098J68726M27588k93263j56451k90942J79711M37991l7730m33351
6625E7145r0400L49549l3045P9993l71017L50492p8055J04960J28265k40864k00995
6614E6028N60154j104292m43494Q35896L62883K71147j3608j50608j93771j45763
6604C4572K66892j81728l104J17590j76019Q9479k76218P01109L33130k90775
$$ y = [741071, 157261, 170002, 978755, 1173036, 1041397, 624459, 623231, 736004, 89627, 747613, 830963, 706052, 356370, 552010, 73528, 658969, 1229652, 645531, 266026, -205081, 351706, 153923, -205815, -136111, 723043, 816473, 784963, 487589, 163369, -38889, -599235, -424452, 329035, 374555, 427487, 13145, -225249, -351976, -23690, 34768, 54866, 223592, 651180, 357917, 201466, -89476, 90235, 528226, 490496, 57145, -33255, 316294, 283249, 363242, -7775, 342717, 264662, 369622, 497887, 257023, 56028, 616182, -488110, -931604, -95708, 267175, 538322, 524714, 374106, 180335, 34572, 301464, 119736, 116632, 234222, 58203, 147682, -128536, 572573, 905703, 614928]
6594F14928J67740l47296l11543J10662k97803j23487J27986K52979j81809L58198
6584C70555j00456M5172M78563l67531l79616J31690l7251J68719R0614j57928
6574B42531P7729p6486J36159l70199J33663j70061n7393Q61084Q8066k27242
6564F37851L8298k7687o73048K893J12458m46028j36854K53301L30205L9278L46434
6553D77101l1567j21315n61390k60462O69416K22558k02066m82233j80795K23064
6543b47689J88647J01162O0093J49084K44458J49002l2177k91062k68102N84746
6533F38162K13545n97314l23073K24899j0149J36985j18413l66635L3172k27763
6523c96584K39932R9439J13810j40471J25497K91713q0105k03432K3367j44768
$$ y = [614928, 782668, 435372, 123829, 234491, -63312, -186799, -58813, 194166, 12357, 370555, 270099, 315271, 793834, 426303, 46687, 178377, 141126, 309845, 400459, 242531, 320260, 243774, 379933, 9734, 143397, -26664, -84057, 777027, 865093, 637851, 676149, 648462, -24586, -21693, 90765, -355263, -492117, -238816, 91389, 130667, 477101, 445534, 324219, -237171, -497633, 171783, 394341, 192275, -289958, -470753, -247689, -59042, 42120, 102213, 251297, 495755, 644757, 612580, 321518, 53416, 638162, 851707, 254393, -68680, 156219, 146070, 283055, 164642, -201993, -168821, -396584, -156652, -57213, 56597, -83874, 41623, 333336, 253231, 49799, 73166, -71602]
6513g1602m2215O5932j81507M10128m06647o18913p9972N08687J3032P39132l22922
6502A3133k15627J78031m68498K72747j44581J03823M04221J51931j0695j98439
6492H6046j09074r9047o5422K41199J26697k04408N55099N1578j67428o15257
6482b00017j36640L57938l22499N5624O73013M87519o63941m24927p7132R2926
6472a58136K96694l91871K09680r0110J57159k0110j84519k06358M85212n135
6462I2506n22562J51694l97026Q64271j18608k68352L99828J71046L663m380j94497
6451A77583J67257j62676L07075q0931o84556K70360N64775l90042M96324j52460
6441E12709m45434J44138m98214O2910O1228L84674l55839m1175Q09587m1636
$$ y = [-71602, -113817, -47885, -229392, 180736, -225911, -844824, -924796, -416109, -403077, 336055, 13133, -202494, -24463, -492961, -220214, -364795, -260972, 143249, 295180, 284485, 86046, -23028, -122075, -187497, 53702, 180399, -24009, 531090, 582668, 415240, -200017, -336657, 21281, -301218, -245594, 427419, 914938, 250997, -173930, -251062, -158136, 138558, -253313, -43633, -133743, 23416, 3306, -181213, -387571, 97641, 92506, -430056, -278362, -675388, 188883, 70275, -198077, 201751, 372797, 376460, 372080, 177583, 344840, 182164, 489239, 408308, -276248, -5888, 558887, 168845, 665169, 512709, 67275, 211413, -286801, -223891, -162663, 222011, -133828, -175003, 634584, 592948]
6431E92948m52672j69923o0045k98474M65016O7439k26387n2370k15987m56299
6421h06754K70847J65974L35950j72129j60740j17341m8019p9318p0295n44062
6411a225887j18823O46558j57288J62455N11557M03104n84060L86438P79755p151
6401G96658k97999j67778k5139q6606j08934o29610j02573l04760K8311K92082
6391f06348J02038M64326N9986J10703k78571J8337N66752m25480r6189r055j42598
6380b36099n1993j10265r2414o08108L76472J65304Q3994j41269J0938j20546
6370g23986K19442L92743K25086K26228j98417k21995K10204k14570K81406p5111
6360A21030k28674l30706K7354K1855q3976J58858O0249O89294j66791k01173
$$ y = [592948, 140276, -29647, -89692, -388166, 76850, 144289, -82098, -134468, -350455, -806754, -535907, -369933, -33983, -206112, -366852, -484193, -532212, -611530, -681825, -1225887, -1344710, -698152, -855440, -692985, -181428, 221676, -362384, 24054, 803809, 796658, 498659, 330881, 305742, 219136, 110202, -519408, -621981, -926741, -898430, -606348, -504310, -39984, 20002, 130705, -147866, -129529, 437223, 11743, -84446, -93501, -236099, -288092, -398357, -490771, -1098879, -722407, -557103, -473109, -614378, -603440, -723986, -504544, -111801, 113285, 339513, 141096, -80899, 129305, -85265, 196141, 121030, -107644, -438350, -410996, -389141, -473117, -314259, -254010, 435284, 268493, 67320]
6350F7320k49157O6561M00632j96426o90464K02530j74635K65328k46057J97742
6340c56626J40048p08096M54005l84326K7931P18074J47569k88426K04651l45221
6330c90417j62251M0962L28470L13220p7874l85366l39921R6177K54832j8301
6320c40469j57932L92747K99236K93804m68290j89761J60256j60938L30450M49601
6310F08704l56012j16189o30378l92648J065800k89809k23188K09830k19065M52728
6300A09773J61786m85473J57464k77708J427j09455R2129m71678l45811J000736
6290a66810N12188l19614l6706l47303J30309K70390l46540j66883K06954J38927
6280a25088L8948M74801M35168n92792l43023K63862l52471j23055K38153O95459
$$ y = [67320, -181837, -115276, 285356, 88930, -601534, -399004, -573639, -308311, -554368, -356626, -216578, -924674, -470669, -854995, -827064, -108990, 38579, -249847, -45196, -390417, -552668, -511706, -183236, 129984, 52110, -333256, -673177, -577000, -322168, -340469, -498401, -105654, 193582, 487386, 19096, -170665, -10409, -171347, 159103, 608704, 252692, 136503, -493875, -886523, 179277, -110532, -333720, -123890, -342955, 109773, 271559, -213914, -56450, -334158, -332731, -442186, -350057, -821735, -1167546, -166810, 345378, 25764, -10942, -358245, -227936, 42454, -304086, -470969, -264015, -125088, -86140, 388661, 823829, 231037, -111986, 151876, -200595, -323650, -85497, 609962]
6270F09962j59852k87453j23630j96419l92673N45956R8126l04165o0777l3215
6260c04140K63744M64341l4437o1934p5939j29895l09366L10050N2056N636P2088
6249B52204J0414M9651k89904k91076j38250J18479j82695j12100J24161L68837
6239i0279M15994l09546P2103M086o4755m62606q35651Q44339J48669J84341M65603
6228C72298p3896k04246M9659J40788J48029n52053m28712M7815k67966J19260
6218f49024J89032R5540K87831n8319k35802M3998k77199L09063K31343q5178
6208a48715K80709M59663p3469p11801j0425l16021J39769n2133K05460l8405
6198b65368l00367N8836q3369M02963n5425j39943j79039J16297J08417R19896
$$ y = [609962, 450110, 162657, 39027, -157392, -550065, -4109, 94017, -210148, -270925, -304140, -40396, 423945, 389508, 327574, 251635, 121740, -187626, 122424, 174480, 180116, 252204, 262618, 312269, 22365, -268711, -406961, -288482, -471177, -583277, -459116, -90279, 325715, 16169, 88272, 92358, 27603, -435003, -1270654, -426315, -277646, -93305, 372298, 298402, 94156, 143815, 284603, 432632, -119421, -548133, -500318, -768284, -649024, -459992, -364452, -76621, -134940, -370742, -326744, -603943, -294880, -63537, -148715, 131994, 591657, 518188, -193613, -204038, -520059, -380290, -432423, -226963, -265368, -565735, -506899, -590268, -187305, -242730, -382673, -561712, -445415, -336998, 582898]
6188E82898j29123p44854J93052L39611j08190K03236k27705k81940R0230K33686
6178A50901k28720j90197m508p0314M10967m0329q0786j51440n5617K57761N6504
6167E4222o50640J03697N37572N60930K7579o72056l29959L79391K57709q0355
6157A88090j40007l02409J68282k52963j51394k28554r6427J56104K8044M26718
6147b04516J32476K2113l58609J60844k33753j36331M86096J5434j46508j27540
6137c90294N4081n44655j34182K30000L63036j80429p5233Q058N0629N14339n31947
6126f36597m6904M99346r6736m6416O6279l36352K13609j21237M95073L15170
6116C05235k59013j49839K00583l75303l30771l9236K0439J7782N6420L0022N2237
$$ y = [582898, 453775, -291079, -98027, 241584, 133394, 336630, 108925, -173015, -82785, 150901, -77819, -268016, -272524, -342838, 68129, 27800, -52986, -204426, -260043, -2282, 54222, -596418, -492721, 44851, 605781, 633360, -38696, -368655, 10736, 268445, 188090, 48083, -254326, -86044, -339007, -490401, -718955, -815382, -659278, -631234, -204516, -72040, -49927, -408536, -247692, -481445, -617776, -131680, -116246, -262754, -390294, -336213, -880868, -1015050, -785050, -422014, -602443, -677676, -669618, -618989, -104650, -636597, -683501, -184155, -280891, -327307, -261028, -597380, -383771, -505008, -9935, 305235, 46222, -103617, 96966, -278337, -609108, -648344, -627905, -610123, -553703, -523681, -471444]
6105d71444l11567J35776M22509M5908o9607l66536L72429M79665j44581J16636
6095B09188N06490o5316j86160l95367L08888k55910L19085j36571l74715j08659
6085a79047O8629L44544n54161P6153J93410k92757l5987J50486M2730k67919
6075d53919J38735K9151j74370Q2704j37168M10483r8209Q739J01141m10717k22945
6064g26375L20304M16132j46725M29371j8280n53765O8525j34516K20423l28536
6054d53442K88138M31000j90516n37804k91017k6988J32027M27879J21855k54331
6044c53199j31442j55138O7856P23462n3021j1111n36972K72798K50078J00658
$$ y = [-471444, -783011, -647235, -224726, -178818, -248425, -614961, -242532, 237133, 92552, 209188, 715678, 650362, 464202, 68835, 377723, 121813, 440898, 304327, -70388, -179047, -110418, 234126, -320035, -243882, -50472, -343229, -379216, -228730, -186000, -453919, -315184, -286033, -460403, -377699, -514867, -104384, -202593, -193854, -92713, -503430, -726375, -406071, 10061, -136664, 292707, 274427, -279338, -210813, -345329, -124906, -453442, -165304, 265696, 75180, -462624, -753641, -780629, -648602, -220723, -98868, -353199, -484641, -639779, -571923, 151539, 98518, 87407, -449565, -176767, 73311, 173969]
$$ [...]
##END NTUPLES=NMR SPECTRUM
##END=
