##TITLE=1H_EC-3340
 200.13MHz, CDCl3,
 8 sc
 
 28.1.2025
##JCAMPDX= 6.0         $$ Bruker NMR JCAMP-DX V2.0
##DATA TYPE= NMR SPECTRUM
##DATA CLASS= NTUPLES
##ORIGIN= UXNMR, Bruker Analytische Messtechnik GmbH
##OWNER= pz
$$ XWIN-NMR		Version 3.5
$$ Tue Jan 28 13:57:48 2025 Russian Standard Time (UT+4h)  she@DPX200
##.OBSERVE FREQUENCY= 200.1313
##.OBSERVE NUCLEUS= ^1H
##.ACQUISITION MODE= SIMULTANEOUS
##.ACQUISITION SCHEME= undefined
##.AVERAGES= 8
##.DIGITISER RES= 18
##SPECTROMETER/DATA SYSTEM= spect
##.PULSE SEQUENCE= zg30
##.SOLVENT NAME= D2O
##.SHIFT REFERENCE= (INTERNAL, D2O, 0, 15.4769)
##AUDIT TRAIL= $$ (NUMBER, WHEN, WHO, WHERE, WHAT)
$$ ##TITLE= Audit trail, XWIN-NMR		Version 3.5
$$ ##JCAMPDX= 5.01
$$ ##ORIGIN= Bruker BioSpin GmbH
$$ ##OWNER= she
$$ F:/spectra/data/she/nmr/H-C/1/pdata/1/auditp.txt
$$ ##AUDIT TRAIL=  $$ (NUMBER, WHEN, WHO, WHERE, WHAT)
(   1,<2025-01-28 13:56:21.18 +0400>,<she>,<DPX200>,
      <created by zg, POWCHK disabled, PULCHK disabled
       configuration hash MD5:
       00 E9 B6 7A A2 85 ED C7 34 08 36 98 17 FE 4E 26
       data hash MD5: 16K
       01 3F 2B 60 56 62 A8 D2 5E 50 F9 C1 34 08 CB EA>)
(   2,<2025-01-28 13:56:23.23 +0400>,<she>,<DPX200>,
      <Start of raw data processing
       efp BC_mod = 2 LB = 0.25 FT_mod = 6 PKNL = 1 PHC0 = 79.27728 PHC1 = 28.79223 SI = 16K 
       data hash MD5: 16K
       54 F8 39 FF 7F FD FE 78 36 89 CE D3 10 1C F5 10>)
(   3,<2025-01-28 13:56:53.09 +0400>,<she>,<DPX200>,
      <pk PHC0 = 172.1039 PHC1 = -18.8 
       data hash MD5: 16K
       C6 AD 99 EF A7 D5 DE E0 BC E9 A7 85 EC 36 19 C2>)
(   4,<2025-01-28 13:56:57.51 +0400>,<she>,<DPX200>,
      <abs ABSG = 5 
       data hash MD5: 16K
       07 27 E1 D8 F8 C9 96 69 AB 17 72 92 54 68 DA 52>)
$$ ##END=
$$ 
$$ hash MD5
$$ 54 ED E9 5B C6 24 BB 40 67 5D 4F 2C 59 D7 E9 52
##$RELAX= 
##$RELAX= 
##$RELAX= 
##$RELAX= 
##$RELAX= 
##$RELAX= 
$$ Bruker specific parameters
$$ --------------------------
##$DU= <F:/spectra>
##$EXPNO= 1
##$NAME= <H-C>
##$PROCNO= 1
##$TYPE= <nmr>
##$USER= <she>
##$AMP= (0..31)
100 100 100 100 100 100 100 100 100 100 100 100 100 100 100 100 100 100 
100 100 100 100 100 100 100 100 100 100 100 100 100 100 
##$AQSEQ= 0
##$AQ_mod= 1
##$AUNM= <au_zg>
##$AUTOPOS= <>
##$BF1= 200.13
##$BF2= 200.13
##$BF3= 200.13
##$BF4= 200.13
##$BF5= 200.13
##$BF6= 200.13
##$BF7= 200.13
##$BF8= 200.13
##$BYTORDA= 1
##$CFDGTYP= 0
##$CFRGTYP= 5
##$CHEMSTR= <none>
##$CNST= (0..31)
1 1 145 1 1 1 1 1 1 1 1 1 1 1 1 1 1 1 1 1 1 1 1 1 1 1 1 1 1 1 1 1 
##$CPDPRG= <>
##$CPDPRG1= <>
##$CPDPRG2= <>
##$CPDPRG3= <>
##$CPDPRG4= <mlev>
##$CPDPRG5= <mlev>
##$CPDPRG6= <mlev>
##$CPDPRG7= <mlev>
##$CPDPRG8= <mlev>
##$CPDPRGB= <>
##$CPDPRGT= <>
##$D= (0..31)
0 0.7 0 0 0 0 0 0 0 0 0 0.03 0 0 0 0 0 0 0 0 0 0 0 0 0 0 0 0 0 0 0 0 
##$DATE= 1738058180
##$DBL= (0..7)
120 120 120 120 120 120 120 120 
##$DBP= (0..7)
150 150 150 150 150 150 150 150 
##$DBP07= 0
##$DBPNAM0= <>
##$DBPNAM1= <>
##$DBPNAM2= <>
##$DBPNAM3= <>
##$DBPNAM4= <>
##$DBPNAM5= <>
$$ [...]
##$SUBNAM3= <"">
##$SUBNAM4= <"">
##$SUBNAM5= <"">
##$SUBNAM6= <"">
##$SUBNAM7= <"">
##$SUBNAM8= <"">
##$SUBNAM9= <"">
##$SW= 18.0517328524113
##$SWIBOX= (0..15)
0 0 2 0 0 0 0 0 0 0 0 0 0 0 0 0 
##$SW_h= 3612.71676300578
##$TD= 16384
##$TD0= 1
##$TE= 0
##$TE2= 300
##$TE3= 300
##$TEG= 300
##$TL= (0..7)
0 120 120 120 120 120 120 120 
##$TP= (0..7)
150 150 150 150 150 150 150 150 
##$TP07= 0
##$TPNAME0= <>
##$TPNAME1= <>
##$TPNAME2= <>
##$TPNAME3= <>
##$TPNAME4= <>
##$TPNAME5= <>
##$TPNAME6= <>
##$TPNAME7= <>
##$TPOAL= (0..7)
0.5 0.5 0.5 0.5 0.5 0.5 0.5 0.5 
##$TPOFFS= (0..7)
0 0 0 0 0 0 0 0 
##$TUNHIN= 0
##$TUNHOUT= 0
##$TUNXOUT= 0
##$USERA1= <user>
##$USERA2= <user>
##$USERA3= <user>
##$USERA4= <user>
##$USERA5= <user>
##$V9= 5
##$VALIST= <valist>
##$VCLIST= <CCCCCCCCCCCCCCC>
##$VD= 0
##$VDLIST= <DDDDDDDDDDDDDDD>
##$VPLIST= <PPPPPPPPPPPPPPP>
##$VTLIST= <TTTTTTTTTTTTTTT>
##$WBST= 1024
##$WBSW= 4
##$XGAIN= (0..3)
0 0 0 0 
##$XL= 0
##$YL= 0
##$YMAX_a= 41015
##$YMIN_a= -64941
##$ZGOPTNS= <>
##$ZL1= 120
##$ZL2= 120
##$ZL3= 120
##$ZL4= 120
##$ABSF1= 15.46924
##$ABSF2= -2.582609
##$ABSG= 5
##$ABSL= 3
##$ALPHA= 0
##$AQORDER= 0
##$ASSFAC= 0
##$ASSFACI= 0
##$ASSFACX= 0
##$ASSWID= 0
##$AUNMP= <proc_1d>
##$AZFE= 0.1
##$AZFW= 0.1
##$BCFW= 0
##$BC_mod= 2
##$BYTORDP= 0
##$COROFFS= 0
##$CY= -3
##$DATMOD= 1
##$DC= 0
##$DFILT= <>
##$DTYPP= 0
##$F1P= 0
##$F2P= 0
##$FCOR= 1
##$FTSIZE= 16384
##$FT_mod= 6
##$GAMMA= 0
##$GB= 0
##$INTBC= 1
##$INTSCL= 3.241238e-09
##$ISEN= 128
##$LB= 0.25
##$LEV0= 0
##$LPBIN= 0
##$MAXI= 10000
##$MC2= 0
##$MEAN= 0
##$ME_mod= 0
##$MI= 1.114404
##$NCOEF= 0
##$NC_proc= -9
##$NLEV= 6
##$NOISF1= 3.799351
##$NOISF2= 2.8
##$NSP= 0
##$NTH_PI= 0
##$NZP= 0
##$OFFSET= 15.47695
##$PC= 1
##$PHC0= 251.3812
##$PHC1= 9.992231
##$PH_mod= 1
##$PKNL= yes
##$PPARMOD= 0
##$PSCAL= 0
##$PSIGN= 0
##$REVERSE= no
##$SF= 200.130008957281
##$SI= 16384
##$SIGF1= 3
##$SIGF2= 2
##$SINO= 0.751879
##$SIOLD= 32768
##$SREGLST= <19F.Aceton>
##$SSB= 0
##$STSI= 16384
##$STSR= 0
##$SW_p= 3612.71676300578
##$SYMM= 0
##$S_DEV= 0
##$TDeff= 16384
##$TDoff= 0
##$TI= <>
##$TILT= no
##$TM1= 0
##$TM2= 0
##$TOPLEV= 0
##$USERP1= <user>
##$USERP2= <user>
##$USERP3= <user>
##$USERP4= <user>
##$USERP5= <user>
##$WDW= 1
##$XDIM= 16384
##$YMAX_p= 318588776
##$YMIN_p= -6508636
$$ End of Bruker specific parameters
$$ ---------------------------------
##NTUPLES= NMR SPECTRUM
##VAR_NAME=  FREQUENCY,     SPECTRUM/REAL,   SPECTRUM/IMAG
##SYMBOL=    X,             R,               I
##VAR_TYPE=  INDEPENDENT,   DEPENDENT,       DEPENDENT
##VAR_FORM=  AFFN,          ASDF,            ASDF
##VAR_DIM=   16384,         16384,           16384
##UNITS=     HZ,            ARBITRARY UNITS, ARBITRARY UNITS
##FACTOR=    0.220516191357247, 1,           1
##FIRST=     3097.40208044581, 0,            0
##LAST=      -515.31468255997, 0,            0
##MIN=       -515.31468255997, -6508636,     0
##MAX=       3097.40208044581, 318588776,    0
$$ Real data points
##PAGE= N=1
##DATA TABLE= (X++(R..R)), XYDATA
$$ [...]
12071f53640j18565N6951N35336m48425r2222M22832k15936L14474P56709q40604
12061b83090L06342J46655O55417k53446j09595j85690J90573q3279K08086k79464
12051C12509k93741L71848j80198m81270j11423q9408N25922M63623r77733j05274
12041e65145O23933k21275k41230J177480o30184j03410P81845j222578l02646
12032g03210M7716P60145P53147k50136p33603Q3007K24250J19175r54582L58914
12022b95177Q6358K78756K21055o81618Q9306J14718k08571j54212K84022k57506
12012e22869k66878O78054j15687n83246O65117o0876L30804l98545k90234J02810
12002d61550L01286P33560J38126n85031n50148O35344K27495j068789k56656
$$ plain form
12071 -653640 -772205 -715254 -179918 -628343 -720565 -297733 -513669 -199195 557514 -283090
12061 -283090 23252 169907 825324 571878 462283 276593 467166 383887 591973 312509
12051 312509 18768 390616 210418 -270852 -382275 -471683 54239 517862 -459871 -565145
12041 -565145 58788 -162487 -403717 773763 143579 40169 822014 -400564 -703210
12032 -703210 -655494 104651 857798 607662 -125941 -42934 181316 300491 -654091 -295177
12022 -295177 -208819 69937 290992 -390626 -301320 -186602 -395173 -549385 -265363 -522869
12012 -522869 -789747 -111693 -227380 -810626 -145509 -206385 124419 -274126 -564360 -461550
12002 -461550 -160264 573296 711422 126391 -423757 211587 439082 -629707 -886363
11993h86363K91582j63075L72435L58931M06083K47320K14775n95251l96327J00298
11983d9592P00939K28326p60782j51966l2923O72440k75303m51673K90328o20494
11973d50700m2493M50838M36330P75917p48809q42008M7069p17835L72492Q70224
11963A51025m10895l51304R8679J44560m73278M88106L72156k29180N32905n65542
11953b42768M52758P52167m97956J89899k1178n63509r55148l05187L30500P30777
11943a29645K85193Q51015p24801K19777n25686k17289O35186J59684l92221Q0817
11933B42030O99523j77041p753o87591p91148N21916Q44694J79815k53606k51533
11923C19306j74375L60957Q4928m45859Q32341L58702r05644J42498O45436j623237
$$ plain form
11993 -886363 -594781 -757856 -385421 -26490 379593 626913 841688 246437 -149890 -49592
11983 -49592 651347 879673 118891 -33075 -65998 606442 331139 -120534 169794 -450700
11973 -450700 -493193 -42355 393975 1169892 421083 -420925 -373856 -1091691 -719199 151025
11963 151025 -259870 -611174 -512495 -367935 -841213 -353107 19049 -210131 322774 -242768
11953 -242768 209990 962157 464201 654100 632922 69413 -885735 -1190922 -860422 -129645
11943 -129645 155548 1006563 281762 501539 -24147 -241436 393750 553434 161213 242030
11933 242030 941553 764512 756759 69168 -721980 -200064 644630 824445 570839 319306
11923 319306 144931 505888 590816 144957 977298 1336000 430356 572854 1218290 -404947
11913d04947P7333l667J14167O56431P4994k06380J73623K41309q0517J46192
11903G88538o92969k19777J65174K28336R9814k40279n2088n53741K8733J259113
11893H10854k71292k41394M60857l54267L76862l72926j01718m92129q43273O88723
11883c39703R4313N14888j07612J4909l72510p86184o1330P21994P61295m48427
11873h367l98637L20031Q80615m10498l79138J5332j91161p4484L33371k1792
11863F5272o10816R26989K93709k33091o08125l73939R70477K94847n97039q58279
11853g29995J09244j78701P10766Q7071J23402K85591l36836p23753k34374M01703
11843d85882P11521j70134m1165M61177K17388q38708o0381O9346L45241J82953
$$ plain form
11913 -404947 -327614 -331281 -217114 439317 514311 307931 481554 722863 642346 788538
11903 788538 95569 -124208 40966 269302 369116 128837 76749 -476992 -448259 810854
11893 810854 539562 298168 759025 404758 781620 408694 306976 -185153 -1028426 -339703
11883 -339703 -245390 269498 161886 176795 -195715 -981899 -1043229 -321235 440060 -8367
11873 -8367 -407004 -86973 793642 383144 4006 19338 -171823 -246307 87064 65272
11863 65272 -545544 381445 675154 442063 -166062 -540001 430476 725323 128284 -729995
11853 -729995 -620751 -799452 -88686 -1615 121787 407378 70542 -653211 -887585 -485882
11843 -485882 225639 55505 14340 475517 692905 -145803 -206184 -136838 208403 391356
11833C91356O79943l21969p40371Q30430p69405P63991K45794m42386p76084J09820
11823b8881j44449O1121O87797Q5755k53692j046472L55453M03543k87380k25661
11813c92866l88343N04932O87088N01161n31663l01313M42720J77646j98798Q34909
11803A335473l72220J66777o71311k13248j36020m81596N2419J56046k33435K58491
11793a38624O3504j62643N48370l69732k75374m96421N49241P3935K45021q80180
11783h42903K78604Q37803J5214O9557k43737j12353P48814m611l88129k42653
11773A15606j005563N22827L5410o68292L74378l82268O12419P8765l14509M89883
11763a41344J0450Q6793M57333r1622m71269J47387n51693L17325Q06947K98790
$$ plain form
11833 391356 1071299 749330 8959 839389 69984 833975 1079769 637383 -138701 -28881
11823 -28881 -173330 -112209 575588 661343 407651 -638821 -283368 120175 -167205 -392866
11813 -392866 -781209 -276277 410811 911972 380309 78996 521716 699362 500564 1335473
11803 1335473 963253 1130030 458719 245471 109451 -372145 -319726 -163680 -397115 -138624
11793 -138624 -75120 -237763 310607 -59125 -334499 -830920 -281679 -207744 37277 -842903
11783 -842903 -564299 273504 288718 358275 114538 2185 750999 746388 358259 115606
11773 115606 -889957 -367130 -331720 -1000012 -625634 -1007902 -395483 -316718 -631227 -141344
11763 -141344 -130894 -44101 413232 321610 -149659 -2272 -553965 -236640 570307 869097
11753H69097l84687k45394J8346j67097k47923r7910J51683J200937j61002j640222
11743g04172P13872M65599q22537j94746O70089p34393m08818j11755l52718N15741
11733i63838M18335K35018K7580J39142n60193l80907M31667p6464M95081q7375
11723c21954m90916K17568K20405M05876L10412o65416p82114K48137j93458j179323
11713b230783N84534N11280L78051Q77836P68455o79738l61449L96397J060264
11704A304847J00428j034908l30957k5609L90811j282469K05541L29372L83218
11695D0274j048238k34785J96033M41052O57260N49846k51980j68625N3968m25884
11685a91079K95806o51145j062272J147723M98290K71939L03976r62378j75204
$$ plain form
11753 869097 484410 239016 257362 90265 -157658 -255568 -103885 1097052 936050 -704172
11743 -704172 9700 475299 -347238 -541984 128105 -606288 -1015106 -1126861 -1479579 -963838
11733 -963838 -545503 -310485 -282905 -143763 -703956 -1084863 -653196 -729660 -234579 -321954
11723 -321954 -812870 -595302 -374897 30979 341391 -324025 -1106139 -858002 -1051460 -2230783
11713 -2230783 -1646249 -1134969 -756918 120918 889373 209635 -151814 244583 1304847
11704 1304847 1405275 370367 39410 13801 404612 -877857 -672316 -342944 40274
11695 40274 -1007964 -1242749 -1046716 -605664 51596 601442 349462 180837 234805 -191079
11685 -191079 104727 -546418 -1608690 -460967 37323 309262 613238 -349140 -524344
11676e24344k18091N22482l00670Q66493M32682j11382L9136q95151j257414q4928
11666a531187O68853L5480P77595M2752k71043j54812P3344M1107k77781O77641
11656H1949k05008O43267L80731N3937P08196j281516q28643Q17412o12182k87523
11646e29380K58442j001036O02364J31550J31679l0952L50812N41922l52016o23086
11636e19701l94710r8238N17412J26389N66633q3823p07552J22741p09130Q74721
11626c05258p19866m8854N84054k86598J1514J96733k87694l63072m287L89577
11616h33751l28571N65318Q279K69932m38081K4475Q50578p02733l1995j67455
11606g84004Q1758J8609O38672K08341m366L55095n92474N7551J4623q86897o43692
$$ plain form
11676 -524344 -742435 -219953 -520623 345870 778552 667170 706306 -188845 -1446259 -1531187
11666 -1531187 -862334 -826854 -49259 -6507 -277550 -432362 -359018 -317911 -595692 81949
11656 81949 -123059 520208 900939 954876 1663072 381556 -447087 370325 -241857 -529380
11646 -529380 -270938 -1271974 -669610 -538060 -406381 -437333 -86521 455401 103385 -519701
11636 -519701 -914411 -1012649 -495237 -368848 197785 113962 -593590 -470849 -1179979 -305258
11626 -305258 -1025124 -1073978 -489924 -776522 -765008 -568275 -855969 -1219041 -1223328 -833751
11616 -833751 -1162322 -597004 -588725 -318793 -756874 -732399 118179 -584554 -616549 -784004
11606 -784004 -702246 -683637 -44965 163376 159010 514105 -78369 -20818 -6195 -893092 -1536784
11595a536784N18724N42193O53881k26306j05568J14960j43785M66564n09276
11586b25397N77696M856k28098m49589M00530O73536Q54981J01906j090834j006074
11576c86487M05398M72637k72985l98044l4680R2037O91708k3416l60343l98713
11566b12888O21226p7008r93031P21592p9333L2398K03257j03844k42721P81190
11556F50838N8465L8824J99698p76271p76185l58836M00920J56898P01992J76135
11546D72478K33967j59601n04994o3985L7094O25844k35072l23667j7920L14471
11536C78615J92856O0592L99453n93514J92042L00740l43423j514496K70330K93155
11526c63650q28486O37253N56767O30707L17726m03660k42917P3932n02104J86102
$$ plain form
11595 -1536784 -1018060 -475867 178014 -48292 -153860 -38900 -182685 283879 -225397
11586 -225397 352299 357155 129057 -320532 79998 753534 1608515 1710421 619587 -386487
11576 -386487 18911 491548 218563 -179481 -214161 -122124 569584 546168 185825 -212888
11566 -212888 408338 331330 -661701 59891 -19442 12956 216213 112369 -130352 650838
11556 650838 709303 748127 947825 171554 -604631 -963467 -562547 -405649 296343 472478
11546 472478 706445 546844 41850 -22135 14959 640803 405731 82064 64144 378615
11536 378615 571471 632063 1031516 438002 630044 930784 587361 -927135 -656805 -363650
11526 -363650 -1192136 -554883 1884 632591 950317 546657 303740 377672 -124432 61670
11516F1670j69352L22786L25009m98847m12048k30264l49814O4295J142147O33994
11506H89576m77954O7945m1796L2619r05989P6110k26753l46594O89479K60489
11496A7132j20859k76744O9603K3309m63960j03515k68775J63480P06822J38570
11486a14937k29993P9441J58639o63463P6208K78662n9104K09389N93192l72232
11476d4198K59381k97386J20764N7648p55134L96147o9035L78840l17701m05896
11466f76570K27102j83581j15977k48624N7583J66266Q77725N72516n75068J48320
11456B49692n38752L04289L97894n2887o70006n04162K1376K89750O64958P16370
11446H78522j085410l98169k69184J29695M32410n0919l11009N39988P30020r43767
$$ plain form
11516 61670 -107682 215104 540113 41266 -370782 -601046 -950860 -886565 255582 889576
11506 889576 411622 479567 437771 470390 -435599 -359489 -586242 -932836 -243357 17132
11496 17132 -103727 -380471 -310868 -287559 -751519 -855034 -1123809 -960329 -253507 -114937
11486 -114937 -344930 -265489 -106850 -770313 -694105 -415443 -474547 -265158 328034 -44198
11476 -44198 215183 -82203 38561 96209 -658925 -262778 -331813 47027 -270674 -676570
11466 -676570 -449468 -633049 -749026 -997650 -940067 -773801 103924 676440 101372 249692
11456 249692 -289060 15229 413123 360236 -309770 -813932 -792556 -502806 162152 878522
11446 878522 -206888 -605057 -874241 -744546 -312136 -363055 -674064 -134076 595944 -347823
11436c47823o5751J24237Q21531P45852m58591K80174J88751j485050k37R58493
11426G61586j65963J22451L22848j190232p56219J31256J37061J157981q7580
11417D33189k74714j6442M0284O2655n2092j87695k92438n57554P18265j60734
11407b87276n48426J239625P7192j53678m57497K95472l27989r1738N40615L81534
11397F67834j058602N01050M11678R5266q94529n48566l5899J287803n56648J18028
11387a2585m0977k86195J33102P64684N92237p13161o20442O2874l0521Q19746
11377F68762M2964L02732r16512q08633k37216n16818P13379L53439J178672r04230
11367a23461L7311O52623K44167j69761R4152l37531j23350j65234L32868j46973
$$ plain form
11436 -347823 -413574 -289337 532194 1278046 819455 1099629 1288380 -196670 -196907 761586
11426 761586 595623 718074 1040922 -149310 -905529 -774273 -637212 520769 433189
11417 433189 158475 142033 182317 244972 192880 5185 -287253 -844807 -126542 -287276
11407 -287276 -835702 403923 481115 327437 -130060 165412 -162577 -254315 286300 667834
11397 667834 -390768 110282 521960 617226 -277303 -825869 -861768 426035 -130613 -12585
11387 -12585 -53562 -339757 -206655 558029 1150266 437105 -183337 -120463 -150984 668762
11377 668762 711726 1014458 97946 -710687 -947903 -1464721 -751342 -397903 780769 -123461
11367 -123461 -86150 566473 810640 640879 735031 397500 274150 108916 441784 294811
11357B94811n53472Q8432l69150J14144p05870k22868J052170J56587M66148j31432
11347A89500n08437K2006l7018J79285M99226j063746L07016N39844j94356J22608
11337E5928K02523o53909N79090L21026j86497L2959m45683Q182J94126M26977
11327E34722p22846l05922l63033M86397m1292k46708P36532l95202r9958M4583
11317c72727l0990l40324l23643K52677M57653P44437m83474p08588q9065J72237
11307g21807Q42820o26288L98933P15894o2876m32056q1279m0260J12537j81083
11297g5465K96401j66941k36560Q2805n64105Q5537K88003J18368O62663K04473
11287F95179j96599o23111N13574j18375l8744m04991J003691J12782L32715J10168
$$ plain form
11357 294811 -258661 -170229 -539379 -425235 -1131105 -1353973 -301803 -145216 320932 189500
11347 189500 -318937 -296931 -333949 -154664 344562 -719184 -412168 127676 -66680 55928
11337 55928 258451 -395458 183632 504658 318161 351120 -94563 -86381 107745 534722
11327 534722 -188124 -494046 -857079 -370682 -411974 -658682 77850 -317352 -417310 -372727
11317 -372727 -403717 -744041 -1067684 -815007 -357354 387083 -96391 -804979 -894044 -721807
11307 -721807 121013 -505275 -106342 609552 546676 114620 33341 -6919 105618 -75465
11297 -75465 220936 53995 -182565 -99760 -663865 -578328 -290325 -171957 490706 695179
11287 695179 498580 -124531 389043 270668 231924 -173067 830624 943406 1276121 1386289
11277A386289q10807r35228l52004J39958Q47838M978n25965J40487J06278j76108
11267a74284j30237R50239m61236k90140m59681K37029J88160O31976l70385j48533
11257b7092M83685M05705o39453O5958l98503J26668Q70010o55870r1683Q14788
11247I54213n58951n55288n3003j03905L16217P45133n10503n71923o29645L45494
11237f22161P5202k12499M94131J219869m38759q11347p0737K0144J279565p26326
11227B07082n33796O96179m66045k67082Q48556K8567j211043M66302M52248K96588
11217E17556m71899r33763M65567N59885K74608M79949j81297K95015J46859r85003
11207A67477L41365k61322n25763R03896p8200m66983l98937L07361k04536m2598
$$ plain form
11277 1386289 575482 -359746 -711750 -571792 276046 281024 -244941 -104454 1824 -174284
11267 -174284 -304521 645718 184482 -105658 -565339 -328310 -140150 491826 121441 -27092
11257 -27092 456593 862298 222845 288803 -109700 16968 886978 231108 139425 954213
11247 954213 395262 -160026 -213029 -316934 -717 744416 233913 -338010 -967655 -622161
11237 -622161 -546959 -759458 -265327 954542 515783 -295564 -366301 -346157 933408 207082
11227 207082 -326714 369465 -96580 -363662 484894 513461 -697582 -231280 220968 517556
11217 517556 45657 -888106 -422539 137346 411954 891903 710606 1005621 1152480 167477
11207 167477 508842 247520 -278243 625653 547453 80470 -318467 -11106 -215642 -258240
11197b58240J12017m7210N59943n8164m05330P94873k05116p73501K96233l1615
11187a6110M03052J7656q82660J24480K36027L93356k33688l96123R28007L72224
11177I46221o25013l66903O18202m05123L14228J42372l56697n07897n71335N44242
11167b67703k54714n9833l9009N56043M33211J75218J55297p48650q95203l98676
11157a344019O14159J72627k47708R6394J83779l00336N15608N04801J15069p4586
11147B35788o07797o33171j13145R44809K76487j07564j96325k21269n4721J98554
11137b78354J75038K29924j10192L12696K62145q15681P49689m40070R8758J31199
11127C15152P4472M34126N58010p51917o48025Q58572n62216j81777n46092L66136
$$ plain form
11197 -258240 -146223 -193433 366510 308346 -96984 697889 492773 -280728 15505 -16110
11187 -16110 386942 404598 -478062 -353582 -117555 275801 42113 -354010 573997 946221
11177 946221 321208 -45695 572507 167384 481612 623984 267287 -240610 -811945 -267703
11167 -267703 -522417 -582250 -621259 -65216 367995 543213 698510 -50140 -945343 -1344019
11157 -1344019 -729860 -557233 -804941 -708547 -524768 -825104 -309496 195305 310374 235788
11147 235788 -372009 -1005180 -1118325 -173516 102971 -4593 -200918 -422187 -476908 -278354
11137 -278354 -103316 126608 16416 329112 591257 -224424 525265 85195 183953 315152
11127 315152 389624 823750 1381760 629843 -18182 840390 278174 96397 -449695 -83559
11117h3559n87030O0399Q51547m74350K09064L64215j52819n49547K75949J29113
11107D2982K94251n39993M96850m10607o5966K54971k11228m70007k74995k3697
11097i07439j16652j13683M00883M76134P97911p04415l67161o5168J28741P37765
11087B66916K41151k75262j165576M10151P36146j98082o53381K69237M68318
11078I9618n42828O87J22258R97105K25974o99518m8363k92253o00656m12498
11068a150474J91140K80787L75402K199K67386K70190k43473l33781M11034M20488
11058D90898Q8483J68410p20073M99791L11983J00061j55438n37867n20227l3532
11048c07511N4378N64067R9244r69507m99245Q27485N05910p37638L25940m15238
$$ plain form
11117 -83559 -670589 -610190 241357 -232993 -23929 340286 187467 -362080 -86131 42982
11107 42982 337233 -202760 294090 -116517 -182483 72488 -138740 -608747 -883742 -907439
11097 -907439 -1024091 -1137774 -736891 -260757 537154 -167261 -534422 -599590 -470849 266916
11087 266916 508067 232805 -932771 -522620 213526 15444 -637937 -368700 99618
11078 99618 -443210 -442523 -320265 676840 902814 203296 154933 -137320 -737976 -1150474
11068 -1150474 -959334 -678547 -303145 -300946 -33560 236630 -6843 -340624 70410 490898
11058 490898 579381 747791 27718 527509 839492 939553 784115 246248 -273979 -307511
11048 -307511 -253133 310934 410178 -559329 -1058574 -231089 274821 -462817 -136877 -552115
11038e52115J468132Q31691o79752O74235J65909j041596k94791J84278n38061
11029B17930q69822K58955l79591j98395O00153P03017k13695Q37715j17725n35687
11019C02855J78921o62465l20758K31223R30046n21562n18421O2150k86514l67939
11009i72464N10784N03480m08680K63718N5136m55639P05644R582l07357k6174
10999a21970j54313M90738M09264j79408k33454M34760m03503n1825r23157O32675
10989a00193o21971Q65376o31043M12939j01632m7906P53644k72940o82440O45377
10979B19211k57296J7056P76970K72008p61907J84640j06973L22029j9957l37811
10969C07970K586m91290l2891L18751Q4261l29591Q4968q45641O05653n01627
$$ plain form
11038 -552115 916017 1747708 1067956 1742191 1908100 866504 571713 755991 217930
11029 217930 -651892 -392937 -772528 -970923 -370770 332247 118552 956267 838542 302855
11019 302855 481776 -180689 -501447 -270224 659822 138260 -380161 -318011 -604525 -972464
11009 -972464 -461680 41800 -366880 -103162 -48026 -503665 201979 211561 -95796 -121970
10999 -121970 -276283 214455 623719 444311 210857 645617 242114 190289 -732868 -100193
10989 -100193 -722164 143212 -487831 -74892 -176524 -224430 529214 256274 -426166 219211
10979 219211 -38085 -21029 755941 1027949 266042 450682 343709 665738 645781 307970
10969 307970 310556 -180734 -213625 105126 189387 -140204 -55236 -900877 -295224 -796851
10959g96851L63440O95478K83580m16421K79271l62079j30395q55949K44005L64420
10949c31501j9463o4242k35274l1304J417205q82336J3331J97314J26030l83330
10939a93570j82977m42119L47894L48970j56469k76297J38349M69387M3947m24424
10929c27309k67598K39501j47630L66126L06256j48848k77399K0243L30863j61463
10919f7258r7667m46015M06136j81815m61980l46702O44882K90877K96887J70221
10909B07566o70404j61705m11143K05768J21722L96234k07694M73727J30034n99306
10899e15201L34774K80509R7702n55670l03324O27016M84065J02071p07948J0182
10889a45824j99456j94224N32232O02924j63409o84083l69444O33679J086748
$$ plain form
10959 -796851 -433411 262067 545647 129226 408497 46418 -83977 -939926 -695921 -331501
10949 -331501 -350964 -415206 -650480 -681784 735421 -146915 -133584 63730 189760 -193570
10939 -193570 -376547 -818666 -470772 -121802 -278271 -554568 -416219 53168 97115 -327309
10929 -327309 -594907 -355406 -503036 -136910 169346 20498 -256901 -236658 94205 -67258
10919 -67258 -164925 -610940 -204804 -386619 -848599 -1195301 -550419 -259542 37345 207566
10909 207566 -462838 -624543 -1035686 -829918 -708196 -311962 -519656 -45929 84105 -515201
10899 -515201 -180427 100082 197784 -357886 -661210 -34194 449871 551942 -156006 -145824
10889 -145824 -345280 -539504 -7272 595652 432243 -251840 -621284 12395 1099143
10880A099143O34264p32049p08232k63057J09306l65278O00849n09888q4993R58538
10870G38603n02987m49250J81302P37377r87493Q1336R58512m1017p44408q56840
10860h84865J83347R570q2842M62738K24399L68128r1825m98510J36609J35687
10850c7564L86727j89571m00965N32990m2405o14595J43929J93575N02404n85862
10840a11337J91554Q2943j53559m07547Q4814M08033J26094Q1475l52572j47559
10830a97661N93367m32954r63894P42020L95833K93650R19806j08013j074328
10821A67826J38898l02845N3832l30076l8641Q02385N11090k55019k39473L51893
10811H59870m96044q75747J84281J58545Q33O11868k86947j1077j127402P00087
$$ plain form
10880 1099143 1733407 1001358 293126 30069 139375 -225903 374946 -134942 -219935 738603
10870 738603 235616 -213634 -32332 705045 -282448 -201112 757400 716383 -28025 -884865
10860 -884865 -701518 -691948 -774790 -312052 -87653 280475 188650 -309860 -173251 -37564
10850 -37564 349163 159592 -241373 291617 249212 -365383 -221454 -27879 474525 -111337
10840 -111337 80217 163160 9601 -397946 -313132 94901 220995 302470 -50102 -197661
10830 -197661 395706 -37248 -1001142 -259122 136711 430361 1350167 1242154 167826
10821 167826 306724 3879 57711 -272365 -311006 491379 1002469 747450 507977 859870
10811 859870 363826 -511921 -327640 -169095 -168262 443606 156659 145582 -981820 -281733
10801b81733K10078k18883P8568n89334K48838k38202J43237k93096P74468J62285
10791c774M30852l09954n16187m67023l88606K05370J32548P25403J2256m83545
10781f62660L61716q67443R419O03499J06130k22753m5803M87266n01602L11611
10771d20620o86808J099930K68522M34928L42682q51563o69827N70102L73726
10762D61072m06253n19554j41058n69061L23344M57523J35401P034J25996O2279
10752f3277O34847k24176q71745k63629j7481M5029L15606q0723L31834N25859
10742C32144l87532J85015k59488P08013J71612n11749k90205j63932M56855m94048
10732b53315r0673K37710j64049P37172j11393K3282l12661m95847N17284M82753
$$ plain form
10801 -281733 -71655 -290538 -211970 -801304 -552466 -790668 -647431 -940527 -166059 -3774
10791 -3774 427078 117124 -399063 -866086 -1254692 -1049322 -916774 -191371 -179115 -662660
10781 -662660 -300944 -1168387 -1158968 -555469 -449339 -672092 -717895 -230629 -732231 -420620
10771 -420620 -1107428 -7498 261024 695952 1038634 187071 -482756 87346 461072
10762 461072 54819 -464735 -605793 -1174854 -851510 -393987 -258586 -251552 -125556 -63277
10752 -63277 571570 347394 -524351 -787980 -805461 -760432 -444826 -525549 -193715 332144
10742 332144 -55388 129627 -129861 578152 749764 238015 -52190 -216122 240733 -253315
10732 -253315 -343988 -106278 -270327 466845 355452 378734 66073 -429774 87510 570263
10722E70263l70179O01569q11383m51603M27091o39556L20K0971l0540K92600
10712c90447k28884J497032o97377R0063P75750r2698o41842m45092N91620l10345
10702A47780M93538p4715j242576N10527K12650J19377M15066o4823m39214k66742
10692a89132P0171p2617l553P9840q53499p6100P24275J021114J24661p11172
10682A13988p30576K18480K83149M12924O07441o53587l41814K07034j41233N60388
10672E36194J20047r6856K30639K4186o26145m58568R70523J77194n91131n96387
10662c10304K50561m65935K6197N53883k8829m07003J37790k77831M51410j30706
10652b00767j61584J028758p6640r88875M74468K51533n48940O55383M73951J08690
$$ plain form
10722 570263 200084 801653 -9730 -461333 -34242 -673798 -673478 -652507 -683047 -390447
10712 -390447 -619331 877701 180324 270387 1046137 953439 311597 -133495 458125 147780
10702 147780 641318 566603 -675973 -165446 47204 166581 581647 516824 77610 -189132
10692 -189132 -118961 -191578 -195131 -115291 -968790 -1044890 -320615 700499 825160 113988
10682 113988 -616588 -398108 -114959 297965 905406 251819 -89995 117039 -24194 536194
10672 536194 656241 559385 790024 814210 188065 -270503 700020 877214 286083 -310304
10662 -310304 -59743 -525678 -499481 54402 25573 -381430 -243640 -521471 -70061 -200767
10652 -200767 -362351 666407 589767 -399108 75360 326893 -222047 433336 907287 1015977
10642A015977o50902p42244K91335M68159k10155J89945O09542j387610m49288
10633h65241R71415M52478q0092k91263r58567j08538P02831O47385p61155J88178
10623a02569P59998j25319j50974K28163j92536L43949p18862n98468M50420N04996
10613C98798J09036r22371o34911Q55885P55135l80188l7194k33682q14615K39427
10603f64680Q79689j90648M17851K75893L25627j138893j52467m28335R66934
10594B90971N06264l36902k07654k79035l69934o16139L38024K47577K06383n30665
10584g51110J28297L49515L58288j743n33057p25963M04712K22111p2726L24390
10574b97286m25677J03208K02547P34889L73698o91949j93759k28l7157r545O14596
$$ plain form
10642 1015977 365075 -377169 -85834 382325 172170 362115 971657 -415953 -865241
10633 -865241 106174 558652 478560 187297 -771270 -879808 -176977 470408 -290747 -102569
10623 -102569 657429 532110 381136 609299 416763 760712 41850 -556618 -106198 398798
10613 398798 507834 -414537 -1049448 -193563 561572 181384 144190 -89492 -904107 -664680
10603 -664680 215009 24361 442212 718105 1043732 -95161 -247628 -675963 290971
10594 290971 797235 460333 252679 -26356 -396290 -1012429 -674405 -426828 -220445 -751110
10584 -751110 -622813 -273298 84990 83247 -449810 -1175773 -771061 -548950 -621676 -297286
10574 -297286 -722963 -619755 -417208 317681 691379 -570 -194329 -194557 -231714 -241259 373337
10563C73337J369446o15618j045243j85067p05975M86515O661K89494n47427M71570
10553a02307o50380Q48786L38263n92258M67206L3701L61911p37502l93657N10874
10543H4637J73217O15201K95992l06742M82713j171380m18358O34437O20622P66933
10533A777272q0718p73957l23799q28135J95594l50777N45668N1543L13919K6033
10523E52643l16774k31673o62431K1198L27194L66179J17964N10239k49377O51397
10513A086559K40298o58876M24195N85503o42000q89144p80871K38576K94532
10504a01228R4110J94755L9496k13148j068583K25307R23845o6014p86191l14452
10494a072103J136606n79575J88619J400513K76797j046770K64420l3152p3613
$$ plain form
10563 373337 1742783 1127165 81922 -103145 -809120 -322605 -315944 -26450 -573877 -102307
10553 -102307 -752687 96099 434362 -157896 309310 343011 704922 -32580 -426237 84637
10543 84637 257854 873055 1169047 862305 1345018 173638 -244720 389717 1010339 1777272
10533 1777272 1696554 922597 598798 -229337 -33743 -384520 161148 212691 526610 552643
10523 552643 235869 4196 -658235 -637037 -309843 56336 174300 684539 435162 1086559
10513 1086559 1326857 667981 1092176 1677679 1035679 146535 -634336 -395760 -101228
10504 -101228 -7118 187637 227133 13985 -1054598 -829291 94554 28540 -757651 -1072103
10494 -1072103 64503 -515072 -326453 1074060 1350857 304087 568507 535355 461742
10485D61742l49824R3265J15554l06150O3628N83756J79881q57709K56589j206291
10475i65559K09652N49269M22369M5582k80518k86956K60940j26305L95000k68763
10465d5289j08897r82059N41039J103264Q25508m80463q11801l49953l9680K76369
10455g1962j24438m5231L88825l24582l25529l85996J17058O54764k21614J087593
10445G48888j11578j15695m87819k66962O50545o6302M38190j07904j001895M74054
10435A53522L2068N26224o4522O74596n8834n70555p10311j23225j69745l41366
10425f52148Q81324M07207k09085K83317l88717m18547k93883n0289Q15023m79347
10415a05145O89438Q6962J49862O69046K78300j221289l55584m12823l83815O20024
$$ plain form
10485 461742 111918 205183 320737 14587 78215 661971 841852 -15857 240732 -965559
10475 -965559 -755907 -206638 215731 261313 -19205 -306161 -45221 -171526 223474 -45289
10465 -45289 -154186 -1136245 -595206 508058 1333566 853103 41302 -308651 -348331 -71962
10455 -71962 -196400 -241631 147194 -177388 -502917 -888913 -771855 -117091 -338705 748888
10445 748888 637310 521615 33796 -233166 417379 351077 789267 681363 -320532 153522
10435 153522 185590 711814 647292 1321888 1263054 692499 -17812 -141037 -310782 -652148
10425 -652148 229176 636383 427298 710615 321898 -96649 -390532 -440821 374202 -105145
10415 -105145 584293 671255 821117 1490163 1768463 547174 191590 -221233 -605048 14976
10405A4976K4312M63761p00556L02174O55673m87938l82575j26998M13848L24561
10395E01238k37842L38807l51276K18241K66381l27050J49428P74923p55363j118357
10385e40870l15809J144485q6753o86008N6470J95664M82198K75641n59033m61243
10375d95258J37136k36226l9145K71567N84669m43502N32364j60862j83064N47352
10365E15031m11012j135107j4480P03532J032213k30644r35201P33643k93306
10356c5331j62840k50828j75495J26476P76371J85962n57113n23908L06308l72444
10346f82842m27938Q96954k96726j04718n96060r8535O36430P21330N77428n75742
10336D9581j57584j26899q32054K22857K87995k24985L37736m02383M09303K98276
$$ plain form
10405 14976 39288 503049 -197507 104667 760340 272402 -110173 -237171 176677 501238
10395 501238 263396 602203 250927 469168 735549 408499 557927 1332850 577487 -540870
10385 -540870 -856679 287806 201053 -484955 -428485 -232821 249377 525018 -34015 -495258
10375 -495258 -358122 -594348 -633493 -361926 222743 -220759 311605 150743 -32321 515031
10365 515031 104019 -1031088 -1045568 -342036 690177 459533 -475668 257975 -35331
10356 -35331 -198171 -448999 -624494 -498018 278353 464315 -92798 -616706 -310398 -682842
10346 -682842 -1110780 -213826 -510552 -615270 -1211330 -1309865 -673435 47895 625323 49581
10336 49581 -108003 -234902 -1066956 -844099 -556104 -781089 -443353 -845736 -436433 -138157
10326a38157M15459j46103N2491J22369m01608J76507k53771R1695N97546J24415
10316F40843J83733N16920p48533l11522o73297M35145j97953L21408K29579N81703
10306I78026J7069P90M04005q4931K2525j224192K40494p7496K77038J27091n57787
10295A22632M35086j81017q51455k75433N17809K77974L32888N21112k8307K59342
10285A130631m47051q60573J72406N34644N366M05311M17526j293053n09324M65805
10275B1688J3571M59904M46608J62393m27331r03025L11237L44087M89306o13235
10265C05203j30124l14974N71348m47438m76405J19l42708n6413l83416J176017
10255i8791m01906M20063K10852q66550N39487J23524q4636n77J55782N97623
$$ plain form
10326 -138157 277302 131199 183690 306059 -95549 80958 -172813 -81118 516428 640843
10316 640843 824576 1341496 592963 281441 -391856 43289 -154664 166744 396323 978026
10306 978026 995095 995885 1399890 1314959 1337484 113292 353786 276290 553328 680419 122632
10295 122632 557718 376701 -474754 -750187 -232378 45596 378484 899596 871289 1130631
10285 1130631 683580 -176993 -4587 530057 535423 940734 1358260 65207 -444117 21688
10275 21688 35259 495163 941771 1104164 676833 -226192 85045 429132 918438 305203
10265 305203 175079 -139895 431453 -15985 -492390 -492271 -834979 -891392 -1274808 -98791
10255 -98791 -500697 -80634 130218 -736332 -196845 -73321 -157957 -158534 -2752 594871
10245E94871M90612m94458q2709K93077p0035l16794m5880n15766m18536M47129
10235a18489j44347N52922J12863r56829K75578P18740j12042n21999p06961J195102
10225B94538L20530k34001m18571J026787L6148l52998k76214l3308q30310O3660
10215d03739j58771M82796M86987j09909Q1407j33757R9487q62728K92172j46775
10205c72830k35872R6347O1646J98816j62406N68776N49041o9569j90555n82173
10195a38779n59107o19428R20773n7056k65124N24991O98792J36877p17355o68868
10185g44284M65198N21227M67552R6950p12417p78061n424L79784Q93974M264
10175E88763j26577L27165o47555J78017n93549j95374N49140j11140m9280N91464
$$ plain form
10245 594871 1085483 591025 508316 801393 731358 414564 368684 -147082 -565618 -118489
10235 -118489 -262836 290086 402949 -553880 -278302 440438 328396 -193603 -900564 294538
10225 294538 615068 381067 -37504 989283 1025431 672433 396219 362911 -467399 -403739
10215 -403739 -562510 -79714 407273 297364 378771 245014 344501 -518227 -226055 -372830
10205 -372830 -608702 -512355 -450709 -251893 -414299 154477 703518 633949 443394 -138779
10195 -138779 -697886 -1317314 -396541 -453597 -718721 -193730 505062 641939 -75416 -744284
10185 -744284 -279086 242141 709693 806643 94226 -683835 -689259 -309475 584499 588763
10175 588763 462186 789351 141796 319813 -273736 -469110 80030 -31110 -80390 511074
10165E11074j82957l63729P13506k36135N90372n58000m84482J44446L13736l77402
10155G0429p95629R80025l74072l38680j33321j05058N65090l73036M65658o39115
10145f77709j60345R59353P14498j8258j070931r03045P28527J43298j53793q8462
10135e26867l61110J146557m42217m38258R8501o8049N26310K47695o66051n02203
10125i85692l1629N75476P27265l01993m85732P70066K33890J29647m30268p42948
10115e41918N19624K70127p809K7993k66347n1607M67356k90663N4139K31624
10105D12519r52654M19049Q55019n53185j7369m09079k45399O94822l93798N96997
10095D06922K737P78436o1375o33736K56979n79553l33665R79260o81439j07023
$$ plain form
10165 511074 328117 -35612 677894 441759 1032131 474131 -10351 134095 447831 70429
10155 70429 -725200 254825 -119247 -457927 -591248 -696306 -131216 -504252 -38594 -677709
10145 -677709 -838054 121299 835797 817539 -253392 -1156437 -427910 -284612 -438405 -526867
10135 -526867 -887977 258580 -183637 -621895 -523394 -591443 -65133 182562 -483489 -985692
10125 -985692 -1017321 -441845 285420 -16573 -502305 267761 501651 631298 201030 -541918
10115 -541918 -22294 247833 240024 268017 1670 -49937 417419 126756 180895 412519
10105 412519 -540135 -121086 733933 180748 163379 -245700 -491099 203723 -190075 406922
10095 406922 409659 1188095 1126720 492984 749963 170410 -163255 816005 134566 27543
10085B7543K93850j57005K97670l24282K60947M52634n47939J45216K01080j233800
10075e84086N10592j72684P46917L71227o26461K6741L53733L93690L65433p91828
10065E93274K35300l07107j134277m65103M11286J116118O2524j18725n34650
10056a41360n72178R0061P25163N76585L2318l88746M36184L83010p04123N36937
10046I73851j020831Q6380R07848j09999o37227k12488P32489j07814j66552k4981
10036D20676N78356Q5025j32091p11185q66578M90613L6637Q38220K51680k91135
10026G00218J35486o02511l94552P99832Q63276p87057n02889p62853R16454l81589
10016a6185m16169j18714m3460N59856k4925O1565k64601J36912Q6560P4424K95719
$$ plain form
10085 27543 321393 164388 462058 137776 398723 851357 303418 448634 649714 -584086
10075 -584086 -73494 -246178 500739 871966 245505 272246 625979 1019669 1385102 593274
10065 593274 828574 521467 -612810 -1077913 -666627 449491 512015 393290 -141360
10056 -141360 -713538 -623477 101686 678271 710589 321843 758027 1141037 436914 973851
10046 973851 -46980 39400 947248 837249 200022 -12466 720023 612209 445657 420676
10036 420676 999032 1084057 951966 240781 -625797 -135184 -98547 739673 991353 700218
10026 700218 835704 233193 -161359 638473 1501749 714692 211803 -551050 365404 -16185
10016 -16185 -432354 -551068 -594528 -34672 -59597 1968 -262633 -125721 -39161 35263 330982
10005C30982O78169J45300q80253L78283k73618R0240J02702k12693J22268o3700
9995D17680o20089R8811M63994J78314n7169r8212K99427k22628n53754n64342
9985f57968J2186O35157O00138M33491L87381r13480k06658K5247M4102j72992
9975A86604l96817K29327K26677K36335n94030L32670q0756o10334Q62996O22145
9965A014817p46538q23130P22196N35455n53202J9079K85849J25043O38626l43140
9955H75055l03339l10152j75153M61058L35503j33239J15850O53212n91951k36270
9945F90574P54230k75240k17785M28442J21629m29920n143k45985L41874M13983
9935A576659j145105j031404J248650N13619p38365q10182Q67573R66811j75451
$$ plain form
10005 330982 1009151 1154451 274198 652481 378863 469103 571805 359112 481380 417680
9995 417680 -202409 -103598 360396 538710 481541 383329 682756 460128 -93626 -657968
9985 -657968 -645782 -10625 589513 1023004 1410385 496905 290247 315494 359596 186604
9975 186604 -210213 19114 245791 482126 -111904 220766 140010 -470324 392672 1014817
9965 1014817 268279 -554851 167345 702800 149598 168677 454526 579569 1218195 875055
9955 875055 571716 261564 86411 547469 882972 749733 865583 1518795 926844 690574
9945 690574 1444804 1169564 951779 1380221 1501850 1071930 1066787 820802 1162676 1576659
9935 1576659 431554 -599850 648800 1162419 424054 -386128 481445 1448256 1272805
9926A272805R7269K82897m9014m73896M00876o07129J96102j09775n28646L13956
9916G95445K27601N47563K37690K67826K02183M10050Q6158K61573n2789l10528
9906B672772o83014j66809M19572J187135k90296q91900L38404k01646K66193
9897B650411j78926p36798L16563k82534m36561N57524P65279m48680o54073J14400
9887A666605n36346J18317j84513q68077O00867M18841O85804j201973n33878
9878A65647O09729m03034L21391M10918Q97320m73916o14770l95553N85432j92394
9868I10770r7860m71799m90269P66748J76944m14938N15061Q40621n41328m58835
9858G35115k29886K56038L7388Q42199q43963k30612K53239k17729Q40288l31303
$$ plain form
9926 1272805 1370074 1652971 1603957 1130061 1530937 923808 1119910 1010135 481489 795445
9916 795445 1023046 1570609 1808299 2076125 2278308 2688358 2774516 3036089 2983300 2672772
9906 2672772 1989758 1822949 2242521 3429656 3139360 2247460 2585864 2384218 2650411
9897 2650411 2471485 1734687 2051250 1768716 1332155 1889679 2654958 2206278 1552205 1666605
9887 1666605 1130259 1248576 1064063 195986 796853 1215694 1901498 699525 165647
9878 165647 775376 372342 693733 1104651 2001971 1528055 913285 517732 1103164 910770
9868 910770 812910 341111 -149158 617590 794534 379596 894657 1735278 1193950 735115
9858 735115 505229 761267 798655 1640854 796891 566279 819518 601789 1442077 1110774
9848A110774l45035q4138M39515l23218o41515M72977P14950k86875P36352o88860
9838A104927p25000J32031K42615m68213K8985R55517J65606q58936j93298K264
9828C86498N11279K57977K72518q7766k17628Q59456L35736j19629m70240Q5835
9818A814036P41088p76930o91947N32275Q78646k25706q04515n31735L31381r1012
9808A175581l17221L33302n9263J88583K18186n02683q9646k27598m17184L75365
9798F77422K24086l53429M46225N34314m42058M47815N51568K35536p10996l26286
9788A284197m34727k5184M52787N64166M36966o31966l43520P55635n5166r39498
9778A063690P51386j66094k61850O74536r74198k82800M63039L8000j0529q8871
$$ plain form
9848 1110774 765739 681601 1121116 797898 156383 629360 1344310 1057435 1793787 1104927
9838 1104927 379927 511958 754573 286360 315345 1270862 1436468 577532 384234 386498
9828 386498 897777 1155754 1428272 1340506 1122878 1982334 2318070 2198441 1728201 1814036
9818 1814036 2555124 1778194 1086247 1618522 2497168 2271462 1466947 935212 1266593 1175581
9808 1175581 858360 1191662 1132399 1320982 1539168 1036485 946839 719241 302057 677422
9798 677422 901508 548079 994304 1528618 1086560 1534375 2085943 2321479 1610483 1284197
9788 1284197 849470 824286 1277073 1841239 2278205 1646239 1302719 2058354 2003188 1063690
9778 1063690 1815076 1648982 1387132 2061668 1087470 804670 1267709 1305709 1295180 1206309
9768A206309P68284k55517k12239P76004L13136o85773n07167J08626M08905o0077
9758A860491p48729M55437l48818O21026K01003N5477p7347J84116o01260J23461
9748A724857R98482o69746m71618O89309J64754l2261k87787R57783q82423m24655
9738A766695O98957N76852j68827l76102O4692K30201o1661n29183j09997P49255
9728B840882j093933M8883Q50423M01760K65640o18624n59772P08657O98689n35289
9718C007316O33752k90950J22535j001201K43342J70438N86902j30556l35201
9709C006377P18400m50989j6540L8502K2645O2984o661j28559P54248K83982n47322
9698C737067l51156l07173P63112L34637k56152m03139n2253m58614m02751j59762
$$ plain form
9768 1206309 1974593 1719076 1506837 2282841 2595977 1910204 1403037 1511663 1920568 1860491
9758 1860491 1111762 1567199 1218381 1839407 2040410 2095887 2018540 2202656 1601396 1724857
9748 1724857 2723339 2053593 1581975 2271284 2436038 2403777 2115990 3073773 2191350 1766695
9738 1766695 2465652 3042504 2873677 2497575 2562267 2792468 2730807 2201624 2091627 2840882
9728 2840882 1746949 1795832 2646255 3048015 3313655 2695031 2135259 2843916 3542605 3007316
9718 3007316 3641068 3350118 3472653 2471452 2714794 2885232 3472134 3341578 3006377
9709 3006377 3724777 3273788 3257248 3295750 3318395 3381379 3374718 3246159 4000407 4284389 3737067
9698 3737067 3385911 3078738 3841850 4176487 3920335 3517196 3464943 3006329 2603578 2443816
9688B443816O00311M09197J369424j24077o47374J07871L88693L65077n27326
9679D385612l21733m23198m2003Q2876M00576j00366L19306J39525n49422j9378
9669C871795O08089M48663J00808M76303l6465K75931N4201o58102k89293k27653
9659D624277k04627L66002k66058N41064N26875O22621J65755m0517N13477j77990
9649F670879J021084L22511o98145K2448L99867P16116n10032m06728M84210J021002
9639I043212J62874m46483p02573K62440J223930N52384m80397K69229K43153
9630A0127769n45041Q06229N37759R82422J22231K41958J30529K88746M98510
9621A3191112R7269J51417N93788Q47977J97122R4134j22613J620253k38257J86575
$$ plain form
9688 2443816 3044127 3453324 4822748 4698671 4051297 4159168 4547861 4912938 4385612
9679 4385612 4063879 3640681 3598678 3681554 4082130 3981764 4301070 4440595 3891173 3871795
9669 3871795 4479884 4928547 5029355 5505658 5469193 5745124 5799325 5141223 4851930 4624277
9659 4624277 4419650 4785652 4519594 5060658 5587533 6210154 6375909 6335392 6848869 6670879
9649 6670879 7691963 8014474 7316329 7338777 7738644 8454760 7944728 7538000 8022210 9043212
9639 9043212 9206086 8759603 8057030 8319470 9543400 10095784 9615387 9884616 10127769
9630 10127769 9582728 10388957 10926716 11909138 12031369 12273327 12403856 12692602 13191112
9621 13191112 13288381 13439798 14033586 14881563 15078685 15172819 15050206 16670459 16432202 16618777
9611A6618777R46136Q74288j13269N47210P25558O7208J200593N06217n50656
9602B0822062m67638M80250Q24420P27994O52535J423505L72284O57999J187084
9593B6680495L67082n33079J435514P43200Q30772R78759J128188J253779J852732
9584C4737442P33721Q62896J626447K560735K901482K701336K972913L481284
9576E2578256L916242L424263N457090O766271O641657P103967P531290P023523
9568A00442559M770454K635496J218217k42451J407704K307815M256686L916987
9560A20713467K278574J520761j719140l270572l237890l265372k576740j910349
9552A08532739m11156R37836K026773K484805L039181O611969P139903Q291930
$$ plain form
9611 16618777 17564913 18439201 18325932 18873142 19598700 19665908 20866501 21372718 20822062
9602 20822062 20354424 20834674 21659094 22387088 23039623 24463128 24835412 25493411 26680495
9593 26680495 27047577 26514498 27950012 28693212 29523984 30502743 31630931 32884710 34737442
9584 34737442 35471163 36334059 37960506 40521241 43422723 46124059 49096972 52578256
9576 52578256 56494498 59918761 65375851 72142122 78783779 85887746 93419036 100442559
9568 100442559 105213013 107848509 109066726 108824275 110231979 112539794 116796480 120713467
9560 120713467 122992041 124512802 122793662 119523090 116285200 113019828 110443088 108532739
9552 108532739 108121583 109059419 111086192 113570997 116610178 123222147 130362050 138653980
9544A38653980R236953J1799836J4600505J8143659K2674338K6793010K8555931
9537B70458212K4909129J7159993O061442l555740j1032229j1991060n760780
9530B86248967J788679P686482R271664N111873o043716j9040346k8491675l2767938
9522B23763990l2046373k6377095k1344580j7880270j4021872j2350343j0433810
9515H9309647q612624p673287o630322n505381n002049l549614m340674l795570
9507D4200126l050934k849771k108301j281636j679126k587047j737017j319882
9499B7586412k005213j49887r26479j469384j209431j609696q91011m36530j263096
9490A7625685p58335l08766j143638L10144j255229p97740n12043n21779k61210
$$ plain form
9544 138653980 147890933 159690769 174291274 192434933 215109271 241902281 270458212
9537 270458212 295367341 312527334 318588776 315033036 304000807 292009747 286248967
9530 286248967 288037646 295724128 304995792 310107665 304063949 285023603 256531928 223763990
9522 223763990 191717617 165340522 143995942 126115672 112093800 99743457 89309647
9515 89309647 80697023 73023736 66393414 60888033 55885984 52336370 47995696 44200126
9507 44200126 41149192 38299421 36191120 34909484 33230358 30643311 28906294 27586412
9499 27586412 25581199 25431312 24504833 23035449 21826018 20216322 19325311 18888781 17625685
9490 17625685 16867350 16558584 15414946 15725090 14469861 13672121 13160078 12638299 12377089
9481A2377089j21351l88942j161288k10929j19687m7076j94059M2386l89603n48782
9471I237758p62144k21075k31978R4484O70860M20452j286730K19978k33395n12966
9461G395244l50323M83635Q5136p81334K3205r3296K42479p1543m84602p2369
9451F376232K35676L77174L71253K5466o8854r66571r0814Q35308j08961p18247
9441F267662k88366m98293N76338n8841n88024K47217k77715N22091L61792n50983
9431E712878j49808j93418l33564m99380Q27644K61745N41147j46806m9925J75788
9421F146301j69932j07403L61203R76751o53308J32260k08787p73527J69478l61110
9411E511926L47561k81390K76200m24324J04484R3579j73714j92093O50025k89914
$$ plain form
9481 12377089 12255738 11866796 10705508 10494579 10374892 10327816 10133757 10176143 9786540 9237758
9471 9237758 8475614 8254539 8022561 8117045 8787905 9208357 7921627 8141605 7908210 7395244
9461 7395244 7044921 7528556 7613692 6832358 6855563 6762267 7004746 6933203 6448601 6376232
9451 6376232 6611908 6989082 7360335 7385801 7316947 6350376 6259562 7094870 6985909 6267662
9441 6267662 5979296 5481003 6057341 5998500 5410476 5657693 5379978 5902069 6263861 5712878
9431 5712878 5563070 5369652 5036088 4536708 5364352 5626097 6167244 6020438 5970513 6146301
9421 6146301 5976369 5868966 6230169 7206920 6553612 6685872 6477085 5703558 5873036 5511926
9411 5511926 5859487 5578097 5854297 5429973 5534457 5628036 5454322 5262229 5912254 5622340
9401E622340L44145j87655l44335M84518k18958P2751J0043r01135k59842K48746
9391D870618l87630Q22562J47331M2362j115211R5572K19029m4405k23292n45418
9381C881518J3128L3612Q03682P54211j13626r11293k77836J95761k99059j23596
9371C956502l25433J10474M70240o67093o30852L44569M98801P5700Q39365m93079
9361D179194m56155m83879K71161M07119K18645R82018m13942j74782j495028
9352C034351J218179L21206J71721m79629J73709R58386j27819p09986j92148
9343D367970m95348J05111j75945K45238O09506k71905N97145J07807o23822J02011
9333D567768M00628J46731M07908r4888Q8020O19217M15004K38780o47881j86467
$$ plain form
9401 5622340 5966485 5778830 5434495 5919013 5700055 5772806 5782849 4881714 4621872 4870618
9391 4870618 4482988 5305550 5452881 5495243 4380032 4475604 4694633 4650228 4426936 3881518
9381 3881518 3894646 3928258 4731940 5486151 5372525 4461232 4183396 4379157 4080098 3956502
9371 3956502 3631069 3741543 4211783 3544690 2913838 3258407 3757208 3832908 4672273 4179194
9361 4179194 3723039 3239160 3510321 3917440 4136085 5118103 4704161 4529379 3034351
9352 3034351 4252530 4573736 4745457 4265828 4439537 5397923 5270104 4560118 4367970
9343 4367970 3872622 3977733 3801788 4047026 4656532 4384627 4981772 5089579 4465757 4567768
9333 4567768 4968396 5115127 5523035 5428147 5516167 6135384 6550388 6789168 6141287 5954820
9323E954820M1364j51479J142981J08486J20764q6442J368067L11943m61750m88254
9313G860500o39464N69599Q8405j32847r9230j02187L95071K05096j9190l83054
9303G742699Q0150m29020j90262N92309Q08697J71155K0583P39263k63584M3619
9293I315609O91492P73472O11878n69427k1008L04098N40575J479637j87581l85186
9283A2553559M65486L15654l49120J643598O59991P34848J338424O81056Q69661
9274A8913157J064610J089084N11487O51868J619056J100093M26536j24515O82708
9265B5934084N18605K75047R35264O14570J719076N72276J172217J358674K746518
9256C5846331J535276K443300K462583K107360K259525K397587K198183L083717
$$ plain form
9323 5954820 5996184 5844705 6987686 7096172 7216936 7130494 8498561 8810504 8348754 7860500
9313 7860500 7221036 7790635 7879040 7746193 7646963 7544776 7939847 8144943 8125753 7742699
9303 7742699 7822849 7393829 7203567 7795876 8604573 8775728 8796311 9535574 9271990 9315609
9293 9315609 10007101 10780573 11392451 10823024 10802016 11106114 11646689 13126326 12938745 12553559
9283 12553559 13019045 13334699 12985579 14629177 15289168 16024016 17362440 18043496 18913157
9274 18913157 19977767 21066851 21578338 22230206 23849262 24949355 25375891 25251376 25934084
9265 25934084 26452689 26727736 27663000 28277570 29996646 30568922 31741139 33099813 35846331
9256 35846331 37381607 39824907 42287490 44394850 46654375 49051962 51250145 54333862
9248E4333862L728405N333603N095828N912292Q385876R500746J0820616J3400034
9240A16511262J5452759J9034057J8760621J5842904J0863974J257200p279473
9233A90443304j4730734j7931977j7594759j5665257j3301068j0445080r238507
9226I1535922o618276m455125n096347l469741j976740j335080o77829n03567
9218F7403217N38731K04065J632183K443730J725581J386064K185217L042872
9210H0561660L463218M724810O124640O454191P702378R324180J1550745J3481133
9202A43386955J7033538K1299356K5742440K9380966K8699960K3803212J1941916
9195C01288343k623072j7056146k9298812l3259399l1959440k6268440k1699786
$$ plain form
9248 54333862 58062267 63395870 68491698 74403990 82789866 92290612 103111228 116511262
9240 116511262 131964021 150998078 169758699 185601603 196465577 197722777 190443304
9233 190443304 175712570 157780593 140185834 124520577 111219509 100774429 91535922
9226 91535922 84917646 80462521 75366174 71896433 69919693 68584613 67906784 67403217
9218 67403217 67941948 68146013 69778196 72221926 73947507 75333571 77518788 80561660
9210 80561660 84024878 88749688 94874328 101328519 109030897 118355077 129905822 143386955
9202 143386955 160420493 181719849 207462289 236843255 265543215 289346427 301288343
9195 301288343 298665271 281609125 252310313 219050914 187091474 160823034 139123248
9188A39123248j7912347j4578752j1927737r901825q692603o586351n138700n616244
9180E8768689m927350m021257k306458k905760l065865k374936j540383j339961
9172C6286719j554476j202553r65155m78496j433157j668576p17996m23116J56446
9163B7999640r33639k32782q462j090468j173249j15778k39530o28286k03306
9154B3374140L61223O74325j614643m07924J069631K52261q78977p099j38023
9145B2684914j13937M1124O24231M43273L48810N98519O90015J048215P71922
9136B7137086R61286K640748J450580N19970J335022J665323K368811J577211
9128C9656037J519076K87132K31072k89901j57746Q21064Q75895J018876J539505
$$ plain form
9188 139123248 121210901 106632149 94704412 84802587 76109984 69523633 64384933 58768689
9180 58768689 53841339 49820082 47513624 44607864 41541999 39167063 37626680 36286719
9172 36286719 34732243 33529690 32564535 32086039 30652882 28984306 28266310 27843194 27999640
9163 27999640 27066001 26833219 26824757 25734289 24561040 24445262 24205732 23577446 23374140
9154 23374140 23735363 24409688 22795045 22387121 23456752 23709013 22830036 22822937 22684914
9145 22684914 22570977 22612101 23236332 23679605 24028415 24626934 25316949 26365164 27137086
9136 27137086 28098372 30739120 32189700 32709670 34044692 35710015 38078826 39656037
9128 39656037 41175113 41462245 41693317 41403416 41245670 42066734 42942629 43961505 45501010
9119D5501010L67692K28254Q11772p79475n61791n9116O36787j14305j89531Q69223
9109D6710520P28322Q04863K263514J984534K682912K682074J545163K476138
9101F1878040L144479K544744L891010L841679K820283M075167N405316O799559
9093I4400277P093351Q509812J0255459J0619088J1439040J0151106R100424Q673981
9085A70242538J0131656J4380293J8044496K3033741K4228249J7551475M490942
9078B82103390j0792766j7363694j4478379q661693k045568L158609P861949N844185
9070B45626033j933700j2591411k1721894k3150789j9247273j5297038j1204604
9063A40479324p928635p442228n327101m209466k325983j015939k73530L62158
$$ plain form
9119 45501010 45868702 46096956 46908728 46129253 45567462 45508346 46145133 46030828 45841297 46710520
9109 46710520 47438842 48243705 50507219 52491753 55174665 57856739 59401902 61878040
9101 61878040 65022519 67567263 71458273 75299952 78120235 82195402 87600718 94400277
9093 94400277 101493628 110003440 120258899 130877987 142317027 152468133 161568557 170242538
9085 170242538 180374194 194754487 212798983 235832724 260060973 277612448 282103390
9078 282103390 271310624 253946930 239468551 230806858 228761290 231919899 239781848 245626033
9070 245626033 243692333 231100922 209379028 186228239 166980966 151683928 140479324
9063 140479324 132550689 125108461 119781360 115571894 113245911 112229972 111956442 112318600
9055A12318600K817525L943513M881726P436842Q500507R231023Q563905O131533
9047A63825174L934445K606657J173037k87846P35400N251323O632242K463071
9039A86333503l863507j0087312j1953310r247153n339611o72051J613881K188405
9031A48972845K441971l452829r774363j4395718j4243952j2472394r612748o653195
9023H0809617o132070n433178n069870l606990l090378k331022j805294j594488
9015E1746327m46761k79376J27154N82121R44030J337862L95461q53470k998793
9006E0554555j882471l607300k771982l071661k479364j675213j338641j825721
8998C1902202k089716j371056j262747o84993j530518j263565J63384p53119j153249
$$ plain form
9055 112318600 115136125 119079638 123961364 131398206 139898713 149129736 157693641 163825174
9047 163825174 167759619 170366276 171539313 171251467 171986867 177238190 183870432 186333503
9039 186333503 182469996 172382684 160429374 151182221 145842610 145170559 146784440 148972845
9031 148972845 151414816 147961987 138187624 123791906 109547954 97075560 87462812 80809617
9023 80809617 74677547 69244369 64174499 60567509 57477131 55146109 53340815 51746327
9015 51746327 51299566 51020190 51147344 51729465 52673495 54011357 54406818 53553348 50554555
9006 50554555 48672084 45064784 42292802 39221141 36741777 35066564 33727923 31902202
8998 31902202 29812486 28441430 27178683 26493690 24963172 23699607 23862991 23109872 21956623
8989B1956623r44154j97411O1298m39039r14275K31573P55097k84183L19723N15017
8979B1060269n66810L62671J219423n91104K71357M44183L77040O54187N22675
8970B3753891k83611Q90271k18719K78610k50146l11669O02693J470680P93284
8961B6725284M64216P79389J429577R99218J52376L11014J783351Q91057K17913
8952C3753395J119918J174530K698355K337517K524596L054936K916472L276422
8944E2856141M709820O384415N105506O081423O154149O843431P195167L404257
8936I8734309o35871k791611k975782l736359j497615L26084K168458N258025
8928I4849638O925112O947971R931400J2416797Q254447L802161n248322j3105420
$$ plain form
8989 21956623 21012469 20815058 20876356 20437317 19523042 19754615 20509712 20225529 20545252 21060269
8979 21060269 20493459 20856130 22075553 21484449 21755806 22199989 22577029 23231216 23753891
8970 23753891 23470280 24360551 24141832 24420442 24170296 23858627 24461320 25932000 26725284
8961 26725284 27189500 27968889 29398466 30397684 30550060 30861074 32644425 33535482 33753395
8952 33753395 34873313 36047843 38746198 41083715 43608311 46663247 49579719 52856141
8944 52856141 57565961 63950376 69055882 75137305 81291454 88134885 95330052 98734309
8936 98734309 98098438 95306827 92331045 88594686 87097071 87423155 89591613 94849638
8928 94849638 101774750 108722721 118654121 131070918 139325365 143127526 137879204 124773784
8920A24773784j2466468r216573m672454k596037k25592N87067L023641N217157
8912A04424525P061788R576943J1241010R799915N074823m049127j1769120j5844746
8904A15516011j4553781j2382444j0356997p305642o086665n363027m407569m196765
8896E0863121l176567j856475j656319j469707j257341m33068p63583M6877J696577
8887D1993515J620879J414203J812291L950770L887491M447120O065889N578366
8879G0770524L043492j241093m356500p092144q614025o495635n773384m611823
8871C5629412l712809l174840l302143k495206j109938j566836j552743p57797
8863A7957100j154974q87690j122838p56136m85509l69559l91896o26725j155560
$$ plain form
8920 124773784 112307316 103090743 98418289 95822252 95596660 96183727 99207368 104424525
8912 104424525 111486313 121063256 132304266 142104181 147179004 143129877 131360757 115516011
8904 115516011 100962230 88579786 78222789 70917147 64830482 59467455 55059886 50863121
8896 50863121 47686554 45830079 44173760 42704053 41446712 41013644 40250061 40296938 41993515
8887 41993515 43614394 45028597 46840888 50791658 54679149 59126269 65192158 70770524
8879 70770524 73814016 72572923 68216423 61124279 52510254 46014619 40241235 35629412
8871 35629412 31916603 28741763 25439620 22944414 21834476 20267640 18714897 17957100
8863 17957100 16802126 15914436 14791598 14035462 13549953 13180394 12788498 12161773 11006213
8854A1006213j080757K36366q8550j53504j192641m30567j465505K59649J19357
8845G210061k90541j09705k5448L58817q09179l22293K62063m0579M106j37261
8835F100041M36983j8116K08865o72707l99029j54506k44916m55487O27155n84659
8825D843624O95360m55452l29128K73729j72155k67506j113933K19748L08304
8816D002591M1528J15483k85793l07528l26748L52749P13418l23056p78127m18890
8806B785627O139J2151J309059K80801j228153j59012K08788j2790k80948n3266
8796B868396K34137j37863n18073k99970l30959J35239L08515o3585P93559m84067
8786B505329k45819J48751j51084p90623j99437O77724J777702L41688N5361R8771
$$ plain form
8854 11006213 9925456 10161822 10073272 9919768 8727127 8296560 6831055 7090704 7210061
8845 7210061 6919520 6809815 6784367 7143184 6334005 6011712 6273775 6233196 6237302 6100041
8835 6100041 6537024 6518908 6727773 6055066 5656037 5501531 5256615 4801128 5428283 4843624
8825 4843624 5538984 5083532 4754404 5028133 4855978 4588472 3474539 3694287 4002591
8816 4002591 4044119 4159602 3873809 3566281 3239533 3592282 4305700 3982644 3204517 2785627
8806 2785627 2791766 2803917 4112976 4393777 3165624 3006612 3215400 3202610 2921662 2868396
8796 2868396 3102533 2964670 2446597 2146627 1815668 1950907 2259422 2195837 2989396 2505329
8786 2505329 2259510 2408261 2257177 1466554 1267117 1944841 3722543 4064231 4119592 4218363
8776D218363n43361K32290q47572l65112L77932K36383l49869m00488n5999m18752
8766B083815q0357M5064J8557m35442L32675L43493l46988r67279J86168K55400
8756A435106J60998R83911k02490n70711K0544m01866r699J39912N98149J17900
8746B271754m18399k97189K32922L72600j222701M58330J090947J52458N94296
8737C235018L48620p14784o39914N45246k193o12532J64170q7369M12565J70257
8727B819084m66331p28733L44863N06149k9488j24290q78120R83978J50301p0397
8717B507016J25988O3729k09285p75863n21905K87960L7266K68864j61623J09928
8707A732075p263J99051K54203J2330k48713M46383l44452q52767r4870J80451
$$ plain form
8776 4218363 3675002 3907292 3059720 2694608 3072540 3308923 2959054 2558566 2502567 2083815
8766 2083815 2003458 2048522 2067079 1631637 1964312 2307805 1960817 993538 1179706 1435106
8756 1435106 1596104 2580015 2377525 1806814 1827358 1425492 1415793 1555705 2153854 2271754
8746 2271754 1853355 1556166 1789088 2161688 938987 1397317 2488264 2640722 3235018
8737 3235018 3583638 2868854 2228940 2774186 2771993 2159461 2323631 2236262 2648827 2819084
8727 2819084 2352753 1624020 1968883 2475032 2445544 2321254 1443134 2427112 2577413 2507016
8717 2507016 2633004 2696733 2487448 1711585 1189680 1477640 1514906 1783770 1622147 1732075
8707 1732075 1724812 1923863 2178066 2190396 1941683 2388066 2043614 1190847 1095977 1276428
8697A276428L51231l78663K11170L70675K57968j63292j38443M98732o94145Q58711
8687B450372m73438m8303M46401n22791J15661n9596q31279M37394Q76858j472275
8677I19004M99116M52530m42255P26619q1286j202856K20114n91542N51879J83910
8667A235233K8317m86677P94435Q1601r9650O77779q15019l19870O56298j84539
8657A567908R1836m37022k67259K48364J96942m17558P4133K94912K91148m19331
8647A224073l91379j74638l02034N46414l07091j70316k43357J09294K46498k01264
8637C36200n26030N37022K88179j43285n00621n06909L66208R22596n8671n54850
8627A59839N0934K59935J25313q10424N2220K58112M00344J8703l40255k54634
$$ plain form
8697 1276428 1627659 1248996 1460166 1830841 2088809 1925517 1787074 2285806 1591661 2450372
8687 2450372 1976934 1928631 2375032 1852241 1967902 1908306 1077027 1514421 2391279 919004
8677 919004 1418120 1870650 1428395 2155014 2073728 870872 1090986 499444 1051323 1235233
8667 1235233 1263550 776873 1571308 1652909 1553259 2231038 1416019 1096149 1752447 1567908
8657 1567908 1659744 1222722 955463 1203827 1400769 983211 1057344 1352256 1643404 1224073
8647 1224073 832694 658056 356022 902436 595345 425029 181672 290966 537464 336200
8637 336200 -189830 347192 635371 492086 -8535 -515444 -149236 773360 714689 159839
8627 159839 210773 470708 596021 -214403 -162183 95929 496273 514976 174721 -79913
8617g9913n55086M40830L89196j02446M08651r56359l97714P20812n30582J35061
8607e27550k91770Q47649J60544p9120J71321r82730O89939K87525N91588p05818
8597A61578r95515l94893O53133n32556O63187P79486l10033L68970k52412j138144
8587i97199N63690m4260L72918l49036l91478J274716k91655k73677m76994P55835
8577A42860l94178J5886j02860L24739J66869l24587N1245M16737o99063N82962
8567A80610n43840j58841o11639J90615P72753n30548l76954J0724O3367N40251
8557d63502J02694j39997k33608l65451J095738J07309m18600n5874K9089m11676
8547g53878l51884R925R73443j20957j6317l94821j42300N13021M75389j78430
$$ plain form
8617 -79913 -634999 -194169 195027 92581 501232 -455127 -852841 -132029 -662611 -527550
8607 -527550 -819320 28329 188873 109753 281074 -701656 -11717 275808 867396 161578
8597 161578 -833937 -1228830 -575697 -1108253 -445066 334420 24387 393357 140945 -997199
8587 -997199 -433509 -477769 -104851 -453887 -845365 429351 137696 -135981 -612975 142860
8577 142860 -251318 -235432 -338292 -13553 153316 -171271 -120026 296711 -402352 180610
8567 180610 -363230 -522071 -1133710 -943095 -170342 -700890 -1077844 -1067120 -1003753 -463502
8557 -463502 -360808 -500805 -734413 -1099864 -4126 103183 -315417 -371291 -342202 -753878
8547 -753878 -1105762 -1095837 -122394 -243351 -259668 -654489 -796789 -283768 191621 13191
8537A3191l02287n22538m58436j3832O03074J066934n63741O0370K10286j74552
8527h1531r84732N25001R45737l44923L8147O64917m96709j13544m84570R26245
8517E94038Q7371l01060n39235q52079L00242L85617r5867p89445P5632K95454
8507h39332Q06315j58753J13725j07839J08718m31704J052361J69493m69720q90236
8497f46972K47939J92810K30481N12480J18936P0594m79835N16267p86556N24924
8487E01068M22790l58899J73653k94473j56057o05459K2613M2034O24627l98248
8477b6351n02247l07442R57625l8265k65659L2545N46103K20037l36890l43046
8467f3590J60004J32913o70366J163370K15590K20899o54478o19979j8972M39173
$$ plain form
8537 13191 -289096 -811634 -1270070 -1283902 -680828 386106 -177635 -117265 93021 -81531
8527 -81531 -1066263 -541262 404475 59552 97699 762616 265907 152363 -332207 594038
8517 594038 681409 380349 -158886 -1010965 -710723 -325106 -420973 -1210418 -1134786 -839332
8507 -839332 -33017 -191770 -78045 -185884 -77166 -508870 543491 712984 243264 -646972
8497 -646972 -399033 -206223 24258 536738 655674 726268 246433 762700 -23856 501068
8487 501068 923858 564959 738612 444139 288082 -317377 -294764 -252730 371897 -26351
8477 -26351 -528598 -836040 121585 83320 -182339 -149794 396309 616346 279456 -63590
8467 -63590 96414 229327 -441039 722331 937921 1158820 504342 -115637 -134609 304564
8457C04564n89141k2333l37769K71607j90253K59237L51167l91551J32458q8762
8447c00776L24717j92280J00288N24051n91052l19372J84777l03500K08330l54999
8437g19816j06069L93628K18694j47280k19112J397265n39581P86643N9132p06213
8427D17291n28120n34414M82633l84615M17947k32844k00838O92125J09324n37739
8417b99250N1298l97108O03995j098999J42580P61901J71013O92804m11511K76562
8407D93285j74517j52688q56717L07131L64804j50901L28954M70193m33728M11356
8397F07172P766j09006K03316J72115J67650j95619l8318k62524j39327Q4885
8387D98110O39252j34740j26703j6437K49344n55731M78071j83344j83751m21865
$$ plain form
8457 304564 -284577 -306910 -644679 -373072 -563325 -304088 47079 -344472 -212014 -300776
8447 -300776 23941 -168339 -68051 456000 -135052 -454424 -269647 -573147 -364817 -719816
8437 -719816 -825885 -432257 -213563 -360843 -579955 817310 277729 1064372 1123504 417291
8427 417291 -110829 -645243 -162610 -547225 -129278 -362122 -562960 129165 238489 -299250
8417 -299250 -247952 -645060 -41065 -1140064 -997484 -235583 -64570 628234 216723 493285
8407 493285 318768 166080 -690637 -383506 -18702 -169603 159351 629544 195816 607172
8397 607172 614938 505932 709248 881363 1049013 853394 815076 552552 413225 498110
8387 498110 1137362 1002622 875919 859482 1108826 553095 1031166 847822 664071 242206
8377B42206m01234m91755q207j94223J11586k4148M2991M84916O58099m32751
8367a2520R23390J767o19846R0324L6521K46375o92338k66911J12265R0371O91925
8356F01323j11118n44387L06435O54890k33725K70068m10166m80944j06285J72692
8346A18783K33634l65558N45719N50252J20712k04173M11377l02959k17698o40850
8336B49239P3085n05937m45967J11701N13140J86673N63969j012822k65665N67274
8326C4690R7727P395l42817M61582J94517p50556m54579L63519P27225O0112L58309
8315G57124l09833n71074l08852O24818N16412n74631l94586r7636p5384J529485
8305A095843l52858j251421j95186K79798r0394K72796p44922j87662Q79009L03548
$$ plain form
8377 242206 -159028 -650783 -658990 -853213 -741627 -765775 -722784 -237868 420231 -12520
8367 -12520 910870 912637 292791 383115 419636 666011 -26327 -293238 -180973 -90602 601323
8356 601323 490205 -54182 252253 907143 673418 943486 533320 52376 -53909 118783
8346 118783 352417 -13141 532578 1082830 1203542 999369 1410746 1107787 890089 249239
8336 249239 322324 -183613 -629580 -517879 -4739 181934 745903 -266919 -532584 34690
8326 34690 132417 139812 -203005 258577 453094 -297462 -752041 -388522 338703 398815 757124
8315 757124 447291 -123783 -432635 192183 708595 133964 -260622 -358258 -433642 1095843
8305 1095843 742985 -508436 -703622 -423824 -514218 -241422 -986344 -1174006 -294997 8551
8295H551J18612l8400K2348j95206Q57877p94030O5252L4668l94985p9569l65936
8284g60818q6981J44731K73618N23516J33509l74733L66851L58378n83106j98810
8274b03845M9373J38980l77420J32414M79106K47803p22977R2422j92539j80888
8264e37571k36838P02163M8838M81457p8638n31080p08119N43986J4970n01541
8254h02373M79285n00797k24603q5819M33648M07770j89556R49553q5362m89590
8244a07844j08198l17523K87710m48385K85519K39157r2413k26383o23256j91915
8234a303531M57646J67406O2422O17983L84095q62590M9848j24748L21691m52458
8224f82236K10083m84290K75647K70326J62622j66619L89225K21227p47882j56797
$$ plain form
8295 8551 127163 88763 111111 -84095 773782 -20248 45004 79672 -315313 -394882 -760818
8284 -760818 -847799 -703068 -429450 94066 227575 -147158 219693 578071 -5035 -203845
8274 -203845 -154472 -15492 -392912 -260498 218608 466411 -256566 -164144 -356683 -537571
8264 -537571 -774409 -72246 -23408 458049 379411 -151669 -859788 -315802 -300832 -802373
8254 -802373 -323088 -823885 -1048488 -1134307 -700659 -292889 -482445 467108 381746 -107844
8244 -107844 -216042 -533565 -245855 -694240 -408721 -169564 -261977 -488360 -1111616 -1303531
8234 -1303531 -845885 -678479 -616057 1926 386021 -476569 -426721 -551469 -229778 -682236
8224 -682236 -472153 -956443 -680796 -410470 -247848 -414467 -25242 195985 -551897 -708694
8214g08694m28571Q09339Q18958j133135L19257o99962j0580Q8314Q41084J77546
8204G3556r43776n31024L36001m02013R69468p09375l52661O29899j95098j042355
8194b167378q08514l054064m78680O581775k66606K08889m75216K727L86371M78938
8184D08242j88005m10939l44887j32884K35711p6233k6944O41834L6814j42644
8174F5j2332o95529j24726m16497Q1799P12309j15122K95758K58425K37988M44467
8163F66605O4091J47799q8968K7741j88678j319528l2085M02179P76936m41937
8153A4155n98719q8022R25678K04852n96769J18453l71612k6298J12670m03164
8143g08776l09203L92256R76508j86079N6786L71148j08217k96233q88511k87985
$$ plain form
8214 -708694 -1137265 -327926 491032 -642103 -322846 -1022808 -1033388 -945074 -103990 73556
8204 73556 -870220 -1401244 -1065243 -1467256 -497788 -1207163 -1559824 -929925 -1125023 -2167378
8194 -2167378 -2975892 -6029956 -6508636 73139 -193467 15422 -459794 -457067 -70696 408242
8184 408242 220237 -190702 -535589 -668473 -432762 -508995 -535939 105895 142709 65
8174 65 -12267 -707796 -832522 -1249019 -1167220 -454911 -570033 -274275 -15850 222138 666605
8163 666605 730696 878495 789527 817268 628590 -690938 -723023 -320844 456092 14155
8153 14155 -584564 -672586 253092 457944 -138825 -20372 -391984 -418282 -305612 -708776
8143 -708776 -1017979 -625723 350785 164706 221492 592640 484423 188190 -700321 -988306
8133i88306M2984N27002p040J58763j03556L48999K10444k11487n61834O92259
8123A08228J55208j70363r49265j74450M12116n08340j81841R25316J19467N78363
8113C14439p12690l05165J57880L94939J44018N7161O2351o41706L31373p09185
8103i06585K48102P24844m5332K13467P82435k40091r3008l12041l20979M04586
8093D55398l80875k7857k82945N6078M49334p34999P67178j93609n32080m31820
8083h56197P42013N0130m77185O5209j09232J73103K48311k11932m93618M46111
8073d23287j9575n26214M34263J115528j01793q72531k10493k69718K51676j42282
8063g64426j76440L37441k13893m26147J66776O95745j81326m53285M34942N12030
$$ plain form
8133 -988306 -945322 -418320 -425360 -266597 -370153 -21154 189290 -22197 -584031 108228
8123 108228 263436 93073 -856192 -1030642 -618526 -1126866 -1308707 -383391 -263924 314439
8113 314439 -398251 -703416 -545536 -150597 -6579 50582 112933 -528773 -197400 -906585
8103 -906585 -658483 66361 21029 234496 1016931 776840 683832 371791 50812 455398
8093 455398 74523 46666 -236279 -180201 269133 -465866 301312 107703 -424377 -856197
8083 -856197 -114184 -64054 -541239 -476030 -585262 -412159 -163848 -375780 -869398 -423287
8073 -423287 -442862 -969076 -534813 580715 478922 -393609 -604102 -873820 -622144 -764426
8063 -764426 -940866 -603425 -817318 -1243465 -1076689 -380944 -562270 -1015555 -580613 -68583
8053f8583m94268N7430p8230N48925O4491J55950o7197l63113j87001m01274r9303
8042i32173p09623J239335M54914R81937l14566n19715K21210m29186k00678j034884
8032a243429L02440N36735J09514p20250Q5312J056611o04318k78589K22209j04121
8022f37886J098554j064938k47090P72554k39126m57087k08809M40340K30038
8013c13450P1933j19793j70040O78238k69102q46460k78587J038639l82812J21617
8003d69817n85718m4459K68037J99683k06748L0311P55203l41596O03858p26928
7993e18174k96121k27791j77375N42461J69639L55050n23938n83506K77223M47892
7983e34640j89654k81001K57202K12078p0491l11673L70357M11298o59017l35506
$$ plain form
8053 -68583 -562851 -505421 -583651 -34726 29765 185715 118518 -244595 -431596 -832870 -932173
8042 -932173 -1641796 -402461 52453 1034390 719824 200109 421319 -7867 -208545 -1243429
8032 -1243429 -940989 -404254 -294740 -1014990 -929678 126933 -477385 -755974 -533765 -637886
8022 -637886 460668 -604270 -851360 -78806 -317932 -775019 -983828 -543488 -313450
8013 -313450 -241517 -361310 -531350 146888 -122214 -968674 -1247261 -208622 -591434 -469817
8003 -469817 -1055535 -1099994 -831957 -632274 -839022 -808711 -53508 -395104 208754 -518174
7993 -518174 -814295 -1042086 -1219461 -677000 -507361 -152311 -676249 -1259755 -982532 -534640
7983 -534640 -724294 -1005295 -748093 -536015 -606506 -918179 -547822 -136524 -795541 -1131047
7973a131047o9958M89792M51908N80311j16982j198317O43520n93337L0585N43115
7963c70410m10616m19270K45966O31225m22300Q41098j09470p71623J44529M33089
7953b07782n48014k48993M88904l31241K85268M04M02738O74145j13777n07806
7943a06154R5292n10484q8879J09911o9001L39570j849Q8759p88757K40887O15199
7932g5506j004909J31626J057335j09060l78825J70795k12315j88823R18009J206997
7922A515324m60841j29408m03076M94610r8242r15296l26260O59471J005327j53406
7912A188203j0024K77061q41852L81491j72675R2539n21938l12319J32496j30441
7902H2541L97422N86943K37724j013915l939J69090l92754R31664p5553k45216
$$ plain form
7973 -1131047 -1201005 -711213 -259305 321006 204024 -994293 -350773 -944110 -913525 -370410
7963 -370410 -781026 -1200296 -954330 -323105 -745405 95693 -13777 -785400 -640871 -207782
7953 -207782 -755796 -1004789 -515885 -847126 -561858 -561454 -158716 515429 401652 -106154
7943 -106154 -10862 -521346 -610225 -500314 -569315 -229745 -231594 -142835 -931592 -690705 -75506
7932 -75506 -1080415 -948789 108546 -514 -379339 -208544 -420859 -609682 308327 1515324
7922 1515324 1054483 925075 521999 1016609 918367 3071 -323189 336282 1341609 1188203
7912 1188203 1178179 1455240 613388 994879 822204 914743 392805 80486 212982 82541
7902 82541 479963 1066906 1304630 290715 286776 455866 63112 994776 919223 674007
7892F74007J59219J58053M85573q6770L60935m84307k52742l48450j37380k05030
7882C23108k30676O37705l98527P81050l90726M08448J01991q54408Q1696L07026
7872G66687L77327L64591q60268n73712o91735o91128J392763J77728k25833j12036
7862g5616P42306n32554l976j15528O06148j81962j30913l66303k66170P04643
7852C80075n94330k00550Q28421j98558M19360J10480M10725Q33236q5301j145407
7842G58151O04780N44765j030007P22961O1155l80141Q4807j044899L22626R67217
7832A611415o70833j58521O91835J69508k15768l65792l07013M7635k3341m11279
7822C67846Q32444J37683k93144m99370R00575r55932l61549Q4964m20586J160483
$$ plain form
7892 674007 833226 991279 1476852 1390082 1751017 1266710 1013968 665518 528138 323108
7882 323108 92432 730137 331610 1112660 721934 1130382 1232373 377965 459661 766687
7872 766687 1144014 1508605 648337 74625 -617110 -1308238 84525 262253 36420 -75616
7862 -75616 666690 134136 130160 14632 620780 438818 307905 -58398 -324568 380075
7852 380075 -214255 -414805 413616 215058 634418 744898 1155623 1988859 1903558 758151
7842 758151 1362931 1907696 877689 1600650 1661805 1281664 1366471 321572 644198 1611415
7832 1611415 940582 782061 1473896 1643404 1427636 1061844 754831 802466 779125 367846
7822 367846 1200290 1337973 1044829 545459 1446034 490102 128553 213517 -207069 953414
7812I53414L85039n33699l03579Q0197K85632k78212m50540R00117n24290j235542
7802g21463j595796L562602J575874j466727n17114r60498n7889J68621L06935
7793B94545J92425K85597k75395q74838K77637P09242n5821m1441n63913L0335
7783b1627l24409O44412K0001j4427J71138O88869j41946l66670J472n02149R9387
7772B54051L09508P1227j43265l84626j61610K92702k90383K91305O13952j61963
7762F90898q95338j6110k43498P19093o04882J72353R5508Q6798N42879P1925
7752F19626M86312n97391q3927O32334Q18490l76085O21203j7072J98726K4980
7742B327196r78064K57430j97317n34566K67823j21677j74733l88640j75757M04971
$$ plain form
7812 953414 1338453 804754 501175 581372 867004 588792 138252 1038369 514079 -721463
7802 -721463 -2317259 1245343 2821217 1354490 837376 -123122 -181011 -12390 294545
7793 294545 486970 772567 497172 -377666 -100029 609213 553392 511951 -51962 -21627
7783 -21627 -346036 298376 318377 303950 475088 1163957 1022011 655341 656813 154664 254051
7772 254051 563559 634786 491521 106895 -54715 237987 -52396 238909 852861 690898
7762 690898 -204440 -220550 -464048 255045 -349837 -177484 -81976 4822 547701 619626
7752 619626 1105938 508547 424620 1056954 1875444 1499359 2120562 2103490 2302216 2327196
7742 2327196 1349132 1606562 1409245 874679 1142502 1020825 846092 457452 281695 686666
7732F86666l02350j20713L1585O51878k54328N71482J48924o51488m95891j219
7722B64546r8319L17287r42928M40481N29207L27195J08229J59790J65921l89270
7712H82139O4580k13429j57649L03597k10607N51665N50316p96876n29615j68754
7702B75367M82715P56838q91384j19612O68260L3273j33426j20984N41629j7501
7692A475175p9889M57893o55087m01383l78280N10606M57682m8710m5995l17994
7682I74018J011841p29495l46654N49501j0118K27727K29957j6310N35993j17196
7672B309264l95043p86111J59475J99131m59700o64968M43818k55130M80840L42871
7662A374447J25046K8864L4760L61828Q9656J51004k35192l72812l9669K40494
$$ plain form
7732 686666 384316 263603 295188 947066 692738 1264220 1413144 761656 265765 264546
7722 264546 166227 483514 -459414 -18933 510274 837469 945698 1105488 1271409 882139
7712 882139 946719 733290 575641 879238 668631 1220296 1770612 973736 444121 275367
7702 275367 758082 1514920 623536 503924 1172184 1205457 1072031 951047 1492676 1475175
7692 1475175 1395286 1853179 1198092 796709 418429 929035 1386717 1338007 1292012 974018
7682 974018 1985859 1256364 909710 1459211 1449093 1676820 1906777 1890467 2426460 2309264
7672 2309264 1914221 1128110 1287585 1486716 1027016 362048 805866 550736 1031576 1374447
7662 1374447 1499493 1528357 1563117 1924945 2014601 2165605 1930413 1557601 1517932 1758426
7652A758426K38561O18495N9158n01170m92846K57945M61686P52529m25631q16898
7642A910255M9485J51128J037575n50361j40985j79046M96922k7288k82041M89506
7632B955150M15754O2459j11619m38405m0879J76112j80530L98023J0663m46190
7622B800538j9994M7702K86526J99665p66219Q42277L27165K91002N51867j27191
7612D433338q82585P79836J92548l97313L20866L35754Q75006j85505L04617m15358
7602E361204m41483J95537M49781Q31967J39490J72359j31733J03345j88549J52021
7592F643939J129773P51955N72587m29362n14318P04038L35437k65312J77277
7583I106014J011311P81196N95405k46959R49130J112340J040002M42507O61634
$$ plain form
7652 1758426 1996987 2615482 2674640 2173470 1680624 1938569 2400255 3152784 2727153 1910255
7642 1910255 1959740 2110868 3148443 2598082 2457097 2278051 2774973 2747685 2465644 2955150
7632 2955150 3370904 3433363 3321744 2883339 2842460 3018572 2838042 3236065 3246728 2800538
7622 2800538 2780544 2828246 3114772 3314437 2548218 3390495 3717660 4008662 4560529 4433338
7612 4433338 3550753 4330589 4523137 4125824 4446690 4782444 5657450 5471945 5776562 5361204
7602 5361204 4919721 5115258 5565039 6397006 6536496 6708855 6577122 6680467 6491918 6643939
7592 6643939 7773712 8525667 9098254 8668892 8154574 8858612 9194049 8928737 9106014
7583 9106014 10117325 10898521 11493926 11246967 12196097 13308437 14348439 14790946 15452580
7574A5452580Q38863P18166J534717J422579J607612J511247J004253O72936J746861
7565B6509814K50847J54401J210948J305805J755598P52602P84452J909203K160635
7556C6794305K252781K582006K392133K687666K597504L428423L082290K996243
7548E8813351L603425M393497N830760O439335O859099R066301R799862J1426090
7540A16231720J4182606J8388973K0790953K2907500K6520996K8159148K5176334
7533B72358230R992568r567433k7440965l2317597k7704452k2230462j6439191
7526A46650698j1853942j1153864r057213q046757m751742k791425k212938j550536
7518I5232281j440185R35185K625435K978226M818664N949961P702206J0627982
$$ plain form
7574 15452580 16291443 17009609 18544326 19966905 21574517 23085764 24090017 24762953 26509814
7565 26509814 26760661 26915062 28126010 29431815 31187413 31940015 32724467 34633670 36794305
7556 36794305 39047086 41629092 44021225 46708891 49306395 52734818 55817108 58813351
7548 58813351 62416776 66810273 72641033 79080368 85939467 95005768 104805630 116231720
7540 116231720 130414326 148803299 169594252 192501752 219022748 247181896 272358230
7533 272358230 282350798 272783365 245342400 213024803 185320351 163089889 146650698
7526 146650698 134796756 123642892 114585679 106538922 101787180 98995755 96782817 95232281
7518 95232281 93792096 94727281 97352716 100330942 105149606 111099567 118801773 129429755
7510A29429755J3555604J6450337J9531544K3880964K6778737K3626921J2764281
7503B66018143n493701k4480175l2730244l0379553k6076219k0261331j5977570
7496A10619350j3438127j1864448r707005p877567p188528o812204o115136k895176
7488D4721159m056709l958842k669198k414846k369756j826207j950213j856129
7480B3619259j930145p37424q80967m86890j062462n26886j774745j555970m31848
7471A4231922m73793k49730o46787m96190j632646r67857N9675M443k60439q07486
7461H761112p85981j33548j37285q00097q448o99151o33242k27799m91240m38823
7451D405498M06680N22365L76422l17960q20561J38875o22583n32120Q09551p42224
$$ plain form
7510 129429755 142985359 159435696 178967240 202848204 229626941 253253862 266018143
7503 266018143 260524442 236044267 203314023 172934470 146858251 126596920 110619350
7496 110619350 97181223 85316775 75609770 67732203 60543675 53731471 47616335 44721159
7488 44721159 40664450 36705608 34036410 31621564 29251808 27425601 25475388 23619259
7480 23619259 21689114 20951690 20070723 19583833 18521371 17994485 16219740 14663770 14231922
7471 14231922 13758129 13508399 12861612 12365422 10732776 9764919 9824594 9829037 9568598 8761112
7461 8761112 7975131 7841583 7704298 6904201 6895753 6196602 5563360 5335561 4844321 4405498
7451 4405498 4812178 5334543 5710965 5393005 4572444 4711319 4088736 3556616 4366167 3623943
7441C623943K75889k28115o02695m8901N35825K60552l2368n80114J84772J40145
7431C528933k47464J96264n22892M66929q21365q81330P27883Q10305J52435p75460
7421B634238J42079j095510k92381N51009M37320K99648m88177N6817J75410L51641
7411B772094j61026m15024J57801N26527j73237k15736j67291R9368k3424J88612
7401B588664p12991J37044j48584K03922j74855j55754m89971L81836k53899O08273
7391A983685l72370K64830k3889l13509K91090o4602j04154n8060k481n70147
7381A030393l47686O10802R1272P44719l73709m44624O4185M76090j88257o31787
7371A031398L70962p08503q47095M10601M18450o41194O67193N28986L9178p3257
$$ plain form
7441 3623943 3899832 3671717 3069022 3020121 3555946 3816498 3784130 3204016 3388788 3528933
7431 3528933 3281469 3477733 2954841 3421770 2600405 1719075 2446958 3257263 3409698 2634238
7421 2634238 2776317 1680807 1388426 1939435 2376755 2676403 2188226 2245043 2420453 2772094
7411 2772094 2611068 2196044 2353845 2880372 2707135 2491399 2324108 2423476 2400052 2588664
7401 2588664 1875673 2012717 1864133 2068055 1893200 1737446 1247475 1629311 1375412 1983685
7391 1983685 1611315 1876145 1852256 1538747 1829837 1765235 1661081 1603021 1600540 1030393
7381 1030393 682707 1293509 1384781 2129500 1755791 1311167 1375352 1851442 1663185 1031398
7371 1031398 1402360 693857 -153238 257363 675813 34619 701812 1230798 1269976 1196719
7361A196719j359441Q58930k81024L06457K01851m31406Q09802p79622L21553
7352H43819m5554J72714j07000k54046l50217k9455j02812K0420R25816R60875
7342B034560p36876n73205o33263J88852J51779Q28520k69740r35691M75227J97447
7332G27610k30308l49587L21571P62109j82605k94360o32754L02780L62427J60423
7322I47306L91033j11131j64620q20798L12047K93136j031875J30334P39927J93834
7312H79193K45250j66439m87592K09901l73397n6896m67923m44102O89542K55364
7302B82901o387L9502j30012k31666P2472R15544J1337p75010K70794o95548L75666
7291A29593N56775P8259L1961k96940l60106l88j943M85904M28328m05212p11819
$$ plain form
7361 1196719 -162722 696208 415184 721641 923492 492086 1301888 522266 843819
7352 843819 798265 970979 863979 609933 259716 230261 127449 147869 1073685 2034560
7342 2034560 1297684 724479 91216 280068 431847 1260367 990627 54936 530163 727610
7332 727610 497302 147715 469286 1231395 1048790 754430 121676 424456 786883 947306
7322 947306 1338339 1227208 1062588 241790 553837 846973 -184902 -54568 685359 879193
7312 879193 1124443 958004 470412 680313 306916 250020 -217903 -662005 27537 282901
7302 282901 276514 316016 186004 -45662 26810 942354 953691 178681 449475 -246073 129593
7291 129593 686368 764627 796588 499648 139542 139154 137211 623115 1051443 646231 -65588
7280f5588M05360k93063l49555J264676p0771O98107m60932n18043J060310O98031
7270B368532l40253l55271M79647l23310l65516J018203J091053q5510P94258
7261D281833l61200k91127j36493k93379n30168j375516M05401n03702n67166
7252F28483J03915K80770K01629J40821p92428r71558P13722N15872M0236k08172
7242F53290o11095K24448L3028K19119n38198m73242O75525J08904j89563n27661
7232d25445j06607l25665M90182M82034j20339J011611N5017j52585j22975n59420
7222B25808J296K89507o93243n33340k09008N62660J32500m95967L89955N35835
7212B06003k31125J42687N08146j38015q49569J52083J47470M42328J1767j28309
$$ plain form
7280 -65588 339772 46709 -302846 961830 891059 1589166 1128234 610191 1670501 2368532
7270 2368532 2028279 1673008 2152655 1829345 1463829 2482032 3573085 3487575 4281833
7261 4281833 3920633 3629506 3493013 3199634 2669466 1293950 1699351 1195649 628483
7252 628483 732398 1013168 1214797 1355618 563190 -408368 305354 821226 861462 653290
7242 653290 42195 266643 299671 518790 -19408 -492650 182875 291779 102216 -425445
7232 -425445 -532052 -857717 -367535 114499 -5840 1005771 1060788 908203 785228 225808
7222 225808 227104 516611 -176632 -709972 -918980 -356320 -223820 -719787 -329832 206003
7212 206003 -25122 117565 625711 487696 -361873 -209790 -62320 380008 391775 263466
7202B63466J66114r2040l7444r65516O01801Q45170m96588k75401o68892N03572
7192a55758J19895j036701J09O52679j5175l36193J055918K81519K51302J95474
7182A013069K26112n80913k10653K37257k22201m19276K93886P69170J91416n16677
7172G81190m93100K01853l94629l15407M43755J70135M13103J469j11942j18279
7162E78148M64639l53572m95670n04053O28019J87986q24898Q51951K16980r7914
7152F51616k89745J12856K50955J110840O45213n32957j115841p0413K55878p39495
7142B78907J83615K75233K97484l87420N93845o38426j39534n75434k46598L13563
7132d4765q87223J14153L8586J61445P61095M49428l55639l25876J202850m06461
$$ plain form
7202 263466 429580 337540 300096 -665420 -63619 781551 284963 9562 -659330 -155758
7192 -155758 -35863 -1072564 -1072455 -419776 -434951 -771144 284774 566293 817595 1013069
7182 1013069 1239181 658268 447615 684872 462671 43395 337281 1106451 1297867 781190
7172 781190 288090 489943 95314 -220093 223662 393797 806900 808369 696427 578148
7162 578148 1042787 689215 193545 -310508 317511 505497 -319401 532550 749530 651616
7152 651616 361871 474727 725682 1836522 2481735 1948778 832937 762524 1018402 278907
7142 278907 462522 737755 1035239 647819 1241664 603238 463704 -111730 -358328 -44765
7132 -44765 -931988 -817835 -779249 -617804 143291 592719 237080 -88796 1114054 707593
7122G07593n22514o8480M35189q6510P15427J32430J31845n26440o14391l24290
7112b0141m90667L48992L30370l49227m66025L08606p0192J70208K47045L66596
7102C75565k28364j79310N33377M43901l47959l47400q8381L72706r61765N98600
7092A70970Q8044n88692L53874K06438J16056L18145m50514m92280j63940M47496
7082E597q65831M84626P2149m2402J97258L61645K28138l73999j080402P54004
7072b59217J1024n68014j46796J126832P59866k80557l446r70936p6642J68765
7062b39121Q06362l27348l67643J223298K45867n97169o04374J2677o27840K01478
7052b73813P53261n30248J4921q68476L8958l750R6984L33580Q4079J58982J28964
$$ plain form
7122 707593 185079 116599 551788 465278 1180705 1313135 1444980 918540 304149 -20141
7112 -20141 -510808 -161816 168554 -180673 -646698 -338092 -408284 -238076 8969 375565
7102 375565 147201 -32109 501268 945169 597210 249810 161429 534135 -427630 170970
7092 170970 259014 -329678 24196 230634 346690 664835 214321 -277959 -441899 5597
7082 5597 -860234 -375608 -303459 -345861 -148603 213042 441180 67181 -1013221 -259217
7072 -259217 -248193 -816207 -963003 163829 923695 643138 639692 -331244 -407886 -239121
7062 -239121 567241 239893 -127750 1095548 1341415 744246 139872 152549 -475291 -273813
7052 -273813 479448 -50800 -35879 -904355 -865397 -869147 -772163 -438583 -354504 -195522 -66558
7041f6558j171086O07531Q4066L96394M03225l40483J56210l15971K00422Q5276
7031C9026L48939l7279p40398j043023J57970J361745O78441j531399p51234P02517
7021h14695N69826n17567J92628J212766J59729k49422j55461R57314l57621r28664
7011F8833J110988k37030n01092j532n92656O46947k44413j82830o27438L40041
7001b20182J30196m99224M88791Q25626Q79547j98183o08996q85005O38016M2531
6991E93117k94135n12004o64285K27856N89833l06283J05970N0873M89953M61833
6981G42728K45399l78529l70789j22904l44407k07679O35538O9798o30813J66990
6971a94668M41531l90540N8014m08736P3502N24685o9130K85400l4878n6637K86752
$$ plain form
7041 -66558 -1237644 -630113 -546047 -149653 253572 -86911 69299 -246672 -46250 39026
7031 39026 387965 350686 -389712 -1432735 -1274765 86980 765421 -765978 -1517212 -814695
7021 -814695 -244869 -762436 -569808 642958 802687 553265 397804 1355118 997497 68833
7011 68833 1179821 942791 441699 440167 -152489 494458 250045 67215 -560223 -220182
7001 -220182 -89986 -589210 -100419 725207 1604754 1406571 797575 -87430 550586 593117
6991 593117 298982 -213022 -877307 -649451 -59618 -365901 -259931 -209058 280895 742728
6981 742728 988127 609598 238809 115905 -228502 -436181 199357 269155 -361658 -194668
6971 -194668 246863 -143677 -85663 -494399 -420897 103788 34658 320058 285180 228543 515295
6960E15295j73495L09488j56099K03509K03892n77506k29217o63389Q46239P36143
6950A014860o951l99314J14387j45332q9379o6146N38107p5217q78625m41692
6940d35302J044184L92648M15044N80253k74691j058880K72453q2825n18538n50264
6930b15918Q08358Q97022J86845p95182p7227O52813M59041r99187n45792J097506
6920A468279Q74048r82456L22709L44205n28865J64271l45022O46967j7061m89376
6910A457699K90270P25794r5844R8228O94531r7219P59246k45721n61780j27524
6900B897680N38434K54823K60137M30602K63991O41955o57142J622326J084930
6891G337736Q26942N64194L12659J132213j6505J79727k09072j04322p1057J42254
$$ plain form
6960 515295 341800 651288 495189 698698 902590 325084 95867 -567522 278717 1014860
6950 1014860 1007909 608595 722982 577650 488271 422125 960232 885015 6390 -435302
6940 -435302 608882 1001530 1416574 1996827 1722136 663256 935709 852884 334346 -215918
6930 -215918 592440 1489462 1676307 881125 803898 1456711 1915752 916565 370773 1468279
6920 1468279 2342327 1359871 1682580 2026785 1497920 1662191 1317169 1964136 1947075 1457699
6910 1457699 1747969 2473763 2377919 2476147 3170678 3073459 3832705 3586984 3025204 2897680
6900 2897680 3436114 3690937 3951074 4381676 4645667 5287622 4630480 6252806 7337736
6891 7337736 8164678 8728872 9041531 10173744 10157239 10336966 10127894 10023572 9952515 10094769
6881A0094769Q19854P46941M38218L92349O05674O55835O94154L3023q89669L91356
6871A3982504J474478J38276J526061J436642J155532N36984N81726J847578K675092
6862B5354873Q92294K690257L137994L606515L751281M700128N495140N086375
6854E4714857M809844L065553j63219k797188l468033l245688j788654l38377
6846E0789095N62220K443590K861083K186879P77273p09445l598816n727277p018753
6837D2565849o236304l917570m012393l988572l956066k129627j656062j286649
6829A5382606q46572j294715p70128p27749k115509j139990j26701m31952k26780
6820G702510j209110m65761o31347l78269N14872q96328j049916J99416n48303
$$ plain form
6881 10094769 10914623 11661564 12099782 12492131 13097805 13753640 14447794 14480817 13591148 13982504
6871 13982504 15456982 15595258 17121319 18557961 19713493 20250477 20832203 22679781 25354873
6862 25354873 26247167 28937424 32075418 35681933 39433214 44133342 49628482 54714857
6854 54714857 59524701 62590254 62427035 59629847 56161814 52916126 51127472 50789095
6846 50789095 51351315 53794905 56655988 58842867 59620140 58910695 55311879 49584602 42565849
6837 42565849 36329545 32411975 28399582 24411010 20454944 18325317 16669255 15382606
6829 15382606 14536034 13241319 12471191 11743442 9627933 8487943 8361242 7929290 7702510
6820 7702510 6493400 6027639 5396292 5018023 5532895 4636567 3586651 3786067 3237764
6811C237764R9309k25839o12462J37443m91543N75205K95908m09437k56042m00624
6801A949682K82487O07973k78141j086931M46420N6817j19188j05792p70609M44607
6791A427325P0736k54021M08275O99650k113o03058m04046j35750n05309L26504
6781A028193O13001L15025L2673K52426l00117m70277n47447L55308q68106L0073
6771D40752l54730l50355K6566L33507j82304k32898M33485J26936K11955m51048
6761A866j24384j71116P71070k7861o50653o67070O20592O68644q6402P2018o70971
6750b64267J01339r17518J33218J06898J03675R08646N94391l0307P5492m19633
6740C91934p48389M05301o7792j164815K33426K39812j25350J49867K52541J62273
$$ plain form
6811 3237764 3337073 3111234 2498772 2636215 2144672 2719877 3015785 2606348 2350306 1949682
6801 1949682 2232169 2840142 2562001 1475070 1921490 1978307 1859119 1753327 982718 1427325
6791 1427325 1498061 1244040 1652315 2351965 2349852 1746794 1342748 1206998 701689 1028193
6781 1028193 1641194 1956219 1988892 2241318 1941201 1470924 923477 1278785 410679 440752
6771 440752 86022 -264333 -237767 95740 -86564 -319462 114023 240959 452914 1866
6761 1866 -122518 -293634 477436 449575 -201078 -868148 -247556 421088 334686 406704 -264267
6750 -264267 -162928 -1080446 -947228 -840330 -736655 171991 766382 736075 811567 391934
6740 391934 -356455 48846 -18946 -1183761 -950335 -710523 -835873 -686006 -433465 -271192
6730b71192K06954r8498k67331N3627p8101K39597o75239J85237J35085M18540
6720a51321j28129j52292L3550M62910l67176j80492M12621j70016K73855j557
6710C1953n41328l12518j46829Q88443J13387K21759j45560p98607L34576j54300
6700e09024K52785J8765m08008k46940O62380P43474K2633O2259k31293J2109
6690C79140K83547o05027r74330J52993M2308J33955K6923k78995q5813O21172
6680c04127K87584p45250L8089j02092P75881k1798k80528K47783l8850o38717
6670g82025r14885L61723O25841q8683M1973K88706j70165J91736J11522K81230
6660e3027Q2979p38312O7080M08954l17644j24649L60917K49122k0921m56118
$$ plain form
6730 -271192 -64238 -162736 -430067 -376440 -454541 -214944 -890183 -704946 -569861 -151321
6720 -151321 -279450 -431742 -398192 64718 -302458 -482950 -70329 -240345 33510 31953
6710 31953 -509375 -821893 -968722 -80279 33108 254867 109307 -689300 -354724 -509024
6700 -509024 -256239 -237474 -645482 -892422 -230042 513432 536065 598324 367031 379140
6690 379140 662687 57660 -916670 -763677 -721369 -587414 -560491 -839486 -925299 -304127
6680 -304127 -16543 -761793 -723704 -825796 -49915 -71713 -352241 -104458 -143308 -782025
6670 -782025 -1696910 -1335187 -709346 -798029 -756056 -467350 -637515 -445779 -334257 -53027
6660 -53027 29952 -708360 -641280 -232326 -549970 -674619 -313702 -64580 -85501 -541619
6650e41619K78355J90699k14259n0136j36028l24861r9074m6872j49714L3284
6640a060225J044654M19642l22495o08611o96670L69391M46544l81485N29479
6631b59776P29202k06054l80486j546490J66555K66004Q77807O75367o25741q77030
6621a180642k4880N48098j94535k94175L76864m34439j64645j37997J97053O82614
6611f26684L00628n09349K30686K16790P09604k30124o58271M78388q64082L02700
6601f49714q8323l08740M13538J58294j78723L92382m96557k15694k12952k3903
6591a210392M08629M72013L69990m45328j96355J55977o59171l85351R23108M46853
6581a20027o07644j273654J80896O74154l17689J72537P74691O5185J06908q377
$$ plain form
6650 -541619 -263264 -72565 -286824 -336960 -472988 -797849 -896923 -943795 -1093509 -1060225
6640 -1060225 -15571 404071 81576 -527035 -1223705 -854314 -407770 -789255 -259776
6631 -259776 469426 263372 -117114 -1663604 -1497049 -1231045 -353238 322129 -303612 -1180642
6621 -1180642 -1205522 -657424 -851959 -1146134 -769270 -1203709 -1368354 -1506351 -1309298 -626684
6611 -626684 -326056 -835405 -604719 -387929 321675 91551 -566720 -88332 -952414 -649714
6601 -649714 -738037 -1046777 -633239 -474945 -653668 -261286 -757843 -973537 -1186489 -1210392
6591 -1210392 -801763 -329750 40240 -405088 -601443 -445466 -1104637 -1489988 -566880 -120027
6581 -120027 -727671 -2001325 -1820429 -1146275 -1463964 -1291427 -516736 -451551 -344643 -353020
6571c53020J9940J32531o3562J66583K94061n22701K66754l30812M94648M92920
6561E97342P3275r39026r84386P28264L09024p63512m33767P08859M03110k36986
6551e37803n90680N2495M29188r278n49015Q57928O40194m32476J29729L18150
6541C08432m59280J1925K42699J53393j01446k17170r45107N68061M41487M82995
6531D85989P2629n93209m92470R56212o30631k82108k05314j0529l43923O61010
6521c82344L66123q74374L55737N9498L35999m58392k01527J68910K27198k52870
6511f56042P23713M47781L89769k57764l79427Q0766m21303m46922K52713K15784
6501e0932m21117J61472P70838q9770n88186o37345l42140O04223l15609k46245
$$ plain form
6571 -353020 -333080 -200549 -264111 -97528 196533 -326168 -59414 -390226 104422 597342
6561 597342 670617 -268409 -1252795 -524531 -215507 -979019 -1412786 -703927 -300817 -537803
6551 -537803 -1128483 -1075988 -646800 -656078 -1205093 -347165 293029 -139447 -9718 308432
6541 308432 -150848 -138923 103776 257169 155723 -61447 -1006554 -438493 2994 485989
6531 485989 558618 -34591 -527061 429151 -201480 -483588 -688902 -699431 -1043354 -382344
6521 -382344 -16221 -890595 -534858 -475360 -139361 -597753 -799280 -630370 -403172 -656042
6511 -656042 67671 515452 905221 647457 268030 348796 -72507 -519429 -266716 -50932
6501 -50932 -472049 -310577 460261 370491 -217695 -855040 -1197180 -592957 -908566 -1154811
6491a154811P22224J61493L3704L34585j88202K65504J77517o97340O9846k96316
6481e71796j1948j045074m93365P85281l03652j38126M42346N30880K99551J25214
6471c80689K32545l70174k85480J48044K31331j46059O18552o53250K25716o5697
6461d45161j00087k34962l03577R07933j83835N09786J2414J03577p26387m25752
6451h86051k07480K63399J12365k30171M28568j18337N81039p20419K02928O5975
6441e08184m81218J43732Q44542l49237j306590q8661L2863J071067K96083l29255
6431f74858j0735L24526k73210k35076k77295J14858K85578N48126n22839r7986
6421h18911O72656J35002j038093n01563N89490n64368K2653P66913Q64531k98719
$$ plain form
6491 -1154811 -432587 -271094 -237390 97195 -91007 174497 352014 -345326 -275480 -571796
6481 -571796 -583744 -1628818 -2122183 -1336902 -1640554 -1778680 -1336334 -805454 -505903 -380689
6471 -380689 -148144 -518318 -803798 -655754 -424423 -570482 48070 -605180 -379464 -445161
6461 -445161 -545248 -780210 -1083787 -175854 -359689 150097 162511 266088 -460299 -886051
6451 -886051 -1093531 -830132 -717767 -947938 -519370 -637707 -56668 -777087 -574159 -508184
6441 -508184 -989402 -845670 -1128 -350365 -1656955 -1745616 -1712753 -641686 -345603 -674858
6431 -674858 -685593 -361067 -634277 -869353 -1146648 -1031790 -746212 -198086 -720925 -818911
6421 -818911 -146255 -11253 -1049346 -1550909 -961419 -1525787 -1503134 -736221 128310 -170409
6411a70409n23958M40758j68918J94596o22410j88978J065727j37338m45218l45326
6401i01474L75681l13583k30162Q33747o0243K57311M9671k51002J21112m78828
6391e97770k34839o4687J14339M16010o99398K3566N59640J48960J49417n93768
6381g78530J66470m5468N499k83378O48185j75899J98974o64743k5217L06480
6371f47627l79347M11676N43780m55889m17671J78922l10130q599N8423J051523
6361B5061J05682J31789j072681n97998J97828Q27923l32668p84681L32713J73032
6351i94000K29330j1574R51379K40752l91651j131740j13058R25632K09439k16711
6341c02202J64884L8736l70007L5690L64367k7415m7209P35649q1306r40902n43234
$$ plain form
6411 -170409 -694367 -253609 -422527 -227931 -850341 -1039319 26408 -110930 -556148 -901474
6401 -901474 -525793 -839376 -1069538 -235791 -296034 -38723 10948 -240054 -118942 -597770
6391 -597770 -832609 -897296 -782957 -366947 -1066345 -1042779 -483139 -334179 -184762 -778530
6381 -778530 -612060 -657528 -652029 -935407 -287222 -463121 -264147 -928890 -954107 -647627
6371 -647627 -1026974 -615298 -71518 -527407 -945078 -766156 -1076286 -1084885 -1026462 25061
6361 25061 130743 262532 -810149 -1408147 -1210319 -382396 -715064 -1499745 -1167032 -994000
6351 -994000 -764670 -776244 175135 415887 24236 -1107504 -1220562 -294930 -85491 -302202
6341 -302202 -137318 -98582 -468589 -432899 -68532 -95947 -143156 592493 511187 -429715 -972949
$$ [...]
##END NTUPLES=NMR SPECTRUM
##END=
