##TITLE=1H_EC-3339(4)
 200.13MHz, CDCl3,
 8 sc
 
 16.1.2025
##JCAMPDX= 6.0         $$ Bruker NMR JCAMP-DX V2.0
##DATA TYPE= NMR SPECTRUM
##DATA CLASS= NTUPLES
##ORIGIN= UXNMR, Bruker Analytische Messtechnik GmbH
##OWNER= pz
$$ XWIN-NMR		Version 3.5
$$ Thu Jan 16 13:50:58 2025 Russian Standard Time (UT+4h)  she@DPX200
##.OBSERVE FREQUENCY= 200.1313
##.OBSERVE NUCLEUS= ^1H
##.ACQUISITION MODE= SIMULTANEOUS
##.ACQUISITION SCHEME= undefined
##.AVERAGES= 8
##.DIGITISER RES= 18
##SPECTROMETER/DATA SYSTEM= spect
##.PULSE SEQUENCE= zg30
##.SOLVENT NAME= DMSO
##.SHIFT REFERENCE= (INTERNAL, DMSO, 0, 15.359)
##AUDIT TRAIL= $$ (NUMBER, WHEN, WHO, WHERE, WHAT)
$$ ##TITLE= Audit trail, XWIN-NMR		Version 3.5
$$ ##JCAMPDX= 5.01
$$ ##ORIGIN= Bruker BioSpin GmbH
$$ ##OWNER= she
$$ F:/spectra/data/she/nmr/H-C/1/pdata/1/auditp.txt
$$ ##AUDIT TRAIL=  $$ (NUMBER, WHEN, WHO, WHERE, WHAT)
(   1,<2025-01-16 13:49:24.68 +0400>,<she>,<DPX200>,
      <created by zg, POWCHK disabled, PULCHK disabled
       configuration hash MD5:
       00 E9 B6 7A A2 85 ED C7 34 08 36 98 17 FE 4E 26
       data hash MD5: 16K
       76 61 5D B9 E6 E0 2E E9 46 C5 E5 7F 96 4E 6F 5C>)
(   2,<2025-01-16 13:49:26.76 +0400>,<she>,<DPX200>,
      <Start of raw data processing
       efp BC_mod = 2 LB = 0.25 FT_mod = 6 PKNL = 1 PHC0 = 252.8981 PHC1 = 14.9922 SI = 16K 
       data hash MD5: 16K
       AA 23 39 46 C0 2E 6A 24 78 E0 BE BE 6D A3 EB 8F>)
(   3,<2025-01-16 13:49:54.21 +0400>,<she>,<DPX200>,
      <pk PHC0 = -9.771832 PHC1 = 7.400001 
       data hash MD5: 16K
       35 10 5F 5F E5 BE BC FB 42 F3 14 D1 03 48 E7 3D>)
(   4,<2025-01-16 13:49:58.71 +0400>,<she>,<DPX200>,
      <abs ABSG = 5 
       data hash MD5: 16K
       CB DD 99 7C AB DD 20 65 22 1B A6 04 95 FF 5E A0>)
$$ ##END=
$$ 
$$ hash MD5
$$ 1A DB 62 46 17 35 94 85 80 08 98 70 6D F1 B9 03
##$RELAX= 
##$RELAX= 
##$RELAX= 
##$RELAX= 
##$RELAX= 
##$RELAX= 
$$ Bruker specific parameters
$$ --------------------------
##$DU= <F:/spectra>
##$EXPNO= 1
##$NAME= <H-C>
##$PROCNO= 1
##$TYPE= <nmr>
##$USER= <she>
##$AMP= (0..31)
100 100 100 100 100 100 100 100 100 100 100 100 100 100 100 100 100 100 
100 100 100 100 100 100 100 100 100 100 100 100 100 100 
##$AQSEQ= 0
##$AQ_mod= 1
##$AUNM= <au_zg>
##$AUTOPOS= <>
##$BF1= 200.13
##$BF2= 200.13
##$BF3= 200.13
##$BF4= 200.13
##$BF5= 200.13
##$BF6= 200.13
##$BF7= 200.13
##$BF8= 200.13
##$BYTORDA= 1
##$CFDGTYP= 0
##$CFRGTYP= 5
##$CHEMSTR= <none>
##$CNST= (0..31)
1 1 145 1 1 1 1 1 1 1 1 1 1 1 1 1 1 1 1 1 1 1 1 1 1 1 1 1 1 1 1 1 
##$CPDPRG= <>
##$CPDPRG1= <>
##$CPDPRG2= <>
##$CPDPRG3= <>
##$CPDPRG4= <mlev>
##$CPDPRG5= <mlev>
##$CPDPRG6= <mlev>
##$CPDPRG7= <mlev>
##$CPDPRG8= <mlev>
##$CPDPRGB= <>
##$CPDPRGT= <>
##$D= (0..31)
0 0.7 0 0 0 0 0 0 0 0 0 0.03 0 0 0 0 0 0 0 0 0 0 0 0 0 0 0 0 0 0 0 0 
##$DATE= 1737020963
##$DBL= (0..7)
120 120 120 120 120 120 120 120 
##$DBP= (0..7)
150 150 150 150 150 150 150 150 
##$DBP07= 0
##$DBPNAM0= <>
##$DBPNAM1= <>
##$DBPNAM2= <>
##$DBPNAM3= <>
##$DBPNAM4= <>
$$ [...]
##$SUBNAM3= <"">
##$SUBNAM4= <"">
##$SUBNAM5= <"">
##$SUBNAM6= <"">
##$SUBNAM7= <"">
##$SUBNAM8= <"">
##$SUBNAM9= <"">
##$SW= 18.0517328524113
##$SWIBOX= (0..15)
0 0 2 0 0 0 0 0 0 0 0 0 0 0 0 0 
##$SW_h= 3612.71676300578
##$TD= 16384
##$TD0= 1
##$TE= 0
##$TE2= 300
##$TE3= 300
##$TEG= 300
##$TL= (0..7)
0 120 120 120 120 120 120 120 
##$TP= (0..7)
150 150 150 150 150 150 150 150 
##$TP07= 0
##$TPNAME0= <>
##$TPNAME1= <>
##$TPNAME2= <>
##$TPNAME3= <>
##$TPNAME4= <>
##$TPNAME5= <>
##$TPNAME6= <>
##$TPNAME7= <>
##$TPOAL= (0..7)
0.5 0.5 0.5 0.5 0.5 0.5 0.5 0.5 
##$TPOFFS= (0..7)
0 0 0 0 0 0 0 0 
##$TUNHIN= 0
##$TUNHOUT= 0
##$TUNXOUT= 0
##$USERA1= <user>
##$USERA2= <user>
##$USERA3= <user>
##$USERA4= <user>
##$USERA5= <user>
##$V9= 5
##$VALIST= <valist>
##$VCLIST= <CCCCCCCCCCCCCCC>
##$VD= 0
##$VDLIST= <DDDDDDDDDDDDDDD>
##$VPLIST= <PPPPPPPPPPPPPPP>
##$VTLIST= <TTTTTTTTTTTTTTT>
##$WBST= 1024
##$WBSW= 4
##$XGAIN= (0..3)
0 0 0 0 
##$XL= 0
##$YL= 0
##$YMAX_a= 811604
##$YMIN_a= -973383
##$ZGOPTNS= <>
##$ZL1= 120
##$ZL2= 120
##$ZL3= 120
##$ZL4= 120
##$ABSF1= 15.48687
##$ABSF2= -2.56498
##$ABSG= 5
##$ABSL= 3
##$ALPHA= 0
##$AQORDER= 0
##$ASSFAC= 0
##$ASSFACI= 0
##$ASSFACX= 0
##$ASSWID= 0
##$AUNMP= <proc_1d>
##$AZFE= 0.1
##$AZFW= 0.1
##$BCFW= 0
##$BC_mod= 2
##$BYTORDP= 0
##$COROFFS= 0
##$CY= -3
##$DATMOD= 1
##$DC= 0
##$DFILT= <>
##$DTYPP= 0
##$F1P= 0
##$F2P= 0
##$FCOR= 1
##$FTSIZE= 16384
##$FT_mod= 6
##$GAMMA= 0
##$GB= 0
##$INTBC= 1
##$INTSCL= 3.241238e-09
##$ISEN= 128
##$LB= 0.25
##$LEV0= 0
##$LPBIN= 0
##$MAXI= 10000
##$MC2= 0
##$MEAN= 0
##$ME_mod= 0
##$MI= 1.114404
##$NCOEF= 0
##$NC_proc= -5
##$NLEV= 6
##$NOISF1= 3.799351
##$NOISF2= 2.8
##$NSP= 0
##$NTH_PI= 0
##$NZP= 0
##$OFFSET= 15.35905
##$PC= 1
##$PHC0= 243.1263
##$PHC1= 22.3922
##$PH_mod= 1
##$PKNL= yes
##$PPARMOD= 0
##$PSCAL= 0
##$PSIGN= 0
##$REVERSE= no
##$SF= 200.130032551254
##$SI= 16384
##$SIGF1= 3
##$SIGF2= 2
##$SINO= 0.751879
##$SIOLD= 32768
##$SREGLST= <19F.Aceton>
##$SSB= 0
##$STSI= 16384
##$STSR= 0
##$SW_p= 3612.71676300578
##$SYMM= 0
##$S_DEV= 0
##$TDeff= 16384
##$TDoff= 0
##$TI= <>
##$TILT= no
##$TM1= 0
##$TM2= 0
##$TOPLEV= 0
##$USERP1= <user>
##$USERP2= <user>
##$USERP3= <user>
##$USERP4= <user>
##$USERP5= <user>
##$WDW= 1
##$XDIM= 16384
##$YMAX_p= 288559815
##$YMIN_p= -805473
$$ End of Bruker specific parameters
$$ ---------------------------------
##NTUPLES= NMR SPECTRUM
##VAR_NAME=  FREQUENCY,     SPECTRUM/REAL,   SPECTRUM/IMAG
##SYMBOL=    X,             R,               I
##VAR_TYPE=  INDEPENDENT,   DEPENDENT,       DEPENDENT
##VAR_FORM=  AFFN,          ASDF,            ASDF
##VAR_DIM=   16384,         16384,           16384
##UNITS=     HZ,            ARBITRARY UNITS, ARBITRARY UNITS
##FACTOR=    0.220516191357247, 1,           1
##FIRST=     3073.80713584157, 0,            0
##LAST=      -538.90962716421, 0,            0
##MIN=       -538.90962716421, -805473,      0
##MAX=       3073.80713584157, 288559815,    0
$$ Real data points
##PAGE= N=1
##DATA TABLE= (X++(R..R)), XYDATA
$$ [...]
9746E87873J20330Q7827m8141J43309J6782j62546K5275J1743k6891j663p8022
$$ 587873 708203 796030 747889 891198 907980 745434 770709 782452 755561 753898 675876
9735F75876q0703L1700r9586o9819L5499N964n3856L8327l6363K0566o337q98
$$ 675876 595173 626873 527287 457468 492967 498931 445075 483402 447039 467605 461268 460370
9723D60370L5739p7859m4825J4640J10339l2069j26332N2119n267Q59J02300m0161
$$ 460370 496109 418250 373425 388065 498404 466335 340003 392122 386855 387714 490014 449853
9711D49853O8529m4030n7871J6756k7393K8941l304q2708K9454j0131P9829J22597
$$ 449853 518382 474352 416481 433237 405844 434785 431481 348773 378227 368096 447925 570522
9699E70522q3309j14952p7989m487J2114P3211l0925o3032O7777K014r6659J05701
$$ 570522 487213 372261 294272 289785 301899 375110 344185 281153 348930 350944 254285 359986
9687C59986M8898O525l9198k120L8094K132J7259k9274o4905R6234O1864p7586
$$ 359986 408884 415409 376211 374091 412185 414317 431576 402302 337397 433631 495495 417909
9675D17909N0755j17572j01485M1623K2456P7545k7910n3801K598J04867k7572
$$ 417909 468664 351092 249607 291230 313686 391231 363321 309520 312118 416985 389413
9664C89413l5769N9983L5126j7104p7979L4276P0373P2637j21085n7220M7168
$$ 389413 353644 413627 448753 431649 353670 387946 458319 530956 409871 352651 399819
9653C99819n0772p9064P0104r751M1969J7685J6498l5077N8115N0699l6077N2850
$$ 399819 349047 269983 340087 330336 372305 389990 406488 371411 429526 480225 444148 496998
9641D96998m3335n0078J2089P935J9644L3899l825n1029p8817L1921J03787M5983
$$ 496998 453663 403585 415674 423609 443253 477152 473327 422298 343481 375402 479189 525172
9629E25172J3507J8359k1774k7899J5791l9049l944l3417J8381r341m7449L1621
$$ 525172 538679 557038 535264 507365 523156 484107 480163 446746 465127 455786 408337 439958
9617D39958k0014L7241k8832l3485M5890N7517N749K0469K4734N4701j2164j531
$$ 439958 419944 457185 428353 394868 440758 498275 504024 524493 549227 603928 591764 590233
9605E90233k4575k466M8489N5457k4987l3873K3868l7793N6010m729m3168J1424
$$ 590233 565658 563192 611681 667138 642151 608278 632146 594353 650363 645634 602466 613890
9593F13890N319L5663L5374J07975J8322J3756m398P4533K5797m2038N2035k6658
$$ 613890 619209 654872 690246 798221 816543 830299 825901 900434 926231 884193 936228 909570
9581I09570L1026N2693n8114n5679R1767l303r9809J2596jm3007O5873l0524j15751
$$ 909570 940596 993289 935175 879496 971263 967960 868151 880747 880746 837739 903612 873088 757337
9568G57337j3927N7435L4474J7378j39855k0772O1410J2220L923J2957L8611M9363
$$ 757337 743410 800845 835319 852697 712842 692070 753480 765700 769623 782580 821191 870554
9556H70554O5858P1152K595q6250O2500J42871P6179j49099N6064p789N5679R04
$$ 870554 936412 1007564 1010159 923909 986409 1129280 1205459 1056360 1112424 1104635 1160314 1161218
9544A161218l146j19437k7752n705p3913O9028j15461n2489L3966R9466M295k5438
$$ 1161218 1158072 1038635 1010883 1005178 931265 1000293 884832 832343 866309 965775 970070 944632
9532I44632p6007P420q2811m470K8609K852R3508p8771l5662M1591o9918O2107
$$ 944632 868625 876045 793234 788764 817373 820225 913733 834962 799300 840891 770973 833080
9520H33080n3725J35079l0895q0959O4077J4902K781K8913m9788m5544j1700L5458
$$ 833080 779355 914434 883539 802580 866657 881559 884340 913253 863465 817921 806221 841679
9508H41679L7088o2345m7537K7683N0795m3163N4482O776j088o43J28006k4520
$$ 841679 878767 816422 768885 796568 847363 804200 858682 865458 864370 863727 991733 967213
9496I67213p1180N5645o0797m5439J5455M7364P6398l267L3947m8043L4404M740
$$ 967213 896033 951678 890881 845442 860897 908261 984659 981392 1015339 967296 1001700 1006440
9484A006440L1654m779Q971p716l1874J0548m5376M7328O903M7730n4134L8539
$$ 1006440 1038094 1033315 1042286 1034570 1002696 1013244 967868 1015196 1022099 1069829 1015695 1054234
9472A054234L6890R025j0329J03287L2784o5698O3468M0539j668l0974J7373k2905
$$ 1054234 1091124 1100149 1089820 1193107 1225891 1160193 1223661 1264200 1262532 1231558 1248931 1226026
9460A226026J0519N4731M5114m8532k9325Q0505P0368J00177o283k5631L3713
$$ 1226026 1236545 1291276 1336390 1287858 1258533 1339038 1409406 1509583 1503300 1477669 1511382
9449A511382J09008N4303r022Q6094n5834M7921n3634N1089m271n0158R583L5418
$$ 1511382 1620390 1674693 1665671 1751765 1695931 1743852 1690218 1741307 1737036 1686878 1696461 1731879
9437A731879o4522k4642K3516l5444M0850n929j4395J0237r852L6033K9563p1370
$$ 1731879 1667357 1642715 1666231 1630787 1671637 1665708 1651313 1661550 1651698 1687731 1717294 1645924
9425A645924N9466J41470N1654K8919l2762L6907L3856k2809L359J01597K6486
$$ 1645924 1705390 1846860 1898514 1927433 1894671 1931578 1965434 1942625 1945984 2047581 2074067
9414B074067M5824J18349L5212K2288M0465k8316O4598m4217q9346J4041l6632
$$ 2074067 2119891 2238240 2273452 2295740 2336205 2307889 2372487 2328270 2238924 2252965 2216333
9403B216333m890j4278O1060j7321j6226r690N1219K5598j9340n7573Q0605O1175
$$ 2216333 2211443 2197165 2258225 2240904 2224678 2214988 2266207 2291805 2272465 2214892 2295497 2356672
9391B356672n0862k4205P9890K6922n9806M9908N6983k6633P9735O8906N6244
$$ 2356672 2305810 2281605 2361495 2388417 2328611 2378519 2435502 2408869 2488604 2557510 2613754
9380B613754n5772J29608l7305o3354K8412J31009J3896N2598J50574n280l3255
$$ 2613754 2557982 2687590 2650285 2586931 2615343 2746352 2760248 2812846 2963420 2958140 2924885
9369B924885L2118l588M2508O0668l6322j342O356N0592p1673J2956N8766N7413
$$ 2924885 2957003 2953415 2995923 3056591 3020269 3018927 3025283 3075875 3004202 3017158 3075924 3133337
9357C133337O7100L2260M1863M7034O8937O9837K4241Q555J01104M5348L2272
$$ 3133337 3200437 3232697 3274560 3321594 3390531 3460368 3484609 3493164 3594268 3639616 3671888
9346C671888M0154l7643J26593Q5124O7873M4500L3458L3874J70583Q4971J8177
$$ 3671888 3712042 3674399 3800992 3886116 3953989 3998489 4031947 4065821 4236404 4321375 4339552
9335D339552o8789M6068K5652P5133J03555M5907m7379L114O5240M7372O0578
$$ 4339552 4270763 4316831 4342483 4417616 4521171 4567078 4519699 4522813 4588053 4635425 4696003
9324D696003N548J68447R4864Q4818O0222l67L8034R8610K03025L8934K7716J48176
$$ 4696003 4701551 4869998 4964862 5049680 5109902 5109535 5147569 5246179 5449204 5488138 5515854 5664030
9312E664030J02478J23460J13721J12863M8244P0645J81810J17082R8439J29680
$$ 5664030 5766508 5889968 6003689 6116552 6164796 6235441 6417251 6534333 6632772 6762452
9302F762452L8794J09566P6831O9561P9717Q5576Q9095J87068Q4289O4217J25282
$$ 6762452 6801246 6910812 6987643 7057204 7136921 7222497 7311592 7498660 7582949 7647166 7772448
9291G772448J51587J33727J39542J14318K54310J77671R9948R2510J93949J54601
$$ 7772448 7924035 8057762 8197304 8311622 8565932 8743603 8843551 8936061 9130010 9284611
9281I284611J26519K23064K77270K50677K77556K36333J46538L25697L00638K93079
$$ 9284611 9411130 9634194 9911464 10162141 10439697 10676030 10822568 11148265 11448903 11741982
9271A1741982K91453K59272K46060K85223K99671L65163K71823K31527L18715
$$ 11741982 12033435 12292707 12538767 12823990 13123661 13488824 13760647 13992174 14310889
9262A4310889L61743L67983K71651K66741M28710M36021L86459M17403L69240
$$ 14310889 14672632 15040615 15312266 15579007 16007717 16443738 16830197 17247600 17616840
9253A7616840M59033N73056N42361N83159N43323O34388P50745Q64358R78324
$$ 17616840 18075873 18648929 19191290 19774449 20317772 20952160 21702905 22567263 23545587
9244B3545587J029479J112410J237554J380653J727572J947074K440842K851783
$$ 23545587 24575066 25687476 26925030 28305683 30033255 31980329 34421171 37272954
9236C7272954L544545M342028N072181M884306M061391L605549L568490L178234
$$ 37272954 40817499 45159527 50231708 55116014 59177405 62782954 66351444 69529678
9228F9529678K810732K528513J320702r3680l42072l274n51413k301570l636364
$$ 69529678 72340410 74868923 76189625 76095945 75753873 75750599 75199186 72897616 69261252
9219F9261252m461022m380582l336361k333512j984378k432018k750275k288034
$$ 69261252 64800230 60419648 57083287 54749775 52765397 50333379 47583104 45295070
9211D5295070j788782j219417n63094j92860K85191P38362J252983J764304K495559
$$ 45295070 43506288 42286871 41723777 41530917 41816108 42554470 43807453 45571757 48067316
9202D8067316L387777M425633N513386O238101N563090M100510K437807J276593
$$ 48067316 51455093 55880726 61394112 67632213 73195303 77295813 79733620 81010213
9194H1010213J643453K861916L272576J809075l0985j935539m362667n530691
$$ 81010213 82653666 85515582 88788158 90597233 90566248 88630709 84268042 78737351
9186G8737351n463804n039450m769779m203214l867269m401852n041892m733953
$$ 78737351 73273547 68234097 63464318 59261104 55393835 50991983 45950091 41216138
9178D1216138l934519l127701k677326k008544j565314j401284j288390j067792
$$ 41216138 37281619 34153918 31476592 29468048 27902734 26501450 25213060 24145268
9170B4145268r43025q49958p88036o90686n70557m48967m31414m61334l77645
$$ 24145268 23202243 22352285 21564249 20873563 20303006 19854039 19422625 18961291 18583646
9161A8583646l05691k98060l16685k90058k32303k33213j99716j38690j31942
$$ 18583646 18277955 17979895 17663210 17373152 17140849 16907636 16707920 16569230 16437288
9152A6437288j57651q6490n0436o7018j72755l3080L0143K796k1971o7678L855
$$ 16437288 16279637 16193147 16142711 16075693 15902938 15869858 15900001 15902797 15880826 15813148 15817003
9141A5817003o188j6493j4851j0143K7516k0749q5363J6821P4994K2353J32262
$$ 15817003 15810815 15794322 15779471 15769328 15796844 15776095 15690732 15707553 15782547 15804900 15937162
9130A5937162J40262L0339P8282J14417J05505Q3361K14543K24856K56227J68282
$$ 15937162 16077424 16107763 16186045 16300462 16405967 16489328 16703871 16928727 17184954 17353236
9120A7353236K76215J98787K55977L81412L00067L62391M09229N33975O50892
$$ 17353236 17629451 17828238 18084215 18465627 18765694 19128085 19537314 20071289 20722181
9111B0722181P75535P27279Q58747Q48778R50264J144388J425195J670417K034861
$$ 20722181 21497716 22224995 23083742 23932520 24882784 26027172 27452367 29122784 31157645
9102C1157645K532694L357800M187163M696294M488791L459919L123716L624180
$$ 31157645 33690339 37048139 41235302 45931596 50420387 53880306 57004022 60628202
9094F0628202L760357L171172K474001J697225N00151j583398l648365m311725
$$ 60628202 64388559 67559731 70033732 71730957 72231108 70647710 66999345 62687620
9086F2687620l628126l486237l355744l809781m217658l591439k674974j992406
$$ 62687620 59059494 55573257 52217513 48407732 44190074 40598635 37923661 35931255
9078C5931255j330684o82744k17369j1916L03425N88412Q63770J182333J602463
$$ 35931255 34600571 33917827 33700458 33688542 33991967 34580379 35444149 36626482 38228945
9069C8228945J990759K718730L451502M549547N897639O671663O237761M523841
$$ 38228945 40219704 42938434 46389936 50939483 56837122 63508785 69746546 74270387
9061G4270387L620074N613525Q002141P777715L982753K28761j501106j532070
$$ 74270387 77890461 83503986 91506127 99283842 103266595 103495356 101994250 100462180
9053A00462180j245439l520471o672347q620738q341098o658836o075691o834390
$$ 100462180 99216741 95696270 89023923 80403185 72062087 65403251 59327560 52493170
9045E2493170o591462n570091m400239l413675k753681k082865j673701j442155
$$ 52493170 45901708 40331617 35931378 32517703 29764022 27681157 26007456 24565301
9037B4565301j216867r19731q29349p68317n04943n70172m73677l51536k94941
$$ 24565301 23348434 22428703 21599354 20831037 20326094 19755922 19282245 18930709 18635768
9028A8635768l24189k07013k30654j64769j58146p3201o9253q8314l8354K0768
$$ 18635768 18311579 18104566 17873912 17709143 17550997 17477796 17408543 17320229 17281875 17302643
9018A7302643l6587J6020K23981J96649J56489J65247L5911q4589N0164N0124
$$ 17302643 17266056 17282076 17506057 17702706 17859195 18024442 18060353 17975764 18025928 18076052
9008A8076052K3035J32464J65638J42221L3825R5687K28118J49690K59040L38815
$$ 18076052 18099087 18231551 18397189 18539410 18573235 18668922 18897040 19046730 19305770 19644585
8998A9644585M05462M65433N06768N06271N32165O48790P71245Q23685R42634
$$ 19644585 20050047 20515480 21022248 21528519 22060684 22709474 23480719 24304404 25247038
8989B5247038J089592J291391J661538K021145K585992L163388L371867K857178
$$ 25247038 26336630 27628021 29289559 31310704 33896696 37060084 40431951 43289129
8981D3289129J606552O33882Q34822J859387K990733L227917J436637j572878
$$ 43289129 44895681 45529563 46364385 48223772 51214505 54442422 55879059 54306181
8973E4306181l048197k703963j573028n50136l55250r91730j813082j897795j289922
$$ 54306181 51257984 48554021 46980993 46430857 46075607 45083877 43270795 41373000 40083078
8964D0083078p99409l26237P4801L34779N85312R68059J265472J819031K301266
$$ 40083078 39283669 38957432 39032233 39367012 39952324 40920383 42185855 44004886 46306152
8955D6306152L076121M124774N273910O521017O899310N486192K501061Q03469
$$ 46306152 49382273 53507047 58780957 65301974 72201284 77687476 80188537 80992006
8947H0992006J028811K775408M525035M474229J071616l441810n052388m191024
$$ 80992006 82020817 84796225 89321260 93795489 94867105 91425295 86372907 82181883
8939H2181883k928643k362293k705449l740444m297064l879419k913727k396815
$$ 82181883 79253240 76890947 74185498 70445054 66147990 62268571 59354844 56958029
8931E6958029k101303j722140q95247j45793R03403J678926K591435L480867M676415
$$ 56958029 54856726 53134586 52239339 52093546 52996949 54675875 57267310 60748177 65424592
8922F5424592L169413m91787k510796j842005Q70285K810280L965043L249051
$$ 65424592 68594005 68102218 65591422 63749417 64619702 67429982 71395025 74644076
8914G4644076J110481o22432l09097J310967L712892N323897M911624K566956
$$ 74644076 75754557 75132125 74823028 76133995 79846887 85170784 90082408 92649364
8906I2649364Q00191P34830K138532J925766q32943k010973k066698n84886J538200
$$ 92649364 93449555 94184385 96322917 98248683 97415740 95404767 93338069 92753183 94291383
8897I4291383L991788J680045n215250q355365p726823n058655k646008q12667
$$ 94291383 98283171 99963216 94747966 86392601 78665778 73607123 70961115 70148448
8889G0148448j234005l992308n070933m272072l220439k391677j849663j045769
$$ 70148448 68914443 64922135 59851202 55579130 52358691 49967014 48117351 47071582
8881D7071582p01474m46760N1878L87724Q06596J523361K114151L073877L828954
$$ 47071582 46370108 45923348 45975226 46362950 47169546 48692907 50807058 53880935 57709889
8872E7709889M750702M598191L915878L364979J530693M75642J305645L146699
$$ 57709889 62460591 67058782 70974660 74339639 75870332 76345974 77651619 80798318
8864H0798318L781027J435990k171782n727301p108255n634468l486239j965426
$$ 80798318 84579345 86015335 83843553 78116252 71007997 65373529 61887290 59921864
8856E9921864k376628m584272n520148m950697l944462k864886k259222j676399
$$ 59921864 57545236 52960964 47440816 42490119 38545657 35680771 33421549 31745150
8848C1745150j364417j101869q62323o87032n68380k21295J9083L62500Q39717
$$ 31745150 30380733 29278864 28416541 27729509 27161129 26939834 26958917 27321417 28161134
8839B8161134J305166J709190J489949J89470p76174n27023L51362J244824J148345
$$ 28161134 29466300 31175490 32665439 32854909 32078735 31551712 31903074 33147898 34296243
8830C4296243j23806k029859k961442k452904j664366p81661p88227j658963k139719
$$ 34296243 34172437 32142578 29181136 26728232 25063866 24282205 23493978 21835015 19695296
8821A9695296j939901j616144j330042j071640q51440p35070o06017n41604m75423
$$ 19695296 17755395 16139251 14809209 13737569 12886129 12151059 11545042 11003438 10528015
8812A0528015n37019l88891l47181l77933l66386k60007k51032k15208k09951
$$ 10528015 9990996 9602105 9254924 8876991 8510605 8250598 7999566 7784358 7574407
8803G574407k01819j74999j21925j24123k48246j03063k19021j68279r760j14454
$$ 7574407 7372588 7197589 7075664 6951541 6703295 6600232 6381211 6212932 6203172 6088718
8793F088718j00332j26674j28204j47963j02183j30706j05146m6241o8304j24769
$$ 6088718 5988386 5861712 5733508 5585545 5483362 5352656 5247510 5201269 5132965 5008196
8783E008196p919K1154q8401m2011m5445j03450r0945L2996o689o0103M370m5848
$$ 5008196 5000277 5021431 4933030 4891019 4845574 4742124 4651179 4684175 4677486 4617383 4621753 4575905
8771D575905n406p250k0236o9418m5155o9185j30631r7064q9702O9o7606o0275
$$ 4575905 4570499 4563249 4543013 4473595 4428440 4359255 4228624 4131560 4041858 4041927 3974321 3914046
8759C914046P091l8694j37181o2048k2761m9795M6849Q610J06040j4907K0181
$$ 3914046 3921137 3882443 3745262 3683214 3660453 3610658 3657507 3666117 3772157 3757250 3777431
8748C777431N4170M9671J33024J43856J55331J07491R3296N6305R1544J1934O1365
$$ 3777431 3831601 3881272 4014296 4158152 4313483 4420974 4514270 4570575 4662119 4674053 4735418
8737D735418Q9974J47169p179j6599j0036m7586r4683j18888l7852q8631j74999
$$ 4735418 4825392 4972561 4965382 4948783 4938747 4891161 4796478 4677590 4639738 4551107 4376108
8726D376108j56885j74499k32538j60938k25438k39746r6730j23093j75627j52714
$$ 4376108 4219223 4044724 3812186 3651248 3425810 3186064 3089334 2966241 2790614 2637900
8716B637900q765N568q6322o3195m0393L3165P1672P4393N1002k0652j4655R7637
$$ 2637900 2629135 2634703 2548381 2485186 2444793 2477958 2549630 2624023 2675025 2654373 2639718 2737355
8704B737355o5330n1250J43347M8564O3414q8904n8510k3195l3035l5196J1626
$$ 2737355 2672025 2620775 2764122 2812686 2876100 2787196 2728686 2705491 2672456 2637260 2648886
8693B648886L3191l6060m9132m0119J6982K0390o7111N2552J22568l8660q804
$$ 2648886 2682077 2646017 2596885 2556766 2573748 2594138 2527027 2579579 2702147 2663487 2654683
8682B654683R6502J25524Q0557R3887O4856M0661J0015m7433Q5366K8571l2037
$$ 2654683 2751185 2876709 2957266 3051153 3116009 3156670 3166685 3119252 3204618 3233189 3201152
8671C201152r7447j02102j07271j30013k31717j49816j55534j57806j63649j16986
$$ 3201152 3103705 3001603 2894332 2764319 2532602 2382786 2227252 2069446 1905797 1788811
8661A788811p3302j47264j27777p3643l8895j0269r2145n6376K6518n399m0894
$$ 1788811 1715509 1568245 1440468 1366825 1327930 1317661 1225516 1169140 1195658 1190259 1149365
8650A149365j3778M5079R8076O3234o8486K8608N2501K5800K8496L7945q449j74
$$ 1149365 1135587 1180666 1278742 1341976 1273490 1302098 1354599 1380399 1408895 1446840 1438391 1438217
8638A438217j294p2585l7901J0253j44661N100j06620J8855P999j72381j30703
$$ 1438217 1436923 1364338 1326437 1336690 1192029 1197129 1090509 1109364 1117363 944982 814279
8627H14279m6719k5478o3498p8954o8106J837k2496l3516K526P533O0799K6140
$$ 814279 767560 742082 678584 599630 531524 533361 510865 477349 479875 487408 548207 574347
8615E74347k5547m6630L2441n1509o0277o0585o4341p727P3096k471n1777m5283
$$ 574347 548800 502170 534611 483102 422825 362240 297899 290172 363268 360797 309020 263737
8603B63737l2399J9422P465k3806l9671m8070k884P7950m4020L3145q742n177
$$ 263737 231338 250760 258225 234419 194748 146678 143794 221744 177724 210869 202127 196950
8591A96950l5705L0241O4699N6369m0070O5114Q7903R606M243p0226R2318J34251
$$ 196950 161245 191486 256185 312554 272484 337598 425501 435107 439350 369124 461442 595693
8579E95693p8880q218O5175j49465j1635p416l7095L0677l6905J533J5658n4206
$$ 595693 516813 508595 573770 424305 412670 405254 368159 398836 361931 363464 379122 324916
8567C24916N4737j5132k1536q9584j8155J4848l6914P3254J4367r653o7022M6817
$$ 324916 379653 364521 342985 253401 235246 250094 213180 286434 300801 291148 224126 270943
8555B70943M145O4128J46521j13534n8896L1906O7797P6244K9208K2092O6246
$$ 270943 275088 339216 485737 372203 313307 345213 413010 489254 518462 540554 606800
8544F06800N1549n0193p8270k0916l7711j6007m7394j6294L1176k4272L375j02712
$$ 606800 658349 608156 529886 508970 471259 455252 407858 391564 422740 398468 401843 299131
8532B99131p3827j1694R346j3598l3348Q1269Q1664m5524q9643k9876j2200J12790
$$ 299131 225304 213610 222956 209358 176010 257279 338943 293419 203776 173900 161700 274490
8520B74490N2227j30054K5164R6410K0830O0243K1122K6618J47996M6270P0295
$$ 274490 326717 196663 221827 318237 339067 399310 420432 447050 595046 641316 711611
8509G11611L1586J02302J1257K7439p8957r719J02759K808K4769L3701K297k4144
$$ 711611 743197 845499 856756 884195 805238 795519 898278 901086 925855 959556 961853 937709
8497I37709J7234L0596J5822q2682m9908k153q9424j23141q4706K0968m2670q8350
$$ 937709 954943 985539 1001361 918679 868771 866618 777194 654053 569347 590315 547645 459295
8485D59295p4265k2066n6298K4003j1108j5971O759J2854J65151J0500K0706J7105
$$ 459295 385030 362964 306666 330669 319561 303590 310349 323203 488354 498854 519560 536665
8473E36665N3424J3721p7021P1584L1578M59o729m6158N6683Q9220J2361J27R6419
$$ 536665 590089 603810 526789 598373 629951 630410 623681 577523 634206 723426 735787 735914 832333
8460H32333L9866M9640N2211j4099N904j9167p0693p7140l3805M3788J2637l4505
$$ 832333 872199 921839 974050 959951 965855 946688 875995 798855 765050 808838 821475 786970
8448G86970k6277P3046L0006q3620j50165M3692j6239j31370o7901M4504K845
$$ 786970 760693 833739 863745 780125 629960 673652 657413 526043 458142 502646 505491
8437E05491n8674k5567o1198q6451j3708O5078k870l5933j45847l5969N569k6697
$$ 505491 446817 421250 360052 273601 259893 324971 322101 286168 140321 104352 109921 83224
8425H3224K8266L8410p0067p9100j616q8762k6491J8198o4417o7831J9765o5197
$$ 83224 111490 149900 79833 733 -883 -89645 -116136 -97938 -162355 -230186 -210421 -275618
8413b75618P3694Q058r340J0021m0962k1508j5780J15721n6325l1696L1428L6333
$$ -275618 -201924 -193866 -203206 -193185 -234147 -255655 -271435 -155714 -212039 -243735 -212307 -175974
8401a75974n4355j5322P8667K1020Q9038O68N2362P2831m6835J00389j7053p8817
$$ -175974 -230329 -245651 -166984 -145964 -56926 -56258 -3896 68935 22100 122489 105436 26619
8389B6619L8570j6147n0859j08055j14729J7596L0797K2305R9761l1199m5276
$$ 26619 65189 49042 -1817 -109872 -224601 -207005 -176208 -153903 -54142 -85341 -130617
8378a30617m3106j26293k1176J09218M7922l3647l9114J7845l875k7025p701l8801
$$ -130617 -173723 -300016 -321192 -211974 -164052 -197699 -236813 -218968 -222843 -249868 -257569 -296370
8366b96370k525K8442r603O527O7308l0702p9033J2281K4564K9526k4568L1384
$$ -296370 -298895 -270453 -280056 -273529 -206221 -236923 -315956 -303675 -279111 -249585 -274153 -242769
8354b42769J1611K9310k4560n1899l5185O112K5058J3580O6889J2221q1380m0240
$$ -242769 -231158 -201848 -226408 -278307 -313492 -307380 -282322 -268742 -201853 -189632 -271012 -311252
8342c11252j0212p667M1611J2298k3925M95o1908j4027k5710o9981L5677l4715
$$ -311252 -321464 -329131 -287520 -275222 -299147 -298652 -360560 -374587 -400297 -470278 -434601 -469316
8330d69316N2555O6084l814k4845K6317m459L0580k6507P166Q119k4442n0725
$$ -469316 -416761 -350677 -354491 -379336 -353019 -357478 -326898 -353405 -346239 -338120 -362562 -413287
8318d13287M0783P693K0242l6356n4432N8543P6137j03983m5189M8508P5118m953
$$ -413287 -372504 -364811 -344569 -380925 -435357 -376814 -300677 -404660 -449849 -401341 -326223 -331176
8306c31176o2663n6481Q7180N6639j01856j3286J34964P5467j25756j159P3021
$$ -331176 -393839 -450320 -363140 -306501 -408357 -421643 -286679 -211212 -336968 -338127 -265106
8295b65106N8044q0650P0100J7661j7050m2397K9619M6621R4618N270n6121M1440
$$ -265106 -207062 -287712 -217612 -199951 -217001 -259398 -229779 -183158 -88540 -83270 -139391 -97951
8283i7951J8007l2158j1134R5303O5199L5838K142m2480j20853K3271O146p9230
$$ -97951 -79944 -112102 -123236 -27933 37266 73104 75246 32766 -88087 -64816 -58670 -137900
8271a37900N6520K7878o6402Q6853o7519n5686j6717p0914p0729M0172P4327k7221
$$ -137900 -81380 -53502 -119904 -33051 -100570 -156256 -172973 -243887 -314616 -274444 -200117 -227338
8259b27338m2719k103K8966O524j0396p402J1593n6954k2175L0288p7185M5171
$$ -227338 -270057 -272160 -243194 -236670 -247066 -254468 -242875 -299829 -322004 -291716 -368901 -323730
8247c23730J43601k3335j6896J1211M4501l0651L5636J0905J090r701P361L0190
$$ -323730 -180129 -203464 -220360 -209149 -164648 -195299 -159663 -148758 -147668 -157369 -150008 -119818
8235a19818J4855j6955J9181q7357l5649J38958k1057r8389J12120k4749k3690
$$ -119818 -104963 -121918 -102737 -190094 -225743 -86785 -107842 -206231 -94111 -118860 -142550
8224a42550J935N943l9016L4997L9830l9406K0280K3188P6953M3221m2733l1292
$$ -142550 -140615 -134672 -173688 -138691 -98861 -138267 -117987 -94799 -17846 25375 -17358 -48650
8212d8650J07275j4521K2674q681J8853o0983p6496J4439P4766J1351m7060Q8706
$$ -48650 58625 44104 66778 58097 76950 15967 -60529 -46090 28676 40027 -7033 81673
8200H1673j15452j70977N0122J22548Q2134j170m7696J80564l23645l20589K09477
$$ 81673 -33779 -204756 -154634 -32086 50048 48878 1182 181746 -141899 -462488 -253011
8189b53011k3996P9875O0699M0757q573j6387L9218J2495J20231J3023p777Q3273
$$ -253011 -277007 -197132 -136433 -95676 -104249 -120636 -81418 -68923 51308 64331 56554 139827
8177A39827M6837k875k6487P0446J5182J19J1947K2098Q4793N7886L2126k3690
$$ 139827 186664 183789 157302 227748 242930 243049 254996 277094 361887 419773 451899 428209
8165D28209P8614K2494P8070J44906O4862P5471J51917J52781K45549K43378J73684
$$ 428209 506823 529317 607387 752293 817155 892626 1044543 1197324 1442873 1686251 1859935
8154A859935L17887K14771K41758L32600K02406L8034J9571m8853m6065o8236
$$ 1859935 2177822 2392593 2634351 2966951 3169357 3207391 3226962 3178109 3132044 3063808
8144C063808k07893l14241k93227k13515k24610k70189k79654j89956j39413k06109
$$ 3063808 2855915 2541674 2248447 2034932 1810322 1540133 1260479 1070523 931110 725001
8134G25001p9562p4184j22459j30637r9354n6018l8976P1091r9263q6915j4727
$$ 725001 645439 571255 448796 318159 218805 162787 123811 194902 95639 8724 -6003
8123f003K1325j3090o0624k0922q6773j4412L7568n7514j8536p3983R913K9445
$$ -6003 15322 2232 -58392 -79314 -166087 -180499 -142931 -200445 -218981 -292964 -283051 -253606
8111b53606m3995O5289n2878j22533J8426Q8289j8510K0020j9000L432N6160P4541
$$ -253606 -297601 -232312 -285190 -407723 -389297 -301008 -319518 -299498 -318498 -315066 -258906 -184365
8099a84365q3613K9597J2274l4235L4414K3071R9374m2942q9524J4527J15579
$$ -184365 -267978 -238381 -226107 -260342 -225928 -202857 -103483 -146425 -235949 -221422 -105843
8088a05843N4568n3693o7501J6153O1850P1323q4567q2624J7130l8060k4490m2748
$$ -105843 -51275 -104968 -172469 -156316 -94466 -23143 -107710 -190334 -173204 -211264 -235754 -278502
8076b78502M2842m142j3446M2378K2429M4347L3461N8850l329m6278k8773P2803
$$ -278502 -235660 -239802 -253248 -210870 -188441 -144094 -110633 -51783 -55112 -101390 -130163 -57360
8064e7360M265m7638l8214m5342O6603J1618p9564l7527j3947R7777K569l7383
$$ -57360 -53095 -100733 -138947 -184289 -117686 -106068 -185632 -223159 -237106 -139329 -136760 -174143
8052a74143M7060k5299O909j2899j7279L5683q202N828K3577L2398N8442j0037
$$ -174143 -127083 -152382 -145473 -158372 -175651 -139968 -148170 -142342 -118765 -86367 -27925 -37962
8040c7962O1076K0921j3817J4709j911m1670q5923L0886o6337j4134L8764N6173
$$ -37962 23114 44035 30218 44927 43016 1346 -84577 -53691 -120028 -134162 -95398 -39225
8028c9225m5142o3470P7922k5433N1536Q3218o614n1547l9443N9317N5224L3842
$$ -39225 -84367 -147837 -69915 -95348 -43812 39406 32792 -18755 -58198 1119 56343 90185
8016I0185l4463J5122O719k5179n5447n877J1686L7527j2060j7061M5076J3544
$$ 90185 55722 70844 77563 52384 -3063 -8940 2746 40273 28213 11152 56228 69772
8004F9772o6795M5618L5853o8996n4510J9484k5863K6733J0263n4471J01024M2320
$$ 69772 2977 48595 84448 15452 -39058 -19574 -45437 -18704 -8441 -62912 38112 80432
7992H0432J2181O8132L0148j21352Q635O9821k1658Q823P5481k0804m6962L541
$$ 80432 92613 160745 190893 69541 78176 147997 126339 135162 210643 189839 142877 146418
7980A46418l7039J4161j3360m0511m1829p6557k0598j0157J1576k9771J8597M5904
$$ 146418 109379 123540 110180 69669 27840 -48717 -69315 -79472 -67896 -97667 -79070 -33166
7968c3166q1067l3416L2005K1250o5655P260L2493j9313L3106j09011L7453R6933
$$ -33166 -114233 -147649 -115644 -94394 -160049 -152789 -120296 -139609 -106503 -215514 -178061 -81128
7956h1128J832p6360k4497j8312O0838P480M8863l5933O4371N6633O3841J35813
$$ -81128 -79296 -155656 -180153 -198465 -137627 -130147 -81284 -117217 -52846 3787 67628 203441
7944B03441m5718q7255N6269n4517j4367Q2717r7270M7089q6940M625l6185j7090
$$ 203441 157723 70468 126737 72220 57853 140570 43300 90389 3449 8074 -28111 -45201
7932d5201k1879L2972N7308j9500j1659o8955R395k2149J9831j7304m6161n7220
$$ -45201 -67080 -34108 23200 3700 -7959 -76914 -67519 -89668 -69837 -87141 -133302 -190522
7920a90522Q1506j0473k1843o9711o4131L1628p659R701K8986m5912L0718L279
$$ -190522 -109016 -119489 -141332 -211043 -275174 -243546 -251205 -241504 -212518 -258430 -227712 -224433
7908b24433m5138K1838K1076l604m9056O7311l0569o4380o3076N5245Q9772p2472
$$ -224433 -269571 -247733 -226657 -230261 -279317 -212006 -242575 -306955 -370031 -314786 -225014 -297486
7896b97486p8815O7142J4010o4860l650K1896M4733P5924k9940o4686q1678P3076
$$ -297486 -376301 -309159 -295149 -360009 -363659 -341763 -297030 -221106 -251046 -315732 -397410 -324334
7884c24334M1167n4362k963J6539r2151m541l1632L1559j6762k5385L0103O7707
$$ -324334 -283167 -337529 -340492 -323953 -416104 -420645 -452277 -420718 -437480 -462865 -432762 -365055
7872c65055k9682J2298P509Q7638M053j0917P72O491j8686p6037k9659L9021J70544
$$ -365055 -394737 -382439 -374930 -287292 -283239 -294156 -293384 -286893 -305579 -381616 -411275 -372254 -201710
7859b01710M3281q8317o6713p5331l4402K4640m4292L2169L7971P5112j9054o5785
$$ -201710 -158429 -246746 -313459 -388790 -423192 -398552 -442844 -410675 -372704 -297592 -316646 -382431
7847c82431J0377M3055m0805L0960M0799R1206r6174l3066k1172l4959k4803K2583
$$ -382431 -372054 -328999 -369804 -338844 -298045 -206839 -303013 -336079 -357251 -392210 -417013 -394430
7835c94430P9919Q5725r0949J3185N4048j7570M6199n8864m7107N6240N8568K7069
$$ -394430 -314511 -228786 -319735 -306550 -252502 -270072 -223873 -282737 -329844 -273604 -215036 -187967
7823a87967n1628m1853N4577M7166l8736O618Q0381M4635j2993P0082J5567r5247
$$ -187967 -239595 -281448 -226871 -179705 -218441 -211823 -131442 -86807 -99800 -29718 -14151 -109398
7811a09398l5307K3939M1067L1813k9293o6215J13724k7225K85997J48131j32955
$$ -109398 -144705 -120766 -79699 -47886 -77179 -143394 -29670 -56895 229102 377233 244278
7800B44278q813l4243J20538N4029L8993J2183R0239Q3438J09977P2156Q6480
$$ 244278 235465 201222 321760 375789 414782 426965 517204 600642 710619 782775 869255
7789H69255K6755l8716n5888j4704q165l945k6167j5468R1391j01996j18016K7864
$$ 869255 896010 857294 801406 786702 778537 774592 748425 732957 824348 722352 604336 632200
7777F32200M5485n5383j17858j565M2646N5820N4722k9827j41720p9196k6513
$$ 632200 677685 622302 504444 502879 545525 601345 656067 626240 484520 405324 378811
7766C78811l1969L8757K6059K6891l0041n6669j18570j1129k8993o8441m6076
$$ 378811 346842 385599 411658 438549 408508 351839 233269 222140 193147 124706 78630
7755G8630p577J1927j9759l4589O004k7306L3490r3220m4354L812K4924k6655
$$ 78630 71053 82980 63221 28632 34636 7330 40820 -52400 -96754 -92942 -68018 -94673
7743i4673Q8749Q4651r4428k1461Q6537L4291P4978l8141n0217Q9138M0851k0447
$$ -94673 -5924 78727 -15701 -37162 49375 83666 158644 120503 70286 159424 200275 179828
7731A79828m2227p4831o1651L5511K9699m0633k4023L8938k814N4234m9563m6688
$$ 179828 137601 62770 1119 36630 66329 25696 1673 40611 37797 92031 42468 -4220
7719d220j1195k122n1046J1899J16600J6998P393l2217R935j0363N6335J9035
$$ -4220 -15415 -17537 -68583 -56684 59916 76914 84307 52090 62025 51662 107997 127032
7707A27032n6625O3456M2768j25396J7973L1241j6707J6077n6129j353m7749N9796
$$ 127032 70407 133863 176631 51235 69208 100449 83742 99819 43690 42337 -5412 54384
7695E4384o6462n699K8709k8895K3040Q2051j02372n5080L3367j3702l5617k8301
$$ 54384 -12078 -17777 10932 -17963 5077 87128 -15244 -70324 -36957 -50659 -86276 -114577
7683a14577P0112M2874q2819N4564l149j3229L5129m5579k40N3186M124N0263
$$ -114577 -44465 -1591 -84410 -29846 -32995 -46224 -11095 -56674 -56914 -3728 396 50659
7671E0659n3025N1649o57L8947L0286j705k4637L198J2431n8606L5963n8517J2379
$$ 50659 -2366 49283 48626 87573 117859 116154 91517 94715 107146 48540 84503 25986 38365
7658C8365K4363n724j42949L9893L7129L2768K2241K2673o0758n039L4834M0344
$$ 38365 62728 57004 -85945 -46052 -8923 23845 46086 68759 8001 2962 37796 78140
7646G8140k472n5724Q676P467p166R1874K151o8612l1760K4740M0461J495k0810
$$ 78140 75668 19944 28620 36087 28921 120795 122946 54334 22574 47314 87775 89270 68460
7633F8460m3651k3268J5390j15154m3378J02016M9473M2661m3984p4025M4752
$$ 68460 24809 1541 16931 -98223 -141601 -39585 9888 52549 8565 -65460 -20708
7622b0708o0972j3459M6851p375M5351k8637p3340J5497O9524l2317O314j8154
$$ -20708 -81680 -95139 -48288 -55663 -10312 -38949 -112289 -96792 -27268 -59585 -53271 -71425
7610g1425l0799l2394j3548L5035P3213o4580N005R6919J2847p4876k4938J3894
$$ -71425 -102224 -134618 -148166 -113131 -39918 -104498 -99493 -2574 10273 -64603 -89541 -75647
7598g5647n5965J32350N4096n0123j9808n3410J0423r197l6663Q499k0619K7366
$$ -75647 -131612 738 54834 4711 -15097 -68507 -58084 -67281 -103944 -95445 -116064 -88698
7586h8698L7762l625o8327N4671J7454k8742P4469m6906M7011l7746j3217M2294
$$ -88698 -50936 -54561 -122888 -68217 -50763 -79505 -5036 -51942 -4931 -42677 -55894 -13600
7574a3600Q39R2004k3781K1248m6831j28735R2772q779k2716l2830l2737n2668
$$ -13600 -12761 79243 55462 76710 29879 -98856 -6084 -14863 -37579 -70409 -103146 -155814
7562a55814R3485K2544l4962l0199L7178m7701r0267k3310M6443P1159r2665L8851
$$ -155814 -62329 -39785 -74747 -104946 -67768 -115469 -205736 -229046 -182603 -111444 -204109 -165258
7550a65258K8421K0986l2682o0013Q2872q5182N1292M7114j3387n914j4387K5963
$$ -165258 -136837 -115851 -148533 -208546 -125674 -210856 -159564 -112450 -125837 -131751 -146138 -120175
7538a20175l4730j6715M042Q3194K1544K753J8804k5560n4141j3200l0797M2217
$$ -120175 -154905 -171620 -167578 -84384 -62840 -60087 -41283 -66843 -120984 -134184 -164981 -122764
7526a22764L2656N1901j520Q607L438M5874k0883N0102M253J0639O6935R312l1468
$$ -122764 -90108 -38207 -39727 -31120 -27682 18192 -2691 47411 51664 62303 129238 138550 107082
7513A07082q4545L7093j0108n3348l0598Q0550M2800j9137O768R385R236q9109
$$ 107082 22537 59630 49522 -3826 -34424 46126 88926 69789 76557 85942 95178 6069
7501F069K0073j3230K0615J3517M6478n8817n1619P4026N3928j015J3622r532
$$ 6069 26142 12912 33527 47044 93522 34705 -16914 57112 111040 110025 123647 114115
7489A14115M3406k2101n3826O4958N1411N626p3330L017K507k6723K4519R0040
$$ 114115 157521 135420 81594 146552 197963 203589 130259 133276 135783 109060 133579 223619
7477B23619M9354K3128J30191N2963J3050k7868m2661k5610N9511m7230m8161
$$ 223619 272973 296101 426292 479255 492305 464437 421776 396166 455677 408447 360286
7466C60286r1634j97344K8023o1465K4551l3581o9305K3307O3032N5904n950l4980
$$ 360286 268652 71308 99331 37866 62417 28836 -40469 -17162 45870 101774 95824 60844
7454F0844n0963n1067j2284L7537Q8626P5647O3753J41103J20877K1034N3060
$$ 60844 9881 -41186 -53470 -15933 72693 148340 212093 353196 474073 495107 548167
7443E48167l1941j03084P0550r311q1728N7446p3129q1238l399q6545j28416k9575
$$ 548167 516226 413142 483692 474381 392653 450099 376970 295732 292333 205788 77372 47797
7431D7797o11J4050k4955J03062j0947k9331l4281n4857o4757J1423L9920l4493
$$ 47797 47186 61236 36281 139343 128396 99065 64784 9927 -54830 -43407 -3487 -37980
7419c7980L9497O9601O3313O724j15217k8824k588p3179N1462m3563l524M1761
$$ -37980 1517 71118 134431 141155 25938 -2886 -5474 -78653 -27191 -70754 -74278 -32517
7407c2517L2080K4551N0747q8165j6405M8953M6100k6817k4215n688o9191k7399
$$ -32517 -437 24114 74861 -13304 -29709 19244 65344 38527 14312 8624 -60567 -87966
7395h7966R5546O1016l1239P5545j7524n8075m9805P118L0293Q3049P8761m2998
$$ -87966 7580 68596 37357 112902 95378 37303 -12502 -5384 24909 107958 186719 143721
7383A43721m8753j3778O979n264n01k583N1350P5206n3785p4640m8111j08792
$$ 143721 94968 81190 88169 82905 82404 79821 131171 206377 152592 77952 29841 -78951
7371g8951m3474P8375J2594O4186l8134j3073J0817K9819q4194p1994j3706k5080
$$ -78951 -122425 -44050 -31456 32730 -5404 -18477 -7660 22159 -62035 -134029 -147735 -172815
7359a72815O1308K3448o2912l146k3726N6538O0137r9069L5327m1109Q6321j8305
$$ -172815 -111507 -88059 -150971 -154117 -177843 -121305 -61168 -160237 -124910 -166019 -79698 -98003
7347i8003K7634m6948K1457M078K476P7756L282l250j38286q1972L6932j9395
$$ -98003 -70369 -117317 -95860 -91782 -89306 -11550 -8268 -11518 -149804 -231776 -194844 -214239
7335b14239J30613K0526j36472l3350K534K9502l5639K3295M3734o4678l1535
$$ -214239 -83626 -63100 -199572 -232922 -230388 -200886 -236525 -213230 -169496 -234174 -265709
7324b65709K1917L289n4322p0094O9935J8416l0194j1242O756k8949M1450o093
$$ -265709 -243792 -240503 -294825 -364919 -294984 -276568 -306762 -318004 -311248 -340197 -298747 -304840
7312c04840m3624L7542J9012K5611K8105m9285l5717N2640k5806K4772l56Q641
$$ -304840 -348464 -310922 -291910 -266299 -238194 -287479 -323196 -270556 -296362 -271590 -271946 -263305
7300b63305L1733n4022j1101M8917Q8686m1333p7242Q144j8631J3282P9321j1934
$$ -263305 -231572 -285594 -296695 -247778 -159092 -200425 -277667 -269523 -288154 -274872 -195551 -207485
7288b07485o0544k6448l5710K0097O5310Q87j4479m7809j9199k6250M409L5763
$$ -207485 -268029 -294477 -330187 -310090 -244780 -243893 -258372 -306181 -325380 -351630 -347221 -311458
7276c11458M9146L5724k8046j9738L1288R6878l1528n4559l4675J3679Q3639K2757
$$ -311458 -262312 -226588 -254634 -274372 -243084 -146206 -177734 -232293 -266968 -253289 -169650 -146893
7264a46893N512n298n6436J2989M5139K7973n9364l627Q6745o4221j01125P2377
$$ -146893 -141381 -146679 -203115 -190126 -144987 -117014 -176378 -180005 -93260 -157481 -258606 -186229
7252a86229J16294n0287m5474j5775P8514K491j6946k1521j3837n1779L087J5817
$$ -186229 -69935 -120222 -165696 -181471 -102957 -100466 -117412 -138933 -152770 -204549 -201462 -185645
7240a85645J19431K3729J8196N9903M9118N4134l9629l7568j6891Q7837J04467
$$ -185645 -66214 -42485 -24289 35614 84732 138866 99237 61669 44778 132615 237082
7229B37082J39101m1364J05244O8976J15591O8277L6474o5160J20171J39893Q9648
$$ 237082 376183 334819 440063 509039 624630 692907 729381 664221 784392 924285 1013933
7218A013933J93083N1121q379j37241n7686O4217O4913J11493N1448j51926j73860
$$ 1013933 1207016 1258137 1249758 1112517 1054831 1119048 1183961 1295454 1346902 1194976 1021116
7207A021116q0565m7433o0185n2905J6674j19930j46903O6655o1387p4213q6720
$$ 1021116 940551 893118 832933 780028 796702 676772 529869 596524 535137 460924 374204
7196C74204j27053K45j5528j17M8483o5000O3441n284k7074m7894k6595J8839
$$ 374204 247151 247396 231868 231751 280234 215234 278675 273391 246317 198423 171828 190667
7184A90667K3720K2671K1806k3808n005r800n143K0655j8719Q7581M3604l2141
$$ 190667 214387 237058 258864 235056 230051 220251 215108 235763 217044 304625 348229 316088
7172C16088N0093R0695J3832L0526M0345L0849J13387M8437K9958Q731N5208N4408
$$ 316088 366181 456876 470708 501234 541579 572428 685815 734252 764210 772941 828149 882557
7160H82557l421K6158N4929O0781j8461o2882p410J9292J0168L9533M874j04088
$$ 882557 879136 905294 960223 1021004 1002543 939661 932251 951543 961711 1001244 1006118 902030
7148I02030J8974R8638K12K5779M841k9894j17381o3599m562l523n7010k8145
$$ 902030 921004 1019642 1019854 1045633 1050474 1020580 903199 839600 835038 831515 774505 746360
7136G46360p3604j27044J6332K2600l3354k3389l8870J2608m8485p4777j16689
$$ 746360 672756 545712 562044 584644 551290 527901 489031 501639 453154 378377 261688
7125B61688r6800k5078K1793l3964j8279p8745o890N6732K3607j9737K2407k6272
$$ 261688 164888 139810 161603 127639 109360 30615 23725 80457 104064 84327 106734 80462
7113H0462k9864Q4374R383r7379L3859J03885k3932k5083M4210o198J8026O2119
$$ 80462 50598 134972 144355 46976 80835 184720 160788 135705 179915 173717 191743 253862
7101B53862P644p5914M456N672J2095o912K1962K7609q6827O453p8082m2179j5860
$$ 253862 261506 185592 190048 195720 207815 200903 222865 250474 163647 170100 92018 49839 33979
7088C3979R7920l0827K5949k9778l3918j5945Q6836K3981l6205l8013n5855O5875
$$ 33979 131899 101072 127021 97243 63325 47380 134216 158197 121992 83979 28124 93999
7076I3999K2450L0416L1867n7937J01624l9651q70k3267K2086j0729l3493N8039
$$ 93999 116449 146865 178732 120795 222419 182768 181898 158631 180717 169988 136495 194534
7064A94534J6689J47467q544K2619n0876k5556l9355K8314O0432K6690o2138p3926
$$ 194534 211223 358690 350146 372765 321889 296333 256978 285292 345724 372414 310276 236350
7052B36350R8528m8905J4143K8912p1302k7179N561N997o0084O5269L2330n073
$$ 236350 334878 285973 300116 329028 257726 230547 236108 242105 182021 247290 279620 274547
7040B74547j216N40O6361j6626o1322J8699o9731Q923n933M0833L0322N7049M849
$$ 274547 273331 273871 340232 323606 262284 280983 211252 220175 214242 255075 285397 342446 347295
7027C47295Q7574m0452k2024R7016K437j6646n51J11338L1399j5069M8234M6965
$$ 347295 434869 394417 372393 469409 471846 455200 454649 565987 597386 582317 630551 677516
7015F77516L1563Q8621Q8113O3304R6755J44549K24089K27403J03262o3429j74442
$$ 677516 709079 797700 885813 949117 1045872 1190421 1414510 1641913 1745175 1681746 1507304
7004A507304p9051q9027j38131l4728N4083J59124M9764O7644J03957m7090j64483
$$ 1507304 1428253 1339226 1201095 1166367 1220450 1379574 1429338 1496982 1600939 1553849 1389366
6993A389366k28676j43670p4696j12984m8561j54648l1513M3093n8122r7022q6726
$$ 1389366 1160690 1017020 942324 829340 780779 626131 594618 637711 579589 482567 395841
6982C95841J7708j6093M2958n9903J792P5923q9297o2125O6311L3194J1651k2667
$$ 395841 413549 397456 440414 380511 382303 458226 368929 306804 373115 406309 417960 395293
6970C95293J0054q4565Q7152M2647M7409M3664j4552K5795k3116j9948K7626J00368
$$ 395293 405347 320782 407934 450581 497990 541654 527102 552897 529781 509833 537459 637827
6958F37827L9929p6800N1938k2707r9405J8584M7566j1174k9029J21904n4510
$$ 637827 677756 600956 652894 630187 530782 549366 596932 585758 556729 678633 624123
6947F24123m449Q4714q0784k0802Q1876J3563m1856N941P4246N7721j4225m472
$$ 624123 619674 704388 623604 602802 684678 698241 656385 662326 736572 794293 780068 775596
6935G75596O5087J2925M9817J18980k2884k4645K8088R9119Q7463O0964O2215
$$ 775596 840683 853608 903425 1022405 999521 974876 1002964 1102083 1189546 1250510 1312725
6924A312725Q1826M1270Q0660M0338J10977K8183J20121j5994P7173J73962L3377
$$ 1312725 1394551 1435821 1516481 1556819 1667796 1695979 1816100 1800106 1877279 2051241 2084618
6913B084618O6671P6751P1783j3748M6492k2876j28079p3683o4897n3377n0453
$$ 2084618 2151289 2228040 2299823 2286075 2332567 2309691 2181612 2107929 2043032 1989655 1939202
6902A939202M2051O571r4507J09369j5457o7898j22623j32308j17708l4712p2731
$$ 1939202 1981253 1987824 1893317 2002686 1987229 1919331 1796708 1664400 1546692 1511980 1439249
6891A439249N2129o8859k0132l2135L0194j4724k7357O6982j12715k7910L071
$$ 1439249 1491378 1422519 1402387 1370252 1400446 1385722 1358365 1425347 1312632 1284722 1287793
6880A287793J26621K7596k7302M2578o8484O5841K2329P101l1078l1551L6656
$$ 1287793 1414414 1442010 1414708 1457286 1388802 1454643 1476972 1484073 1452995 1421444 1458100
6869A458100o670j3558J7775Q2383k4945J7479k9202l6423N9279l5628L9648P4949
$$ 1458100 1451430 1437872 1455647 1538030 1513085 1530564 1501362 1464939 1524218 1488590 1528238 1603187
6857A603187m9291K9661N5938L8439n4587K9122m4919Q0322M7447q5044Q5584
$$ 1603187 1553896 1583557 1639495 1677934 1623347 1652469 1607550 1687872 1735319 1650275 1735859
6846A735859m7862k3515J2576J1910J39416N3630k7068J6020m2072n6044N1240
$$ 1735859 1687997 1664482 1677058 1688968 1828384 1882014 1854946 1870966 1828894 1772850 1824090
6835A824090N5009J4914Q9417j3798L7196m648J23011r934k4877M54j10O7533
$$ 1824090 1879099 1894013 1983430 1969632 2006828 2002180 2125191 2115257 2090380 2090834 2090724 2158257
6823B158257L0172J10519J04372j9244Q1565L7688j3532R0315Q5694N8802l7599
$$ 2158257 2188429 2298948 2403320 2384076 2465641 2503329 2489797 2580112 2665806 2724608 2687009
6812B687009Q2754L7916K3838R5207R8015O1680L5907P9968N7659J6667P4352
$$ 2687009 2769763 2807679 2831517 2926724 3024739 3086419 3122326 3202294 3259953 3276620 3350972
6801C350972R6181J17054Q2423O1765N4435N237P9173O4836M2013J60373R4936
$$ 3350972 3447153 3564207 3646630 3708395 3762830 3768067 3847240 3912076 3954089 4114462 4209398
6790D209398J27436J23325J64107J01609J29396J56156J12980Q5821K12305K81063
$$ 4209398 4336834 4460159 4624266 4725875 4855271 5011427 5124407 5210228 5422533 5703596
6780E703596K61039K57491J91674J38589J01900J62730K32922J86890J89191J62882
$$ 5703596 5964635 6222126 6413800 6552389 6654289 6817019 7049941 7236831 7426022 7588904
6770G588904J24051J95566J83516K02340K07953K16171J67785L3031P2013J13722
$$ 7588904 7712955 7908521 8092037 8294377 8502330 8718501 8886286 8919317 8991330 9105052
6760I105052K35993K82320K50593K64067L58564K21399K94073L86930K87642K73608
$$ 9105052 9341045 9623365 9873958 10138025 10496589 10717988 11012061 11398991 11686633 11960241
6750A1960241K05310K47450K53796K44121L03451L00321L50067L32485K58860
$$ 11960241 12165551 12413001 12666797 12910918 13214369 13514690 13864757 14197242 14456102
6741A4456102L40362K51212L92088M17789M14822M68701M16653M97115N85482
$$ 14456102 14796464 15047676 15439764 15857553 16272375 16741076 17157729 17654844 18240326
6732A8240326N81013N89308O21027O16923P14847P09393P82758P98854O88319
$$ 18240326 18821339 19410647 20031674 20648597 21363444 22072837 22855595 23654449 24342768
6723B4342768Q46798Q52358Q77603J072831Q99529R80660J014642J036817J208176
$$ 24342768 25189566 26041924 26919527 27992358 28891887 29872547 30887189 31924006 33132182
6714C3132182J283078J314133J486392J668983J814560J923565K114224K192177
$$ 33132182 34415260 35729393 37215785 38884768 40699328 42622893 44737117 46929294
6706D6929294K285541K507394K539179L006572L455064M133310M847215N580085
$$ 46929294 49214835 51722229 54261408 57267980 60723044 64856354 69703569 75283654
6698G5283654O503594P842457R294989J1514295J4704177J8915771K4106831K9181518
$$ 75283654 81787248 89629705 98924694 110438989 125143166 144058937 168165768 197347286
6690A97347286L3674848L3299154K1946873K291654j7420711k8187664k6429499
$$ 197347286 231022134 264321288 286268161 288559815 271139104 242951440 216521941
6683B16521941j6534118m561981N851412J4399177K1251817K4670558J8094247
$$ 216521941 199987823 195425842 201277254 215676431 236928248 261598806 279693053
6676B79693053M76559k0611762l6266056m0173910l4164461k5296042j8062006
$$ 279693053 280169612 259557850 223291794 183117884 148953423 123657381 105595375
6669A05595375j3287459j0466430q504513p195973o332323n420845m635886l888426
$$ 105595375 92307916 81841486 73336973 66141000 59808677 54387832 49751946 45863520
6661D5863520l312584k866213k404522k104730j900464j777409j645571j579093
$$ 45863520 42550936 39684723 37280201 35175471 33275007 31497598 29852027 28272934
6653B8272934j553337j401411j186714j029034j064139j002478r20832q35495
$$ 28272934 26719597 25318186 24131472 23102438 22038299 21035821 20114989 19279494
6645A9279494p78738r17152p91308o99021n80719n56907n79322m97698n62037
$$ 19279494 18500756 17583604 16792296 16093275 15512556 14955649 14376327 13878629 13316592
6636A3316592n14911n34324m61883m96298l75178l12961k87359m00192m19390
$$ 13316592 12801681 12267357 11805474 11309176 10933998 10621037 10333678 9933486 9514096
6627I514096l89466l40411l68254l54541k57287k91915j66910j33791k36963j55249
$$ 9514096 9124630 8784219 8415965 8061424 7804137 7512222 7345312 7211521 6974558 6819309
6617F819309k27331k36164j00237l00740k55305k87417k42794j24958l7987j40466
$$ 6819309 6591978 6355814 6255577 5954837 5699532 5412115 5169321 5044363 5006376 4865910
6607D865910k03979j63981j80438j51881r9132k02566l8860p9624j78281l2506
$$ 4865910 4661931 4497950 4317512 4165631 4066499 3863933 3825073 3745449 3567168 3534662
6597C534662j39945j10154j93022p4903m4256p1972o0330r6470r7753q4736q3412
$$ 3534662 3394717 3284563 3091541 3016638 2972382 2900410 2840080 2743610 2645857 2561121 2477709
6586B477709n8949J462p1460r5389l1406o8654j07984m5395l712k5129r2551q6918
$$ 2477709 2418760 2420222 2348762 2253373 2221967 2153313 2045329 1999934 1996222 1971093 1878542 1791624
6574A791624K6198K6083o8376r9563k7932J2662L5955n6234r4087j03859J8691
$$ 1791624 1817822 1843905 1775529 1675966 1648034 1660696 1696651 1640417 1546330 1442471 1461162
6563A461162M3441p5766L9105J52928n9929j07661K4510n9579q675l0779m6680
$$ 1461162 1504603 1428837 1467942 1620870 1560941 1453280 1477790 1418211 1409536 1378757 1332077
6552A332077k4766L2897m986k1204k9119O6403k9648m1760R5289p5400m3532K2642
$$ 1332077 1307311 1340208 1335222 1314018 1284899 1351302 1321654 1279894 1375183 1299783 1256251 1278893
6540A278893r5641m4264L0101m4126m9353j12249P276P3794K8205n6793k0858
$$ 1278893 1183252 1138988 1169089 1124963 1075610 963361 970637 1044431 1072636 1015843 994985
6529I94985j8943n4381J6249M3668k8924j16741J0916O1102J6991n9489Q4512
$$ 994985 976042 921661 937910 981578 952654 835913 846829 907931 924922 865433 949945
6518I49945n9725m4401N8963j25339K3847J45227r9956q8214L5090j6617q635
$$ 949945 890220 845819 904782 779443 803290 948517 848561 760347 795437 778820 770185
6507G70185M930Q656O7026K4086j6187Q4654N1409K757M6180L4207n2757k3952
$$ 770185 775115 783771 850797 874883 858696 943350 994759 997516 1043696 1077903 1025146 1001194
6495A001194N6109N7626o8107J8128J12787L7566L3556o2070K2853M1105o5083
$$ 1001194 1057303 1114929 1046822 1064950 1177737 1215303 1248859 1186789 1209642 1250747 1185664
6484A185664j03494m0613j223m1842m8964Q563l3086O445q1091p9177j5637n9088
$$ 1185664 1082170 1041557 1040334 998492 949528 958091 925005 931450 850359 771182 755545 696457
6472F96457Q5804O3472P1987q0224j04666J4615N7203p9302p3535P6030Q3483
$$ 696457 782261 845733 917720 837496 732830 747445 804648 725346 651811 727841 811324
6461H11324J5631p5328r4484o5006j5446J0850n2346m2968J7668n5637n6670M5068
$$ 811324 826955 751627 657143 592137 576691 587541 535195 492227 509895 454258 397588 442656
6449D42656K0343l0157p9334M3163O770q8052k8713j4616L1883J4530o3760O218
$$ 442656 462999 432842 353508 396671 403441 315389 286676 272060 303943 318473 254713 260931
6437B60931m4711k9018J4115o1064P320N5479L9664O883N7221n6365j5810k9303
$$ 260931 216220 187202 201317 140253 147573 203052 242716 249599 306820 250455 234645 205342
6425B05342j04965N3399l9481j06973K2252M3419k0886j5446n2754J468J216k0590
$$ 205342 100377 153776 114295 7322 29574 72993 52107 36661 -16093 -14625 -13409 -33999
6413c3999J9000O562o7109J4537O8989l3081p4135K8689n0416N7104J482o0899
$$ -33999 -14999 -8437 -75546 -61009 7980 -25101 -99236 -70547 -120963 -63859 -62377 -123276
6401a23276M2770j0142j30445P9878J88939j12673j9248L1060M6937o9552r302
$$ -123276 -80506 -90648 -221093 -141215 47724 -64949 -84197 -53137 -6200 -75752 -85054
6390h5054l6717J1745L0192l0736l7715J5665L890N2149l1301J7652K3473J1301
$$ -85054 -121771 -110026 -79834 -110570 -148285 -132620 -128730 -76581 -107882 -90230 -66757 -55456
6378e5456l8592k8258R4604R5700K0133m185N3764J35742Q3847J29338J80796
$$ -55456 -94048 -122306 -27702 67998 88131 83946 137710 273452 357299 486637 667433
6367F67433J40563J80129J29463M8584j09465p0229j26235p8253o0181l0715N9328
$$ 667433 807996 988125 1117588 1166172 1056707 986478 860243 781990 721809 691094 750422
6356G50422Q6717J28131K0694r649r860j41227j72072k37341j17531n5175r1469
$$ 750422 837139 965270 985964 976315 966455 825228 653156 415815 298284 243109 151640
6345A51640r5982l6859Q117o5381K4421K8254j15970j24847k834M7040n9281p2879
$$ 151640 55658 18799 26916 -38465 -14044 14210 -101760 -226607 -229441 -182401 -241682 -314561
6333c14561M7940M6340J3426j1771J2373N916K4740P587j10957N7879L2559m917
$$ -314561 -266621 -220281 -206855 -218626 -206253 -200337 -175597 -168010 -278967 -221088 -188529 -193446
6321a93446M3284n7718M185j4546j00472K6552L1511m4204k514L3194p617N7986
$$ -193446 -150162 -207880 -203695 -218241 -318713 -292161 -260650 -304854 -307368 -274174 -281791 -223805
6309b23805n418q2162P8831p7551l5834J6521r0531M4109o7795K335m2722p947
$$ -223805 -229223 -311385 -232554 -310105 -345939 -329418 -419949 -375840 -443635 -441300 -484022 -491969
6297d91969Q6526M2121L9081J9009Q6275r4249q4572N1537M1314j1957m0373L2558
$$ -491969 -405443 -363322 -324241 -305232 -218957 -313206 -397778 -346241 -304927 -316884 -357257 -324699
6285c24699Q0001n2887m2754M190m03j4283m0023Q8088L6365n2356N051J921J4004
$$ -324699 -244698 -297585 -340339 -336149 -336552 -350835 -390858 -302770 -266405 -318761 -313710 -311789 -297785
6272b97785n8969n6444k1997L4085n323J4348M195k973j8364K7937n0911k7455
$$ -297785 -356754 -413198 -435195 -401110 -406433 -392085 -387890 -390863 -409227 -381290 -432201 -459656
6260d59656Q1500M332j2662K373r1260k0838K5691k8670K489k0981O6279k2488
$$ -459656 -378156 -373824 -386486 -384113 -475373 -496211 -470520 -499190 -496701 -517682 -451403 -473891
6248d73891K0116n6112q0871K7681L1142m1752K869J4373N2500K8244n8010n0637
$$ -473891 -453775 -509887 -590758 -563077 -531935 -573687 -570818 -556445 -503945 -475701 -533711 -584348
6236e84348k0110r696J9050k364M8999R7318q0958m376N3186N8406j6586o8315
$$ -584348 -604458 -614154 -595104 -597468 -548469 -451151 -532109 -536485 -483299 -424893 -441479 -509794
6224e09794j4745K0490O6118m90L385k3675J8104J0528N1859J4072o0379o815
$$ -509794 -524539 -504049 -437931 -438421 -435036 -458711 -440607 -430079 -378220 -364148 -424527 -431342
6212d31342L1235Q2269P9896M703j7455o1033M6806L9082q8137J066M714j3449
$$ -431342 -400107 -317838 -237942 -233239 -250694 -311727 -264921 -225839 -313976 -312910 -308196 -321645
6200c21645j7424o6469J3818O3907j3340k8085J0556n1378n7516k6493K9524n8987
$$ -321645 -339069 -405538 -391720 -327813 -341153 -369238 -358682 -410060 -467576 -494069 -464545 -523532
6188e23532k182K1060p0191r328o6574K8184O1994n1583L8785P812k2151n6649
$$ -523532 -525714 -504654 -574845 -584173 -650747 -622563 -560569 -612152 -573367 -565555 -587706 -644355
6176f44355k4796O797Q5305N882q052k3761p3217P776J3923N5931l7582K4411
$$ -644355 -669151 -662354 -577049 -571167 -579219 -602980 -676197 -668421 -654498 -598567 -636149 -611738
6164f11738J525L5809N2492K1897k5803k9643k326P0659o4206o8128O7607M033
$$ -611738 -610213 -574404 -521912 -500015 -525818 -555461 -557787 -487128 -551334 -619462 -551855 -547822
6152e47822r7312N0357n1289L1136M5451j2065k7978m56k0550j6599m3910j0062
$$ -547822 -645134 -594777 -646066 -614930 -569479 -581544 -609522 -609978 -630528 -647127 -691037 -701099
6140g01099R227R3005J4767q3504N1787K0756R575J9003j1755k1711m1746j8672
$$ -701099 -691872 -598867 -584100 -667604 -615817 -595061 -585486 -566483 -578238 -599949 -641695 -660367
6128f60367o1888O8193Q5103M606M9984p033o5366n4719k8304M1829p283q1447
$$ -660367 -722255 -654062 -568959 -564353 -514369 -521402 -586768 -641487 -669791 -627962 -635245 -716692
6116g16692K6815L2327r764N3456J5374q3353J7759N5713o9934k838K1619k8342
$$ -716692 -689877 -657550 -667314 -613858 -598484 -681837 -664078 -608365 -678299 -681137 -659518 -687860
6104f87860M8495j7340k1290p8059j1705L9037P0987n0649N3696m5846j2969N2319
$$ -687860 -639365 -656705 -677995 -756054 -767759 -728722 -657735 -708384 -654688 -700534 -713503 -661184
6092f61184M0411M6123m2522p4906L3974Q950o0694p4305K5228N5003j0849J6386
$$ -661184 -620773 -574650 -617172 -692078 -658104 -649154 -709848 -784153 -758925 -703922 -714771 -698385
6080f98385m3971O7494R1938Q302k0825m4550J44168k1751n1163j3873J05378
$$ -698385 -742356 -674862 -582924 -574622 -595447 -639997 -495829 -517580 -568743 -582616 -477238
6069d77238P2346j22600j0593L9996j36828L4256K9825N3990o9739n3609O2992
$$ -477238 -404892 -527492 -538085 -498089 -634917 -600661 -570836 -516846 -586585 -640194 -577202
6058e77202j4088J2353k898r048L212L9931r9565K0069P4090J6668N9569J08396
$$ -577202 -591290 -578937 -581835 -590883 -587671 -547740 -647305 -627236 -553146 -536478 -476909 -368513
6046c68513m9350k6799o7789O5685k717j05925L8284P1567j3065J36976j2357
$$ -368513 -417863 -444662 -512451 -446766 -449483 -555408 -517124 -445557 -458622 -321646 -334003
6035c34003r1872l4028j3058J7779j01174Q631l5792p2780P1197J69428l9151
$$ -334003 -425875 -459903 -472961 -455182 -556356 -547725 -583517 -656297 -585100 -415672 -454823
6024d54823o3840L951o6569o717P354p8034l6924J4593M0770j220K1853q101R269
$$ -454823 -518663 -514712 -581281 -587998 -580644 -658678 -695602 -681009 -640239 -641459 -619606 -627707 -618438
6011f18438L4366K532J20794l5784J6972j6028j3351k6275n2518L4445M8220k0507
$$ -618438 -584072 -581540 -460746 -496530 -479558 -495586 -508937 -535212 -587730 -553285 -505065 -525572
5999e25572j0891m0732J6838o2124m8822L8920K5853R931o4428K5660J7536k9242
$$ -525572 -536463 -577195 -560357 -622481 -671303 -632383 -606530 -596599 -661027 -635367 -617831 -647073
5987f47073O6046M209m4414P9628k4589o8750J0589q796N497p9840n354N182K622
$$ -647073 -581027 -576818 -621232 -541604 -566193 -634943 -624354 -633150 -627653 -707493 -712847 -707665 -705043
5974g05043j0934M0550l5829o3892l0325J9367M2033N2327M6341m8554M0989K2082
$$ -705043 -715977 -675427 -711256 -775148 -805473 -786106 -744073 -691746 -645405 -693959 -652970 -630888
5962f30888l6049N9973k9129q5818Q926n5597J0969K3759L8676j4991K5156j0965
$$ -630888 -666937 -606964 -636093 -721911 -712985 -768582 -757613 -733854 -695178 -710169 -685013 -695978
5950f95978o860P6750M2882n2144m6108l372M3365j6172l8912L7768m7470J8789
$$ -695978 -702838 -626088 -583206 -635350 -681458 -684830 -641465 -657637 -696549 -658781 -706251 -687462
5938f87462j0441Q5559M3552r8526j4369j11304O0236R2933L1377j3375q5353
$$ -687462 -697903 -612344 -568792 -667318 -681687 -792991 -732755 -639822 -608445 -621820 -707173
5927g07173m0186J01723K3447m1921K6482L7434p6174m5854M0171k8309l2986
$$ -707173 -747359 -645636 -622189 -664110 -637628 -600194 -676368 -722222 -682051 -710360 -743346
5916g43346P136M3211J8990k0716n4635K7459m9767Q6780J36931o6561M46j707
$$ -743346 -736210 -692999 -674009 -694725 -749360 -721901 -771668 -684888 -547957 -614518 -614072 -615779
5904f15779m2653m495J7443n3563k5106Q7499L0007n8389J3389m5354L0473P0721
$$ -615779 -658432 -662927 -645484 -699047 -724153 -636654 -606647 -665036 -651647 -697001 -666528 -595807
5892e95807J8298J2389K1848J1390N3318j13003l753L8747N908O070m8698j8886
$$ -595807 -577509 -565120 -543272 -531882 -478564 -591567 -595320 -556573 -550665 -544595 -593293 -612179
5880f12179Q1418J8511k3567m2148k1215J2322L4165m806m668j4489Q5101m6737
$$ -612179 -530761 -512250 -535817 -577965 -599180 -586858 -552693 -557499 -562167 -576656 -491555 -538292
5868e38292r9440L9654k5746N3645o6352m8677o263J1495K84K8064N3970L5837
$$ -538292 -637732 -598078 -623824 -570179 -636531 -685208 -691471 -679976 -679692 -651628 -597658 -561821
5856e61821r5196k3367K7728R9534r521j32666L0117O1529n6612l3573O9016J13313
$$ -561821 -657017 -680384 -652656 -553122 -562643 -695309 -665192 -603663 -660275 -693848 -624832 -511519
5844e11519n7398m8918P365j9033K3909p5966j1059R0990m5806j7295N5397K9505
$$ -511519 -568917 -617835 -610470 -629503 -605594 -681560 -692619 -601629 -647435 -664730 -609333 -579828
5832e79828k2692L7546k3859K0315p7363p0499O0043M3671j713P9381J6660l0762
$$ -579828 -602520 -564974 -588833 -568518 -645881 -716380 -656337 -612666 -614379 -534998 -518338 -549100
5820e49100L970J1782J776J1770K0020M2548J9109n6600r934M4300j4773L2773
$$ -549100 -545130 -533348 -531572 -519802 -499782 -457234 -438125 -494725 -504659 -460359 -475132 -442359
5808d42359j01631O668P9843M2980p0180P9785K5154r29N6254k4618J5129M8313
$$ -442359 -543990 -537322 -457479 -414499 -484679 -404894 -379740 -380669 -324415 -349033 -333904 -285591
5796b85591O4558j00162J588k8036L695k6077J8309J9039K7562o548j0944l878
$$ -285591 -221033 -321195 -319607 -347643 -343948 -370025 -351716 -332677 -305115 -311663 -322607 -326485
5784c26485o0947P390J4990q893j2697k2721O2279L9955j207m8955M6418j3425
$$ -326485 -387432 -380042 -365052 -373945 -386642 -409363 -347084 -307129 -308336 -357291 -310873 -324298
5772c24298k5032p3635L5515R9411n3525m1683N801n8610l71J3726K0590j3381
$$ -324298 -349330 -422965 -387450 -288039 -341564 -383247 -377446 -436056 -436427 -422701 -402111 -415492
5760d15492q546l2549K981J8218r1233J8376M1353J00264p7666j02706L5726J064
$$ -415492 -424038 -456587 -453606 -435388 -526621 -508245 -466892 -366628 -444294 -547000 -511274 -510210
5748e10210J3736p8577L0655k3323j079N4101J2993n0364j9545Q4710l8542K5521
$$ -510210 -496474 -575051 -544396 -567719 -568798 -514697 -501704 -552068 -571613 -486903 -525445 -499924
5736d99924k3790r4065J4591q629l1137O1819Q4478m077j9981N5543j473j0688
$$ -499924 -523714 -617779 -603188 -611817 -642954 -581135 -496657 -500734 -520715 -465172 -466645 -477333
5724d77333P6273L8357j43341r6319k347L8658M5830k8617O7987K4827m1o1251
$$ -477333 -401060 -362703 -506044 -602363 -604710 -566052 -520222 -548839 -480852 -456025 -456066 -517317
5712e17317L4353K0387M3014J6877J34908K1016o3892K4662p0782K2364k6398
$$ -517317 -482964 -462577 -419563 -402686 -267778 -246762 -310654 -285992 -356774 -334410 -360808
5701c60808L8440N5650K3233P727q708l8911j00904m640K1863j3135J1304Q2932
$$ -360808 -322368 -266718 -243485 -235758 -244466 -283377 -384281 -388921 -367058 -380193 -368889 -285957
5689b85957k9332l7800p9096M4802K138P5547M1397o3530k0607l0333J2205p0833
$$ -285957 -315289 -353089 -432185 -387383 -385245 -309698 -268301 -331831 -352438 -382771 -370566 -441399
5677d41399L6651L775m0266M4258N168o0308P216K3889N9163j6749m9484M710
$$ -441399 -404748 -400973 -441239 -396981 -391813 -452121 -444905 -421016 -361853 -378602 -428086 -423376
5665d23376j1001j8951O8766L9188P0633q7452J5952L5616k8050j3203J24664
$$ -423376 -434377 -453328 -384562 -345374 -274741 -362193 -346241 -310625 -338675 -351878 -227214
5654b27214P1005o8757N4720M802n5506l6315k370J4752M380r931q378O4481M9621
$$ -227214 -156209 -224966 -170246 -165444 -220950 -257265 -259635 -244883 -240503 -250434 -258812 -194331 -144710
5641a44710J31624o7507J9354K672p0934K8180J27727M2782m9855l3948M472O6346
$$ -144710 -13086 -80593 -61239 -58567 -129501 -101321 26406 69188 19333 -14615 -10143 56203
5629E6203p6961k1204l3719o1335r956n5200K4725q436M5823l9392r696M5678
$$ 56203 -20758 -41962 -75681 -137016 -146972 -202172 -177447 -185883 -140060 -179452 -189148 -143470
5617a43470r7901m4652L1425K9838k4759o1451J17686J9782l865m3569n0305m9488
$$ -143470 -241371 -286023 -254598 -224760 -249519 -310970 -193284 -173502 -177367 -220936 -271241 -320729
5605c20729l4104j6055J9248R7706J7415n5791k008N9668l2778j08076k389J32886
$$ -320729 -354833 -370888 -351640 -253934 -236519 -292310 -294318 -234650 -267428 -375504 -377893 -245007
5593b45007k2187L8911k2785N3143J4238M0387n610l9126N4904M4334p877j8290
$$ -245007 -267194 -228283 -251068 -197925 -183687 -143300 -148910 -188036 -133132 -88798 -96675 -114965
5581a14965N9158P1162m5690M5636N4410n5506K9700M6488L6582o173j3505p115
$$ -114965 -55807 15355 -30335 15301 69711 14205 43905 90393 126975 120802 107297 100182
5569A00182o1339q45N766J81254o6257p9049j4321J2712j6590l46j1616L5111
$$ 100182 38843 37998 43764 225018 158761 79712 65391 78103 61513 61167 49551 84662
5557H4662k0469j8873Q5628Q5808J897k7852O3676J21594Q9358n392j07038l9649
$$ 84662 64193 45320 130948 216756 218653 190801 254477 376071 465429 460037 352999 313350
5545C13350O1025P0733n1375Q822K1809j7073R7955J0884p9519j8218K5839K4026
$$ 313350 374375 445108 393733 402555 424364 407291 505246 516130 436611 418393 444232 468258
5533D68258n2945m2155k540L0914o610m8152N222K7532O1101K3482p5643n7434
$$ 468258 415313 373158 370618 401532 394922 346770 351992 379524 440625 464107 388464 331030
5521C31030J4363L1382M7189l3026k429L6242Q9490K9117J12496M4391r1170j54760
$$ 331030 345393 376775 423964 390938 388509 424751 514241 543358 655854 700245 609075 454315
5509D54315L4520N5260j186k0801q7007n7807J42258M2000n4855M6032P2269K9692
$$ 454315 488835 544095 542909 522108 435101 377294 519552 561552 506697 552729 624998 654690
5497F54690k5421q0400N1209l7825M9994J8369O6622j8500R556K8917j20032O6248
$$ 654690 629269 548869 600078 562253 612247 630616 697238 678738 688294 717211 597179 663427
5485F63427N9964O2090P3921n0561l2959o0884r9653j74Q531q6972j16577R440
$$ 663427 723391 785481 859402 808841 775882 714998 615345 615171 623702 536730 420153 429593
5473D29593L8911p2700k0245k6457l8655J44186Q4977J03128J02862P8661N5679
$$ 429593 468504 395804 375559 349102 310447 454633 539610 642738 745600 824261 879940
5462H79940l1961o8453K72O0106N6692l8760J3725M5589m1815j41419K6374O1934
$$ 879940 847979 779526 779798 839904 896596 857836 871561 917150 875335 733916 760290 822224
5450H22224m8874j4659O412k6091K9694j9032M4340L9875p5105m5756k5822J2949
$$ 822224 773350 758691 765103 739012 768706 749674 794014 833889 758784 713028 687206 700155
5438G00155P0823q7039o4187L3823P281Q0790Q6353j25730o7075k5950j2113m0891
$$ 700155 770978 683939 619752 653575 660856 741646 827999 702269 635194 609244 597131 556240
5426E56240m7585J10841N140q5994m9082P8489l4673q4840r79k659r8446J0977
$$ 556240 508655 619496 624636 538642 489560 568049 533376 448536 447557 444898 346452 357429
5414C57429M129L7236n3373k6227m6132m4663j5404o9258J9759M0765N655m3795
$$ 357429 361558 398794 345421 319194 273062 228399 212995 143737 163496 204261 209916 166121
5402A66121r3938O9425P6952j02085m8496o403K3881Q8449k2359L9292M0914j045
$$ 166121 72183 141608 218560 116475 67979 61576 85457 173906 151547 190839 231753 230708
5390B30708K7842o0012J6419k6970J3542J8179O3144k9412q2209l4707O3087j2815
$$ 230708 258550 198538 214957 187987 201529 219708 282852 253440 171231 136524 199611 186796
5378A86796l0686k0201J7482l7743N005M0234n9654k0890p6341j1884m457k0429
$$ 186796 156110 135909 153391 115648 120653 160887 101233 80343 4002 -7882 -12339 -32768
5366c2768M3523M595l726L252k7607N2191J427q656o519k6221l7610Q6496k9142
$$ -32768 10755 15350 11624 14876 -12731 39460 40887 32231 25712 -509 -38119 48377 19235
5353A9235n446l1011l4213m205o08J6819K06q030j6107N078J4897J294J9150j174
$$ 19235 13789 -17222 -51435 -55640 -56248 -39429 -39223 -47253 -63360 -58282 -43385 -42091 -22941 -24115
5339b4115k9350n0368L9232M3371p8072k9706N5237j4717l0223R7118O15o7921
$$ -24115 -53465 -103833 -64601 -21230 -99302 -129008 -73771 -88488 -118711 -21593 -20978 -88899
5327h8899M9685N67q8879K9302k8380k8498J23772p697j1014R2538J2454R169
$$ -88899 -39214 -38647 -127526 -98224 -126604 -155102 -31330 -39027 -50041 42497 54951 64120
5315F4120p2579r668p72O8440j35113J30673m1546l603Q5866j3110L203O2004
$$ 64120 -8459 -18127 -18899 49541 -85572 45101 3555 -48 85818 72708 75911 137915
5303A37915k5918k7868N8319n5406m9238J65988N0175p908L8720L9405K6682j3893
$$ 137915 111997 84129 142448 87042 37804 203792 253967 246059 284779 324184 350866 336973
5291C36973N2478K6J9241p9760M1678q697Q930m4857L1486P4546l0644o2634N4452
$$ 336973 389451 389477 408718 328958 370636 361939 370869 326012 357498 432044 401400 338766 393218
5278C93218Q5971K3508n3699J4031J9577J6142O8503P0515L2135K6471P7011J690
$$ 393218 479189 502697 448998 463029 482606 498748 567251 637766 669901 696372 773383 775073
5266G75073J4233K6936N9007k749m8763P2908q9506K8205M8321j6564N7250K1569
$$ 775073 789306 816242 875249 872500 823737 896645 807139 835344 883665 867101 924351 945920
5254I45920K2038Q2175m7093j8741j6962O5496Q8246l4348r156j7633N3412J19562
$$ 945920 967958 1050133 1003040 984299 967337 1032833 1121079 1086731 1077575 1059942 1113354 1232916
5242A232916j7553o4376m4256P8399J09698l9084l1870L8223L811m7070J06996
$$ 1232916 1215363 1150987 1106731 1185130 1294828 1255744 1223874 1262097 1265908 1218838 1325834
5231A325834N9157L7672K6445M7577J04078N4783m637m7885P1554J15176k677
$$ 1325834 1384991 1422663 1449108 1496685 1600763 1655546 1650909 1603024 1674578 1789754 1787077
5220A787077R1556J16760k1454K7652N6397Q4464P8515Q0684L7359J17031n747
$$ 1787077 1878633 1995393 1973939 2001591 2057988 2142452 2220967 2301651 2339010 2456041 2450294
5209B450294l5160O0342M4431K1082K5624Q3004k921M5365L3172n7532P5718J8283
$$ 2450294 2415134 2475476 2519907 2540989 2566613 2649617 2646696 2692061 2725233 2667701 2743419 2761702
5197B761702o3137J8096L1372Q0226Q6349N4080K6775J3660M1047N5766j8612
$$ 2761702 2698565 2716661 2748033 2828259 2914608 2968688 2995463 3009123 3050170 3105936 3087324
5186C087324m994r311o6999K7353P0085n1864j8788K8546N8429J4895R957j2610
$$ 3087324 3082330 3073019 3006020 3033373 3103458 3051594 3032806 3061352 3119781 3134676 3144633 3132023
5174C132023r9588J1407M202L479L8598m0365L1827K7254n1844J9181j1417p0491
$$ 3132023 3032435 3043842 3048044 3051523 3090121 3049756 3081583 3108837 3056993 3076174 3064757 2994266
5162B994266l6405o0346J06380k1071o4642k3099k7460o7593j1763k4343m404
$$ 2994266 2957861 2897515 3003895 2982824 2918182 2895083 2867623 2800030 2788267 2763924 2759520
5151B759520J3421j6455J49120p666l8648k4415l2807j1794n7999Q762N2864j5213
$$ 2759520 2772941 2756486 2905606 2897940 2859292 2834877 2802070 2790276 2732277 2741039 2793903 2778690
5139B778690j7402L6538p1416r0449P3164N6269j1433L777P3687r7609l987O2611
$$ 2778690 2761288 2797826 2726410 2635961 2709125 2765394 2753961 2757738 2831425 2733816 2729829 2792440
5127B792440J9176k0576j1517P4872m0435N3017K0129J01426L60M5259M6144Q2662
$$ 2792440 2811616 2791040 2779523 2854395 2813960 2866977 2887106 2988532 2988892 3034151 3080295 3162957
5115C162957K7127j6585n6600J50578P6997J3795J01155k3612L8779L9731K43
$$ 3162957 3190084 3173499 3116899 3267477 3344474 3358269 3459424 3435812 3474591 3514322 3514565
5104C514565l6003L5771K1489J04973J5613Q7841O3711k799o4359K0239M9126
$$ 3514565 3478562 3514333 3535822 3640795 3656408 3744249 3807960 3805161 3740802 3761041 3810167
5093C810167R0538N4721n2635J28026L9871m3877P6609O6445j5878N7171Q7264
$$ 3810167 3900705 3955426 3902791 4030817 4070688 4026811 4103420 4169865 4153987 4211158 4298422
5082D298422l8229J04378R5980o0697L675R098o7779K8457k0377p274N821Q5933
$$ 4298422 4260193 4364571 4460551 4399854 4403529 4412627 4344848 4373305 4352928 4345654 4351475 4437408
5070D437408P7104O3836J33802Q1453j1920k1845M0424M2669O9448O5997O3635
$$ 4437408 4514512 4578348 4712150 4793603 4781683 4759838 4800262 4842931 4912379 4978376 5042011
5059E042011J15208j6960R7201J2871j7534P1571O6726Q4460P2219R7702M5272
$$ 5042011 5157219 5140259 5237460 5250331 5232797 5304368 5371094 5455554 5527773 5625475 5670747
5048E670747j619k7517K8664J22774P8318J0778K7849J11154Q0917Q8639J48025
$$ 5670747 5669128 5641611 5670275 5793049 5871367 5882145 5909994 6021148 6102065 6190704 6338729
5037F338729N5216J23544l516J30461J34853J29027J09869J41225J08336J39378
$$ 6338729 6393945 6517489 6513973 6644434 6779287 6908314 7018183 7159408 7267744 7407122
5027G407122J03515J67878K18968J07714J52705J96785Q1290J81110K55094J72542
$$ 7407122 7510637 7678515 7897483 8005197 8157902 8354687 8435977 8617087 8872181 9044723
5017I044723J84803J84452K10300K31705K24756K66705J88805K69463J73087K18937
$$ 9044723 9229526 9413978 9624278 9855983 10080739 10347444 10536249 10805712 10978799 11197736
5007A1197736K78659K22705L41535K58562L06450L07827L20201L39440L72977
$$ 11197736 11476395 11699100 12040635 12299197 12605647 12913474 13233675 13573115 13946092
4998A3946092K97007K03574K55385L79257L85915K21041K43884L63445M26455
$$ 13946092 14243099 14446673 14702058 15081315 15467230 15688271 15932155 16295600 16722055
4989A6722055L75729L37246L41807L54055M50461L82277M68366M40400M57817
$$ 16722055 17097784 17435030 17776837 18130892 18581353 18963630 19431996 19872396 20330213
4980B0330213M08675N25672M81824N39197N60964N00808N51117O06827O40842
$$ 20330213 20738888 21264560 21746384 22285581 22846545 23347353 23898470 24505297 25146139
4971B5146139N29761N97574O32240P10083O29556P54536P71882P12225Q78079
$$ 25146139 25675900 26273474 26905714 27615797 28245353 28999889 29771771 30483996 31362075
4962C1362075Q44738Q52911P99938R35403R36619J008176J072652J027376J093154
$$ 31362075 32206813 33059724 33859662 34795065 35731684 36739860 37812512 38839888 39933042
4953C9933042J186711J216119J326974J346244J403561J514995J709939J849201
$$ 39933042 41119753 42335872 43662846 45009090 46412651 47927646 49637585 51486786
4945E1486786J765272K126251K235284K509525K715373K929351L272124L480988
$$ 51486786 53252058 55378309 57613593 60123118 62838491 65767842 69039966 72520954
4937G2520954L859647M064173M418986M931674N448312N903381O256413O428439
$$ 72520954 76380601 80444774 84863760 89795434 95243746 101147127 107403540 113831979
4929A13831979O403699O189244O018063O010260N662487N044674M262948L459177
$$ 113831979 120235678 126424922 132442985 138453245 144115732 149160406 153423354 156882531
4921A56882531K712744K021908J739425K032288K553666L074357L586831L677330
$$ 156882531 159595275 161617183 163356608 165388896 167942562 171016919 174603750 178281080
4913A78281080L943153M915180O239724P236249P527335P211029O386164N893022
$$ 178281080 182224233 187139413 193379137 200615386 208142721 215353750 221739914 227632936
4905B27632936N825689N983005N646173M809609L698040K691403K096842K019805
$$ 227632936 233458625 239441630 245087803 249897412 253595452 256286855 258383697 260403502
4897B60403502J977418J226157o1505j057398j836652k521702k700964k480675
$$ 260403502 262380920 263607077 263545572 262488174 260651522 258129820 255428856 252948181
4889B52948181j939918j615037j937084k670620k832974k505132j664492q78888
$$ 252948181 251008263 249393226 247456142 244785522 241952548 239447416 237782924 236904036
4881B36904036p75000j614054k982982m074020m586790m473438m459393m784972
$$ 236904036 236129036 234514982 231532000 227457980 222871190 218397752 213938359 209153387
4873B09153387n178264n630266n369818m674080l917581l661740l828482m184610
$$ 209153387 203975123 198344857 192975039 188300959 184383378 180721638 176893156 172708546
4865A72708546m463206m408972m307522m326347m879934n864334o776236p341850
$$ 172708546 168245340 163836368 159528846 155202499 150322565 144458231 137681995 130340145
4857A30340145p231924o678941o237015n914213o054582o174346n923226n522779
$$ 130340145 123108221 116429280 110192265 104278052 98223470 92049124 86125898 80603119
4849H0603119n116983m552117m079363l734976l356723l107207k981249k655349
$$ 80603119 75486136 70934019 66854656 63119680 59762957 56655750 53674501 51019152
4841E1019152k358318k185314k016201j830762j752069j534782j389921j224530
$$ 51019152 48660834 46475520 44459319 42628557 40876488 39341706 37951785 36727255
4833C6727255j170251j212827j033159q93914q72362p29600p36224q32964p95722
$$ 36727255 35557004 34344177 33311018 32417104 31544742 30815142 30078918 29245954 28450232
4824B8450232p00738p29921o23212n17747m73421n72571o13151n55906n25982
$$ 28450232 27749494 27019573 26396361 25878614 25405193 24832622 24219471 23663565 23137583
4815B3137583m53874m60124m31080n00219o18594m32184m70748m44222m59992
$$ 23137583 22683709 22223585 21792505 21292286 20673692 20241508 19770760 19326538 18866546
4806A8866546n36205l43861k58963k97967l63044l28343l00090l19387l41780
$$ 18866546 18330341 17986480 17727517 17429550 17066506 16738163 16438073 16118686 15776906
4797A5776906l06987l29342k52268l08785l21043l61366l18120k89792k77234
$$ 15776906 15469919 15140577 14888309 14579524 14258481 13897115 13578995 13289203 13011969
4788A3011969l66143k53382k12054k74051k55447k51178j93907k12136k23910
$$ 13011969 12645826 12392444 12180390 11906339 11650892 11399714 11205807 10993671 10769761
4779A0769761k14633j97431k53991k24718k02316j33731j61133k26261j82576
$$ 10769761 10555128 10357697 10103706 9878988 9676672 9542941 9381808 9155547 8972971
4770H972971k20513j36445j45454j81362q6442j21611j44712j14756j56223j84363
$$ 8972971 8752458 8616013 8470559 8289197 8202755 8081144 7936432 7821676 7665453 7481090
4760G481090R29j34534j58496j4644j87938j21176j93239j26061j29507n6664
$$ 7481090 7482019 7347485 7188989 7174345 6986407 6865231 6671992 6545931 6416424 6359760
4750F359760o057q2840n9839k10191q7311n0082l7706j21188q8526n3527j20372
$$ 6359760 6353703 6270863 6211024 6000833 5913522 5863440 5825734 5704546 5616020 5562493 5442121
4739E442121p3585j00579r7944j00525Q4568n8678o0156l1599j4996n2300p2031
$$ 5442121 5368536 5267957 5170013 5069488 5154056 5095378 5035222 5003623 4988627 4936327 4864296
4728D864296j21787k1252K1062j18082j45559j07224L0600M7009l0622M2325l4354
$$ 4864296 4742509 4721257 4742319 4624237 4478678 4371454 4402054 4449063 4418441 4460766 4426412
4717D426412j58028J3955q4972j1737N07R825P737o7359l0648r7853l7155J678
$$ 4426412 4268384 4282339 4197367 4185630 4186137 4195962 4203699 4136340 4105692 4007839 3970684 3972362
4705C972362N8914K8742j12166J08821L4233r0164J0686l5743k7313K9781j3030
$$ 3972362 4031276 4060018 3947852 4056673 4090906 4000742 4011428 3975685 3948372 3978153 3965123
4694C965123j08730O55l2333l658l0836k2099M230J8719j0171j44391q389R0493
$$ 3965123 3856393 3857048 3824715 3821057 3790221 3768122 3772352 3791071 3780900 3636509 3628120 3718613
4682C718613p4059N171l7631k2758j3143L4320k5350j5482N9466l9957o4999q1001
$$ 3718613 3644554 3649725 3612094 3589336 3576193 3610513 3585163 3569681 3629147 3589190 3524191 3443190
4670C443190K4175l8090l488j7143L8613j8643j233k7607j10058k322R6745K7108
$$ 3443190 3467365 3429275 3425787 3408644 3447257 3428614 3427381 3399774 3289716 3287394 3384139 3411247
4658C411247p2516j7101p95j02024J6082k0958N4189N014n1899J3147L3806J945
$$ 3411247 3338731 3321630 3320835 3218811 3234893 3213935 3268124 3273138 3221239 3234386 3268192 3270137
4646C270137K8228J3359M468p7854k4914J6806O0794K4886k0035J7595o7914R175
$$ 3270137 3298365 3311724 3316192 3238338 3213424 3230230 3291024 3315910 3295875 3313470 3245556 3254731
4634C254731K7109K8315L735O9947m94m8824K9539j5470j9700K5645P027K7977
$$ 3254731 3281840 3310155 3313890 3383837 3383343 3334519 3364058 3348588 3328888 3354533 3361560 3389537
4622C389537K9997O2361l5120l2813M0313M3170K5867P3215K2243k5383P2581
$$ 3389537 3419534 3481895 3446775 3413962 3454275 3497445 3523312 3596527 3618770 3593387 3665968
4611C665968L6693R4230k2999L0473J4331k9360k3802m408R963M0325j1291N0086
$$ 3665968 3702661 3796891 3773892 3804365 3818696 3789336 3765534 3761126 3771089 3811414 3800123 3850209
4599C850209N0529m8418L1258J4641j9976J572L2791j9395l3574k9472R605J4836
$$ 3850209 3900738 3852320 3883578 3898219 3878243 3879815 3912606 3893211 3859637 3830165 3839770 3854606
4587C854606K634k3010Q5280q0553J0043O380l6876n2489k9834J7604L0406N1658
$$ 3854606 3857240 3834230 3919510 3838957 3849000 3855380 3818504 3766015 3736181 3753785 3784191 3835849
4575C835849p832K0979M4270j1766p0k8579k5919J2961k7009N5044J18773J88899
$$ 3835849 3828017 3848996 3893266 3881500 3881430 3852851 3826932 3839893 3812884 3867928 3986701 4175600
4563D175600k35Q3888O8475k027O1487k2459L9289Q2090o8684n2405j1430q6674
$$ 4175600 4175365 4259253 4327728 4325701 4387188 4364729 4404018 4486108 4417424 4365019 4353589 4266915
4551D266915l8705L3579M0095K7811l399J4479O0538L8426J14494K7841J2043
$$ 4266915 4228210 4261789 4301884 4329695 4326296 4340775 4401313 4439739 4554233 4582074 4594117
4540D594117k0594l0012J20679Q5276j8877p0855J40341J71146L7467J22695P949
$$ 4594117 4573523 4543511 4664190 4749466 4730589 4659734 4800075 4971221 5008688 5131383 5139332
4529E139332K3293Q1195p224O0438R713Q5875J05453N9449J37822L1133P0006
$$ 5139332 5162625 5243820 5236596 5297034 5306747 5392622 5498075 5557524 5695346 5726479 5796485
4518E796485J15445J6634M0265O8103J47560J43209K37371J75830M2114R5487
$$ 5796485 5911930 5928564 5968829 6036932 6184492 6327701 6565072 6740902 6783016 6878503
4508F878503J24537R0425J80978J31363M7101J14452O8749K10586K51610O7249
$$ 6878503 7003040 7093465 7274443 7405806 7452907 7567359 7636108 7846694 8098304 8165553
4498H165553J05971P6857J80147J95825J57649J43096J11828J39717J86599K66449
$$ 8165553 8271524 8348381 8528528 8724353 8882002 9025098 9136926 9276643 9463242 9729691
4488I729691K87387J78732K02223L26750K05725K77491M77847M87717L95296O47032
$$ 9729691 10017078 10195810 10398033 10724783 10930508 11207999 11685846 12173563 12568859 13215891
4478A3215891P83577Q93149O18910J89971k5601K3751J31361L86904L75514J89187
$$ 13215891 13999468 14892617 15511527 15701498 15675897 15699648 15831009 16217913 16593427 16782614
4468A6782614j11005p7934n1487Q2689K36785L44088L57865N10546N07429N40503
$$ 16782614 16671609 16593675 16542188 16624877 16861662 17205750 17563615 18074161 18581590 19122093
4458A9122093O09196P69404Q17994Q75935R70350J164111J253704J596986J819803
$$ 19122093 19731289 20500693 21318687 22194622 23164972 24329083 25582787 27179773 28999576
4449B8999576K131865K701294L576023M715471O438188Q236185Q987847O419364
$$ 28999576 31131441 33832735 37408758 42124229 48562417 56798602 65786449 72205813
4441G2205813k37269k338086R19829L966509K557369m12333J851582N188243J0211352
$$ 72205813 71968544 69630458 70550287 74516796 77074165 76661832 78513414 83701657 93913009
4432I3913009J3183709J2471758q78300j1610195o218501J535502K060807q678534
$$ 93913009 107096718 119568476 118690176 107079981 100861480 102396982 104457789 95779255
4424I5779255r724995o425186l119043L22887J791909j276013o845499o434918
$$ 95779255 86054260 79629074 76510031 76832918 78624827 77348814 70503315 64068397
4416F4068397l023031j214500m787796p266511o081308n270185m204006l147915
$$ 64068397 61045366 59830866 55043070 47776559 41695251 36425066 32221060 29073145
4408B9073145k349928k035278j716332j485059j188161j042204q99303q57074
$$ 29073145 26723217 24687939 22971607 21486548 20298387 19256183 18356880 17499806
4400A7499806o46804p00666p01924o36126n42258l54839l60745m09451l00711
$$ 17499806 16853002 16152336 15450412 14814286 14272028 13917189 13556444 13146993 12846282
4391A2846282l60136l58956l33048l26804k56961k58203k69061k51083j47685
$$ 12846282 12486146 12127190 11794142 11467338 11210377 10952174 10683113 10432030 10284345
4382A0284345j87376j87253k98820k44914j10257j36203j73688j15896j45108
$$ 10284345 10096969 9909716 9610896 9365982 9255725 9119522 8945834 8829938 8684830
4373H684830j34438j72949n3544k08526m7171o6623o2587j24400K7882j31648
$$ 8684830 8550392 8377443 8323899 8115373 8068202 8001579 7938992 7814592 7842474 7710826
4363G710826r1380j2316j15288j22096m5566m7278o2026R628n2620j48187l2564
$$ 7710826 7619446 7607130 7491842 7369746 7324180 7276902 7214876 7224504 7171884 7023697 6991133
4352F991133j4714J8853P0622l2361l7758l4015p7794R8175P9230Q852m5735l0177
$$ 6991133 6976419 6995272 7065894 7033533 6995775 6961760 6883966 6982141 7061371 7070223 7024488 6994311
4340F994311o3358p9591j5274R3052J8274K5663j394o4774j14828J26786O7316
$$ 6994311 6930953 6851362 6836088 6929140 6947414 6973077 6971683 6906909 6792081 6918867 6986183
4329F986183m4673M6345K0588M0093N7564M3305P5117O7861N8095M4819K30784
$$ 6986183 6941510 6987855 7008443 7048536 7106100 7149405 7224522 7292383 7350478 7395297 7626081
4318G626081J65588o3928J848J11412J41639J30042n3164n5660N2794J07568J73871
$$ 7626081 7791669 7727741 7729589 7841001 7982640 8112682 8059518 8003858 8056652 8164220 8338091
4307H338091J05018N7791J48821P8825L7435N9114J81181J24493N7696O8074j6542
$$ 8338091 8443109 8500900 8649721 8728546 8765981 8825095 9006276 9130769 9188465 9256539 9239997
4296I239997J64557R1837R0224Q9494J46481J85121J53469K04338J77026J30977
$$ 9239997 9404554 9496391 9586615 9676109 9822590 10007711 10161180 10365518 10542544 10673521
4286A0673521J26671J97244K17612J83121K05977J27558K05777L60304K08529
$$ 10673521 10800192 10997436 11215048 11398169 11604146 11731704 11937481 12297785 12506314
4277A2506314J83191K86220K26875L11174K71725K76496L15596L52644L79694
$$ 12506314 12689505 12975725 13202600 13513774 13785499 14061995 14377591 14730235 15109929
4268A5109929K92561K99556M10995M08570M64416M62287N28990N54207O19406
$$ 15109929 15402490 15702046 16113041 16521611 16986027 17448314 17977304 18531511 19150917
4259A9150917O46684P87509P72271P78793P68475Q04705R25288R07787J015904
$$ 19150917 19797601 20585110 21357381 22136174 22904649 23709354 24634642 25542429 26558333
4250B6558333J127080J043062J010227J065134J138664J309588J443100J406008
$$ 26558333 27685413 28728475 29738702 30803836 31942500 33252088 34695188 36101196
4242C6101196J255440J072512R77511R22430P95686R59269J050195J055182J222061
$$ 36101196 37356636 38429148 39406659 40329089 41124775 42084044 43134239 44189421 45411482
4233D5411482J334592J360368J263645J345957J527909J600367J794158J558901
$$ 45411482 46746074 48106442 49370087 50716044 52243953 53844320 55638478 57197379
4225E7197379J561491J663285J479645J356863J253818J209798J258259J302350
$$ 57197379 58758870 60422155 61901800 63258663 64512481 65722279 66980538 68282888
4217F8282888J555750J370578J191910J102644R77482J164212J391282J635256
$$ 68282888 69838638 71209216 72401126 73503770 74481252 75645464 77036746 78672002
4209G8672002J855481K201903K678955L111149K968366K420092J437182J186869
$$ 78672002 80527483 82729386 85408341 88519490 91487856 93907948 95345130 96531999
4201I6531999J304441J824848J935300J454093P42678L79957L84225O88152J133444
$$ 96531999 97836440 99661288 101596588 103050681 103793359 104173316 104557541 105245693 106379137
4192A06379137J328196J258030J230238Q84788J30957l80858o61157o39298p5509
$$ 106379137 107707333 108965363 110195601 111080389 111211346 110830488 110169331 109530033 109454524
4183A09454524K52562L90139O20891J189648J874148K599210K936704K694882
$$ 109454524 109707086 110097225 110718116 111907764 113781912 116381122 119317826 122012708
4175A22012708K295118K164683K536062K793536L055583K662702J715345P29683
$$ 122012708 124307826 126472509 129008571 131802107 134857690 137520392 139235737 139965420
4167A39965420L38289O45249J305769J588057P03720n01286r97821r21503p30317
$$ 139965420 140303709 140948958 142254727 143842784 144546504 144045218 143047397 142125894 141395577
4158A41395577o35367n29413l4366M14682P08809Q09479P90163J344266J578658
$$ 141395577 140760210 140230797 140196431 140611113 141319922 142129401 142919564 144263830 145842488
4149A45842488J721950J609787J190986R30996O03718J96545m01665o47151q87446
$$ 145842488 147564438 149174225 150365211 151296207 151899925 152096470 151694805 151047654 150160208
4140A50160208j191382j408787j456459q94937l77065J86378M3001j89887j00797
$$ 150160208 148968826 147560039 146103580 145208643 144831578 145017956 145060957 144871070 144770273
4131A44770273j24513M7805L30678O34310P96418M11500m72810j246444j338308
$$ 144770273 144645760 144693565 145024243 145658553 146454971 146866471 146393661 145147217 143808909
4122A43808909r70797l83491n15407j766551l354700l916700l752488l001800
$$ 143808909 142838112 142454621 141939214 140172663 136817963 132901263 129148775 126146975
4114A26146975k446487k315350k489231k337961j614989q00152j71216o1340j71665
$$ 126146975 123700488 121385138 118895907 116557946 114942957 114142805 113971589 113910249 113738584
4105A13738584n80692p26978n45371m54471m84177p31208j192958j622895j707092
$$ 113738584 113157892 112430914 111885543 111431072 110946895 110215687 109022729 107399834 105692742
4096A05692742j560941j244006q40203n17631n49766r39713j856571k645072k580228
$$ 105692742 104131801 102887795 102047592 101529961 100980195 100040482 98183911 95538839 92958611
4087I2958611k150355j775224j712764j964621k301570k405883k246747k140873
$$ 92958611 90808256 89033032 87320268 85355647 83054077 80648194 78401447 76260574
4079G6260574j983328j928853j871225j600677j413796j415023j470783j403437
$$ 76260574 74277246 72348393 70477168 68876491 67462695 66047672 64576889 63173452
4071F3173452j563330j397783j368883j349875j226120j305318j406029j451311
$$ 63173452 61610122 60212339 58843456 57493581 56267461 54962143 53556114 52104803
4063E2104803j494274j638666j551166j396302j323739j089173r86122j064600
$$ 52104803 50610529 48971863 47420697 46024395 44700656 43611483 42625361 41560761
4055D1560761j084302j169510j303173j309010j189879j157795j032712j039336
$$ 41560761 40476459 39306949 38003776 36694766 35504887 34347092 33314380 32275044
4047C2275044j046469j012537j120528j180210j084401q77683q12800q08396p74739
$$ 32275044 31228575 30216038 29095510 27915300 26830899 25953216 25140416 24332020 23557281
4038B3557281p71057q06511q60833o95320n45172o02952o80108o13418n09575
$$ 23557281 22786224 21979713 21118880 20423560 19878388 19275436 18595328 17981910 17472335
4029A7472335l93406n13296m39347m17834m14619l20819l39574l13257l14503
$$ 17472335 17078929 16565633 16126286 15708452 15293833 14973014 14633440 14320183 14005680
4020A4005680k52297k76065k15976k16010j51527k88787j67770j33572l00595
$$ 14005680 13753383 13477318 13261342 13045332 12893805 12605018 12437248 12303676 12003081
4011A2003081j95703q8651o4888k11533k06962j19554k30493p6576q3627r8829
$$ 12003081 11807378 11718727 11653839 11442306 11235344 11115790 10885297 10808721 10725094 10626265
4001A0626265k03910r6992j07122j33828j28727j17777j92350j66046p0015J2595
$$ 10626265 10422355 10325363 10218241 10084413 9955686 9837909 9645559 9479513 9409498 9422093
3991I422093j52554j27083j26098r3813m2601j18776o4346m3756m4892j35405
$$ 9422093 9269539 9142456 9016358 8922545 8879944 8761168 8696822 8653066 8608174 8472769
3981H472769j30264o6118n5724j37770j42561n0516o4439j23293j7006j6637j57019
$$ 8472769 8342505 8276387 8220663 8082893 7940332 7889816 7825377 7702084 7685078 7668441 7511422
3970G511422q1586o3400o8897k8486j04063q3041O2016j7127k7582j17545n3523
$$ 7511422 7429836 7366436 7297539 7269053 7164990 7081949 7143965 7126838 7099256 6981711 6928188
3959F928188j14739q2507L3682j02453r430L2783m7515o7389K1361k2073o1433
$$ 6928188 6813449 6730942 6764624 6662171 6652741 6685524 6638009 6570620 6591981 6569908 6508475
3948F508475M842o1747j37054j194n6100k6365o4110q7003N1496O875p4877Q5136
$$ 6508475 6513317 6451570 6314516 6313322 6257222 6230857 6166747 6079744 6131240 6138115 6063238 6148374
3936F148374o2436J0120k5791j6833n0909r5558O0998j278p8558o048K8445O3735
$$ 6148374 6085938 6096058 6070267 6053434 6002525 5906967 5967965 5966687 5888129 5882081 5910526 5974261
3924E974261j14868m851k9728L6356m4566N9037l3469m2081M7533o2405l813j5693
$$ 5974261 5859393 5854542 5824814 5861170 5816604 5875641 5842172 5800091 5847624 5785219 5781406 5765713
3912E765713j4029j1171J1341o6554M2456m9828n8674o8324K2576n6196P225j0814
$$ 5765713 5751684 5740513 5751854 5685300 5727756 5677928 5619254 5550930 5573506 5517310 5524535 5513721
3900E513721L2278k0597J10R0855K2811K0528l8207l0364j2303R482o1773L6746
$$ 5513721 5545999 5525402 5525512 5616367 5639178 5659706 5621499 5591135 5578832 5588314 5526541 5563287
3888E563287n1294j9306n183m2334m6936J00178K6064Q342J4083r3673l0630J5488
$$ 5563287 5511993 5492687 5487504 5445170 5398234 5498412 5524476 5532818 5546901 5453228 5422598 5438086
3876E438086K7866O2056P2316l8270M5356J26345o9853O1400n1252q4492L6791
$$ 5438086 5465952 5528008 5600324 5562054 5607410 5733755 5663902 5725302 5674050 5589558 5626349
3865E626349M8669j430o798m896J9380K1184L82J3577l1058o2534q909N1050k0792
$$ 5626349 5675018 5673588 5666790 5661894 5681274 5702458 5702840 5716417 5685359 5622825 5613916 5664966 5644174
3852E644174o4476q0080q165j04106L153P399q8064K8622O8015r5644K5707N7551
$$ 5644174 5579698 5499618 5491453 5387347 5390500 5397899 5309835 5338457 5406472 5310828 5336535 5394086
3840E394086j1999N49q8906j04463k2245o1362L1415p9641j7996O5575Q070j7703
$$ 5394086 5382087 5382636 5293730 5189267 5167022 5105660 5137075 5057434 5039438 5105013 5113083 5095380
3828E095380K7988k0783q1139l5479k9995J14343P7072n5719k5046L3808L3716
$$ 5095380 5123368 5102585 5021446 4985967 4955972 5070315 5147387 5091668 5066622 5100430 5134146
3817E134146J8705k8081K6430N934J7903M4143K9027L3789l8846q1916k9236L3086
$$ 5134146 5152851 5124770 5151200 5157134 5175037 5219180 5248207 5281996 5243150 5161234 5131998 5165084
3805E165084j1059N7268J8043L2457K4155j3632n898J20882Q004o786L7753l2641
$$ 5165084 5154025 5211293 5229336 5261793 5285948 5272316 5266418 5387300 5395304 5388518 5426271 5393630
3793E393630P4739L3777J3169K4751K3152L4745k6518k3737R8568R0242J4175
$$ 5393630 5468369 5502146 5515315 5540066 5563218 5597963 5571445 5547708 5646276 5736518 5750693
3782E750693l3113P5633m8486K2252Q9961K6765P052J2109O5877j4360J28165
$$ 5750693 5717580 5793213 5744727 5766979 5856940 5883705 5890757 5902866 5968743 5954383 6082548
3771F082548J14076O0507J4126J18926O1574J02195J27302P5056P2004Q6836K3101
$$ 6082548 6196624 6257131 6271257 6390183 6451757 6553952 6681254 6756310 6828314 6915150 6938251
3760F938251J46567J05195K0307O3070J37834P8354M4042R6404J01302K0944J13841
$$ 6938251 7084818 7190013 7210320 7273390 7411224 7489578 7533620 7630024 7731326 7752270 7866111
3749G866111J09753J47830O5693Q3146J56097J16084J82128J63932K32441K09947
$$ 7866111 7975864 8123694 8189387 8272533 8428630 8544714 8726842 8890774 9123215 9333162
3739I333162K69897J99179J77670M16455K26626K78629N02159O06817P38254J081423
$$ 9333162 9603059 9802238 9979908 10396363 10622989 10901618 11403777 12010594 12748848 13830271
3729A3830271J160237J518064K070327K634305J952367q78431k030541k524937
$$ 13830271 14990508 16508572 18578899 21213204 23165571 22287140 20256599 17731662
3721A7731662k161808j410775r52378p95291m99735m24124l49763k65612k27474
$$ 17731662 15569854 14159079 13206701 12411410 11911675 11487551 11137788 10872176 10644702
3712A0644702j26325j21072j27149j82153j65243p0525n0511L692j33520j19402
$$ 10644702 10518377 10397305 10270156 10088003 9922760 9852235 9801724 9805416 9671896 9552494
3702I552494q9859q4454J1370r7093j9976k1922j31636k3130Q0258j56193k6079
$$ 9552494 9462635 9378181 9389551 9292458 9272482 9250560 9118924 9095794 9176052 9019859 8993780
3691H993780j4810m5832M8093r4233l9181L1796J3271l3251O5446K164o1638O8919
$$ 8993780 8978970 8933138 8981231 8886998 8847817 8879613 8892884 8859633 8925079 8927243 8865605 8934524
3679H934524K8773L7522O9638R1605R4476p4201P3825Q9365J1977R1948M2415
$$ 8934524 8963297 9000819 9070457 9162062 9256538 9182337 9256162 9345527 9357504 9449452 9491867
3668I491867N1895J35059R7955P4084J08291J59918N280Q9220J40942O3098J11351
$$ 9491867 9543762 9678821 9776776 9850860 9959151 10119069 10124349 10213569 10354511 10417609 10528960
$$ [...]
##END NTUPLES=NMR SPECTRUM
##END=
