##TITLE=1H_EC-3339(3)
 200.13MHz, CDCl3,
 8 sc
 
 16.1.2025
##JCAMPDX= 6.0         $$ Bruker NMR JCAMP-DX V2.0
##DATA TYPE= NMR SPECTRUM
##DATA CLASS= NTUPLES
##ORIGIN= UXNMR, Bruker Analytische Messtechnik GmbH
##OWNER= pz
$$ XWIN-NMR		Version 3.5
$$ Thu Jan 16 13:57:25 2025 Russian Standard Time (UT+4h)  she@DPX200
##.OBSERVE FREQUENCY= 200.1313
##.OBSERVE NUCLEUS= ^1H
##.ACQUISITION MODE= SIMULTANEOUS
##.ACQUISITION SCHEME= undefined
##.AVERAGES= 8
##.DIGITISER RES= 18
##SPECTROMETER/DATA SYSTEM= spect
##.PULSE SEQUENCE= zg30
##.SOLVENT NAME= DMSO
##.SHIFT REFERENCE= (INTERNAL, DMSO, 0, 15.3822)
##AUDIT TRAIL= $$ (NUMBER, WHEN, WHO, WHERE, WHAT)
$$ ##TITLE= Audit trail, XWIN-NMR		Version 3.5
$$ ##JCAMPDX= 5.01
$$ ##ORIGIN= Bruker BioSpin GmbH
$$ ##OWNER= she
$$ F:/spectra/data/she/nmr/H-C/1/pdata/1/auditp.txt
$$ ##AUDIT TRAIL=  $$ (NUMBER, WHEN, WHO, WHERE, WHAT)
(   1,<2025-01-16 13:55:55.21 +0400>,<she>,<DPX200>,
      <created by zg, POWCHK disabled, PULCHK disabled
       configuration hash MD5:
       00 E9 B6 7A A2 85 ED C7 34 08 36 98 17 FE 4E 26
       data hash MD5: 16K
       2D 60 18 46 FB D4 F5 9A 5C 60 91 8F A4 18 CD E1>)
(   2,<2025-01-16 13:55:57.59 +0400>,<she>,<DPX200>,
      <Start of raw data processing
       efp BC_mod = 2 LB = 0.25 FT_mod = 6 PKNL = 1 PHC0 = 243.1263 PHC1 = 22.3922 SI = 16K 
       data hash MD5: 16K
       EE 89 90 42 87 56 74 D0 62 25 47 5D E8 54 68 DE>)
(   3,<2025-01-16 13:56:26.39 +0400>,<she>,<DPX200>,
      <pk PHC0 = 4.935194 PHC1 = -7.799999 
       data hash MD5: 16K
       3D 86 C2 35 91 F5 C6 06 FB 0D 91 26 30 D5 D8 EA>)
(   4,<2025-01-16 13:56:29.95 +0400>,<she>,<DPX200>,
      <abs ABSG = 5 
       data hash MD5: 16K
       09 0C 3C D1 62 61 2B 9C 47 28 7C 15 EF F6 07 E0>)
$$ ##END=
$$ 
$$ hash MD5
$$ 4E 8E 2C F0 F5 E8 53 D0 17 2D 3E D1 94 8D 3F DB
##$RELAX= 
##$RELAX= 
##$RELAX= 
##$RELAX= 
##$RELAX= 
##$RELAX= 
$$ Bruker specific parameters
$$ --------------------------
##$DU= <F:/spectra>
##$EXPNO= 1
##$NAME= <H-C>
##$PROCNO= 1
##$TYPE= <nmr>
##$USER= <she>
##$AMP= (0..31)
100 100 100 100 100 100 100 100 100 100 100 100 100 100 100 100 100 100 
100 100 100 100 100 100 100 100 100 100 100 100 100 100 
##$AQSEQ= 0
##$AQ_mod= 1
##$AUNM= <au_zg>
##$AUTOPOS= <>
##$BF1= 200.13
##$BF2= 200.13
##$BF3= 200.13
##$BF4= 200.13
##$BF5= 200.13
##$BF6= 200.13
##$BF7= 200.13
##$BF8= 200.13
##$BYTORDA= 1
##$CFDGTYP= 0
##$CFRGTYP= 5
##$CHEMSTR= <none>
##$CNST= (0..31)
1 1 145 1 1 1 1 1 1 1 1 1 1 1 1 1 1 1 1 1 1 1 1 1 1 1 1 1 1 1 1 1 
##$CPDPRG= <>
##$CPDPRG1= <>
##$CPDPRG2= <>
##$CPDPRG3= <>
##$CPDPRG4= <mlev>
##$CPDPRG5= <mlev>
##$CPDPRG6= <mlev>
##$CPDPRG7= <mlev>
##$CPDPRG8= <mlev>
##$CPDPRGB= <>
##$CPDPRGT= <>
##$D= (0..31)
0 0.7 0 0 0 0 0 0 0 0 0 0.03 0 0 0 0 0 0 0 0 0 0 0 0 0 0 0 0 0 0 0 0 
##$DATE= 1737021354
##$DBL= (0..7)
120 120 120 120 120 120 120 120 
##$DBP= (0..7)
150 150 150 150 150 150 150 150 
##$DBP07= 0
##$DBPNAM0= <>
##$DBPNAM1= <>
##$DBPNAM2= <>
##$DBPNAM3= <>
##$DBPNAM4= <>
$$ [...]
##$SUBNAM3= <"">
##$SUBNAM4= <"">
##$SUBNAM5= <"">
##$SUBNAM6= <"">
##$SUBNAM7= <"">
##$SUBNAM8= <"">
##$SUBNAM9= <"">
##$SW= 18.0517328524113
##$SWIBOX= (0..15)
0 0 2 0 0 0 0 0 0 0 0 0 0 0 0 0 
##$SW_h= 3612.71676300578
##$TD= 16384
##$TD0= 1
##$TE= 0
##$TE2= 300
##$TE3= 300
##$TEG= 300
##$TL= (0..7)
0 120 120 120 120 120 120 120 
##$TP= (0..7)
150 150 150 150 150 150 150 150 
##$TP07= 0
##$TPNAME0= <>
##$TPNAME1= <>
##$TPNAME2= <>
##$TPNAME3= <>
##$TPNAME4= <>
##$TPNAME5= <>
##$TPNAME6= <>
##$TPNAME7= <>
##$TPOAL= (0..7)
0.5 0.5 0.5 0.5 0.5 0.5 0.5 0.5 
##$TPOFFS= (0..7)
0 0 0 0 0 0 0 0 
##$TUNHIN= 0
##$TUNHOUT= 0
##$TUNXOUT= 0
##$USERA1= <user>
##$USERA2= <user>
##$USERA3= <user>
##$USERA4= <user>
##$USERA5= <user>
##$V9= 5
##$VALIST= <valist>
##$VCLIST= <CCCCCCCCCCCCCCC>
##$VD= 0
##$VDLIST= <DDDDDDDDDDDDDDD>
##$VPLIST= <PPPPPPPPPPPPPPP>
##$VTLIST= <TTTTTTTTTTTTTTT>
##$WBST= 1024
##$WBSW= 4
##$XGAIN= (0..3)
0 0 0 0 
##$XL= 0
##$YL= 0
##$YMAX_a= 698408
##$YMIN_a= -824807
##$ZGOPTNS= <>
##$ZL1= 120
##$ZL2= 120
##$ZL3= 120
##$ZL4= 120
##$ABSF1= 15.35905
##$ABSF2= -2.692798
##$ABSG= 5
##$ABSL= 3
##$ALPHA= 0
##$AQORDER= 0
##$ASSFAC= 0
##$ASSFACI= 0
##$ASSFACX= 0
##$ASSWID= 0
##$AUNMP= <proc_1d>
##$AZFE= 0.1
##$AZFW= 0.1
##$BCFW= 0
##$BC_mod= 2
##$BYTORDP= 0
##$COROFFS= 0
##$CY= -3
##$DATMOD= 1
##$DC= 0
##$DFILT= <>
##$DTYPP= 0
##$F1P= 0
##$F2P= 0
##$FCOR= 1
##$FTSIZE= 16384
##$FT_mod= 6
##$GAMMA= 0
##$GB= 0
##$INTBC= 1
##$INTSCL= 3.241238e-09
##$ISEN= 128
##$LB= 0.25
##$LEV0= 0
##$LPBIN= 0
##$MAXI= 10000
##$MC2= 0
##$MEAN= 0
##$ME_mod= 0
##$MI= 1.114404
##$NCOEF= 0
##$NC_proc= -6
##$NLEV= 6
##$NOISF1= 3.799351
##$NOISF2= 2.8
##$NSP= 0
##$NTH_PI= 0
##$NZP= 0
##$OFFSET= 15.38219
##$PC= 1
##$PHC0= 248.0615
##$PHC1= 14.5922
##$PH_mod= 1
##$PKNL= yes
##$PPARMOD= 0
##$PSCAL= 0
##$PSIGN= 0
##$REVERSE= no
##$SF= 200.130027919747
##$SI= 16384
##$SIGF1= 3
##$SIGF2= 2
##$SINO= 0.751879
##$SIOLD= 32768
##$SREGLST= <19F.Aceton>
##$SSB= 0
##$STSI= 16384
##$STSR= 0
##$SW_p= 3612.71676300578
##$SYMM= 0
##$S_DEV= 0
##$TDeff= 16384
##$TDoff= 0
##$TI= <>
##$TILT= no
##$TM1= 0
##$TM2= 0
##$TOPLEV= 0
##$USERP1= <user>
##$USERP2= <user>
##$USERP3= <user>
##$USERP4= <user>
##$USERP5= <user>
##$WDW= 1
##$XDIM= 16384
##$YMAX_p= 458274560
##$YMIN_p= -695995
$$ End of Bruker specific parameters
$$ ---------------------------------
##NTUPLES= NMR SPECTRUM
##VAR_NAME=  FREQUENCY,     SPECTRUM/REAL,   SPECTRUM/IMAG
##SYMBOL=    X,             R,               I
##VAR_TYPE=  INDEPENDENT,   DEPENDENT,       DEPENDENT
##VAR_FORM=  AFFN,          ASDF,            ASDF
##VAR_DIM=   16384,         16384,           16384
##UNITS=     HZ,            ARBITRARY UNITS, ARBITRARY UNITS
##FACTOR=    0.220516191357247, 1,           1
##FIRST=     3078.43806426871, 0,            0
##LAST=      -534.27869873707, 0,            0
##MIN=       -534.27869873707, -695995,      0
##MAX=       3078.43806426871, 458274560,    0
$$ Real data points
##PAGE= N=1
##DATA TABLE= (X++(R..R)), XYDATA
$$ [...]
11923 -76355 31941 -115135 -334408 -287064 -68852 523 -51658 -253789 -191985 10911
11913 10911 -38814 51824 102212 -34667 -114918 -170719 23549 -59007 -144997 -110401 2342
11902 2342 30553 -95752 -182218 -80846 -78585 20629 -133017 -106336 -23933 -138835 -125619
11891 -125619 -29403 -5762 -123606 -29917 -148314 -94174 -20487 -88167 12276 11456 -4275
11880 -4275 130347 73635 -12832 -66811 -82930 -101159 -17036 90885 60022 -52158 87548
11869 87548 104579 -58566 -48840 -203038 -165982 -118860 -109660 -162155 -152035 -204158 -227910 -145042
11857 -145042 -2639 -16840 -85545 8240 -84597 2906 -29465 -39930 -78302 -88704 -22842
11846 -22842 -70405 -145919 -219024 -198813 -218931 -173257 -169709 22463 -31061 -114768 82924
11835 82924 -15517 -127786 -150025 -54266 33444 13684 -7589 -144662 -171355 -95979 -61019
11824 -61019 -218979 -253693 -81879 43384 -89279 -57084 -39771 -95719 -34287 14871 123256
11813 123256 122115 29772 29256 30053 -36923 -18960 -262089 -189649 -51113 -99059 -137528 142116
11801 142116 87742 -44705 62351 47333 -65329 5068 53089 88898 102578 -3838 -149734
11790 -149734 -208619 -148020 40522 -7247 -145325 -184029 -216929 -189331 -49770 107138 140583
11779 140583 104733 -23499 81505 88025 151719 60350 -138935 -198932 -46552 -110311 -23521
11768 -23521 -35065 -171980 -97334 -43036 -75986 -72438 98230 64966 -16295 91596 64989
11757 64989 19734 114523 21578 -89416 -178194 -112420 -172694 -226796 -248871 -8513 -47327
11746 -47327 -25338 -58879 -141456 -188401 -315775 -179978 -71439 -163172 -461634 -307969 -19941
11735 -19941 23244 -28029 -327728 -205838 -189797 -173909 -55877 -77951 -64806 -104754 -118635
11724 -118635 -133047 -66338 1855 75498 -47801 -107312 -140289 49727 -34501 -164701 -136277
11713 -136277 32279 -90549 -97590 -201896 -243814 -234294 -53924 -83764 -112897 3218 -122243
11702 -122243 -45496 -60020 -66187 -28135 -19677 -2173 70913 -21137 -71630 50620 59800 91535
11690 91535 -6715 63031 93928 12823 -6739 -46614 -29536 -15600 -179694 -275162 -86168
11679 -86168 -75076 -82971 -17794 -13385 -129597 25457 -79983 -226879 -112912 -13204 -46432
11668 -46432 18551 37094 99519 -6976 -180932 -15998 48143 66563 84893 225152 35119
11657 35119 -130479 -223678 -137768 -139342 -87316 -60640 -131866 -83552 -75260 -63259 -25015 76602
11645 76602 18593 -40344 -138492 -24361 53992 75527 -34912 -97494 -63532 -117395 -215856
11634 -215856 -217125 -187061 -101110 -111538 -306688 -212134 -58136 -82117 -222619 -279746 -243495
11623 -243495 -238228 -148564 -52891 -2945 78612 67694 -74172 41234 91345 13122 -25101
11612 -25101 -148308 31448 -2670 -166456 -301905 -301564 -231629 -163518 -61700 -51880 21247
11601 21247 -30715 -117235 -207302 -78542 -66647 -157869 -207603 -191779 -21573 85189 3459
11590 3459 144440 112444 6930 116270 120124 49252 -28444 23783 67169 -37992 -42096
11579 -42096 -205263 -303752 -175047 -52694 43158 -4372 -206680 -206962 -184486 -104446 -204807
11568 -204807 -204639 -190739 -202628 -223476 -56405 -118005 -119699 -97388 -187920 -273816 -231680 -63552
11556 -63552 108371 156078 -82195 -77557 -140022 -97789 -4236 -142054 -254103 -254155 -175368 -73203
11544 -73203 -9288 -101536 -322597 -107431 -128151 -189507 -103709 -107299 -85921 -98527 -143824
11533 -143824 -231895 -335926 -332337 -393364 -109133 -136094 -246843 -289602 -256773 -115483 -37649
11522 -37649 -18981 -62960 -210105 -155776 -118197 -61911 -97374 -175621 -152945 -51691 3716
11511 3716 -38633 5799 -100499 -146986 -136415 9539 85280 -114061 -64565 -2043 80269
11500 80269 62625 11355 11244 -131919 -174059 -188725 -135509 -55616 -223929 -142123 -52674 -78766
11488 -78766 -47962 -163583 -255061 -84785 -127379 -288797 -246114 -244204 -220640 -270715 -242827
11477 -242827 -146747 30254 -164 -123716 -170809 -126848 6988 7963 -97127 -62360 -43724
11466 -43724 -100021 -102146 -166350 -64398 108742 -56765 -77076 61183 22912 -28534 -62473
11455 -62473 -234455 -243290 3495 -122282 -230990 -63351 -79838 -144482 -170490 22995 -112250
11444 -112250 -70158 -93204 -239332 -243226 -153708 42435 9274 -153905 -224711 -264291 -216838
11433 -216838 -62001 -151405 -64734 45546 -86223 -84538 -247887 -333296 -250619 -56667 -177829
11422 -177829 -28040 62303 -32155 34317 -33685 -160537 -120022 -173184 -100174 -19688 15987
11411 15987 -18251 -93709 -13686 7894 37060 -15430 -90864 -107996 -145450 -162065 -114771 -168160
11399 -168160 -193626 -133670 -208778 -266094 -271605 -217698 -64399 -67925 33205 -30465 -19775
11388 -19775 48843 -17736 38436 211693 69713 134455 -68721 -98457 -196897 -284252 -126534
11377 -126534 -21646 72737 -3258 -35945 59235 4817 10935 129192 45950 40424 -115575
11366 -115575 -260159 -117282 -125267 -234060 -186083 -76340 -239436 -290653 -202663 -82906
11356 -82906 -3242 86645 -92795 -173392 -136775 -65556 -44777 -228040 -246025 -177346 -125922
11345 -125922 14856 66781 22243 -40766 -143082 -155627 -141815 -109428 -250051 -384905 -305417
11334 -305417 -132764 -250153 -47720 -151190 -223490 -211889 -160927 13972 69804 19462
11324 19462 78066 42324 -203663 -80562 -108167 -80525 54182 -81762 -336461 -352487 -338060
11313 -338060 -220377 -118378 -119053 -86455 -95738 134879 8929 -3044 -2651 44696 106008 78289
11301 78289 148224 31113 -74411 26647 14590 35564 55406 156628 144584 67578 -117972
11290 -117972 -137970 -44005 -89513 -57730 -105160 -126533 -51665 -107367 -78633 -170927 -196228
11279 -196228 -138803 -67544 -94541 -194719 -180898 -229808 -145130 -182342 2277 23392 51302
11268 51302 -75358 19551 -100042 -285536 -378379 -326980 -214497 -240135 -91546 -100032 -182570
11257 -182570 -90675 58964 168996 28482 -168418 2349 -56448 -59483 -72548 -136194 -96385
11246 -96385 -120368 -100167 -89557 -105848 -79068 83798 -13689 -163298 -131089 98926 141465
11235 141465 69763 35210 70306 54434 -40075 -67219 -155645 -325174 -224426 -3575 215611
11224 215611 208219 65833 -91967 -178823 -257047 -159694 -80836 -93774 -90980 -163766 -123891
11213 -123891 -147851 -150224 -172130 -208481 -173005 -76434 -88135 -24066 -92785 -80730 -126878 -190989
11201 -190989 -147913 -229598 -110779 -6090 -225838 -204665 -47338 15915 -64102 -5513 -77167
11190 -77167 -206325 -89187 -100229 -101405 -79114 -185262 -182566 -175419 -239058 -134676 -118812
11179 -118812 -109817 -145774 -114478 -62074 -76717 -113555 -284681 -249182 -184531 -142257 -193819
11168 -193819 -104653 -54954 -146865 -130883 -279918 -243690 -128598 -96417 -89261 -75394 -113493
11157 -113493 -193121 -120140 -63247 -66920 43991 73201 29675 101210 64822 -101190 -144009
11146 -144009 -23668 -47514 -148298 -159538 -109407 37387 158305 124586 5023 -51623
11136 -51623 -106114 -226798 -275604 -336909 -281428 -84280 -19083 -41506 -55383 -70809 97593
11125 97593 -27209 -41710 -9478 -58672 -3934 29944 -44223 64074 -92988 -196290 -79973
11114 -79973 -264102 -197496 -106811 -165109 -308534 -317389 -171855 -10054 20023 4874 -136277
11103 -136277 -187099 -8860 2554 -132575 -240799 -273891 -154444 -123284 -231917 -172011
11093 -172011 -189983 -198144 -78471 -49052 -17920 -72857 -124183 -251887 -318691 -168786 7058
11082 7058 -117105 -379239 -319859 -263550 -344865 -323731 -145050 -90900 10497 89252 14281
11071 14281 -887 -42319 -98245 -220922 -192353 -176748 -23213 -4129 55220 72244 -154478
11060 -154478 -212144 -169898 -158180 -87784 -115626 -49070 -184 -77100 -60446 -116666 -89652
11049 -89652 2678 5662 16833 -46176 -69769 -125508 -93381 -40981 15776 -145111 -96120 -15268
11037 -15268 -48971 -136433 -149374 -125345 -109912 -37140 89358 -112898 -313502 -511999 -366295
11026 -366295 -192561 -183762 -108848 -258834 -159696 -217471 -280968 -291974 -212813 -150280 -179190
11015 -179190 -234337 -288043 -446247 -95670 -102560 -85762 -166710 -343034 -201152 -142895 -146487
11004 -146487 -131777 -70352 -18403 -270773 -335812 -46684 30185 215668 320784 150713
10994 150713 -131215 -227753 -148493 -103489 -302021 -264758 -55913 -84790 -112491 -252911 -128923
10983 -128923 -16744 71011 -20717 -123546 -52926 76818 58227 -14331 -111508 -70999 -111761
10972 -111761 -39477 -5418 -4352 -143373 -13240 65431 -83867 -56695 -117383 -50078 -119782
10961 -119782 -83030 -101759 -178261 -320831 -332756 -237059 -152244 -129461 -276768 -177108 -150280
10950 -150280 -218055 -83963 -160167 -196259 -314299 -412006 -374158 -76148 119957 -178807
10940 -178807 -266882 -210991 -248295 18936 34381 19124 -136341 -91041 -181598 -138258 -20994
10929 -20994 12674 61710 -85172 -242939 -160569 -54550 -25188 -18816 -167805 -209616 -263068
10918 -263068 -291347 -123874 -167228 -232755 -111685 -117590 -144621 -262543 -116812 -97497 -185995
10907 -185995 -23796 62893 -186116 -95027 -77535 4793 33517 -50487 -11701 25512 -9570
10896 -9570 -80010 -173924 -309525 -167865 -134626 -135895 -115360 -47156 -211372 -89396 38584
10885 38584 -173821 -218463 -207313 -262461 42941 -130175 -176999 -24403 23565 -62039 -135471
10874 -135471 -128792 -206853 -116455 -45382 -48613 -7688 148107 14364 -69766 -166726 -202598
10863 -202598 -88690 -213882 -171138 -144656 -258749 -212200 -355282 -235048 -110423 31596
10853 31596 -76258 -56587 21476 -130499 26777 106335 -139781 -344721 -327826 -153038
10843 -153038 -100095 -170851 -168955 -150191 -415394 -329813 -213753 -220934 -191037 -164457 -232754
10832 -232754 -226684 -162437 -184970 -248917 -278070 -154870 -48454 -112187 -219351 -252832 -62945
10821 -62945 -28619 -134187 -238268 -199994 69127 -83536 -265261 -226203 -267935 -282247 -174920
10810 -174920 -131101 -220352 -242006 -131572 9021 -54191 7426 -14136 -85669 26090 20115
10799 20115 -27709 -30177 63515 7890 -153453 -238594 -104784 18996 -163094 -287392 -205008
10788 -205008 -107712 15089 -93370 -22841 -84933 -138304 -266763 -236247 -74143 -70608 126008
10777 126008 60946 -129227 -204656 -86779 -105488 -197999 -142897 -31269 -152327 -87370 -37515
10766 -37515 -108449 47419 95890 40639 -28521 -76218 -95850 143506 133047 174954 -14818
10755 -14818 -171476 -51685 -78239 -99032 -104980 -226430 -60065 -90474 -56621 -133634 -106343
10744 -106343 -168892 -111047 -142115 -211023 -206031 -90208 -76724 -53219 -91961 -236550 -250243
10733 -250243 -333384 -295356 -323441 -162432 -210660 -139944 -63184 -88301 -69702 -142241 -299994
10722 -299994 -190000 -236094 -164265 -264657 -181379 -122504 -176623 -215741 -302692 -164582 -28220
10711 -28220 -78796 40385 -5221 -90917 -80598 -88766 -66902 -17014 -8336 -75501 12827 13286
10699 13286 -107428 -79319 -166217 13619 39018 -250555 -280897 -267724 -211984 -78554 -28591
10688 -28591 -281716 -356009 -202797 -234023 -256352 -109652 -14536 30732 -97241 -146435 -202382
10677 -202382 -92220 -28318 -907 -56291 -13504 -9401 -138191 -227462 -251053 -126091 80482
10666 80482 -91493 -107229 -38238 -89550 -125624 12316 15182 -175255 -171637 -205050 43497
10655 43497 30669 -4535 22306 -166671 -227302 -4703 -132134 -135792 -212398 -133709 -303803
10644 -303803 -313965 -233051 -250646 -150048 -165120 -146251 -15166 11701 -12029 -128013 -187798
10633 -187798 -229278 -269255 -287698 19017 55985 -32765 -88969 -58310 35817 -198646 -28518
10622 -28518 82088 -104208 -169329 -256064 -248993 -148415 -106987 25307 -123151 -49739 -29192
10611 -29192 -107288 -17586 80540 82512 97175 -169784 -134345 -56794 -50368 -86817 -25810 19550
10599 19550 -4733 -57530 26279 -10920 -121391 -66602 84071 124416 -97155 -213656 -45796
10588 -45796 -165302 -208255 -263678 -269441 -251740 -167498 44581 46118 -58301 -12963 -6877 -80203
10576 -80203 -23554 13075 1238 5970 95605 -120075 -156197 -148610 -372874 -345652 -301058 -317071
10564 -317071 -247077 -272785 -296451 -241351 -176215 -182191 -94352 -38247 -61257 -134110 -67879 -41130
10552 -41130 -33809 148236 97547 18360 98843 26379 -187847 -260914 -72093 -35551 893
10541 893 -143134 -246549 -100942 13189 99193 17134 85758 -35900 -109405 94082 176654
10530 176654 130274 19962 69977 -76878 -169295 -38688 -29408 -209251 -282750 -213321 -116894
10519 -116894 -45306 -60803 -91016 -257705 -132014 27882 14044 -146064 -46734 132629
10509 132629 143089 -6734 -114114 -100138 -96043 -6891 -52804 -203183 -90083 51481 26062
10498 26062 144774 -15028 -35927 -88315 -190954 -294533 -42198 -49565 -62199 -29444 -123708
10487 -123708 -172357 -154836 -164019 -48977 -78448 -280545 -141653 -115771 -86391 4620 -17776
10476 -17776 -64595 -106319 -50394 70893 132668 -7619 -3315 -104252 -192492 -153252 -127254
10465 -127254 -94916 -156671 -105388 -275615 -224089 -191482 -108140 76118 -33155 -77309 3697
10454 3697 -132741 -134095 -65999 -70052 39215 8040 58806 -22722 16485 3898 -134189 -300393
10442 -300393 -251579 -89731 -212817 -162541 -112364 -187011 -62603 113880 -68190 -281823
10432 -281823 -327970 -190402 -61925 -6482 -73977 -141091 -30386 57177 58283 46885 -63600
10421 -63600 -35671 -3008 -50895 -144668 -33345 -4014 -123699 -70806 -77374 -98978 -173914
10410 -173914 -91574 50015 23396 54687 -60529 -96695 -37694 -55011 -122380 -61198 44523
10399 44523 -55161 -194504 -226636 -222624 -237701 -233653 -33841 -62274 -107916 -212580 -165390
10388 -165390 -114683 -201271 -276243 -169003 -103332 -14377 -118494 -116416 -156690 -194134 -129262
10377 -129262 36563 146401 -3908 -17232 -214835 -252093 -73232 -42293 -105293 -65147
10367 -65147 -173427 -65762 -64459 -122178 36241 32367 -30753 43218 -1206 -162257 42671
10356 42671 -37223 -164975 -165163 -148390 -54680 -84105 -132138 -195262 -116979 28399 52401 -1167
10344 -1167 -60239 -72919 -106273 -82584 114700 76978 81588 168415 269316 75432 -70478
10333 -70478 -115141 -193660 -237162 -150812 -54029 -87072 -141629 -157676 -356189 -241333 -177448
10322 -177448 -216625 -319523 -202309 -154128 -95029 -33411 33756 -88044 -198028 -175891 -125421
10311 -125421 -27871 -77066 -78996 159490 115266 53172 -23525 28372 48061 -40631 -96036
10300 -96036 -132661 -155040 -284364 -97860 -32801 -15020 -164872 -121153 -162971 -164070 -20432
10289 -20432 61911 79602 169990 148355 81746 -11305 -76441 -12332 8230 69020 -35504
10278 -35504 -126378 -270038 -89623 -212711 -140965 66580 -94332 92170 -19805 -137149
10268 -137149 -96462 -65678 -13549 78426 -13992 12911 -32594 -9254 -61002 -112505 -181198
10257 -181198 -204842 -53054 -20882 -42341 128084 90211 57641 53628 10152 27018 -135200
10246 -135200 -6826 8798 -29278 -42525 -80003 -78902 -57884 47073 -27885 -97890 -76169
10235 -76169 -28330 -33588 -46629 9651 51543 79039 49087 -41531 20813 -140070 -104826 51138
10223 51138 73359 21910 85854 140350 184923 86106 44680 -28803 -102099 -119296 58563
10212 58563 -45604 -159417 -65847 -35847 -169201 -225485 -169149 -63710 -32868 -62836 189355
10201 189355 122328 90955 111461 88760 86665 114943 -32828 62598 220698 217172 236084
10190 236084 132063 4623 -8352 51786 -16792 -141550 -151061 31024 15857 -202173 -73608
10179 -73608 -36602 118257 77550 -46812 -80430 -16345 -56252 -122984 -31488 -33567 -2025
10168 -2025 -118501 32296 8596 -276302 -213526 -124668 -65182 -102432 -59608 -127278 -145020
10157 -145020 -91089 31680 -23645 17031 114628 89067 80778 152568 50860 36928 110753
10146 110753 -98952 5844 30857 15444 150347 112238 -100211 -87914 156014 156598 146582
10135 146582 95296 78830 -9855 -20534 -112138 -74844 -53547 -31067 76567 20779 -109496
10124 -109496 -266467 -193585 51984 60284 -38262 4197 -55780 1942 64617 113049 114795
10113 114795 38265 92978 188744 185097 112217 -12906 84533 272408 211118 264584 192013
10102 192013 163185 145851 75638 98023 87928 156465 28220 -89389 -50505 -81350 -197219
10091 -197219 -37367 -92079 -127328 -6893 123699 84139 97892 182130 119224 60766 -85801
10080 -85801 59372 -28861 -52302 125888 168136 29971 -117934 -122814 -80570 6760 69556
10069 69556 221597 233944 159460 165281 276844 306869 457614 170811 125188 148159 100934
10058 100934 27392 48008 -40242 -129034 -61781 -44122 -42819 45253 19695 8257 -73104 100986
10046 100986 119623 133169 219341 -100772 -74438 26336 -43933 -40303 138122 208018 230517
10035 230517 232708 197066 63993 68166 144842 96813 180441 140916 20583 94484 3895
10024 3895 47086 55960 -30661 69202 94925 81320 108142 59507 122647 -39946 54411 78685
10012 78685 -20429 -109446 -115861 -54445 39404 20792 -31658 29108 20093 -77944 -89443 75590
10000 75590 92531 -48153 58938 38505 90863 99675 71564 135928 127683 144291 81820 -55182
9988 -55182 -201129 -109178 44693 9098 -68798 21888 117135 135345 98541 105247 -161212
9977 -161212 -165713 -13595 -16506 -45854 -88381 -51099 -15829 27385 -48455 31309 148564 57460
9965 57460 48887 20478 160836 175502 183750 13920 -125876 -44978 113537 31099 87850
9954 87850 283267 -1609 -105663 -26305 -32666 -107782 -1055 93934 34617 -96809 -79929
9943 -79929 22204 -59595 -192473 -113376 -87384 -61107 24892 1863 116331 78147 -38776
9932 -38776 -168263 -244337 -23779 -77961 -83964 128997 155417 86225 190018 159973 166069
9921 166069 144987 93420 -44636 765 46948 139529 189114 85349 74722 10881 84480
9910 84480 10200 -8204 95239 -18550 -94365 -89335 -24644 108114 141603 77238 -46703
9899 -46703 -144147 -68827 73909 54367 57541 102116 -4314 -92422 -74027 -53086 -31125 -86186
9887 -86186 -121449 -76081 -46543 17292 35173 5309 -77333 35841 95915 101295 163881 163678
9875 163678 177765 163330 123543 179562 281382 152657 211070 169648 117761 97826 110878
9864 110878 102883 226538 114974 105545 124208 47538 136703 101766 86118 72613 -16969 -60457
9852 -60457 -14646 31751 -23468 99020 190936 304265 329440 341356 156701 -8917 -71549
9841 -71549 -75642 171209 291779 178315 283601 296640 273936 388827 123282 151828 196423
9830 196423 57142 59416 92805 195013 93221 146610 200364 115379 -69487 -34818 82589
9819 82589 85943 83066 9868 181053 269870 202118 113664 235578 196397 149410 175035 234910
9807 234910 180819 342046 336280 288713 238144 240914 176367 289703 272875 231253 117663
9796 117663 128870 228156 168057 240528 203631 218712 289009 353429 334570 257719 190931 194284
9784 194284 224993 124127 161288 353123 199438 214930 363703 395684 539326 545252 477802
9773 477802 505943 430493 488378 466349 354040 403117 466459 522645 520181 473367 380921 467879
9761 467879 468818 465692 487591 375645 335210 369679 322519 378700 518588 669901 706840 537580
9749 537580 613376 564802 659209 539653 552496 593226 502166 742864 813639 714434 631361
9738 631361 622103 671221 708846 676222 599085 619173 606273 612365 605425 501997 430957 579337
9726 579337 595258 655250 442109 307483 566512 598978 494940 537531 434727 400271 288478
9715 288478 212979 327197 429575 372644 241217 428553 559267 461227 487309 750581
9705 750581 730711 555253 435237 451185 282460 361983 358087 475546 567809 483979 497100
9694 497100 398034 399331 291966 193244 377827 427902 454487 543505 474845 412060 354259
9683 354259 467344 553843 436847 310596 207709 304686 324533 219291 483065 538608
9673 538608 358133 253751 328696 350728 403076 475336 445433 437502 326021 435572 598836
9662 598836 341875 166924 442108 551807 502507 477456 464129 374365 377568 456844 435194
9651 435194 409155 486417 666822 641061 475081 441045 373449 398400 433323 535173 469025
9640 469025 335756 417362 544133 462998 521436 574408 626720 628020 591512 635718 555932
9629 555932 496656 534957 556441 619164 671953 551540 405395 451681 576932 552747 443609
9618 443609 513838 448002 477910 634419 559667 578152 543730 610247 563342 568556 424389
9607 424389 656920 573995 533594 607862 495211 586176 670772 625135 750392 847704 831064
9596 831064 776103 769789 627330 607960 806732 671039 707816 738902 676197 697784 803827
9585 803827 777557 881843 923469 879944 1047740 1031849 1089895 1003753 912204 1002900 1006719
9574 1006719 1232466 1393424 1470004 1299469 1394077 1371625 1601151 1678650 1586129 1520777 1435749
9563 1435749 1428084 1389369 1281583 1235824 1167264 1006372 1175439 1278400 1271551 967563 918752
9552 918752 990435 1103241 983558 919499 873112 930684 1121873 977864 995436 1165467 1193778
9541 1193778 1210242 1278106 1321189 1419101 1360498 1428755 1528144 1616097 1626381 1531702 1505694
9530 1505694 1480804 1422946 1454918 1385301 1343909 1235609 1224558 1213455 1047135 1287232 1099553
9519 1099553 1002710 1194498 1108069 1025499 1097427 1211540 1322768 1179190 1144374 1116882 1184121
9508 1184121 1158739 1104938 1126018 966949 955243 1123615 1086428 1067269 1129802 1021967 1171485
9497 1171485 1179394 1065752 1202621 1272852 1256933 1209014 1291283 1298327 1230833 1214488 1399401
9486 1399401 1276685 1283766 1388897 1237276 1208506 1281452 1282581 1140305 1253484 1283257 1306870
9475 1306870 1295938 1339704 1183388 1250869 1275681 1325623 1411785 1397820 1398074 1425966 1257125
9464 1257125 1247020 1292893 1290345 1342945 1476464 1498801 1479039 1531577 1541694 1541188 1484509 1463757
9452 1463757 1476252 1547735 1608396 1620830 1690052 1825600 1879999 1830043 1849405 1962808 1906166
9441 1906166 1944972 2166401 2235063 2394190 2532516 2506951 2441415 2450259 2452245 2398030 2272230
9430 2272230 2224853 2407581 2435796 2289556 2270721 2349364 2300458 2381764 2450958 2306503 2270971
9419 2270971 2389583 2370584 2424930 2471508 2389060 2353489 2521485 2583142 2616747 2574359 2564296
9408 2564296 2613651 2749692 2964397 2948757 2774994 2721897 2880803 3074353 2968296 3036799
9398 3036799 3233149 3326533 3276843 3202484 3091873 3068809 3064034 3041648 2946898 2809206 2810123
9387 2810123 2776468 2767421 2645406 2667575 2868918 3053786 3006175 3027582 3207416 3287564 3325797
9376 3325797 3273389 3193835 3219604 3272962 3432494 3404727 3390818 3387332 3735944 3811602 3773950
9365 3773950 3813695 3898444 4016786 4106934 3913219 3812566 3979685 3931203 3779394 3870383
9355 3870383 4043286 4017752 4183226 4155449 4106164 4283296 4466877 4426787 4439312 4326356
9345 4326356 4362953 4400261 4391292 4504423 4661596 4732074 4742565 4751531 4998198 4997131 5150665
9334 5150665 5141936 5146906 5187759 5164530 5462435 5597019 5706425 5765005 5896177 5977708 6015841
9323 6015841 6083240 6211129 6355331 6223753 6243228 6159963 6153990 6176448 6156910 6151389 6191260
9312 6191260 6293366 6244492 6380905 6330623 6458181 6543158 6629007 6794546 7000127 7037323
9302 7037323 7252691 7557034 7781891 7915657 7912698 8104764 8220151 8454362 8474484 8801913
9292 8801913 8966564 9114284 9273627 9251487 9624089 9798658 9798511 10024775 10136519 10316529
9282 10316529 10355873 10452686 10711816 10754245 10853742 10994119 11142669 11392662 11618728 11838241
9272 11838241 12016138 12303901 12623077 12822337 13094854 13388371 14037722 14388621 14551623
9263 14551623 14793300 15356823 15864271 16322885 16779915 17125744 17695367 18220679 18726776
9254 18726776 19114626 19593153 20030896 20440461 20871531 21234404 21829324 22360277 22980326
9245 22980326 23557440 24237258 24849099 25537435 26081682 26740587 27397428 28340771 29178140
9236 29178140 29847927 30945346 32086347 33014087 34163721 35635217 37316507 39132351
9228 39132351 40928425 43070052 45583880 48469853 51527695 55277852 60002987 65667577
9220 65667577 72756325 81191826 90980251 101260666 110422213 118132770 124759340 129417557
9212 129417557 131671184 132411259 131228985 127658384 123532286 119779321 115558901 109827887
9204 109827887 102144433 94022159 86244404 79242875 73549201 69507240 66827451 65195912
9196 65195912 64530591 64431966 64710555 65570106 66730593 68141949 70116357 73048656 76849613
9187 76849613 81983093 88891455 97732956 108481245 121036246 132984873 142587220 149069936
9179 149069936 151456533 151283992 150333930 148786497 145859949 141929769 136792352 129123120
9171 129123120 118346803 106014363 94021171 82915364 73249545 65402639 59177308
9164 59177308 54485389 50623869 47358534 44886775 42704889 40869222 39325502 37936844
9156 37936844 36878565 35589695 34492780 33470969 32343864 31197509 30406743 29469331
9148 29469331 28487171 27796727 27316819 26920200 26569006 26451542 26132122 25801148 25578203
9139 25578203 25395312 25263262 25214830 25251700 25421845 25439709 25546941 25746631 26101847 26297903
9129 26297903 26583920 26696494 26729505 26618337 26621847 26687256 26743039 26633939 26588118 26729817
9119 26729817 26809632 26785440 26820480 27098454 27476743 27450738 27594020 27854665 28217363 28387822
9109 28387822 28596172 29048577 29498043 30017478 30540331 31028259 31910312 32668931 33466774
9100 33466774 34512524 35533703 36857837 38318602 40067912 41834127 44134598 46779687
9092 46779687 50209466 54336588 59232685 65210941 72669499 81676482 90834684 98532742
9084 98532742 104409856 109483227 113356328 115534925 117204749 118442806 117478622 113494421
9076 113494421 106153365 96116998 85726615 76335507 68748555 62854999 58637897 55633355
9068 55633355 53638208 52518804 52085255 52177222 52605362 53454223 54847944 56748159 58825567
9059 58825567 61376158 64838891 68884956 74217197 80887581 89145196 99654169 112204963
9051 112204963 125637175 136338187 143875119 150646600 158865360 167722294 173659641 175710835
9043 175710835 172219665 164629194 155140854 143414415 128241966 111495246 96027345
9036 96027345 82745432 72143472 63885096 57577446 52752203 48941947 45659590 42860367
9028 42860367 40637009 38916283 37246311 35823840 34654186 33751128 32978356 32234479 31602840
9019 31602840 30848504 30376522 30024524 29762074 29587581 29396778 29311010 29051942 28943695 29076759
9009 29076759 29041117 29052679 29141144 29491442 29851614 30180377 30565591 31069306 31657607 32240250
8999 32240250 32768370 33339152 33598444 33568696 33444221 33263264 32860404 32784136 32824720 32965830
8989 32965830 32832411 33021448 33322087 33809210 34507883 35110404 35667901 36210283 37076953
8980 37076953 38020494 39183131 40322924 41718121 43248110 45351817 47805132 50764745
8972 50764745 54068581 58079084 62799903 68228478 74333918 81138213 86648834 89618894
8964 89618894 90703146 90774838 91143334 92597924 94030196 93898607 90875388 86315452 80907669
8955 80907669 75588343 71210859 68112920 65939920 64753427 64246162 64620429 65425839 66617094
8946 66617094 68316452 70581813 73541803 76780054 80925317 85988223 92296724 100198373
8938 100198373 109611092 121133756 134713889 149205696 160988785 167484914 169730241
8931 169730241 170133904 169721253 170504480 171798964 170884441 167272860 163159919 159029709 156003304
8922 156003304 150650435 138215385 124287656 111274721 101416237 94481008 89721465 86607674
8914 86607674 84714440 83710459 83293518 83572360 84402366 85790624 87823070 90369754 93482732
8905 93482732 97594645 102619503 108712446 115771470 124703429 134537246 142684439 146602434
8897 146602434 146801802 145351280 143820642 143981761 146208477 150608614 154957926 157830563
8889 157830563 160438733 164506512 169967889 173099230 169681396 165571587 161408004 157918939
8881 157918939 157500118 159350803 158364025 150699301 142069537 132160563 121902612 113184056
8873 113184056 106183576 101178558 97493710 94548135 92150310 90245559 88860986 87625892
8865 87625892 87043930 86808607 86955876 87442272 88754460 90709343 93549225 97876234 103888331
8856 103888331 111824003 121273650 130695606 138437965 145943518 148288971 146823903 145966638
8848 145966638 145462182 144662458 140964354 131715368 119783597 107789954 95048815 83742967
8840 83742967 74548297 67984585 62790650 58665205 55466737 53263456 51418767 50031205
8832 50031205 48902301 47991250 47259700 46601391 45940417 45596492 45787928 46275627 47457440
8823 47457440 49530392 52655334 56577928 60449054 61486859 60752389 59875776 58624241
8815 58624241 57949026 56425555 52651795 48580971 44252361 39632245 35338365 31932601
8807 31932601 29530662 27721337 26242343 25006695 24171526 23424474 22450582 21525627 20713197
8798 20713197 20174824 19681861 19091916 18811796 18488192 18210574 17977497 17761597 17572771
8789 17572771 17361427 17259562 17003584 16781848 16547704 16226119 16127075 15983449 15513594 15026105
8779 15026105 14875384 14928482 14848616 14698548 14589979 14562538 14414366 14348597 14408785 14321193
8769 14321193 14341982 14245154 14476203 14962440 15318514 15621340 15946484 16301422 16745001 17340366
8759 17340366 17774403 17876785 18085231 18270359 18449911 18345678 18331749 18276822 18120685 18032918
8749 18032918 17700107 17470661 17141422 16610274 16308357 15854994 15480436 15325984 15432375
8740 15432375 15391283 15268271 15539276 15857990 16118826 16600456 16992836 17567364 18401920 19368901
8730 19368901 20265242 21226450 22388710 23711321 25057418 26069985 26799746 27236904 27530238
8721 27530238 27655586 27800921 27917378 28110163 28003500 27786474 27173520 26448581 25659498
8712 25659498 24565944 23344303 22041233 20685393 19354463 18094448 17103104 16432150
8704 16432150 15711669 15059433 14712197 14511979 14382875 14412444 14268111 14390079 14567694 14672316
8694 14672316 14898527 15350682 15633891 15974356 16353609 16424071 16698231 16953171 17169614 17385335
8684 17385335 17538321 17590426 17531208 17316985 16947502 16613195 16150872 15612668 15184319 14937715
8674 14937715 14712718 14437427 14605663 14682714 15019979 15525294 16230735 17052660 18023393 19385145
8664 19385145 20596712 21703245 22534410 23219448 23488094 23467164 23300089 22743020 22389125
8655 22389125 21782928 21061982 20162239 18742065 17303178 16020313 14689474 13313495 12360690
8646 12360690 11589262 10762896 10020227 9519174 9100398 8676020 8554432 8425207 8345267 8457721
8636 8457721 8669495 8828503 8962207 9142841 9606844 10011445 10058740 10283192 10513489 10744084
8626 10744084 10793631 10926880 10959198 10972519 10932679 10685101 10486405 10220538 9598543 8691961
8616 8691961 7911097 7055868 6500171 5861014 5296993 5095170 4757113 4543176 4348279 4080918
8606 4080918 3889361 3705456 3608368 3493385 3615097 3658621 3415537 3193587 3035952 2869801
8596 2869801 2806595 2818655 2667606 2419049 2483116 2394216 2158921 2049131 1938993 1930361 2008827
8585 2008827 2044044 2017207 1916172 1919919 1793892 1736476 1780022 1862092 2010458 1936915 1966459
8574 1966459 2037638 1844010 1852240 1989168 1922134 1968226 1986313 2025133 2185201 2141761 2014144
8563 2014144 2057133 2088510 2069029 2027587 1876338 1777923 1719036 1503566 1586089 1534554 1448926
8552 1448926 1395659 1492301 1453922 1345859 1368501 1420696 1419664 1589685 1621743 1611114 1528556
8541 1528556 1525155 1585644 1608908 1678084 1774446 1856570 1999633 2112892 2077308 2062175 2123042
8530 2123042 2184824 2204156 2174662 2216936 2236535 2079968 2005502 1794713 1649255 1603339 1594918
8519 1594918 1628212 1566644 1710427 1454016 1384501 1373027 1418862 1471825 1340292 1410900 1370997
8508 1370997 1473826 1463903 1496633 1633921 1726195 1760072 1849778 1849574 1970358 2108017 2216543
8497 2216543 2421640 2577978 2763834 3124164 3183566 3312677 3404873 3420632 3404103 3424793
8487 3424793 3374614 3067257 2831684 2703730 2592775 2332791 2044630 1985280 1898536 1744583
8477 1744583 1570125 1425522 1482300 1407446 1316995 1227658 1105840 1093350 1221849 1300411 1376866
8466 1376866 1476057 1462413 1552925 1764446 1734063 1778285 1906165 1926826 2119322 2136038 2301526
8455 2301526 2521659 2500015 2445867 2408805 2461400 2470552 2560185 2592940 2718245 2800064 2662299
8444 2662299 2847848 2797574 2682471 2619652 2575779 2478390 2233371 2204369 2138916 2319664 2172518
8433 2172518 1857828 1780552 1658479 1587891 1430581 1386807 1553521 1431816 1191080 1073356
8423 1073356 1149781 1165319 922629 935837 905542 919560 730704 527643 586183 664779 585287
8412 585287 491557 444647 649617 599518 635516 608847 329849 353798 341644 311472 338882
8401 338882 474585 530847 485637 493045 402219 260125 228946 381268 587469 558952 469252
8390 469252 531535 489525 658919 851219 815141 743034 712088 761296 755970 785122 798786
8379 798786 694592 705365 847118 787140 744710 653926 508405 458762 406544 512954 596755
8368 596755 467131 465501 441022 395090 518066 558951 513638 519070 553514 611188 418963
8357 418963 330922 406368 535989 614971 471472 458528 613578 614020 541087 393233 248547
8346 248547 135094 251587 311021 306126 237424 334935 234550 377654 419604 288414 289121
8335 289121 395698 434032 352743 294086 53163 -30558 142231 270141 324520 330741 276949
8324 276949 246781 307179 395142 372304 168364 34739 145110 283937 301923 340784 296024
8313 296024 168321 176793 198174 160977 192825 309717 336530 277745 367043 463065 483073
8302 483073 436440 308769 392647 482419 459589 374551 447470 420219 558963 639628 562885
8291 562885 516552 592922 524784 439661 590098 619628 630394 608459 628802 804199 675471
8280 675471 652261 632686 566844 563517 873770 891988 924962 1016071 1049670 948344 949853 1086588
8268 1086588 1202774 1396180 1568014 1807407 2022525 2175675 2335471 2548239 2559198 2608253
8258 2608253 2406055 2172825 2046878 1862258 1464298 1380140 1319016 1116438 1038547 1101528
8248 1101528 1105226 1098145 908029 863529 832342 796620 928200 793422 820240 729766 784572
8237 784572 932985 1023741 914119 979654 934492 985390 1127890 1136304 1082736 957859 889621
8226 889621 966478 932406 856122 662864 599164 882589 868852 909020 1056240 1110598 1149024
8215 1149024 1164633 962413 1034198 1000792 1164208 1184506 1304916 1234534 1278368 1407154 1568596
8204 1568596 1579387 1550632 1591937 1673620 1720768 1927783 1965019 2038064 2016804 2263184 2293694
8193 2293694 3073928 3563106 1790216 1649056 1680877 1706536 1816406 1773639 1825037 1935974
8183 1935974 1887407 2088090 2097386 2045720 2172000 2230070 2343860 2340752 2416391 2577657 2686962
8172 2686962 2651106 2817067 2931104 2979085 3120086 3229107 3500778 3552963 3669878 3950924
8162 3950924 3972971 4351447 4704479 4776318 4970975 5392776 5753472 6351052 6914467 7293310
8152 7293310 8014670 8692745 9449563 10512114 11604880 12716604 14119965 16063349 18009176
8143 18009176 20005955 21969789 23848057 25377726 26571243 27277364 27388440 26826522 25662676
8134 25662676 24154010 22358563 20251562 18148669 15860891 13876888 12193334 10674200
8126 10674200 9392971 8491538 7616410 6810855 6200176 5404382 4935883 4752503 4341354
8117 4341354 3894920 3538852 3202086 3085317 3069311 2948394 2707081 2574335 2368211 2220730
8107 2220730 2063108 1848602 1659279 1468929 1411202 1401239 1400437 1440442 1443799 1428441 1362039
8096 1362039 1280760 1105328 1010400 1060192 912448 941724 1072883 934107 807541 788909
8086 788909 740571 880000 838761 890772 760887 840687 833998 727350 772672 701814 990080
8075 990080 939695 846478 885941 917218 918484 850214 797969 855383 653194 705240 570750
8064 570750 635803 504668 420781 637174 579640 512409 596882 585872 679566 649342 612017
8053 612017 755056 828217 810466 777122 792470 728069 654587 612751 530268 665338 555088
8042 555088 593032 835410 895237 987143 907034 1197202 1353108 1518265 1723480 1962118
8032 1962118 2109920 2136913 2128142 2093406 2115240 2073938 1584851 1418825 1413018 1262147 966183
8021 966183 786319 763064 659542 636103 534337 553763 678358 588474 541548 679715 764640
8010 764640 865512 870950 1048819 1003547 888096 866534 671273 667688 691200 491236 549166
7999 549166 535061 532249 536172 493138 674235 850672 879488 822320 650973 577973 346277
7988 346277 275600 418256 512238 660154 669401 754037 736660 620487 822673 1003835 977739
7977 977739 975015 1048578 1161458 1171057 1115074 1029418 1070606 1246614 1106887 959785 992629
7966 992629 732985 652223 651413 531368 397578 505733 501570 584903 543967 422948 379562
7955 379562 379212 469520 529429 417829 387103 441430 522393 607896 699922 510847 480907 540217
7943 540217 439143 433235 395476 381772 286670 326024 466548 476877 579267 690265 946510
7932 946510 983402 1140676 1256614 1096059 1098262 1160498 1188537 948550 752611 772625 879978
7921 879978 638872 424716 504317 519328 547264 544400 622448 625571 671239 663906 513368 559398
7909 559398 412390 209658 257255 397113 328853 202979 129910 168652 56005 204507
7899 204507 256796 316041 48168 -6176 54484 -42594 -124692 19821 141021 95719 4934
7888 4934 81995 118527 137184 140129 254995 311191 544376 476049 291971 235955 170750 192717
7876 192717 96586 77787 57630 59981 -128400 -119638 -104064 -29130 35333 73431 2257 -154815
7864 -154815 -151105 -28711 34374 174963 -50642 42631 46063 58673 166168 21928 38279
7853 38279 281798 328475 413874 548008 681609 472166 549181 565962 416787 460186 224450
7842 224450 223000 68034 -165229 -60046 43588 72940 85447 83303 123135 89457 75793
7831 75793 61155 139092 268323 194169 235679 145165 167070 118493 63432 151213 256724
7820 256724 353697 246928 225658 74965 76787 211373 253335 203895 369393 328655 388242
7809 388242 465686 538569 598973 903786 989291 936997 806970 727312 1144138 1343489 1404242
7798 1404242 1265216 1294107 1064697 929891 1008307 947958 916209 978714 1000060 1126017 1157405
7787 1157405 1163886 1354181 1442304 1491351 1475205 1457963 1638582 1787244 2013247 2261212 2316805
7776 2316805 2411488 2445472 2480041 2352768 2188456 2130649 2071355 2099100 2211286 2043523 2139862
7765 2139862 2218202 2262560 2288973 2190266 2112955 2275708 2270337 2184491 2162164 2180816 2193911
7754 2193911 2057276 1700145 1694145 1689503 1590384 1541900 1563989 1381639 1229134 1276820 1179924
7743 1179924 1176822 1011778 787153 677765 686577 517943 566198 678397 749291 823986 753016
7732 753016 845998 827655 730016 1032018 1096381 1069179 939286 991509 829809 834050 880081
7721 880081 685953 555062 664511 602321 650068 533145 434685 576069 583653 659113 559204
7710 559204 514253 623391 615927 625173 690191 733856 908837 1014963 969988 932855 1040541
7699 1040541 1141780 1114896 1211197 1228822 1243136 1370638 1457968 1410317 1327177 1205989 1230971
7688 1230971 1269765 1188242 1382929 1256067 1098980 1075358 1211748 1120237 1155213 1133832 1078195
7677 1078195 1092105 1080702 974015 924811 886255 719363 718384 720979 789151 676077 406622
7666 406622 402005 642196 521094 531648 721599 785150 818973 828801 1002702 1087659 1073224
7655 1073224 987148 1100467 1296788 1305264 1344486 1223187 1268156 1137686 902931 1075216
7645 1075216 1233361 1338724 1523304 1821520 1989699 1712061 1375918 1172243 1213327 1248757
7635 1248757 1274348 1213462 1162781 1025830 1080590 1220343 1185771 1298068 1349694 1490440 1377514
7624 1377514 1353899 1369088 1348835 1235644 1297231 1241884 1036374 1096612 1053711 950760 982700
7613 982700 893908 868044 903710 1104885 1020631 866857 792688 733695 731355 689758 830247
7602 830247 612307 492579 470456 555364 718789 902018 973235 952376 1001017 1082915 1077183
7591 1077183 1235667 1431535 1540558 1622802 1632445 1690802 1564680 1477357 1409143 1308305 1234083
7580 1234083 1292982 1431385 1476259 1432796 1420246 1334122 1380427 1531275 1527615 1527845 1536840 1506395
7568 1506395 1585348 1451009 1320218 1337874 1430367 1371267 1445859 1572645 1665420 1562682 1377286
7557 1377286 1225809 1047978 893837 850202 722962 685368 671974 538511 566090 657328
7547 657328 729707 725392 806209 823558 749934 532190 494329 467262 391643 552499 588621
7536 588621 509624 546889 518980 447845 436739 422072 335558 440592 392483 594256 597453
7525 597453 485971 518085 507993 368763 450904 427103 358808 353457 540861 435742 352532
7514 352532 476139 605930 665359 701818 685523 607437 644580 689788 743837 817461 979443
7503 979443 1084098 1136656 935515 769750 674117 898768 1130001 1147213 1282333 1377660
7493 1377660 1518139 1655464 1770176 1657124 1513414 1449771 1453397 1390827 1471656 1495508 1410358
7482 1410358 1739243 1758793 1665179 1601870 1512953 1418759 1249415 1189606 1250617 1254573 1191167
7471 1191167 1295463 1438980 1356700 1579917 1783783 1872411 2045809 2230390 2547744 3084658
7461 3084658 3443984 3604246 3611936 3396589 3152381 2695575 2181349 1943880 1771702 1655665
7451 1655665 1540279 1596516 1632564 1589554 1520887 1490679 1560926 1675224 1774362 1981305 1986812
7440 1986812 1829528 1945057 2184869 2171428 2431978 2721626 3062502 3503095 3979091 4460014
7430 4460014 4454629 3983485 3652448 3161577 2733148 2414610 2020827 1688084 1573885 1586912
7420 1586912 1527619 1585818 1489286 1408126 1299274 1106719 952000 883355 789925 916270 941720
7409 941720 806744 780340 683787 827233 755109 683273 796312 684736 674121 609188 754067
7398 754067 768302 588150 527735 555220 521330 678169 751028 711262 611343 627523 498851
7387 498851 536719 664093 642403 787153 973204 1138105 1192278 1173176 974741 1020065 955638
7376 955638 779025 806009 977056 1054503 1196985 1242231 990198 960964 1002604 1019452 948379
7365 948379 959977 953235 751828 726669 591171 621435 774219 863675 795878 604718 631563
7354 631563 687824 638950 574801 773575 677512 686497 620161 621899 393555 301876 419094
7343 419094 480640 552279 445666 511608 487613 321415 265544 247134 243221 245982 128188
7332 128188 113295 97213 219121 353043 342397 288404 179935 325206 254380 346123 352165
7321 352165 346975 454176 401336 145551 290905 422614 333482 255352 240557 186067 48166
7310 48166 -32778 1794 121860 -24108 -37018 -183849 -209644 -96564 35176 3161 -6783
7299 -6783 57460 66416 -158265 -170077 -37102 -14667 -107686 43452 -3187 68601 -29745 -181258
7287 -181258 -115431 -42835 -20412 34371 127786 172183 199714 106759 54066 -56752 17651
7276 17651 -120711 -46834 32047 -205434 -135449 100342 224513 37968 21265 79219 203950
7265 203950 37576 -52633 -13892 86406 155651 59735 75092 162547 211056 87660 1271
7254 1271 -237 67253 177419 177233 74133 104392 372310 247385 113076 80743 193137
7243 193137 150554 393454 408985 134967 368445 312046 389187 340447 453940 397097 259031
7232 259031 366445 391238 237502 171183 209846 324360 301102 425976 461086 450880 542940
7221 542940 624522 754981 794347 862651 830474 899243 1147350 1326986 1197818 1337506 1477518
7210 1477518 1496312 1694637 1997533 1964054 2166119 2294312 2320035 2488540 2593677 2783303
7200 2783303 2802168 2773072 2613601 2708928 2581738 2566017 2485739 2487315 2269098 2271183 2153910
7189 2153910 1867940 1827871 1808489 1572053 1416638 1424770 1120179 1067254 1160585 1129822 1193071
7178 1193071 1076794 1030626 951434 910055 952075 948115 886380 1071906 1387797 1342244 1434356
7167 1434356 1460152 1472518 1256454 1133993 1234994 1072079 967921 1038801 974656 1084906
7157 1084906 1234857 1473039 1563414 1604408 1716337 1711989 1780951 1753098 1931602 2088257 2153421
7146 2153421 2266992 2260563 2344304 2536566 2509765 2477049 2449950 2489771 2408499 2199144 2208671
7135 2208671 2265040 2550608 2501582 2441599 2617397 2619218 2456560 2529677 2481368 2180808 2002606
7124 2002606 1964717 1849652 1932908 1911910 1651988 1527790 1366784 1281286 1101476 1060062
7114 1060062 973490 994189 990048 930554 1080346 1035611 1120844 1297101 1302129 1128544 1041780
7103 1041780 1124021 1141889 1223363 1254670 1338232 1436897 1465877 1553562 1662179 1630278 1624035
7092 1624035 1970946 2179998 2095610 2150347 2083974 1828717 1707060 1607661 1637435 1454660
7082 1454660 1436262 1266769 1152612 1159768 1270556 1304090 1066350 877495 858975 903833 770608
7071 770608 833676 898283 830199 835235 888720 822886 757731 915600 901824 923300 1020495 961786
7059 961786 896079 800817 762110 804089 772611 771136 844445 912470 886036 1018545 1166582
7048 1166582 1196027 1362266 1339666 1054774 1060487 1150396 1170254 1125053 919602 860239 865268
7037 865268 1014989 885516 929556 1117489 1125920 981995 982120 1016997 1048733 883179 853040
7026 853040 1143479 1293519 1349714 1356425 1151673 1169028 1220590 1096440 1271361 1343477 1240279
7015 1240279 1483925 1599597 1653349 1765064 2008131 2156180 2448491 2647617 2839432 3148141
7005 3148141 3243321 2991312 2820333 2751149 2697991 2566018 2575912 2491222 2422167 2906248 3089363
6994 3089363 2934137 2716232 2479504 2166381 2090089 1719634 1520433 1308015 1008994 1020184
6984 1020184 1101156 1086290 1057509 913190 941942 1112245 1094349 997829 981502 960220 1015608
6973 1015608 951055 904112 857840 779731 966897 1005524 990741 1022322 1172275 1172550 1145401
6962 1145401 1107852 1034794 1148280 1123134 1152829 1078855 1135466 1207573 1081537 942841 974507
6951 974507 932283 1025183 1277553 1327837 1272765 1189155 1147557 1111136 1213882 1354651 1380877
6940 1380877 1435463 1419052 1542299 1668649 1681422 1615404 1596038 1699430 1705940 1705528 1710525 1703109
6928 1703109 1708050 1789618 1892871 1958296 1898383 1969553 2006716 2172779 2208686 2315291 2418087
6917 2418087 2688760 2953097 3027806 3252850 3411151 3523296 3543371 3801140 3862171 4282172
6907 4282172 4514821 4620769 4736183 4712549 4730861 4590404 4493348 4537959 4447744 4234860
6897 4234860 4135779 3993480 3752709 3664839 3653456 3281092 3248883 3229607 3173325 3087982 3137860
6886 3137860 2916379 2848193 2848847 2787584 2608982 2479462 2481441 2615687 2680439 2662718 2680816
6875 2680816 2619078 2436151 2260224 2408881 2483733 2513470 2528701 2618175 2631500 2614395 2700874
6864 2700874 2627263 2520568 2554700 2565299 2696651 2597940 2770611 2737733 2633560 2573507 2660038
6853 2660038 2778266 2809170 2869183 2977506 3059387 2907665 2811925 3096598 3418319 3298694
6843 3298694 3259440 3205497 3181092 3278878 3236211 3399729 3518455 3384181 3409300 3339029 3297969
6832 3297969 3232906 3515936 3451843 3437847 3447924 3503068 3533787 3559409 3676752 3607296 3688248
6821 3688248 3737662 3877128 3803982 3747549 3981177 4104470 4058232 4115673 4224849 4338413
6811 4338413 4221969 4218637 4392356 4622565 4704694 4699623 4710633 4843806 4934480 4974043 5014949
6800 5014949 4967350 4984301 5127853 5298416 5401143 5579225 5922692 5983346 6157493 6200698
6790 6200698 6161245 6244946 6460470 6605927 6855082 6912318 7026039 7363696 7632733 7829984
6780 7829984 8092770 8409390 8630340 8851158 9143904 9441747 9930402 10219888 10476064 11012271
6770 11012271 11382142 11627230 11840760 12290518 12766387 13118746 13231214 13794761 14154062
6761 14154062 14505055 14906849 15222782 15429325 15756178 16439382 16889490 17176439 17387554
6752 17387554 17917382 18250988 18674551 19145511 19387774 19863735 20468584 21003694 21492812
6743 21492812 21776954 22045218 22676447 23120927 23699708 24217266 24893485 25437606 26178021
6734 26178021 26800893 27656317 28600610 29343689 30149312 31381101 32472871 33594866 34761694
6725 34761694 35995857 37231786 38436051 39788167 41162713 42509005 43824013 45488064
6717 45488064 47039405 48328120 49944134 51964283 53779856 55866618 58040039 60384532
6709 60384532 62820131 65518218 68459748 71568613 75004078 78783217 83097939 87874867
6701 87874867 93513834 100115512 107271310 115495703 124513754 134831466 146962833 161587220
6693 161587220 179683881 202497720 230670921 265518241 308707943 359981001 414995367
6686 414995367 455889991 458274560 425641428 381427463 343269743 320009010 312130625
6679 312130625 318087121 336604356 366031864 403475093 436520454 438833964 400690791
6672 400690791 341299760 281706712 232206033 194564791 166490877 145128298 128272253
6665 128272253 114338339 102301524 92040727 83572435 76896300 71333956 66817821 62926462
6657 62926462 59463663 56176956 52982040 50066302 47274117 44346334 41876946 39608567
6649 39608567 37674341 36016592 34411370 33122739 31863592 30341127 29051689 27840303
6641 27840303 26815444 25695832 24728745 24020903 23168480 22354594 21561034 20870246 20159806
6632 20159806 19731935 19019946 18433725 17858131 17156855 16401267 15655919 14920489 14265863
6623 14265863 13560527 12951588 12394036 11908019 11264334 10745347 10309287 9825918 9386344
6614 9386344 9052760 8865570 8651215 8340112 8183027 7775502 7661396 7410689 7110490 6827483
6604 6827483 6550814 6383791 6178046 6053531 6090582 6082511 5953057 5716405 5428943 5309305
6594 5309305 5301132 5147893 4928974 4865645 4803442 4788330 4697070 4705236 4661980 4603735 4434527
6583 4434527 4464005 4488503 4304529 4265903 4210857 4137608 4224482 4189731 4251168 4118402 3898576
6572 3898576 3794631 3588667 3377498 3469970 3455652 3294258 3201795 3166620 3210360 3194858 3071442
6561 3071442 3044121 2832506 2797970 2726518 2624327 2713012 2797012 2730393 2661311 2649335 2730057
6550 2730057 2485941 2262596 2343488 2339049 2404517 2522834 2441467 2314021 2249852 2177228 2122348
6539 2122348 2273582 2144354 2034078 2109098 2084495 2128843 1958180 1933687 2127109 1914418
6529 1914418 1955012 1875706 1680082 1803159 1830411 1791476 1835160 1755013 1656633 1855276 1887892
6518 1887892 1772768 1714800 1755661 1858025 1798848 1638649 1622366 1703739 1846305 1884075 1766480
6507 1766480 1692612 1838659 1920079 1825990 1772204 1792565 1653064 1775009 1741461 1668948 1542122
6496 1542122 1469559 1596250 1497418 1546502 1595177 1577684 1676071 1690466 1766937 1830848 1945506
6485 1945506 2170429 2147576 2112268 2205195 2293707 2373233 2333867 2288341 2258353 2344580 2208987
6474 2208987 2093763 2115169 2208224 1986219 1930371 2066486 2118632 1960100 1723319 1665935
6464 1665935 1591446 1520705 1545899 1651608 1542686 1387445 1249445 1298968 1322261 1259337 1259248
6453 1259248 1061442 1025028 1094117 1067672 1103871 1123369 1060947 942106 868723 875142 953870
6442 953870 1000607 1008160 969160 796055 822997 1086652 918476 865380 788060 893671 841165
6431 841165 837735 730640 684639 729762 815611 895688 853997 855797 784514 731391 770039 879204
6419 879204 622675 625302 747245 692336 649137 702816 443942 385906 633511 679556 420373
6408 420373 468699 598565 592757 486510 456554 472302 362346 397036 396459 312286 135588
6397 135588 171498 362362 277604 163900 60296 166785 175435 238584 171548 324115 296303
6386 296303 246585 261028 126286 250672 328447 383662 434194 457510 467806 463113 434811
6375 434811 358026 476170 488637 643496 551398 557035 860527 942188 1238039 1324740 1548108
6364 1548108 1952422 2225020 2261808 2153009 1838269 1799510 1573400 1474594 1551170 1608792
6354 1608792 1806193 1935893 2080202 2347800 2035767 1633862 1384026 1070693 990073 992840
6344 992840 857619 734545 443805 493659 454729 178245 173392 262649 210713 192971 58500
6333 58500 4549 65614 64217 25274 -46873 -51812 6246 -2546 -221098 -146887 -47461 -133866
6321 -133866 -189944 -85401 -27508 11590 -36308 -306490 -361793 -132445 -202458 -371204 -371755
6310 -371755 -330778 -343684 -610904 -406094 -320005 -367375 -224778 -175290 -191531 -169680 -262515
6299 -262515 -453033 -539716 -648410 -576877 -499754 -423487 -370278 -448414 -398004 -401042 -584416
6288 -584416 -385480 -252953 -211774 -225707 -194319 -273128 -206165 -182989 -225758 -257452 -330987
6277 -330987 -295959 -276841 -196408 -242325 -340849 -506863 -350486 -454995 -585265 -353912 -370550
6266 -370550 -492895 -459927 -427489 -436688 -554252 -503470 -526183 -536278 -427400 -368732 -345959
6255 -345959 -382290 -434110 -475780 -480156 -621416 -489229 -553883 -637038 -631620 -543354 -385908
6244 -385908 -269722 -341028 -425106 -473263 -423762 -307663 -174010 -170032 -190538 -424577 -530357
6233 -530357 -615308 -452123 -380955 -361794 -477320 -423603 -400141 -486229 -324125 -375258 -227560
6222 -227560 -296927 -456196 -289957 -128633 -317670 -249543 -123581 -45379 -182635 -234991
6212 -234991 -287292 -316000 -288831 -269343 -243066 -227491 -120849 -212048 -210461 -72139 -148396
6201 -148396 -266675 -184935 -87044 -216032 -291238 -275690 -223405 -156124 -383954 -351166 -335522
6190 -335522 -254701 -300228 -307776 -345607 -584278 -583542 -342714 -290191 -295023 -213766 -257961 -412876
6178 -412876 -397174 -518118 -620135 -359737 -421023 -390883 -369992 -402370 -344767 -395317 -302327
6167 -302327 -204207 -378679 -405692 -487806 -532267 -598900 -662653 -573599 -529088 -535519 -392907
6156 -392907 -337896 -375967 -268222 -458485 -695995 -499893 -415151 -447594 -354687 -228468 -364658
6145 -364658 -550130 -594469 -398997 -416506 -418040 -267771 -293199 -403320 -458462 -474342 -392105
6134 -392105 -402583 -311255 -381961 -444113 -335300 -396836 -445396 -320197 -389195 -583004 -659799
6123 -659799 -549491 -345655 -363912 -429866 -386887 -340416 -436406 -378282 -505355 -570788 -546704
6112 -546704 -537344 -558522 -470986 -554295 -564747 -402412 -486727 -427587 -428387 -547921 -546673 -492734
6100 -492734 -465914 -476469 -560897 -491775 -236812 -320909 -371826 -434006 -607467 -576784 -435397
6089 -435397 -410415 -529650 -491756 -431180 -497632 -664246 -561800 -475323 -405260 -438155 -314506
6078 -314506 -458004 -417859 -366780 -397204 -402935 -473116 -277331 -311285 -429076 -450745 -395631
6067 -395631 -383440 -382351 -471307 -422275 -399340 -358194 -235664 -152861 -116806 -143208 -300045
6056 -300045 -334477 -317826 -339971 -359505 -286460 -416140 -420742 -351889 -288252 -173242 -192009
6045 -192009 -394157 -325180 -345715 -383943 -283547 -334370 -479295 -378978 -390980 -391616 -171961
6034 -171961 -164967 -261960 -324381 -387444 -318189 -122907 -185694 -189666 -218696 -367215 -323756 -375592
6022 -375592 -333407 -304849 -462763 -520456 -389006 -237945 -328393 -283111 -249198 -423116 -485865
6011 -485865 -463641 -536635 -445408 -269973 -397628 -546625 -480894 -501813 -457336 -416095 -556718
6000 -556718 -335502 -145751 -353588 -419755 -373502 -433710 -462159 -427303 -321052 -390332 -454841
5989 -454841 -391793 -390951 -383688 -485267 -395126 -398631 -332551 -293507 -442197 -415909 -320463 -334262
5977 -334262 -391062 -399061 -412122 -544988 -504012 -506091 -411188 -371825 -478406 -558772 -505994 -399171
5965 -399171 -472670 -484688 -444727 -489208 -533656 -531971 -630737 -643115 -445668 -430446 -484288 -304782
5953 -304782 -395091 -457731 -354582 -298458 -200305 -272699 -403244 -328813 -391771 -421123 -511719
5942 -511719 -613190 -561841 -612740 -451917 -428529 -365025 -300090 -206740 -230594 -174006 -434676
5931 -434676 -521847 -241902 -257197 -353425 -512577 -355125 -353263 -323688 -318192 -262156 -430807
5920 -430807 -480888 -281923 -338649 -425268 -290726 -377058 -373284 -373376 -232654 -187759 -295960 -264152
5908 -264152 -433108 -512787 -619393 -555698 -479416 -417441 -339637 -337747 -224720 -180118 -264913
5897 -264913 -345575 -366506 -387514 -399197 -452264 -412933 -394762 -470773 -371356 -467959 -427276 -476013
5885 -476013 -438374 -350008 -327127 -474798 -486928 -441044 -429581 -408377 -429504 -419917 -479945 -450303
5873 -450303 -360749 -143234 -172244 -81707 -256969 -319027 -163818 -225930 -331222 -407574 -341350
5862 -341350 -344340 -348130 -336681 -324830 -296540 -343533 -268716 -191629 -324639 -178221 -191675 -329332
5850 -329332 -342393 -388010 -424150 -497579 -454901 -383353 -396965 -466285 -558593 -458039 -234155
5839 -234155 -197084 -258188 -291835 -418338 -394750 -120495 -105431 -320424 -460974 -412981 -269477
5828 -269477 -233538 -179120 -90954 -127901 -231378 -315770 -295967 -267829 -358540 -184689 -214033
5817 -214033 -280110 -223433 -236218 -372126 -331875 -271178 -126911 -143430 -316670 -353169 -300339
5806 -300339 -300324 -258068 -92002 -260002 -325289 4779 24385 -64275 -120389 -173673 8856
5795 8856 -51960 -162823 -147474 12043 -81912 46654 28869 79013 147775 6614 169718
5784 169718 166209 301477 278454 218475 228833 129855 149961 77641 92211 190793 169895 121335
5772 121335 -16101 -126102 -14659 -157049 -84505 -16230 -25074 14959 94173 80035 23325
5761 23325 -91772 -21718 7153 32047 15396 -97710 -26273 8558 173964 256435 56527
5750 56527 121952 95784 32625 85315 70623 -27480 125834 50737 32925 4828 12864 15603
5738 15603 52790 109109 69491 -15767 -176384 -58504 72758 -220135 -267373 -54122 -48842
5727 -48842 -218259 -202681 42055 -227588 -239335 -183433 106198 130109 86534 170369 132932
5716 132932 141652 202475 -24176 32063 112584 7965 -649 -16651 -170051 146721 124687
5705 124687 93465 66597 33915 40727 135630 298229 141611 228956 85531 102893 89188
5694 89188 154336 221545 320432 253882 268686 344424 192777 356251 198797 198190 227452 286171
5682 286171 248542 355300 369376 241855 263234 315169 400510 231612 222242 92874 71188
5671 71188 193720 372410 383657 402894 304030 328359 158627 15752 144289 225236 220883
5660 220883 248629 296297 231978 317623 306740 394992 346982 439829 344240 377926 616571
5649 616571 636460 700952 681112 666976 701688 725016 647250 550911 587747 704982 571436
5638 571436 682535 610595 442793 421610 635872 745907 663008 675538 662227 798301 883101
5627 883101 1008539 1141070 1132488 1047187 1064067 1028916 1033142 1160883 1086419 962274 933168
5616 933168 766569 728758 713722 429451 520403 620719 556295 563676 476352 704224 798319
5605 798319 748504 612029 568761 582218 605159 617586 574197 511299 451455 477637 475638 469678
5593 469678 576719 666342 644453 466118 503383 438054 400219 391568 354031 273956 229379
5582 229379 481785 468033 669936 649973 599778 699657 787126 725488 759715 748473 704813
5571 704813 1021126 1102601 1100673 1179217 1217012 1362864 1292532 1206560 1207530 1205833 1266730 1341729
5559 1341729 1436999 1329115 1357469 1381346 1394850 1399527 1380517 1314742 1316721 1348755 1422702 1342275
5547 1342275 1204816 1264174 1331973 1472952 1533507 1720053 1753833 1835759 1690610 1663398 1679469
5536 1679469 1695177 1854988 1904905 1981595 1937263 2000462 1964738 1843483 1917216 1957890 1969037
5525 1969037 1871508 1895054 1831161 1861415 1863570 1765140 1638287 1807155 1817480 1744684 1794850
5514 1794850 1850811 1908967 1887231 1920729 2102485 2081385 2019891 1982995 1881814 1874037 1966745
5503 1966745 2057732 2233054 2302291 2287636 2201936 2153112 1973867 1992555 1978031 1943362 2035651
5492 2035651 1935194 2161554 2205521 2043249 1997341 2303503 2355345 2485335 2528933 2675852
5482 2675852 2685893 2525561 2447748 2569890 2535433 2525367 2244752 2221080 2250724 2332143 2309498
5471 2309498 2322696 2557067 2703302 2762557 2629709 2546941 2455836 2296195 2160707 2360889
5461 2360889 2338637 2209112 2034716 1912570 2127998 2322574 2503823 2581170 2630373 2896810
5451 2896810 3026887 3106279 3337702 3405767 3422197 3337075 3407338 3368344 3378499 3354028 3416118
5440 3416118 3489866 3621541 3629346 3543573 3634980 3538444 3649739 3610337 3895076 4208969 4429660
5429 4429660 4679648 4825989 5321194 5542003 5581622 5342358 5072347 4864492 4696241 4475771
5419 4475771 4032016 3877242 3824312 3546107 3314004 2999464 2788590 2734453 2529132 2384389
5409 2384389 2503167 2404768 2128981 2070628 1994459 1976590 1860194 1758712 1677946 1797944
5399 1797944 1701801 1812911 1793342 1685847 1526615 1531965 1573458 1563812 1703282 1612564 1627219
5388 1627219 1641502 1593839 1560148 1558546 1688890 1734446 1847552 1726629 1784357 1785756 1679675
5377 1679675 1816179 1883328 1890748 1870610 1745630 1656630 1610023 1576357 1779912 1732668 1571855
5366 1571855 1561190 1503818 1613521 1484841 1511838 1644535 1494808 1267559 1336500 1533921
5356 1533921 1563993 1484529 1431726 1376680 1371127 1449116 1458727 1397964 1467626 1545849 1626745 1660119
5344 1660119 1535387 1594053 1591018 1557673 1491574 1569063 1407057 1314752 1444535 1550793 1527312
5333 1527312 1492083 1502387 1568377 1610606 1766096 1633024 1554377 1588179 1514543 1473149 1523768
5322 1523768 1557408 1584586 1664867 1608024 1658367 1662267 1563006 1706636 1761178 1695951 1819487
5311 1819487 1732221 1853961 1983267 1994731 1824797 1754981 1883729 1856357 1841990 2033280
5301 2033280 1913619 2085924 2184660 2230950 2275639 2155929 2255915 2347080 2357166 2392769 2371730
5290 2371730 2470448 2591946 2543402 2641617 2611878 2755324 2863231 3028729 3091385 2976432
5280 2976432 2940244 2910898 3023356 3052283 3068288 3160755 3367739 3533517 3444329 3478740 3475237
5269 3475237 3519217 3428783 3565153 3601327 3697606 3797170 3882607 3967138 4129147 4219299 4532853
5258 4532853 4595337 4479240 4567584 4667695 4774740 4835252 4897930 4854883 4915209 5105510 5301283
5247 5301283 5331493 5417928 5513119 5535201 5571794 5641828 5696589 5892822 5805627 5827859 6020412
5236 6020412 5989682 6091455 6261222 6296987 6307008 6380370 6561152 6753320 6921652 6989408
5226 6989408 7203681 7282849 7312926 7514307 7825030 7867763 8096715 8173807 8151984 8201688 8343230
5215 8343230 8513572 8528195 8712098 8871305 9000352 9196451 9311631 9215475 9515584 9691527
5205 9691527 9684386 9884781 10032957 10198857 10277243 10327230 10466970 10523985 10637927 10709531 10784471
5194 10784471 10795704 10896238 11108139 11199628 11259164 11417656 11612446 11780752 11840414 11940207
5184 11940207 11977868 12047462 12160630 12068994 12160318 12289137 12295601 12306898 12309886 12315884 12144095
5173 12144095 12034138 11962409 11761666 11755033 11902755 11957095 11960920 11993399 11822049 11819812 11825813
5162 11825813 11896830 12045313 11946364 11824469 11903198 11969077 11903198 11902254 11877206 11796362 11681693
5151 11681693 11711658 11584035 11416777 11519010 11572044 11451334 11489028 11549817 11515710 11501902
5141 11501902 11441270 11343525 11413932 11468623 11401652 11425746 11440573 11524610 11491240 11534087 11631927
5130 11631927 11375573 11444840 11461873 11490247 11548622 11441929 11381873 11374406 11468645 11505512 11365834
5119 11365834 11213301 11476007 11546476 11652348 11539779 11454471 11666056 11811120 11930395 11977500
5109 11977500 12189532 12265097 12244224 12405724 12393414 12480854 12600551 12612115 12500158 12432273
5099 12432273 12437537 12604514 12660282 12681707 12701265 12589790 12709093 12870329 12661643 12514539
5089 12514539 12630575 12714009 12623441 12540347 12645937 12837420 12782507 12525907 12481011 12556820
5079 12556820 12454629 12446427 12482846 12487121 12579856 12381487 12416386 12532966 12430249 12344283 12199080
5068 12199080 12302380 12438657 12346663 12266817 12284854 12387937 12285669 12184596 12250446 12343432
5058 12343432 12439195 12537665 12505069 12444095 12397523 12398824 12407038 12383175 12295358 12479760 12546522
5047 12546522 12676306 12677973 12534701 12525634 12439005 12501098 12719799 12595875 12430983 12530812 12671364
5036 12671364 12718307 12765801 12788434 12825053 13047602 13160596 13050516 13037280 13395641 13567605
5026 13567605 13560302 13482927 13597218 13832596 13927271 14079407 14148809 14105878 14481359 14724233
5016 14724233 14885916 15083733 15140034 15333835 15552747 15717436 15941332 16292982 16504859 16588859
5006 16588859 16818870 17185052 17423940 17821412 18317641 18766165 19272984 19608233 19942256
4997 19942256 20354980 20451097 20769663 21434809 21930792 22391241 22821702 23458001 24143725 24484783
4987 24484783 24950387 25196954 25404077 25965788 26612569 27009592 27537094 28241252 28976543
4978 28976543 29696291 30301092 30920173 31546674 32363874 33169220 33833037 34496153 35117573
4969 35117573 35923193 36835666 37826127 38784868 39665482 40649404 41681763 42420811 43432059
4960 43432059 44615600 45648381 46812615 47895387 49246971 50537894 51943680 53346395
4952 53346395 54624835 56050518 57678457 59339553 61059880 62884143 64722041 66523137
4944 66523137 68506557 70716800 73082792 75654354 78391321 81222482 84312775 87651022
4936 87651022 91229020 95186594 99311825 103892908 108895310 114155429 119881398 125948669
4928 125948669 132395441 139526473 147034637 155042044 163613567 172712356 181866346 190604549
4920 190604549 198372928 205174224 211176501 216608121 221699462 226427195 230689491 234099198
4912 234099198 237066814 239479182 242363765 246003920 250684534 256543706 263695286 272615778
4904 272615778 283869607 297750803 314358749 333248158 353642961 374113147 392605127
4897 392605127 407399515 417350267 422378500 423498212 421548133 416482748 408684179 399330557
4889 399330557 389495358 380191432 371731010 364001888 357470109 351994824 348088769 346789054
4881 346789054 348282748 351882797 356803053 362543340 368916929 375956768 384152238 393443894
4873 393443894 402706718 410324494 415765080 418186109 416599110 409961760 398011775 381953124
4865 381953124 362942428 342383486 321894493 302522268 285739983 272132305 261234061
4858 261234061 252717196 246122971 240639451 236241258 232944758 230044760 226942150 223274957
4850 223274957 218494166 213161700 207619125 201518805 194605772 186120278 176459256 165931191
4842 165931191 155431627 145003291 135160631 126030302 117689947 110070573 102944896 96365105
4834 96365105 90243252 84681808 79770807 75351681 71520291 67941379 64674602 62086509
4826 62086509 59638722 57327392 55036546 53143869 51264636 49444413 47860073 46176557
4818 46176557 44570684 43271580 42058186 40806364 39709210 38652412 37636404 36588956
4810 36588956 35651047 34753738 33927633 33283649 32592035 31886547 31340750 30964654 30351988
4801 30351988 29732788 29007879 28374222 27903247 27449507 26934146 26300688 25750788 25206294
4792 25206294 24787956 24156881 23668197 23315328 22864931 22348155 21860311 21627342 21230152
4783 21230152 20818397 20222037 19617774 19280226 19075553 18840199 18528729 18153507 17904668
4774 17904668 17519071 17274584 16930742 16905669 16565938 16209523 15970421 15697423 15569073 15286148
4764 15286148 14997164 14793146 14663744 14238027 13995667 13745516 13368892 13141463 13163983 12997012
4754 12997012 12838595 12514246 12283063 12176140 12064172 11838324 11613849 11373437 11268935
4745 11268935 11112559 10965034 10830764 10494622 10435835 10508313 10493694 10322158 10115861 9909470
4735 9909470 9677691 9620862 9397135 9284113 9189935 9100979 9012253 9010406 8978982 8957589 8765049
4724 8765049 8560338 8549636 8497021 8547762 8469343 8265709 8061876 7949777 7906518 7874850 7916022
4713 7916022 7951342 7744031 7764840 7769926 7600876 7651873 7512400 7440131 7488235 7344388 7409348
4702 7409348 7288053 7354569 7282591 7216010 7392885 7443848 7360900 7246388 7154447 7002695 7163467
4691 7163467 7110503 7124205 6987740 6930767 6974761 6894118 6885956 6941760 6902936 6912515 6865906 6725151
4679 6725151 6833231 6812803 6888282 6806596 6846804 6765908 6846799 6928393 6899153 6804632 6836625
4668 6836625 6758504 6712403 6645401 6536262 6485931 6526952 6542191 6518140 6498094 6402648 6385254
4657 6385254 6611589 6697648 6539187 6576987 6574921 6512703 6433979 6531343 6620331 6561315 6399811
4646 6399811 6370227 6414731 6588255 6465803 6456609 6470931 6543729 6629932 6605491 6765758 6815541
4635 6815541 6744686 6716495 6597978 6572261 6636215 6658498 6666195 6799055 6765145 6822998 6908911
4624 6908911 6873696 6788646 6703388 6717799 6934882 6940544 6937616 7124068 7143232 7061968 7145937
4613 7145937 7353776 7406009 7480113 7568205 7618751 7766001 7758266 7751337 7924182 8090952 8199589
4602 8199589 8227495 8420736 8388119 8361487 8284485 8222852 8418306 8353608 8465644 8509063 8538356
4591 8538356 8613329 8632242 8839245 9249735 9375340 9247235 9298691 9439582 9646428 9793172
4581 9793172 9925194 10105551 10134377 10071617 10129631 10084472 10232285 10396776 10481901 10571331 10683065
4570 10683065 10737913 10813425 10967105 11223606 11418044 11540326 11708162 11952505 12315113 12536787
4560 12536787 12934864 13552369 13909096 14429035 14995579 15767611 16887090 18109238 19685689
4551 19685689 21945873 24098411 26604531 28735090 29990876 30847764 30811240 29766389 28064222
4542 28064222 26143337 23884257 21804463 20004236 18418393 17335253 16420058 15798197
4534 15798197 15490291 15342902 15387534 15116781 14861635 14666667 14508440 14561397 14421433 14459887
4524 14459887 14501348 14579911 14871249 15144286 15347416 15404099 15477905 15685904 15762074 15954866
4514 15954866 16188871 16267841 16423433 16629712 16908063 17037234 17116716 17214133 17666843 17949341
4504 17949341 18256423 18499499 18624236 18800268 19182011 19512390 19738299 20048970 20328618
4495 20328618 20599006 20719164 21070573 21437054 21545001 21702676 21986629 22179926 22451852
4486 22451852 22689262 22933368 23210332 23411482 23742683 24161657 24535265 24972740 25197665
4477 25197665 25568714 26212126 26591876 27095848 27710760 28404026 28976442 29794110 30541281
4468 30541281 31429018 32757715 34256397 35901173 37898498 40597758 43512764 45330257
4460 45330257 45529780 44551583 43066400 41754498 40455576 39713708 39341288 39260845 39469489
4451 39469489 39710482 40308810 41229648 42143935 43400319 44952537 46550881 48332304 50411785
4442 50411785 52518241 55058163 57919498 61590163 66353034 72438566 80011048 89311517
4434 89311517 101225010 115823238 132781131 145598705 146823477 140461492 132693382 127543740
4426 127543740 126524689 130833491 139650508 154001931 174046093 200080972 225887638
4419 225887638 228211170 208343060 181780155 157875974 138987615 126425431 120286144
4412 120286144 118426268 120766609 126367793 134316282 135232383 125156455 109993477 94976539
4404 94976539 82104745 71407260 63405145 57385868 52472932 48570883 45262980 42635551
4396 42635551 40357744 38570743 36996979 35616499 34388855 33306965 32306002 31376185
4388 31376185 30506430 29684279 28930551 28317931 27608225 26888458 26109686 25596794 25101448
4379 25101448 24709545 24346969 23763657 23405742 22956268 22495150 22087051 21753599 21383068
4370 21383068 21163696 20709215 20729836 20372449 19883228 19634619 19292835 18880487 18826775 18898741
4360 18898741 18540537 18430982 18269424 18051250 17713195 17551840 17651670 17592887 17509525 17311686
4350 17311686 17086641 16895556 16601279 16457542 16276756 16046218 15978003 15927188 15937345 15985171
4340 15985171 16006236 15972423 16089135 16208494 16411947 16499279 16679861 16856390 17177215 17883723
4330 17883723 18669191 19451981 19964784 20189706 19615852 19070923 18460290 17918019 17550658
4321 17550658 17354722 17099935 17098630 17126410 16859070 16652090 16660405 16686382 16574898 16494683 16637310
4310 16637310 16709186 16983779 17177966 17513096 17610063 17530652 17471168 17475431 17530464 17472029 17526279
4299 17526279 17651074 17893466 18114192 18322007 18364752 18443007 18525321 18676173 18704450 18862425
4289 18862425 18962364 19037562 19207134 19462013 19908668 20157684 20328587 20635550 20797086 21091325
4279 21091325 21234215 21410646 21753745 21914832 22245328 22541829 22957043 23174179 23417760
4270 23417760 23818123 24338147 24797775 25061396 25473534 25784592 26272548 26823415 27449858
4261 27449858 28037152 28440895 28920469 29345250 29846203 30581257 31434164 32246388 32971497
4252 32971497 33855165 34701128 35608715 36530829 37644654 38822825 39908398 41261763 42786729
4243 42786729 44270293 45904342 47491786 49095943 50750703 52508975 54413644 56437885
4235 56437885 58232197 59978911 61737620 63601036 65551624 67306017 69126935 70579105
4227 70579105 71958483 73526459 75007994 76482015 78159340 80140693 82676875 85712968
4219 85712968 88917655 91746912 94360321 96895899 98963820 100926298 103052926 105228253
4211 105228253 107627761 109942051 112007623 113962379 115883896 117836997 119681666 121885782
4203 121885782 123937712 125599401 127090873 128660340 130218588 132422842 134989195 138370398
4195 138370398 142709021 148011896 154228036 160370224 165304455 168401102 169973361 170466278
4187 170466278 170626226 171269241 172211371 173521679 174664744 175377261 176236531 177151826 178110903
4178 178110903 179250138 180179171 181029429 181414699 180627097 179297991 177919568 177033520 177023119
4169 177023119 178102636 180435520 184323432 189464219 195632705 202063900 207845644 212159755
4161 212159755 215574649 218237056 220939857 224268834 227621097 230292305 231622958 231589319
4153 231589319 230971348 230235245 229171060 227708328 225637747 223138604 220751564 218809077
4145 218809077 217470005 216919687 217709257 219798715 223163971 226939534 231049142 235292689
4137 235292689 239290072 242513012 244657817 245826264 246451070 246649043 246072930 244377660
4129 244377660 241848720 238676384 234830960 230545881 226182206 222896013 221073650 220481394
4121 220481394 221273471 222854002 224804721 227065951 229039901 230647362 231782620 232822493
4113 232822493 233551797 233511236 232354578 229638143 225904424 222282739 219143479 216329673
4105 216329673 212814672 208006505 202026215 195602601 189358860 183827034 179460368 176496504
4097 176496504 174988181 174688547 175499778 177023418 178724663 179697673 179785200 179182292 177948788
4088 177948788 176336602 174230014 171962934 169496520 166506195 163748020 161150376 159416069
4080 159416069 158540195 158208894 158130843 157223669 154429113 149894935 144283771 138275414 132919085
4071 132919085 128304251 124749803 121614364 119081235 116862907 114752462 112779510 110424406
4063 110424406 108055347 105703907 103337353 100981341 98590738 96407686 94162295 92038554
4055 92038554 90151339 88415237 86646171 84761121 82879294 80780005 78309085 75451140
4047 75451140 72461072 69774719 67320178 65195547 63570573 62139363 60792416 59425199
4039 59425199 57757676 55725214 53766506 51916340 50162824 48595172 47157128 45985626
4031 45985626 44622478 43218680 41831595 40437551 39134678 37893436 36745583 35449728
4023 35449728 34164934 33236640 32324904 31448059 30516169 29750622 29015334 28335469 27622427
4014 27622427 27163966 26731283 26180568 25737421 25152498 24789259 24396995 24129436 23744587
4005 23744587 23311233 23043010 22662889 22307102 22020864 21695944 21410476 21172856 20951435
3996 20951435 20646622 20292392 19998508 19851372 19522584 19226255 19021081 18861866 18695317
3987 18695317 18470053 18296016 17978936 17812979 17629038 17204075 17004215 16897948 16757107
3978 16757107 16579405 16550977 16275257 16046282 15846230 15687399 15566326 15354853 15263026 15017823
3968 15017823 14714419 14623956 14454156 14120349 14168297 14191647 13909045 13816211 13579841 13224941
3958 13224941 13169241 13064159 12917385 13037704 12960944 12701901 12555048 12310058 12318971 12293283
3948 12293283 12123109 11985597 11814443 11842772 11846616 11594423 11490928 11525602 11354566 11343006
3938 11343006 11153360 11091482 11227925 11177332 10880926 10723048 10912270 10795141 10735139 10537173
3928 10537173 10481274 10603726 10505890 10306568 10285376 10301983 10267405 10216506 10138505 10244910 10324384
3917 10324384 10215357 10102619 10005194 9815304 9918854 9909776 9849334 9929010 9965502 9960312 10043872
3906 10043872 10113689 10037747 9982045 9750577 9647987 9624682 9611927 9733177 9756668 9567506
3896 9567506 9480855 9427173 9599945 9555386 9506385 9497995 9545287 9512229 9303677 9299405 9485665
3885 9485665 9601710 9581809 9586520 9709575 9485468 9340864 9372510 9368113 9446817 9344288 9398790
3874 9398790 9414431 9357990 9379779 9505776 9554015 9486090 9515086 9556631 9613146 9623345 9704348
3863 9704348 9751897 9840009 9951664 9965116 10085501 10110124 10022701 10012670 10031443 10007217 9989429
3852 9989429 10110513 10323752 10324746 10375372 10447236 10421264 10312495 10133137 9883196 9906286 9668136
3841 9668136 9748166 9826540 9870105 9850810 9853645 9928741 9825068 9749750 9849236 9852998 9839732 9732960
3829 9732960 9974461 10010531 10056550 10146961 10091849 10018319 9850455 9893709 10058977 10130162 10140530
3818 10140530 10158823 10172837 10327182 10244723 10368136 10389009 10407333 10423713 10528321 10490424 10610103
3807 10610103 10785242 10968890 11032148 11162877 11399234 11508105 11585502 11610683 11779194 11872741
3797 11872741 11968070 12266649 12225055 12293837 12447743 12561268 12594014 12735123 13089104 13123434
3787 13123434 13303667 13561641 13742592 13847099 13981585 14265082 14684863 14977453 15162059
3778 15162059 15467141 15676086 15791581 15982764 16297223 16432002 16671455 16974715 17097006
3769 17097006 17241838 17626579 17956206 18003030 18256564 18546682 19013997 19369850 19733685 20173858
3759 20173858 20467642 20828737 21022244 21340472 21774979 22221518 22722841 23366625 23895571
3750 23895571 24163324 24631622 25153671 25795493 26404017 26815853 27428095 28101867 28719045
3741 28719045 29490419 30213118 31155378 32096407 33037142 34129713 35293865 36455735 38069736
3732 38069736 40129407 42493179 45522048 49205740 53118570 57267792 60106816 58810700
3724 58810700 55439083 51550549 48073888 45791597 44365154 43501897 42891081 42128510 41719844
3715 41719844 41442688 41235577 40994640 41051323 40973522 40957351 40919941 40730274 40359735 40086283
3705 40086283 39984809 39783237 39584541 39342690 39329965 39057328 38663255 38421884 38254975 38188229
3695 38188229 37732028 37217900 36998369 36564059 36300922 36231113 35752060 35342889 35026298 34515926
3685 34515926 34134689 33517940 32998966 32682812 32136876 31522691 31288625 30666462 30098255
3676 30098255 29704019 29410749 29051775 28840656 28350031 27857525 27555928 27187627 26603867
3667 26603867 26401852 26167102 25905016 25576700 25435925 25095169 24770528 24783075 24620131 24297231
3657 24297231 24157588 24022126 24002927 23726536 23434918 23505587 23376011 23335837 23171162 22985364
3647 22985364 23054828 22916095 22873788 22989142 22955534 22997791 22918259 22860212 22918892 23171618 23113599
3636 23113599 23196334 23173429 23095485 23234076 23253124 23300517 23302095 23343195 23465031 23525456 23737475
3625 23737475 23960818 24071565 24422190 24779589 25206702 25662268 25810212 26055562 26243728
3616 26243728 26545368 26901184 27173838 27544200 28023435 28355773 28675102 28922083 29182295
3607 29182295 29528858 29908685 30126284 30429575 30881439 31362330 31779049 32175233 32686622
3598 32686622 33369447 33942388 34609867 35573482 36367568 37267404 38173319 39016137 39625344
3589 39625344 40572500 41687816 42701266 43740118 44920130 46367097 47872275 49579614
3581 49579614 51533405 53769143 56253907 59020477 61921216 64726539 67679585 70732681
3573 70732681 73358158 75665411 77470574 78562765 79266932 79301959 78749622 77643108 76293612
3564 76293612 74971640 73337716 71622948 69574687 67315972 64877132 62116898 59446708
3556 59446708 56448840 53487332 50939408 48317023 45941697 43625869 41346646 39346561
3548 39346561 37407543 35683511 34016279 32431362 31018447 29738258 28746182 27625420
3540 27625420 26767102 25716349 24989200 24014283 23137409 22600712 21885635 21192982 20717694
3531 20717694 20275697 19783263 19244993 18751963 18221778 17662414 17481420 16986153 16535989
3522 16535989 16078525 15685244 15344358 15112743 15087928 14876455 14591021 14381060 14238169 13990396
3512 13990396 13810950 13667912 13497659 13322423 13149552 13021125 12987720 12850514 12730188 12816160
3502 12816160 12877175 12935371 13124081 13125019 13285388 13146043 12814853 12465650 11924853 11416842
3492 11416842 11071111 10742493 10581025 10575341 10263095 10136142 10117064 9957657 9996063 10325416
3482 10325416 10388121 10528790 10679642 10758936 10618171 10747323 10602296 10485195 10354091 10315586
3472 10315586 10270636 10493216 10806166 11218016 11793947 12520560 12717453 12630192 12312749 11697672
3462 11697672 11033672 10339166 9739031 9109558 8696742 8646611 8632059 8344294 8044711 7974688
3452 7974688 7953865 7986570 7950355 7948083 7832238 7773504 7762236 7783136 7670580 7428586 7593734
3441 7593734 7505002 7509769 7565619 7709804 7762771 8226698 8599749 8608922 8294677 8078407 7853661
3430 7853661 7391682 7092354 6817910 6477534 6343153 6173440 6226993 6020659 5893855 5760765
3420 5760765 5619175 5613202 5609197 5563028 5506343 5514410 5455419 5235928 5179501 5064645 4992484
3409 4992484 5181066 5079738 5079547 5046699 5074517 5074179 5054742 4884823 5087080 5150110 5176807
3398 5176807 5144441 5195725 5185883 5153607 5013798 4860400 4711638 4751946 4778603 4787483 4727673
3387 4727673 4659020 4775809 4746802 4821385 4790773 4615767 4469338 4558637 4422492 4492218 4549884
3376 4549884 4511203 4443976 4523036 4638660 4447672 4388743 4392996 4389716 4503404 4467933 4444683
3365 4444683 4427880 4458114 4347781 4417331 4544900 4588362 4696380 4818587 4748743 4665808 4872511
3354 4872511 4782842 4633484 4535865 4613132 4860195 4716378 4564580 4689917 4744515 4721562
3344 4721562 4676981 4706903 4708259 4768548 4901835 4949621 4972157 5029019 4949604 4815323 5049775
3333 5049775 5105042 5087926 5144628 5253255 5216466 5347860 5362559 5397663 5659748 5750113 5755895
3322 5755895 5595267 5762951 5892506 5853869 6004747 6125440 6145018 6297197 6550851 6587617
3312 6587617 6603212 6466195 6593420 6708975 6807473 6973732 7218059 7431817 7416772 7556267
3302 7556267 7706050 7773759 7854355 8002326 8019710 8042873 8281282 8522892 8644775 8721520
3292 8721520 8965681 9096303 9208998 9338625 9439449 9498796 9599721 9671221 9942239 10175888
3282 10175888 10221786 10517386 10668319 10993004 11309146 11706371 11868038 12095814 12345848 12634100
3272 12634100 12997503 13460254 14001169 14403946 14861228 15612849 16273482 16787073 17364948
3263 17364948 18141014 18854839 19794075 20640072 21713536 22968271 24120899 25244471 26235561
3254 26235561 27333792 28197184 28850966 29308937 29485797 29547069 29566928 29748412 29844250 29938582
3244 29938582 29903231 30035392 30106282 30099166 30316559 30755387 31249755 31710415 32301753 32812671
3234 32812671 33460424 34158858 35058478 36426738 37998141 40100092 42692660 45907076 49645614
3225 49645614 53242850 55117354 54686934 53418957 51177793 48012410 44456220 41049482
3217 41049482 38012329 35575931 33673437 32094773 30742225 29611518 28814224 28277824
3209 28277824 27735083 27426437 27150053 27078016 27052415 26919214 26971069 27340981 27463761 27714024
3199 27714024 28193995 28544414 29020224 29618341 29807071 29678443 29442974 28997405 28122813
3190 28122813 26823807 25456562 24131414 22695811 21432981 20211030 19003185 18091644
3182 18091644 17366509 16774517 16250146 15632554 15075104 14622523 14251995 13884142 13460947
3173 13460947 12968302 12637797 12277413 11941045 11575503 11153313 10756407 10370132 10078217
3164 10078217 9759924 9482485 8965188 8637207 8449661 8306422 8136857 7774289 7497644
3155 7497644 7397182 7181108 6960336 6805666 6643778 6488598 6266181 6075309 6036507 6045791
3145 6045791 5933380 5746699 5722331 5611457 5507780 5275887 5289481 5183788 5061265 4889152
3135 4889152 4651721 4659371 4444210 4398388 4430418 4376123 4255240 4132174 3998713 3976669 3917920
3124 3917920 3839576 3962828 3867138 3728318 3669917 3810788 3653027 3407227 3462189 3446528
3114 3446528 3383856 3332416 3159992 3035891 3194406 3201084 3014989 3026979 2899618 2822981 2727177
3103 2727177 2653162 2697884 2749324 2826908 2850786 2655776 2441417 2584217 2427101 2417856 2522639
3092 2522639 2430916 2368052 2439443 2298396 2109255 2014917 1944247 1927777 1876067 1849678 1865129
3081 1865129 1813916 1902452 1947850 1895536 1742988 1669401 1655679 1696347 1537009 1599386 1664867
3070 1664867 1534355 1638079 1546556 1537571 1486211 1389278 1260089 1135088 1247331 1562725
3060 1562725 1496525 1392364 1376168 1329405 1423568 1427440 1383202 1372934 1233035 1257396 1227984
3049 1227984 1131574 1166481 1272064 1185746 1075281 1141589 1082566 1100089 968361 1082922 1052780
3038 1052780 1076094 1099261 1104628 989355 975106 986295 1026198 933602 895509 930202 826828
3027 826828 772333 697300 726089 652276 736250 954472 972451 903211 900497 782387 742091
3016 742091 737471 753957 758051 835999 710163 745003 794989 934080 886887 707476 750342
3005 750342 801729 755662 742736 638732 572084 681253 678327 432539 548719 624262 757514
2994 757514 890340 828354 753377 832953 691945 689229 678528 646613 610406 378371 434697
2983 434697 554512 696627 670299 640918 460916 374636 556424 588521 548461 643152 659013
2972 659013 643037 543409 543730 523032 388178 537983 699321 796482 702822 734510 847836
2961 847836 594165 458762 469241 590516 677331 625817 523053 389300 567018 668250
2951 668250 650450 739289 678765 538335 427943 617344 683312 734440 667961 647273 653640
2940 653640 609265 616037 601837 598485 529425 573913 463534 354448 418709 346699 400112 491537
2928 491537 452392 404805 396321 477425 581099 428238 328238 440010 607621 462753 531855
2917 531855 418728 466155 478863 491404 630840 600381 523703 510413 458771 436169 533616
2906 533616 495975 480769 483404 578269 597906 504411 396436 249923 275878 294394 391340
2895 391340 480340 274076 141935 318391 332334 150971 309549 398557 350713 227096
2885 227096 360116 264176 225097 249240 162624 327925 406556 418127 296126 247717 314323
2874 314323 233169 142436 144540 274401 458477 333736 196986 248462 222756 163240 179185
2863 179185 262287 114950 116334 171913 83722 -8762 34218 193 -91467 47543 32183
2852 32183 2195 -72656 -56869 81290 36956 140518 178122 124355 90809 6615 -52965
2841 -52965 87088 206856 150266 16735 70345 262775 166023 68481 35060 24290 20488
2830 20488 -175739 -42317 56152 45596 95164 27512 -48638 88176 140001 105648 161822
2819 161822 50329 -158614 16864 191370 314725 287075 236503 -66483 -1420 168335
2809 168335 125205 104429 133277 202803 13169 -53446 -26464 7089 32766 144082 232712
2798 232712 -114615 -256746 -183981 -63343 23611 57212 117128 -112533 -13264 -55707 -154129
2787 -154129 -67095 45293 -38695 -46743 76906 49976 26277 -89104 29335 91947 -22189
2776 -22189 23731 5875 -175653 -134705 -92208 -202288 -92020 -98720 -117066 64813 -71713
2765 -71713 -48188 41572 -214 58005 46727 135695 55984 72593 78022 95247 4915 -85281
2753 -85281 -74633 3826 -44291 -110315 -146245 -93892 -121180 -93827 -138779 -90156 -278218 -245906
2741 -245906 -294721 -254076 -129582 -62614 -36328 29129 -99149 -130724 -79906 -88176 -234087
2730 -234087 -265565 -237911 -270024 -278292 -227467 -328665 -192583 -99541 -95980 -23072 -262570
2719 -262570 -90268 -148624 -295799 -258809 -90089 10052 -117971 -272628 -219348 -287746
2709 -287746 -228118 -69373 -133522 -194149 -227010 -133754 -58858 -39312 66773 22081 -67110
2698 -67110 -198591 -52843 15089 184174 22591 94777 189733 114827 95147 252610 119088
2687 119088 -30219 -79552 -67892 -83958 -180524 -46384 -9181 -160609 -138391 -76820 -214499
2676 -214499 65417 -6927 -139938 55278 -23806 -31699 -6671 39368 -91229 -63504 37835
2665 37835 -8870 51676 9875 -85204 -62719 138283 66350 -16489 5901 57476 96623 147237
2653 147237 -23599 -315 58065 141053 45820 -60213 -162487 -140861 37677 -141666 -97714
2642 -97714 -202613 -126951 -183283 -164518 -91771 -41596 10868 -96374 -209171 -110407 -36287
2631 -36287 -65476 17927 91681 -171055 -204075 -91187 -175271 -271090 -85864 -18408 -69842
2620 -69842 31119 102782 89394 81886 51629 44310 -61506 -50694 -41160 -52334 106257 129306
2608 129306 80262 101934 -24689 74419 222035 17413 106848 90623 21120 -210017 -309841
2597 -309841 -275770 -192036 -169259 -93996 -156351 3804 -47602 -196814 -207404 -158996 -231906
2586 -231906 -47432 -14123 117764 111722 -53217 16375 -101959 -87935 92600 22680 36913
2575 36913 106297 -75614 -37978 -112710 -68493 62213 48553 101834 -64941 -128539 47552
2564 47552 136242 121007 32510 6071 105890 211882 204497 227037 234303 162213 80086 173090
2552 173090 47014 -45648 27541 -7774 53685 79302 170361 52889 5409 30924 69800
2541 69800 5853 25363 82575 -36860 -143558 -145477 103934 101059 49083 86475 87445 179252
2529 179252 125165 172866 76812 -7746 137794 178398 172236 219934 107511 107588 133354 360275
2517 360275 371721 278879 436232 265553 125677 160599 165216 170952 270028 369034 374733 286087
2505 286087 447573 585452 688040 618824 538849 580978 686852 541579 539664 489884 574122
2494 574122 710481 769818 787489 814844 674717 588508 717344 837790 741113 635857 630708
2483 630708 753308 977796 988088 963486 1087836 1066652 1018155 950747 956529 1218063 1244644
2472 1244644 1226611 1326687 1465802 1430317 1483475 1573374 1494596 1756476 1787799 1883989 2074437
2461 2074437 2098618 1995915 2165228 2239671 2171426 2191934 2305191 2438177 2507681 2794199
2451 2794199 2886558 2871813 3026660 3263941 3600279 3711380 3638925 3905432 4229322 4515466
2441 4515466 4934599 5660992 6206422 6427046 7003126 7549464 8135254 8501363 9126420 10265547
2431 10265547 11701308 13343636 16005169 19060760 23489406 29159573 35472640 37438932
2423 37438932 34048830 32631587 29531686 24571823 19936561 16048672 13209239 11144349
2415 11144349 9462006 8056283 7191661 6497175 5835480 5367777 5193967 4866426 4463491
2406 4463491 4323043 3980810 3677885 3299743 3115235 2932595 2703365 2336187 2199765 2236848
2396 2236848 2119901 2113834 2123670 2037721 1947950 1665625 1452469 1363687 1215476 1116778 1091076
2385 1091076 1155840 1201829 1182247 1285924 1378286 1183882 979899 881885 927080 876486 867956
2374 867956 761526 755061 773730 702743 617219 502446 425288 496353 516909 468577 584248
2363 584248 554150 420766 558712 452930 332676 336785 241141 289185 357802 421200 364651
2352 364651 254727 247984 252247 155995 158324 248667 258101 244169 365663 369113 213450 95294
2340 95294 101878 238542 188671 206468 192000 326888 218076 114105 159109 185062 159895
2329 159895 199418 161683 25528 50119 30650 -62021 94734 175666 2568 173259 204066
2318 204066 189057 332667 219480 218638 270630 163439 94044 182355 238343 168089 -31111
2307 -31111 -100165 -16620 -7145 123460 214157 147242 179724 94595 179088 191038 137392 -14243
2295 -14243 -81383 -17283 -51128 5320 14819 201276 230923 14343 -55533 47263 69670
2284 69670 86702 204295 82200 -48713 -79823 -23995 40033 41980 -81552 30581 985
2273 985 -131287 -131013 -148435 -83203 -165608 -58667 20264 101041 -16759 -138383 -22048 -57239
2261 -57239 537 -87943 30685 -65936 -125401 53 -82633 -89061 -58073 -130981 -161532 -164096
2249 -164096 -96638 -38120 -34345 -915 -128978 -165884 -134801 -11751 -178880 7762 43934
2238 43934 82086 63701 10114 -22528 90958 40731 -125266 -147175 -65385 -48736 -179390
2227 -179390 -100383 -120362 -23992 -160852 -43593 67993 224264 109485 34842 60311 -126365
2216 -126365 105481 50941 -50213 -96684 -46437 -36904 10867 -76317 -47139 -7108 -87512
2205 -87512 -139268 6264 84942 205 -11767 30413 37674 -11940 5140 -45183 49519 -15592
2193 -15592 -112317 -88148 -145053 -205622 -94220 -91718 -102770 29737 -121117 -133641 -113892
2182 -113892 -135242 -80028 -21416 -188902 -152433 -16112 51812 -30517 -70447 -56273 -22977
2171 -22977 23136 -46279 92621 29793 -81343 -47893 6849 -45296 -50877 -127185 -17604
2160 -17604 17967 36274 84950 146850 223458 175481 225083 112101 -17620 64313 -118180
2149 -118180 -97594 74560 13784 -92567 59760 101244 -87462 -161308 -243649 -277562 -166084
2138 -166084 -186045 -235856 -269222 -156839 -316416 -222785 -29687 -208121 -335276 -300796 -204964
2127 -204964 -192513 -248662 -194929 -142470 -149546 -71675 -88125 -38700 -65586 -110437 -159034 -124514
2115 -124514 -338451 -310130 -202166 -155345 -166511 -118416 -15984 -23844 -67471 -47897 8679
2104 8679 -33046 -124882 -212278 -133527 -135512 -161998 -135237 -260873 -53740 -86322 -102519 -177147
2092 -177147 -163333 25257 -45698 74587 -18687 -62376 -227834 -148277 -100012 -101712 -145566
2081 -145566 44230 82652 -179405 -112800 6867 -31320 -183661 -178396 -164747 -364933 -178434
2070 -178434 29716 -39911 -224662 -287312 -163568 -64888 -57897 -142202 14169 67834 -114087
2059 -114087 -97053 29035 31422 -3392 -120279 66704 262086 70315 -141230 -151113 -126843
2048 -126843 -186946 -61861 29196 -242203 -256503 -180650 -111724 -113576 -239723 -290533 -293965
2037 -293965 -149487 -147881 -75410 -108463 -240167 -122993 48078 54819 24747 -172062 -162767
2026 -162767 -124743 -255249 -340231 -330542 -241785 -118714 -128413 -138757 -130911 -164027 -195811 -268739
2014 -268739 -196466 -149160 -231681 -172155 -120229 -68419 -39774 -148952 -267014 -337452 -226010
2003 -226010 -187108 -140078 -32177 -75525 -209364 -123238 -263884 -115182 33408 -41312 -147236
1992 -147236 -66062 1842 -114454 -111118 -28661 -109271 -18091 -117368 -243692 -170553 -166127 -151952
1980 -151952 -54397 -141470 -175115 16389 -10372 -132808 -284654 -128505 94000 24513 -20473
1969 -20473 -112627 -158128 -13205 -87454 -201614 -180695 -231025 -205429 -146486 -67567 -41055
1958 -41055 -93780 -118736 -23609 -84121 -222123 -115031 -71906 -109816 2963 -5972 -84391
1947 -84391 -148738 -4565 22230 -111535 -94908 -1428 -25901 55603 132513 121625 -30814
1936 -30814 -201783 -185106 47522 93975 -45276 -81770 -209301 -248945 -241719 -199900 -389547
1925 -389547 -194027 -333290 -362991 -255629 -85811 57390 408 -23400 160591 185016
1915 185016 17408 -133171 -144479 -63521 -672 -30126 -197140 -114996 -78657 -85819 110975
1904 110975 30796 -104080 -209412 -62035 -39597 -51802 216205 53232 -131788 -204266
1894 -204266 -222508 -174451 -219052 -180378 -79879 32528 24598 -48798 -132798 -145965 -231683
1883 -231683 -282855 -104354 42379 101401 100128 -90586 -326287 -286922 -20623 2243 -86846
1872 -86846 -180981 -129060 -160870 -170481 34590 8119 108470 75360 -29548 -22001 51058 -14883
1860 -14883 -19398 -67350 -126053 -183659 -115007 -175130 -83310 -103538 -234697 -131648 -264240
1849 -264240 -79745 32187 -89239 -96813 -147013 -171300 -187899 -177010 -249745 -139824 -156500
1838 -156500 -323260 -236315 -88266 88213 198618 147841 -69513 -148461 -188653 -217452 -124321
1827 -124321 -224622 -162006 -48542 61857 4179 -94878 -249978 -296944 -23752 3319 141405
1816 141405 230083 -102661 -153487 43298 -25947 -123421 -54675 77076 -4370 -5003 -98078
1805 -98078 106057 235319 65551 -77138 -87450 -66810 -14391 -22369 -35097 -515 -28445
1794 -28445 -196480 -354269 -144909 -43106 43072 -43098 -55551 17336 -151118 -144988 -54237
1783 -54237 -114836 -100749 -1848 -32655 -144533 19699 43108 -198409 -224374 -47607 125163
1772 125163 90480 -66580 37318 -16889 11346 -81073 -77718 -1690 -103379 -157239 -165933
1761 -165933 -42917 10663 -46479 -25930 39521 14040 -174506 -156532 -170897 -8339 -17705
1750 -17705 38515 -26010 -151731 -221708 51698 74373 44328 -16943 -105454 -153333 -231765
1739 -231765 -14370 -161338 -147331 -324432 -284978 -69144 -32692 -14955 67327 54936 39951
1728 39951 135272 101159 12425 33034 -78037 -8962 26189 116438 97035 -64431 -100582
1717 -100582 31292 -52969 -6219 85978 84849 56753 -14439 -60447 -19395 -109909 -24333 -7542
1705 -7542 67408 3370 34855 -28653 -48629 -282785 -273847 -41842 -123221 -243341 -201551 -136970
1693 -136970 -224071 -200477 -174555 -244623 -171340 -84011 -142655 -142896 -146363 -24002 -57059 -86044
1681 -86044 -33341 -47644 -100742 -83931 -127303 -273459 -167213 31864 -155177 -219053 -187985
1670 -187985 -170691 6160 127552 43225 -14614 -98615 -112711 -156808 -29086 -70136 78228
1659 78228 97314 146221 96787 43270 -103736 -73446 51877 -17818 -116141 -139410 -56822
1648 -56822 -44648 -16897 -150753 161095 116345 -13934 -35735 -75043 -25393 -104061 -44878
1637 -44878 86645 -37425 -108107 100575 272139 233192 12334 -99057 -100599 -103134 -116676
1626 -116676 -56619 31819 76314 147834 165456 138105 -3208 50601 67502 -5588 64307
1615 64307 -71770 -23824 22464 -129299 -143576 -55856 -65680 -3066 -8689 16631 -24920 -118316
1603 -118316 -5530 -97616 -207468 -58514 -626 -80202 -24775 16940 -13036 -8322 -66594
1592 -66594 -129375 -91789 -14739 59553 -3398 54136 98090 47686 10720 73768 41786 -140051
$$ [...]
##END NTUPLES=NMR SPECTRUM
##END=
