##TITLE=1H_EC-3339(2)
 200.13MHz, CDCl3,
 24 sc
 
 15.1.2025
##JCAMPDX= 6.0         $$ Bruker NMR JCAMP-DX V2.0
##DATA TYPE= NMR SPECTRUM
##DATA CLASS= NTUPLES
##ORIGIN= UXNMR, Bruker Analytische Messtechnik GmbH
##OWNER= pz
$$ XWIN-NMR		Version 3.5
$$ Wed Jan 15 13:50:25 2025 Russian Standard Time (UT+4h)  she@DPX200
##.OBSERVE FREQUENCY= 200.1312
##.OBSERVE NUCLEUS= ^1H
##.ACQUISITION MODE= SIMULTANEOUS
##.ACQUISITION SCHEME= undefined
##.AVERAGES= 8
##.DIGITISER RES= 18
##SPECTROMETER/DATA SYSTEM= spect
##.PULSE SEQUENCE= zg30
##.SOLVENT NAME= D2O
##.SHIFT REFERENCE= (INTERNAL, D2O, 0, 14.9459)
##AUDIT TRAIL= $$ (NUMBER, WHEN, WHO, WHERE, WHAT)
$$ ##TITLE= Audit trail, XWIN-NMR		Version 3.5
$$ ##JCAMPDX= 5.01
$$ ##ORIGIN= Bruker BioSpin GmbH
$$ ##OWNER= she
$$ F:/spectra/data/she/nmr/H-C/1/pdata/1/auditp.txt
$$ ##AUDIT TRAIL=  $$ (NUMBER, WHEN, WHO, WHERE, WHAT)
(   1,<2025-01-15 13:49:11.25 +0400>,<she>,<DPX200>,
      <created by zg, POWCHK disabled, PULCHK disabled
       configuration hash MD5:
       00 E9 B6 7A A2 85 ED C7 34 08 36 98 17 FE 4E 26
       data hash MD5: 16K
       34 C6 4E 34 A7 34 F1 3B 09 8F 6E 96 D1 A6 94 43>)
(   2,<2025-01-15 13:49:13.43 +0400>,<she>,<DPX200>,
      <Start of raw data processing
       efp BC_mod = 2 LB = 0.25 FT_mod = 6 PKNL = 1 PHC0 = 248.5649 PHC1 = 9.19222 SI = 16K 
       data hash MD5: 16K
       98 29 1D 41 6A D9 F6 3F C4 5B 89 BB 55 AD 96 C4>)
(   3,<2025-01-15 13:49:39.18 +0400>,<she>,<DPX200>,
      <pk PHC0 = -8.376843 PHC1 = 16.19999 
       data hash MD5: 16K
       69 D5 C6 72 CB C5 E6 5F E3 3B 41 18 DA E5 5C 94>)
(   4,<2025-01-15 13:49:42.92 +0400>,<she>,<DPX200>,
      <abs ABSG = 5 
       data hash MD5: 16K
       45 CA 7C 54 E4 8E 8E EE E5 B9 CA 38 81 4A F2 23>)
$$ ##END=
$$ 
$$ hash MD5
$$ 93 BE F8 B8 E0 67 D7 A3 D4 E6 97 2D 89 C8 D0 F8
##$RELAX= 
##$RELAX= 
##$RELAX= 
##$RELAX= 
##$RELAX= 
##$RELAX= 
$$ Bruker specific parameters
$$ --------------------------
##$DU= <F:/spectra>
##$EXPNO= 1
##$NAME= <H-C>
##$PROCNO= 1
##$TYPE= <nmr>
##$USER= <she>
##$AMP= (0..31)
100 100 100 100 100 100 100 100 100 100 100 100 100 100 100 100 100 100 
100 100 100 100 100 100 100 100 100 100 100 100 100 100 
##$AQSEQ= 0
##$AQ_mod= 1
##$AUNM= <au_zg>
##$AUTOPOS= <>
##$BF1= 200.13
##$BF2= 200.13
##$BF3= 200.13
##$BF4= 200.13
##$BF5= 200.13
##$BF6= 200.13
##$BF7= 200.13
##$BF8= 200.13
##$BYTORDA= 1
##$CFDGTYP= 0
##$CFRGTYP= 5
##$CHEMSTR= <none>
##$CNST= (0..31)
1 1 145 1 1 1 1 1 1 1 1 1 1 1 1 1 1 1 1 1 1 1 1 1 1 1 1 1 1 1 1 1 
##$CPDPRG= <>
##$CPDPRG1= <>
##$CPDPRG2= <>
##$CPDPRG3= <>
##$CPDPRG4= <mlev>
##$CPDPRG5= <mlev>
##$CPDPRG6= <mlev>
##$CPDPRG7= <mlev>
##$CPDPRG8= <mlev>
##$CPDPRGB= <>
##$CPDPRGT= <>
##$D= (0..31)
0 0.7 0 0 0 0 0 0 0 0 0 0.03 0 0 0 0 0 0 0 0 0 0 0 0 0 0 0 0 0 0 0 0 
##$DATE= 1736934550
##$DBL= (0..7)
120 120 120 120 120 120 120 120 
##$DBP= (0..7)
150 150 150 150 150 150 150 150 
##$DBP07= 0
##$DBPNAM0= <>
##$DBPNAM1= <>
##$DBPNAM2= <>
##$DBPNAM3= <>
##$DBPNAM4= <>
$$ [...]
##$SUBNAM3= <"">
##$SUBNAM4= <"">
##$SUBNAM5= <"">
##$SUBNAM6= <"">
##$SUBNAM7= <"">
##$SUBNAM8= <"">
##$SUBNAM9= <"">
##$SW= 18.0517418723606
##$SWIBOX= (0..15)
0 0 2 0 0 0 0 0 0 0 0 0 0 0 0 0 
##$SW_h= 3612.71676300578
##$TD= 16384
##$TD0= 1
##$TE= 0
##$TE2= 300
##$TE3= 300
##$TEG= 300
##$TL= (0..7)
0 120 120 120 120 120 120 120 
##$TP= (0..7)
150 150 150 150 150 150 150 150 
##$TP07= 0
##$TPNAME0= <>
##$TPNAME1= <>
##$TPNAME2= <>
##$TPNAME3= <>
##$TPNAME4= <>
##$TPNAME5= <>
##$TPNAME6= <>
##$TPNAME7= <>
##$TPOAL= (0..7)
0.5 0.5 0.5 0.5 0.5 0.5 0.5 0.5 
##$TPOFFS= (0..7)
0 0 0 0 0 0 0 0 
##$TUNHIN= 0
##$TUNHOUT= 0
##$TUNXOUT= 0
##$USERA1= <user>
##$USERA2= <user>
##$USERA3= <user>
##$USERA4= <user>
##$USERA5= <user>
##$V9= 5
##$VALIST= <valist>
##$VCLIST= <CCCCCCCCCCCCCCC>
##$VD= 0
##$VDLIST= <DDDDDDDDDDDDDDD>
##$VPLIST= <PPPPPPPPPPPPPPP>
##$VTLIST= <TTTTTTTTTTTTTTT>
##$WBST= 1024
##$WBSW= 4
##$XGAIN= (0..3)
0 0 0 0 
##$XL= 0
##$YL= 0
##$YMAX_a= 259631
##$YMIN_a= -262210
##$ZGOPTNS= <>
##$ZL1= 120
##$ZL2= 120
##$ZL3= 120
##$ZL4= 120
##$ABSF1= 15.00648
##$ABSF2= -3.045369
##$ABSG= 5
##$ABSL= 3
##$ALPHA= 0
##$AQORDER= 0
##$ASSFAC= 0
##$ASSFACI= 0
##$ASSFACX= 0
##$ASSWID= 0
##$AUNMP= <proc_1d>
##$AZFE= 0.1
##$AZFW= 0.1
##$BCFW= 0
##$BC_mod= 2
##$BYTORDP= 0
##$COROFFS= 0
##$CY= -3
##$DATMOD= 1
##$DC= 0
##$DFILT= <>
##$DTYPP= 0
##$F1P= 0
##$F2P= 0
##$FCOR= 1
##$FTSIZE= 16384
##$FT_mod= 6
##$GAMMA= 0
##$GB= 0
##$INTBC= 1
##$INTSCL= 3.241238e-09
##$ISEN= 128
##$LB= 0.25
##$LEV0= 0
##$LPBIN= 0
##$MAXI= 10000
##$MC2= 0
##$MEAN= 0
##$ME_mod= 0
##$MI= 1.114404
##$NCOEF= 0
##$NC_proc= -8
##$NLEV= 6
##$NOISF1= 3.799351
##$NOISF2= 2.8
##$NSP= 0
##$NTH_PI= 0
##$NZP= 0
##$OFFSET= 14.94588
##$PC= 1
##$PHC0= 240.188
##$PHC1= 25.39221
##$PH_mod= 1
##$PKNL= yes
##$PPARMOD= 0
##$PSCAL= 0
##$PSIGN= 0
##$REVERSE= no
##$SF= 200.130015239466
##$SI= 16384
##$SIGF1= 3
##$SIGF2= 2
##$SINO= 0.751879
##$SIOLD= 32768
##$SREGLST= <19F.Aceton>
##$SSB= 0
##$STSI= 16384
##$STSR= 0
##$SW_p= 3612.71676300577
##$SYMM= 0
##$S_DEV= 0
##$TDeff= 16384
##$TDoff= 0
##$TI= <>
##$TILT= no
##$TM1= 0
##$TM2= 0
##$TOPLEV= 0
##$USERP1= <user>
##$USERP2= <user>
##$USERP3= <user>
##$USERP4= <user>
##$USERP5= <user>
##$WDW= 1
##$XDIM= 16384
##$YMAX_p= 446404155
##$YMIN_p= -7519740
$$ End of Bruker specific parameters
$$ ---------------------------------
##NTUPLES= NMR SPECTRUM
##VAR_NAME=  FREQUENCY,     SPECTRUM/REAL,   SPECTRUM/IMAG
##SYMBOL=    X,             R,               I
##VAR_TYPE=  INDEPENDENT,   DEPENDENT,       DEPENDENT
##VAR_FORM=  AFFN,          ASDF,            ASDF
##VAR_DIM=   16384,         16384,           16384
##UNITS=     HZ,            ARBITRARY UNITS, ARBITRARY UNITS
##FACTOR=    0.220516191357247, 1,           1
##FIRST=     2991.11917940259, 0,            0
##LAST=      -621.59758360318, 0,            0
##MIN=       -621.59758360318, -7519740,     0
##MAX=       2991.11917940259, 446404155,    0
$$ Real data points
##PAGE= N=1
##DATA TABLE= (X++(R..R)), XYDATA
$$ [...]
8127b84059J01108J78325j73400k10855P0653N99800k66568m50110O6477l9878
8117d08507m0300m9167j88124K65218m4470R1300j4686L99475n58591j18655M61280
8106b05227j08863Q93357J55183l79319l45461O7802O72377j12380l34193L35715
8096F38991R1853J46081n42624j96943K35857M2878L831k80934L87629J14132
8086F40751m09005q2602j51355J18652J27565L42044j52742J8309l03347M625
8076A52895P039l94040N01058q4135q5939K86720j12612O4958l73243N0064N21720
8065E34485l50877L36803M287L1666M89008L32668j61459j74298n6429k59780
8055G26074l65724l02796R54316N69372m59548K86154l67036J69767J05420n4826
$$ plain form
8127 -284059 -182951 -4626 -178026 -388881 -318228 281572 15004 -435106 -368629 -408507
8117 -408507 -448807 -497974 -686098 -420880 -465350 -374050 -388736 10739 -547852 -666507 -205227
8106 -205227 -314090 579267 734450 355131 9670 77472 749849 637469 303276 638991
8096 638991 730844 876925 334301 137358 373215 416093 419924 138990 526619 640751
8086 640751 231746 149144 -2211 116441 244006 586050 433308 451617 148270 152895
8076 152895 159934 -234106 266952 182817 96878 383598 270986 335944 -37299 12765 534485
8065 534485 183608 520411 524698 556364 1045372 1378040 1216581 1042283 985854 726074
8055 726074 360350 57554 1011870 1581242 1121694 1407848 1040812 1210579 1315999 1261173
8045A261173n83168l39050K00274K75417N7930j89699N5572k07876J17769k4620
8035F23722J37880K74135j20494q3863l52160M7779j58805K85586N43189j38578
8025A058391J3024J44224l90776q8258j48908p0703N55028o3575N57125n17377
8015A048195p5170L97693m70841k59649K84628J48008O1494k35947Q74941L70206
8005B143558K274j78736K05080L02158M17952j80368q36292K53815r9392p1415
7995A958634q2265l02726L36266k5392L85338q1966J21899J23153j65277k92147
7985A975517j69977O05278k03856K08537J54504J09958j45361J78349Q8703j64279
7975B637373N30568J22654k90609M69331K13205o03267m11454L91285M31916m00332
$$ plain form
8045 1261173 678005 338955 539229 814646 872576 682877 738449 530573 648342 623722
8035 623722 761602 1035737 915243 831380 479220 526999 368194 653780 1196969 1058391
8025 1058391 1071415 1215639 824863 736605 587697 516994 1072022 1008447 1565572 1048195
8015 1048195 973025 1370718 899877 640228 924856 1072864 1134358 898411 1773352 2143558
8005 2143558 2145832 1967096 2172176 2474334 2892286 2711918 1875626 2129441 2030049 1958634
7995 1958634 1876369 1573643 1909909 1884517 2269855 2187889 2309788 2432941 2267664 1975517
7985 1975517 1805540 2410818 2206962 2415499 2570003 2679961 2534600 2712949 2801652 2637373
7975 2637373 3167941 3290595 2999986 3469317 3682522 3079255 2667801 3059086 3491002 3090670
7965C090670j27065O1850m10731M91512M93214k23773k86875J63514K74494o77625
7955B849185K45645M34948N25467q9342n05686N20416m42672j47038L54158M00416
7945D145497K99885J71100j32538j32870L48488m4055J37844L86482m045J93363
7935E369151J35325j80119J93342K21957K49193K65471j1444L98741L6768O9592
7925F747977N80561J67006k02489N12245L85134M46453N53210P07685M01493k32535
7915A0066740m0177N0309L02214P6369M0795l52475K57732L40288j73023P58445
7905A1327217j60210N82704L08682P99721M39696p6992N46799N38432l3587N93965
7895A4866427M79479N50406P96753L85874P48421J050650J189457J049160R84876
$$ plain form
7965 3090670 2963605 3025455 2614724 3106236 3599450 3375677 3088802 3252316 3526810 2849185
7955 2849185 3094830 3529778 4055245 3965903 3460217 3980633 3537961 3390923 3745081 4145497
7945 4145497 4445382 4616482 4483944 4351074 4699562 4655507 4793351 5179833 5175788 5369151
7935 5369151 5504476 5324357 5517699 5739656 5988849 6254320 6242876 6641617 6678385 6747977
7925 6747977 7328538 7495544 7293055 7805300 8190434 8636887 9190097 9897782 10299275 10066740
7915 10066740 10026563 10076872 10379086 10455455 10496250 10143775 10401507 10741795 10568772 11327217
7905 11327217 11167007 11749711 12058393 12858114 13297810 13220818 13767617 14306049 14272462 14866427
7895 14866427 15345906 15896312 16693065 17078939 17827360 18878010 20067467 21116627 22101503
7886B2101503J252980J368216Q22150J651599J986473K129355K171889L258610
7878C6742775L556069M594780N701514P519168J0174143J1863485J3555613J3164298
7870A06871845P246234k721052j2301974j5740922j6184019j2908224q371400
7863D5890488n816346m120327k704342k204136j572793J47928l22510j19468M17112
7854B9595606M04895J307533R50395J425637K563644K339153L267009M813797
7846D6667669N776827Q109434J0447452J1809038J2160624R304623O23726r365052
7838I5534341j5867095j6277103j4227040j0377789p016757m755731l136971l013354
7830B0862501k389563k372650o53091q38590j208228j093847q03534o15536n44266
$$ plain form
7886 22101503 23354483 24722699 25544849 27196448 29182921 31312276 33484165 36742775
7878 36742775 40298844 44893624 50595138 58114306 68288449 80151934 93707547 106871845
7870 106871845 114118079 111397027 99095053 83354131 67170112 54261888 45890488
7863 45890488 40074142 35953815 33249473 31045337 29472544 29620472 29297962 29178494 29595606
7854 29595606 30000501 31308034 32258429 33684066 36247710 38586863 41853872 46667669
7846 46667669 52444496 60553930 71001382 82810420 94971044 104275667 104899393 95534341
7838 95534341 79667246 63390143 49163103 38785314 31768557 27012826 23875855 20862501
7830 20862501 18472938 16100288 15447197 14608607 13400379 12306532 11502998 10887462 10343196
7821A0343196o77186k84205o32276n37065n07355m33480m65565p95433l60022
7812E650609l91633j16792k14421j31586L63033k56049n60804n27135r2186K79002
7802D002038m82123m63864j86776P6749P0710N56077m57925k86523O6494M24246
7792C319103O02698P6649k85701j55913O5658R9013j83346n26974j51742j3655
7782B845790L31279m53130m33957n9216R240N61199r1358k71835o0232k16004
7772B161776l71804L64798K96574m95495J87048k38015j06788k13678M0624Q5711
7762A710751K29232O6752O6773N0762k16995k78437n78252n47864m77685K78684
7752C03721M21043l6337k55855K62694K67952l86072j76129K38585j31675k246
$$ plain form
7821 10343196 9666010 9381805 8749529 8212464 7705109 7271629 6806064 6010631 5650609
7812 5650609 5258976 5142184 4927763 4796177 5159210 4903161 4342357 3815222 3723036 4002038
7802 4002038 3519915 3056051 2869275 2946024 3016734 3572811 3114886 2828363 2894857 3319103
7792 3319103 3921801 3998450 3712749 3556836 3622494 3721507 3538161 3011187 2859445 2845790
7782 2845790 3177069 2723939 2289982 2230766 2240006 2801205 2709847 2438012 2377780 2161776
7772 2161776 1789972 2154770 2451344 1955849 2142897 1904882 1798094 1584416 1625040 1710751
7762 1710751 1939983 2006735 2073508 2124270 1907275 1628838 1050586 502722 25037 303721
7752 303721 724764 688427 432572 695266 963218 577146 401017 639602 507927 505681
7742E05681L78529o1178j86092j99105P1615j11786j45586K27178k53116K42980
7732D69120J3831n53084n86000K67334N44244M2835k43095J35476J95084k96283
7722a0538P3516o18835L66578P4585K11296j09999k58823K26527K57676J01968
7712C13951j43221q6591k96053J82877J33540p8794m55021K71100J29324j18437
7702a47325L09733J43156Q2309J50055j05923l0753l16099k46306m5589J51225
7692e5517L39648K22223j16238l60191k99029L60330Q6941k58378K2012n24169
7682e82368l92629M93406P64625J58113J42837K03349K0236k11496j57005k5276
7672D13792N28390J62695p8332L7066j92989J45675J64481j91025o34904l30774
$$ plain form
7742 505681 884210 823032 636940 437835 509450 397664 252078 479256 226140 469120
7732 469120 482951 -70133 -656133 -388799 155445 198280 -44815 90661 285745 -10538
7722 -10538 62978 -555857 -189279 -114694 96602 -13397 -272220 -45693 211983 313951
7712 313951 170730 84139 -211914 -29037 104503 25709 -429312 -158212 -28888 -147325
7702 -147325 162408 305564 387873 537928 432005 401252 85153 -161153 -206742 -55517
7692 -55517 284131 506354 390116 29925 -269104 91226 178167 -80211 -58199 -582368
7682 -582368 -974997 -481591 283034 441147 583984 787333 807569 596073 439068 413792
7672 413792 942182 1104877 1026545 1063611 870622 1016297 1180778 989753 354849 24075
7662B4075N21400m8819K43425J48566n06241L18844K35663k08068n50892L49975
7652E27928n14805o8532J4823O31088N4318o05451J30634L96716k5237l55664
7642A85818L53964N7399n95976l54496L28458o7055l73910m25J8692N85320N95758
7631G33547k48240J61339n66492j16860N32337m20998m3163N3889k34569L32356
7621A83146j57688L04406L17843m8540l50991O01649m30557j52002P45643N81322
7611A594231k63355k42980o91462k88792O64201L84887Q7397J26394R9024m6318
7601A423227l18303M13383j90039n40129J80342k0535M04644n1643O056p56562
7591E50441K84018j08941m33303j47008M1738M35807j65818o1173M21728j93597
$$ plain form
7662 24075 545475 496656 740081 888647 382406 701250 936913 728845 177953 527928
7652 527928 13123 -55409 -40586 590502 644820 39369 170003 566719 541482 185818
7642 185818 539782 597181 1205 -353291 -24833 -91888 -465798 -466223 -447531 137789 733547
7631 733547 485307 646646 80154 -36706 495631 74633 31470 85359 -149210 183146
7621 183146 25458 329864 647707 599167 248176 849825 419268 267266 1012909 1594231
7611 1594231 1330876 1087896 396434 107642 771843 1156730 1244127 1370521 1469545 1423227
7601 1423227 1104924 1518307 1328268 788139 968481 947946 1352590 1300947 1307003 550441
7591 550441 834459 725518 292215 145207 186945 622752 456934 395761 817489 623892
7581F23892p1092L78802J74056j72122K79701o21493p5874K53379L22213l38825
7571G52637j55849L2155p4662J1470J28313N11623K81926o15587l56888N24996
7561A040134M95421j39840o7315L41750m22970J83652j05098j21117L32202O87565
7551B224384j10686j59460q8602n79679K49456J25668j1536Q8538J79140L21351
7541B238574l79060j25689M53032J59686q9123L69237m5567O8812r7795N2863
7531B604970r3499J34776K3248l41748K80304J37990J3157P0571k02149R8793
7521B726413L37164N7687K44708L10161J28570k02622L97804J84910P5807P1089
7511D331691L37293J133270K38159N79619N13889P22750L50357j91162m33337
$$ plain form
7581 623892 552800 931602 1105658 933536 1213237 591744 515870 769249 1091462 752637
7571 752637 596788 628943 554281 565751 694064 1205687 1487613 872026 515138 1040134
7561 1040134 1535555 1395715 1328400 1670150 1247180 1430832 1325734 1204617 1536819 2224384
7551 2224384 2113698 1954238 1865636 1285957 1535413 1661081 1649545 1738083 1917223 2238574
7541 2238574 1859514 1733825 2186857 2346543 2257420 2626657 2581090 2649902 2552107 2604970
7531 2604970 2511471 2646247 2669495 2327747 2608051 2746041 2759198 2829769 2627620 2726413
7521 2726413 3063577 3121264 3365972 3676133 3804703 3602081 3999885 4184795 4260602 4331691
7511 4331691 4668984 5802254 6040413 6620032 7133921 7856671 8207028 8015866 7582529
7502G582529o82527m15580j17130N6797r12769j85749J09602k36232J65480l44530
7492E019891l29294o05695L60241o2347M98201K22774j3978K35076p7293M19611
7482E667187L95647M01027L56322K79977J79326O04405J153390J022458J022905
7473A1082644J525683J171374P40282l2804n91397j446122j167071j660538j055004
7464H567047j268626o67033k03056l28802l90540K21704N93678k97795j0901o9019
7454F146657L37323M75795P8322K86322k41640O22775M93115M74589O21508L90092
7444I684858N63270L17499Q68261J0520L73584M01831k21707J77124k31129j042234
7434A0901877j221190k15610p64424j013559j236539o05453J59944o91790p9285
$$ plain form
7502 7582529 6900002 6484422 6367292 6424089 5511320 5325571 5435173 5198941 5364421 5019891
7492 5019891 4690597 4084902 4445143 4382796 4880997 5103771 5089793 5324869 5247576 5667187
7482 5667187 6062834 6463861 6820183 7100160 7279486 7883891 9037281 10059739 11082644
7473 11082644 12608327 13779701 14519983 14487179 13895782 12449660 11282589 9622051 8567047
7464 8567047 7298421 6631388 6428332 6099530 5708990 5930694 6524372 6226577 6215676 6146657
7454 6146657 6483980 6959775 7038097 7324419 7082779 7705554 8198669 8673258 9294766 9684858
7444 9684858 10248128 10565627 11433888 11444408 11817992 12219823 11998116 12175240 11944111 10901877
7434 10901877 9680687 9465077 8700653 7687094 6450555 5845102 6005046 5313256 5233971
7425E233971k48641N9873K84867j81299R7097M77489L95170Q6401k11977j01496
7415E891455Q1952O62244P53526K29150O77868J363362J061408J490298P33648
7406A2944911k81935o99360j562245j274348j630069j459680m58610k54109m735
7397E319820o55216q23406j7258K51460m98898k74603k0780J0493J49975j77374
7387C264213m25738J88754M71267k18979M49019L65874M02772J59968k72186O66740
7377E051704j1300L31750Q60161P2956L57296O00630j54911r07732r27484l37165
7367D935905p52975p76510N7570M51088j76210j384568j39550r0701L63384l92093
7357B095340p29009r0274M49681N9627K01328K48744o8627j39735J27753k89921
$$ plain form
7425 5233971 4985330 5045203 5330070 5148771 5245868 5723357 6118527 6204928 5992951 5891455
7415 5891455 5973407 6635651 7389177 7618327 8296195 9659557 10720965 12211263 12944911
7406 12944911 12662976 11963616 10401371 9127023 7496954 6037274 5578664 5324555 5319820
7397 5319820 4664604 3841198 3823940 4075400 3576502 3301899 3281119 3291612 3441587 3264213
7387 3264213 2838475 3027229 3498496 3279517 3728536 4094410 4497182 4657150 4384964 5051704
7377 5051704 5040404 5372154 6232315 6305271 6662567 7263197 7108286 6200554 5273070 4935905
7367 4935905 4182930 3406420 3463990 3915078 3738868 2354300 2214750 2124049 2487433 2095340
7357 2095340 1366331 1276057 1725738 1785365 1986693 2235437 2166810 2027075 2154828 1864907
7347A864907K07418J41511j4056O0357r3205J37315l14391p8561j76223m6569
7337A688503O56605j07668m63196j66034K51723L94321O7466N19474k00919m32781
7327B207494K63743L11296o35670J42045j61437K82939J4545O2840L56653P16968
7317C561416m63149m12830L26643K02589J05915K75835k02625L66187j27237N4919
7307C687663P3868j18932J48363l8642k38693J91758m12648n2716k62011P8196
7297C056206L33972l6121O86257o8446k23868k53806M3332m71124k44930R2322
7287B913794j91661J28282J05122j88003K48605K56741K71472k26857J13173K02596
7277C633264k60875j24125M38871L25795l89619q3923P12683n06870k43353m27695
$$ plain form
7347 1864907 2072325 2213836 2199780 2260137 2166932 2304247 1989856 1911295 1735072 1688503
7337 1688503 2345108 2237440 1774244 1608210 1859933 2254254 2321720 2841194 2640275 2207494
7327 2207494 2471237 2782533 2146863 2288908 2127471 2410410 2424955 2487795 2844448 3561416
7317 3561416 3098267 2685437 3012080 3214669 3320584 3596419 3393794 3759981 3632744 3687663
7307 3687663 3761531 3642599 3790962 3752320 3513627 3705385 3292737 3240021 2978010 3056206
7297 3056206 3390178 3354057 4040314 3971868 3748000 3494194 3537526 3066402 2821472 2913794
7287 2913794 2722133 2850415 2955537 2767534 3016139 3272880 3544352 3317495 3430668 3633264
7277 3633264 3372389 3248264 3687135 4012930 3623311 3539388 4252071 3745201 3501848 3074153
7267C074153J42133R1829l67382J46734M88657J56348L68380J77121k50970m0694
7257C986309m23199K04309J07348J52931J09447J56754N2747o19809J30957k9292
7247C828502N64765p2500J49915r9978M58789k3756J38275L01889n26947Q9255
7237D808209J90802P2454J66017J68490K87282k90859R740M93941J37172J09485
7227F152733O09235k00372l21000O44711M93841j98686J31802J86485o7694m3541
7217G387514N2137O64737L605N09834O85622M09128K34555l71320m61885M88834
7207I602761L11385J024514J0558J56955J60423L59891N82773l0766J69508P7267
7197A2425269M17681P73789m59754K84043N00426O7266K97373L83080M11896O85908
$$ plain form
7267 3074153 3216286 3308115 2940733 3087467 3576124 3732472 4100852 4277973 4027003 3986309
7257 3986309 3563110 3767419 3874767 4027698 4137145 4293899 4346646 3726837 3857794 3828502
7247 3828502 4393267 4320767 4470682 4370704 4829493 4805737 4944012 5245901 4718954 4808209
7237 4808209 4999011 5071465 5237482 5405972 5693254 5402395 5412135 5906076 6043248 6152733
7227 6152733 6761968 6561596 6240596 6885307 7379148 7180462 7312264 7498749 7431055 7387514
7217 7387514 7439651 8104388 8107993 8617827 9303449 9712577 9947132 9575812 9113927 9602761
7207 9602761 9914146 10938660 10949218 11106173 11266596 11626487 12209260 12178494 12348002 12425269
7197 12425269 12842950 13616739 13156985 13441028 13941454 14008720 14306093 14689173 15101069 15786977
7187A5786977L62065J42609M94042P78058J65521O5737r9755L33141O72398O60506
7177A9361299M32842R46228P33469M66927K21817P20651J051209R07523O66084
7168B5508049O65915R08219P95084J276467N75120N29614J063558J258319J168381
7159C3748726J277639J095831R44349P13897J212661J274165J696519J548833
7151D3512620J540910K041103K136343J982684K308597K931409L197228L246925
7143F2897819L759302M175901M637710N722485O379796P180516R012903J0593928
7135A14360360J2459342J6606409K0876305K4921501L0762070L5469248L3719712
7128B89174947J8828846j838331k0509341l0774222k8972996j7386569m130382
$$ plain form
7187 15786977 16149042 16291651 16785693 17563751 17729272 17795009 17695254 18028395 18700793 19361299
7177 19361299 19794141 20740369 21473838 21940765 22162582 22883233 23934442 24841965 25508049
7168 25508049 26173964 27082183 27877267 29153734 29728854 30258468 31322026 32580345 33748726
7159 33748726 35026365 36122196 37066545 37780442 38993103 40267268 41963787 43512620
7151 43512620 45053530 47094633 49230976 51213660 53522257 56453666 59650894 62897819
7143 62897819 66657121 70833022 75470732 81193217 87573013 94753529 103766432 114360360
7135 114360360 126819702 143426111 164302416 189223917 219985987 255455235 289174947
7128 289174947 308003793 306165462 285656121 254881899 225908903 208522334 204391952
7121B04391952O437314J5619707K3178307K5202685J6915195l426638k4708736
7114B63609786l9177170m3767940l6375903k5766387j8132936j3277348r450780
7107G7661322p679411o927485o507142n730850m651273l569546k673521j734716
7099C8187378k011509k040478k121238j137093j398135j535026j503978j162337
7091B5277584j533949j709308m50043q28616n10152j382845o64820j041226j081817
7082A6074808j123121m85511l59302n57921l25641m29739r91087r68173N2675
7073A0886988p94543m20885J66471j63962q09450l97611j66536n12641k02927
7064G584904m22512o44148J58286j41191j69749l26850j43447l07608j07066K82255
$$ plain form
7121 204391952 210829266 226448973 249627280 274829965 291745160 288318522 263609786
7114 263609786 224432616 180664676 144288773 118522386 100389450 87112102 77661322
7107 77661322 69981911 63054426 56547284 50816434 46165161 42595615 39922094 38187378
7099 38187378 36175869 34135391 32014153 30877060 29478925 27943899 26439921 25277584
7091 25277584 23743635 22034327 21584284 20755668 20245516 18862671 18197851 17156625 16074808
7082 16074808 14951687 14466176 14106874 13548953 13223312 12793573 11802486 10834313 10886988
7073 10886988 10092445 9671560 9838031 9674069 8864619 8467008 8300472 7787831 7584904
7064 7584904 7162392 6518244 6676530 6535339 6365590 6038740 5895293 5587685 5480619 5762874
7054E762874n64122K99303l0947o50258M21342k26885j59377k21136m79429J84103
7044D335468k6673q6980q9318n35164O3809K15785J01498L54860n18724k30903
7034C583658r8010o4659J10381p01116k46654J88682J584j95709M28148j6940
7024B989365o24167r0092L90442m49963L688L04163k6269m17447J45497l71803
7014A853414L07947J66360q26622M09131L22171l58852m27937n16378o5521K41271
7004A104984L91025K81561J4323J19845m09837M51751j073265l46931R0003K13410
6994H36869K3137k5198N0348n15459Q66501K95240o69742m47852r4600K17609
6984E36853k82512M5200l44984J51991K71840L28709L72892o27539r0455l8150
$$ plain form
7054 5762874 5198752 5498055 5467108 4816850 5238192 5011307 4851930 4630794 4151365 4335468
7044 4335468 4308795 4221815 4132497 3597333 3661142 3876927 3978425 4333285 3814561 3583658
7034 3583658 3485648 3420989 3531370 2830254 2583600 2772282 2773866 2578157 3006305 2989365
7024 2989365 2365198 2275106 2665548 2215585 2219273 2523436 2497167 2079720 2225217 1853414
7014 1853414 2161361 2327721 1501099 1910230 2232401 1873549 1445612 929234 863713 1104984
7004 1104984 1496009 1777570 1791893 1911738 1501901 1953652 880387 533456 623459 836869
6994 836869 860006 834808 885156 369697 1236198 1531438 861696 413844 319244 536853
6984 536853 254341 299541 -45443 106548 378388 707097 1079989 452450 361995 323845
6974C23845l40277K18331M42393J59696j2153m07591j43723k59874l02110M32257
6964A10794o3734O91157n2303j97225o5667k55857K86622N3056J09399m39228
6954A77014K65692j4687L77859p20406l29158L85784J53980m22128k48503J17431
6944b57122o58726J29627Q73035K11808j23915j03561m02797N04387M83019m96977
6934A58778l77145R7063L57042o6645k43163n4288m8095J86960J42896j94910
6924d1507k22646M49727K88710q1789J64147k23789O5786K13982K37495K47578
6914A097694n48239J1557K64545r1851P9628m42834m03521L15565L09741J78154
6904G70439M87169m25739J35950L18463p61479p037m06352Q9686l2096K96609
$$ plain form
6974 323845 -16432 201899 644292 803988 791835 384244 240521 -19353 -321463 110794
6964 110794 47060 738217 685914 488689 423022 167165 453787 506843 616242 177014
6954 177014 442706 428019 805878 85472 -243686 142098 296078 -126050 -374553 -257122
6944 -257122 -915848 -786221 86814 298622 174707 71146 -331651 172736 655755 158778
6934 158778 -218367 -121304 235738 169093 -74070 -128358 -176453 10507 153403 -41507
6924 -41507 -264153 185574 474284 392495 556642 332853 398639 612621 850116 1097694
6914 1097694 549455 561012 825557 733706 813334 370500 -33021 282544 592285 770439
6904 770439 1257608 831869 967819 1286282 524803 517766 111414 201100 169004 465613
6894D65613R7771n9907L00875M07805r5725K31800j51668n92239Q9142j70620
6884E22847K34574L55114J7687k30734N8620N098M17387p3985l92099k92j50800
6873G63417J65407k29568K10973j93666J3918M89527l70843O6052k76721m66653
6863A71843P5797M94813o01849k88409J1533O57606M64011k21912q90043j00642
6853b27252l21128k03706O09271L38194K71840K50542K3225l113k43977J36932
6843F30828j85664k16291K36973o72144K20385M85918J58170j84565j8572j11410
6833C43628J42863j14042L68238l83406J55111J89443j67333k82403L47440k89610
6823C09929L03897n3314K52441k20966j09261M54560o91351O4280J13569J5822
$$ plain form
6894 465613 563384 503477 804352 1212157 1116432 1348232 1196564 604325 693467 522847
6884 522847 757421 1112535 1130222 899488 958108 963206 1380593 1306608 914509 914217 763417
6873 763417 928824 699256 910229 716563 730481 1220008 849165 915217 638496 171843
6863 171843 247640 742453 140604 -147805 -136272 521334 985345 763433 -126610 -227252
6853 -227252 -548380 -752086 -142815 195379 467219 717761 740986 737873 493896 630828
6843 630828 445164 228873 465846 -206298 14087 500005 658175 473610 455038 343628
6833 343628 486491 372449 740687 357281 512392 701835 534502 252099 599539 309929
6823 309929 613826 560512 812953 591987 482726 937286 245935 310215 423784 439606
6813D39606J02835M46371p0268M5514L29221m22300K47469P73125l35726J65167
6803A721014O9952k38729p23661O7521J29954q0542L30021J32409k47293J68689
6793A329335K04654m06233k0495J82002r5530r0576k18133J08907j99455l45369
6783D49107l18254p8225N76560J90847m46595J9048m06600L04964j43916K19979
6773C66915K36234J07537N83225o21885n40353K7229K05968K43692k88050K14240
6763E34752l5117K91633O993n77600L22943j05277N02840l35238j82858N05770
6753I28841R9453l63724k13995K78005O9462J079O2414L77273M4529l40993k16770
6742G25574l7200K353J22502k91183j62271J94614p0127Q0896J33794N74584j89578
$$ plain form
6813 439606 542441 988812 918544 964058 1293279 870979 1118448 1891573 1555847 1721014
6803 1721014 1790966 1552237 828576 896097 1026051 945509 1275530 1407939 1160646 1329335
6793 1329335 1533989 1127756 1107261 1289263 1193733 1103157 885024 993931 794476 449107
6783 449107 130853 52628 629188 820035 373440 392488 -14112 290852 146936 366915
6773 366915 603149 710686 1293911 672026 131673 158902 364870 608562 320512 534752
6763 534752 499635 791268 798261 220661 543604 438327 941167 605929 423071 928841
6753 928841 1028294 664570 450575 728580 798042 799121 861535 1238808 1283337 942344 725574
6742 725574 688374 690727 813229 522046 359775 554389 484262 565158 698952 1273536 1083958
6731A083958l04295l6103N1929L9606M38729M47942j29598j29866K7609J26890
6721A616801l45268l11904n44711m3115Q99358N3232n26072m53594M21883K20930
6711I87540p6959L88846N48680K04755m52094k38648o3827M89728N84781L53375
6701B726177l2107L81857M44062J210999P33349o0127q98278o72697p55182j60767
6691B917286O56292j40589L500M33721K72988M0772j36006q34043o98383p11012
6681A804526m70361n21276M16609m08709j66988O21683k53267l18561j85560k39866
6671B78230K10982j22615P37696l61767l23674p4074N90915P0654o51684j01347
6661B53316j97843J18012m00227M10495k40857l76467L97277M83328K18144m27833
$$ plain form
6731 1083958 779663 743560 795489 835095 1273824 1721766 1592168 1462302 1489911 1616801
6721 1616801 1271533 959629 414918 371803 1271161 1324393 798321 344727 766610 987540
6711 987540 910581 1299427 1848107 2052862 1600768 1362120 1298293 1788021 2372802 2726177
6701 2726177 2694070 3075927 3519989 4730988 5464337 5404210 4505932 3833235 3078053 2917286
6691 2917286 3573578 3432989 3436489 3870210 4143198 4183970 4047964 3213921 2515538 1804526
6681 1804526 1334165 812889 1229498 820789 653801 1275484 1022217 703656 518096 278230
6671 278230 489212 366597 1104293 742526 418852 344778 935693 1006347 354663 253316
6661 253316 55473 173485 -226742 183753 -57104 -433571 -36294 447034 665178 237345
6651B37345p95262N34860P30871M8859J55053l21487k14707q1542K00025l9779
6641D54236k14285o6149L8523M51363R6783K67518l16960m66926j01171k10290
6631f7358N47804m10512Q7822J0547p74483p8816J17531O00521M6083M6246j36621
6620a1236n2503j37482L9534L13838L409N05406m58712j02877J13004n88692L72436
6609c875k32431p9904O39279O80079R2213l60420l81697L04197o8128j35402l57380
6598I6531r0837k75735k06156K12801R4162j49053O012R0260K4897R3246K89107
6587A85235O0356J39233j96949l08586K84598m70024K64338L50723j42330N06214
6577F72808n50944j35189l07799j7576L61342J17756K76087M03621l2568j22642
$$ plain form
6651 237345 -557917 -23057 707814 756673 911726 590239 375532 293990 494015 454236
6641 454236 239951 173802 212325 663688 760471 1027989 711029 244103 142932 -67358
6631 -67358 480446 69934 157756 168303 -606180 -684996 -567465 33056 79139 125385 -11236
6620 -11236 -63739 -201221 -161687 152151 155560 660966 202254 99377 212381 -376311 -3875
6609 -3875 -236306 -316210 323069 1003148 1095361 734941 353244 657441 589313 453911 96531
6598 96531 5694 -270041 -476197 -263396 -169234 -318287 -312275 -222015 -197118 -103872 185235
6587 185235 245591 384824 187875 -120711 163887 -306137 -41799 308924 166594 672808
6577 672808 121864 -13325 -321124 -338700 22642 140398 416485 820106 787538 664896
6567F64896l84782l19240M08649m68614K92550q3442j16153k01582O2473j63140
6557c08385L46729r6576j24923N32393L28071J7196K98907j60154k59701k33818
6547C39739K58131m0348k56500J04289j32897L18715k21831R8880Q0708l62871
6537A86015L71267Q2655j88805l21059m65366j60676K68016L98923k61936P3867
6527a7099K44626n62758q1458l8826l24026L8796L20859L16352k97232l3280j92081
6516f26127l18200M02340O658j97985M42106L35576l70085m32593J2754n1862
6506g97418N66192K83456k77391j17959O0954k39062M7410k03701O2659P5920
6496e38940Q0113M3340P417J24023q3781j19499m57427j36030J31158p7299K09085
$$ plain form
6567 664896 280114 -39126 369523 -99091 193459 110017 -6136 -207718 -145245 -308385
6557 -308385 38344 -58232 -183155 349238 677309 694505 993412 833258 573557 339739
6547 339739 597870 557522 301022 405311 272414 591129 369298 468178 548886 186015
6537 186015 557282 639937 451132 130073 -335293 -495969 -227953 170970 -90966 -17099
6527 -17099 227527 -335231 -416689 -455515 -779541 -740745 -419886 -103534 -400766 -434046 -626127
6516 -626127 -944327 -541987 -535329 -733314 -291208 44368 -325717 -758310 -745556 -797418
6506 -797418 -231226 52230 -225161 -343120 -282166 -521228 -473818 -677519 -614860 -538940
6496 -538940 -458827 -415487 -408070 -284047 -367828 -487327 -944754 -1080784 -949626 -1026925 -817840
6485h17840J01243l6162P690M69736K60324P4843l48955k64467j45114J78467
6475e20235L92072J76184m1335l57656J21492K6012K86569k85455j113941L41836
6465i74457M92117J34236n5893J59506R0095l33063K01399j22220j2302n51322
6455i71904M07240Q06269k01976m88213j31341k63158M55418K41802J89268R9449
6445A42854l81616o64487K2174M07497m4784k93914J59397p8819K90096j11328
6435e52930K2100j08826J8775K36157j25467K01933j56687Q3633L18241k01221
6425b64292p51213K0760L14294O61673K35306m16150l65863K02799K20634o122
6415a48174k79902L47773K09577j23588k54464j12962N04846J28368J9878m24224
$$ plain form
6485 -817840 -716597 -752759 -745069 -275333 -15009 59834 -289121 -553588 -698702 -520235
6475 -520235 -128163 48021 6686 -350970 -229478 -203466 83103 -202352 -1316293 -974457
6465 -974457 -482340 -348104 -403997 -244491 -154396 -487459 -286060 -408280 -420582 -971904
6455 -971904 -564664 241605 39629 -448584 -579925 -843083 -387665 -145863 43405 142854
6445 142854 -238762 -903249 -881075 -473578 -518362 -812276 -652879 -731698 -441602 -552930
6435 -552930 -530830 -639656 -620881 -384724 -510191 -308258 -464945 -381312 -63071 -264292
6425 -264292 -1015505 -994745 -680451 -18778 216528 -199622 -565485 -362686 -142052 -148174
6415 -148174 -428076 -80303 129274 5686 -248778 -361740 143106 271474 291352 -132872
6405a32872k33698k56878K75435J74522O00124n62251n56807O11867L14893o2558
6395A71777J13539j61198o7445l69405k63108L46259r00811J3019O25425K66193
6385b25755l35754K40746L30628m4705O0265J67659p25508j13605K08415L49940
6375h7674j33544k13606J35521l86480K00561K00463J87068J05737l47618l3344
6365c72916j36469K96304j04766k9082n7862k69219N37254N3138o6679K94898
6355A44601n108M0303j38197j00847k41826l45168j29130N04511k13680l0583
6345e15124J85942K08116K45453j67339q3666K68011k18716j12592j24208j55965
6335d70088j3722O5446K55744l2481j25295L40496k1276j15104k30615N6661P4547
$$ plain form
6405 -132872 -366570 -623448 -348013 -173491 426633 -135618 -692425 -80558 234335 171777
6395 171777 285316 124118 56673 -312732 -575840 -229581 -1130392 -1117373 -491948 -225755
6385 -225755 -561509 -320763 9865 -34840 25425 193084 -532424 -646029 -437614 -87674
6375 -87674 -221218 -434824 -299303 -685783 -485222 -284759 -97691 8046 -339572 -372916
6365 -372916 -509385 -213081 -317847 -346929 -404791 -674010 -136756 -83618 -150297 144601
6355 144601 139493 179796 41599 -59248 -301074 -646242 -775372 -270861 -484541 -515124
6345 -515124 -329182 -121066 124387 -42952 -126618 141393 -77323 -189915 -314123 -470088
6335 -470088 -483810 -418364 -162620 -195101 -320396 20100 -1176 -116280 -346895 -290234 -215687
6324b15687O6388n15682j98142L04760P53125m9521n65395q7926n21882R3545
6314i36417M39991j39082l95532P62271N09063M8457k67012l5365M34961m29878
6304h543n30768k25420O5954M90485n94805N43759k01054K19740P8813p6611J36744
6293a01706l99663k73130M72370n04741j56595K35497J202575J72335m23172j56535
6283F7235J50414M7631m09142K01961J15628l8166L00458l75610L4167j36151
6273d1575k15172q2553K82593j48824n17029L05023J31258j49078K51796M46484
6263B62923l3842n5676m60970M70811K98581l40496k69209l37246o21606K82606
6253h04124K83100L46596M87364m72996j30862N72582k16759j43528M58468n48110
$$ plain form
6324 -215687 -149299 -664981 -863123 -558363 194762 145241 -420154 -508080 -1029962 -936417
6314 -936417 -496426 -635508 -1031040 -268769 240294 288751 21739 -13626 421335 -8543
6304 -8543 -539311 -764731 -698777 -208292 -803097 -259338 -460392 -240652 -161839 -238450 -101706
6293 -101706 -501369 -774499 -302129 -806870 -963465 -727968 474607 646942 223770 67235
6283 67235 217649 265280 -143862 58099 173727 135561 436019 60409 94576 -41575
6273 -41575 -256747 -339300 -56707 -205531 -722560 -417537 -286279 -435357 -183561 262923
6263 262923 229081 173405 -287565 183246 481827 141331 -127878 -465124 -1086730 -804124
6253 -804124 -521024 -174428 312936 -160060 -290922 281660 64901 -78627 379841 -168269
6243a68269R4489M01233r893j81765j96313O7351k83879J5270j54556J77644O5595
6232a73093K6346K86472L41733k62198k81306n8430J84191k74425q0313J17513
6222a73510K46039K75616K04534L66062k38340j97066k41011J7008k27082K33490
6212B65740L87257j8492l62841k97922K99102k99303M97752N38068l05482j80947
6202E22932M53519o27704k40195M14063J82585Q6340L71048o00799k70021n06
6192B91262L3874K34708O4460k50229J01635j20627L35008k85667j48541M8509
6182C04392M806r726r3061O25447M2754L9590k80143k297j04700J98692K05573
6171I31327k6200K62853n93869J9964k14561k86701K89864J83794j24478N0196
$$ plain form
6243 -168269 -73780 327453 317560 135795 -60518 6833 -277046 -261776 -416332 -238688 -173093
6232 -173093 -146747 139725 481458 219260 -62046 -120476 63715 -210710 -291023 -173510
6222 -173510 72529 348145 552679 918741 680401 483335 242324 259332 32250 265740
6212 265740 652997 634505 271664 -26258 272844 -26459 471293 1009361 703879 522932
6202 522932 976451 348747 108552 522615 705200 791540 1162588 561789 291768 291262
6192 291262 325136 559844 624304 374075 475710 355083 690091 404424 255883 304392
6182 304392 309198 299472 206411 831858 874612 914202 634059 631762 527062 725754 931327
6171 931327 905127 1167980 574111 594075 379514 92813 382677 566471 441993 492189
6161D92189K21974p7364m05751J93843M52481L48386m55077n17923L61835L81923
6151I96516M03924l40238m68521p82971K83948O78815M26420r0424n30356j19769
6141D57344J39383l36786m64651N24941K24754q2258L93254k58381k13179K159
6131C86580N72124k29038K2507m9906J67370j07651j80852L47016N67363J13462
6121A608975k76645K05077j69829j80785m69974k69731K52582q9018M19076N59410
6111A589138m01991N16106m8796p91021P2143j83109J19693K71456K97510n17602
6101I23527J91134p7636j9897k24030M13014l89249L17088L33683m44397K30737
6091A253974L31333M5325j39736q6934l38239o12486K95139N0400L35410K33128
$$ plain form
6161 492189 714163 636799 231048 424891 877372 1225758 770681 252758 614593 996516
6151 996516 1400440 1060202 591681 -191290 92658 771473 1197893 1107469 577113 457344
6141 457344 596727 259941 -204710 320231 544985 462727 855981 597600 384421 386580
6131 386580 958704 729666 752173 702267 869637 761986 581134 928150 1495513 1608975
6121 1608975 1332330 1537407 1367578 1186793 716819 447088 699670 610652 1029728 1589138
6111 1589138 1187147 1703253 1654457 863436 935579 752470 872163 1143619 1441129 923527
6101 923527 1114661 1037025 1017128 793098 1206112 816863 1133951 1467634 1023237 1253974
6091 1253974 1585307 1630632 1490896 1403962 1065723 453237 748376 798776 1134186 1367314
6081A367314l98515N23634N94903n27313l43231K12648J69790k39835l50570M5223
6071A054048J95338q7460k09079J65379n81371J61838L26507j32982k19581j97419
6061D75218J00618N10780p63222J80564L85779J1502K47856k7757J75469R71O5081
6050A362859k5094m25787J56204O1735K23240k62439N7675L70312j08406m57939
6040I52360r546K58938M36942R8524P20051m70753m74288k58223l56932M38179
6030A335252J69793j70561J03101N9630k03179l12266O0263o1338N46008L13460
6020A840163j11246l55822k37335Q986Q2775M2039p2631k2295m6997j73857P321
6009I61101K09024J27909l00844J65020L6563j54849K12499K01710l13154k73743
$$ plain form
6081 1367314 968799 1492433 2087336 1560023 1216792 1429440 1599230 1359395 1008825 1054048
6071 1054048 1249386 1161926 952847 1118226 536855 698693 1025200 892218 672637 475218
6061 475218 575836 1086616 323394 503958 889737 901239 1149095 1121338 1296807 1297778 1362859
6050 1362859 1337765 911978 1068182 1129917 1353157 1090718 1148393 1518705 1410299 952360
6040 952360 942814 1201752 1638694 1737218 2457269 1986516 1512228 1254005 897073 1335252
6030 1335252 1505045 1334484 1437585 1497215 1294036 981770 1042033 980695 1526703 1840163
6020 1840163 1728917 1373095 1135760 1144746 1227521 1269560 1196929 1174634 1127637 953780 961101
6009 961101 1170125 1298034 997190 1162210 1198773 1043924 1256423 1458133 1144979 871236
5999H71236L3944k52448K1219k29386L43392Q24940p5944q2840k48363J18699
5989A324449M28996o1047M60332k43504j01676j93688m51044o9736k04496J01297
5979I89883k9429l23319K11719L68813M1341l77684L48933M33433m862l95443
5969A263385j67550k82376O62616J2464j63672j16662K07093k17277Q3170K29767
5959A510958N50718M8865m14590K10604K26955k63469J75883j04003l88753J15852
5949A669020M38675k67454k19414M64405k99712r0870K30509K20646K0653r1568
5939B074890j48495l35187k76338M08752m87671l64055O75652J40567l25836k94245
5929A068034j86397J64453L57329J13729m25173k2796k50988k55436M96427N4458
$$ plain form
5999 871236 905180 652732 673951 444565 787957 1612897 1536953 1454113 1205750 1324449
5989 1324449 1753445 1692398 2152730 1909226 1807550 1613862 1162818 1093082 888586 989883
5979 989883 960454 637135 848854 1217667 1259008 881324 1230257 1663690 1658828 1263385
5969 1263385 1095835 813459 1476075 1488539 1324867 1208205 1415298 1198021 1281191 1510958
5959 1510958 2061676 2110541 1695951 1906555 2133510 1870041 2045924 1941921 1553168 1669020
5949 1669020 2107695 1840241 1620827 2085232 1785520 1694650 1925159 2145805 2166458 2074890
5939 2074890 1926395 1591208 1314870 1723622 1235951 871896 1547548 1688115 1362279 1068034
5929 1068034 881637 1046090 1403419 1517148 1091975 1069179 818191 562755 1059182 1113640
5919A113640k67065N98639m7064o93763L13556M46395j88175k92073N82458L05057
5909A871605k8927l96773m984M95993M43925o19706j38997j47399k05593M2361
5899A311505K03920N8536j42908Q7490o73119J3061q991J58015j40100M24934
5889A292343N73258k45597l72919O8938j53944L25408L73373L71017m80705k41937
5879A509235M0303L60794j5465O1105L3661L48589k28319j60850o6890l30543
5869A551620J52267m9671J85346j39984j89615L65213m7475K83994M24506m07014
5859B129187m3642j26097K51594J48688J9214n59788L6000m19377J07424L60321
5849A903524k34597J5630N80456k95509J25842K24359m66787K59724Q4408J08216
$$ plain form
5919 1113640 846575 1445214 1398150 704387 1017943 1464338 1276163 984090 1566548 1871605
5909 1871605 1842678 1445905 1440921 1936914 2380839 1761133 1622136 1474737 1269144 1311505
5899 1311505 1515425 1573961 1431053 1518543 845424 858485 849494 1007509 867409 1292343
5889 1292343 1865601 1620004 1247085 1316023 1162079 1487487 1860860 2231877 1751172 1509235
5879 1509235 1549538 1910332 1894867 1955972 1989633 2338222 2109903 1949053 1882163 1551620
5869 1551620 1703887 1654216 1839562 1699578 1509963 1875176 1827701 2111695 2536201 2129187
5859 2129187 2085545 1959448 2211042 2359730 2378944 1819156 1855156 1435779 1543203 1903524
5849 1903524 1668927 1684557 2265013 1969504 2095346 2319705 1852918 2112642 2197050 2305266
5839B305266K74168J85615M18215j43952J25843J7836K49630m41148n09525L52829
5829B834777j62308j4933k27245M07809L53045k45960p81463q3904L8683K91502
5819B410003L18060o14224j58635M96552J1118k97647n54983j49392k97507J80748
5809A344093L29692o9813k42969j89739K29687Q7199j56929l4781M2043J46494
5799A484977L99496L68295p48556n7025O71224n25888j81829J00872o3383K11741
5789A659924P0366l55317r4754K11357j71251J6004m2767l3793Q02804K4599k89270
5778A797902J88122J87292K40112k98566m06056L05763l26491K42835j26495N5988
5768A860406p2466K03589J91777j79730Q6307J16207J2375k86146J98139n37877
$$ plain form
5839 2305266 2579434 2765049 3183264 3039312 3165155 3182991 3432621 2991473 2481948 2834777
5829 2834777 2672469 2657536 2430291 2838100 3191145 2945185 2163722 2079818 2118501 2410003
5819 2410003 2728063 2113839 1955204 2451756 2462874 2165227 1610244 1460852 1163345 1344093
5809 1344093 1673785 1603972 1361003 1171264 1400951 1488150 1331221 1296440 1338483 1484977
5799 1484977 1884473 2252768 1504212 1447187 2118411 1592523 1410694 1511566 1448183 1659924
5789 1659924 1730290 1374973 1280219 1491576 1320325 1336329 1293562 1259769 2062573 2087172 1797902
5778 1797902 1986024 2173316 2413428 2114862 1708806 2014569 1688078 1930913 1804418 1860406
5768 1860406 1787940 1991529 2183306 2003576 2089883 2206090 2218465 1932319 2130458 1592581
5758A592581L69513L32844k4401N3123k19647O13789M0742n89870o1652l25688
5748A781334J6812M3647L5009N15200J88239R1643m749l68061L26866P3269k09402
5737B489807m67663J70305M30289m1961k11457j06147L40520l49790j8424j90678
5727B044801o26674K48831L17646J45249K28601L49030K45732j17021r4906j82098
5717B559191J7911L52044N52443k19114l67486O27690n66398r3576n5178L92065
5707C199592J19598Q5387N82914m60710l47245J27917J93496l80633j84723K50133
5697C185726O30455n59614J21379j26338p1735N91117M13835k26712n11647p80129
5687B666337K86639L12569R5026K67099J7636O4006k14406K16347J0953l5192
$$ plain form
5758 1592581 1962094 2294938 2270537 2323660 2104013 2717802 2758544 2168674 2107022 1781334
5748 1781334 1798146 1841793 1876802 2392002 2580241 2671884 2667135 2299074 2625940 2699209 2489807
5737 2489807 2022144 2192449 2622738 2580777 2369320 2263173 2603693 2253903 2235479 2044801
5727 2044801 1418127 1666958 1984604 2129853 2358454 2707484 2953216 2836195 2741289 2559191
5717 2559191 2577102 2929146 3481589 3262475 2894989 3522679 2956281 2862705 2807527 3199592
5707 3199592 3319190 3404577 3987491 3526781 3179536 3307453 3500949 3120316 2935593 3185726
5697 3185726 3816181 3256567 3377946 3251608 3179873 3770990 4184825 3958113 3446466 2666337
5687 2666337 2952976 3265545 3360571 3627670 3645306 3709312 3494906 3711253 3722206 3687014
5677C687014N04015J97247l15877q4159M14130J68051J25802k32352j81426O1528
5667D343973n07351J05767j823M28666Q50001n56048k35776L45904M3333k63999
5657D552647j21870P0686l6505O49876l3080l84886k31214L35334j11574k93801
5647D395613Q35163M56378k56786J41214N2829m67665k44348r4382L22901L35040
5637E475957k77807K03608N68179j39275L3025j81028n4943L78461l91765L31280
5627E945692K16248P1440K52235l02800N9186j9605J97453m08148j7157K99931
5617F294475L08774L99674K76543K67782m91773k78230J56594K70352l0426N47300
5607G721065L8200k96664K59320L48202k85631M38768n0412k92665k3622l677
$$ plain form
5677 3687014 4191029 4388276 4072399 3988240 4402370 4570421 4696223 4463871 4282445 4343973
5667 4343973 3836622 3942389 3940566 4369232 5219233 4663185 4427409 4773313 4816646 4552647
5657 4552647 4430777 4501463 4464958 5114834 5081754 4696868 4465654 4800988 4689414 4395613
5647 4395613 5230776 5687154 5430368 5571582 5624411 5156746 4912398 4818016 5140917 5475957
5637 5475957 5198150 5401758 5969937 5830662 5863687 5682659 5627716 6006177 5614412 5945692
5627 5945692 6161940 6233380 6485615 6182815 6242001 6222396 6419849 6011701 5994544 6294475
5617 6294475 6603249 7002923 7279466 7547248 7055475 6777245 6933839 7204191 7173765 7721065
5607 7721065 7759265 7462601 7721921 8070123 7784492 8223260 8172848 7880183 7856561 7852884
5597G852884O83041j13649J41696l68993m5544L19472K40321N2220j39929k27649
5587H393870r2472M11316k97786J188k8276K11904K94712K98351M99279L98949
5577A0091035r9555p5156L78098l97423K0706J42461j91203K77996J3044L79786
5567A0539789R4096k19505r1580K5993k5277J32502N50202O0996L42430j17452
5557A1292194k49584k01162j54832M37847K87545K97977j81101M50578k649J26221
5547A2103034l38175M32628N19782q7371j95892l61457N26916L09791j42153m05055
5537A2362048p74232L12281M45501n1194N77989k93623l09622N96935R02257L77617
5527A4145957J50474O6246K55404R12617O68656J96440m4378L7969M86713N50669
$$ plain form
5597 7852884 8535925 8422276 8563972 8194979 8149435 8468907 8709228 8761448 8621519 8393870
5587 8393870 8301398 8712714 8414928 8416116 8387840 8599744 8894456 9192807 9692086 10091035
5577 10091035 9991480 9916324 10294422 9896999 9917705 10060166 9868963 10146959 10160003 10539789
5567 10539789 10633885 10414380 10322800 10348793 10323516 10456018 11006220 11067216 11409646 11292194
5557 11292194 11042610 10841448 10686616 11124463 11412008 11709985 11528884 11979462 11976813 12103034
5547 12103034 11764859 12197487 12717269 12629898 12434006 12072549 12599465 12909256 12767103 12362048
5537 12362048 11587816 11900097 12345598 12294404 12872393 12578770 12269148 12866083 13768340 14145957
5527 14145957 14296431 14362677 14618081 15530698 16199354 16395794 16351416 16389385 16876098 17426767
5517A7426767N47951j68570L93797L11672J62395N24169N94561l6978M59207r3423
5507B0121548M04629r2350Q5996O34102L48085M45673J5696J70835N17251J36387
5497B2787852O97212R12320J78723k79676N96292P60915M60966N10701k61048
5488B6364257M18269k14674M0245k0675j51281J13926O03719N66445J12733j2914
5478B7820050n9218n74236l25145O4172L53947M91230J63310L05544L63278M28530
5468B9031462n98860j50440P41901P47934J72951Q5937K51234J420883N99586
5459C2302588j34433M05912j45105K53824L58436M20076J70562R9984K53579K76151
5449C4261574L17968j8621L09940K76323j65008K83273N96535L73998J55612L03145
$$ plain form
5517 17426767 17974718 17806148 18199945 18511617 18674012 19198181 19792742 19755764 20214971 20121548
5507 20121548 20526177 20433827 20519823 21153925 21502010 21947683 21963379 22134214 22651465 22787852
5497 22787852 23485064 24397384 24576107 24296431 24892723 25653638 26114604 26625305 26364257
5488 26364257 26782526 26567852 26608097 26587422 26436141 26550067 27153786 27720231 27832964 27820050
5478 27820050 27760832 27186596 26861451 26925623 27279570 27770800 27934110 28239654 28602932 29031462
5468 29031462 28432602 28282162 29024063 29771997 29944948 30030885 30282119 31703002 32302588
5459 32302588 32168155 32574067 32428962 32682786 33041222 33461298 33631860 33731844 33985423 34261574
5449 34261574 34579542 34560921 34870861 35147184 34982176 35265449 35861984 36235982 36391594 36694739
5439C6694739O98777P11720N20037O72475J007058J015569J118158Q60913J361224
5430D4660670J235353M39576J616432J463394J182845J259845p3215k72092P2728
5421E1585536o49112J94856R3612K48296L16532J078105R08544M49987l03015
5412E3923341M19691O85870p81080o49633l77116o42961r35699l47432l09546
5403E0985435N72909R04048M30399J78968K23033L55027N32331k1468L47632K5
5393E4508339Q2893q7964K88677M80971Q35505J132494L97795k8005M06967J074724
5383E9092396J055659J023427Q40768J302597J124134J247883J526860J668296
5375F8882020J810921J221157J055349J978542J520469J889921J701219K638308
$$ plain form
5439 36694739 37393516 38105236 38625273 39297748 40304806 41320375 42438533 43299446 44660670
5430 44660670 45896023 46335599 47952031 49415425 50598270 51858115 51784900 51512808 51585536
5421 51585536 50936424 51131280 51224892 51473188 51789720 52867825 53776369 54226356 53923341
5412 53923341 54343032 55028902 54247822 53598189 53221073 52578112 51642413 51294981 50985435
5403 50985435 51558344 52462392 52892791 53071759 53294792 53649819 54182150 54160682 54508314 54508339
5393 54508339 54591232 54503268 54791945 55272916 56108421 57240915 57638710 57610705 58017672 59092396
5383 59092396 60148055 61171482 62012250 63314847 64438981 65686864 67213724 68882020
5375 68882020 70692941 71914098 72969447 74947989 76468458 78358379 80059598 82697906
5367H2697906K534856K602945L006276L468387L812222M224301N266193N197238
5359A12810324O109451P263944P519192P862118O806671P296951P063053O979939
5351A69711643O690472O541943O340885N499826M710374L589213K865689K376256
5343B08326301K305747K833656K256451K785163L074642J229720M59132p46532
5335B22524280o91485o07285J016986Q12802J956535M029268M718151O047675
5327B39806927P930207R566934J0862285J2038145J3613346J5124913J6226525
5320C25169282J6524634J6089687J5140174J3066352R508883N689517K569046
5313D03757575O11369k166080l829934o804695q954066j0865127j1144051j0050393
$$ plain form
5367 82697906 85232762 87835707 90841983 94310370 98122592 102346893 107613086 112810324
5359 112810324 118919775 126183719 133702911 141565029 148371700 155668651 162731704 169711643
5351 169711643 176402115 182944058 189284943 194784769 199495143 203084356 205950045 208326301
5343 208326301 210632048 213465704 215722155 218507318 221581960 222811680 223270812 222524280
5335 222524280 221832795 221225510 222242496 223055298 225011833 229041101 233759252 239806927
5327 239806927 247737134 257304068 268166353 280204498 293817844 308942757 325169282
5320 325169282 341693916 357783603 372923777 385990129 395499012 401188529 403757575
5313 403757575 404368944 402202864 398372930 391568235 382614169 371749042 360604991 350554598
5305C50554598q697763o840820l367037n25156M73833J724020K835656M073073
5297C40230404M984700N597011O421739O651870P724711R532551J0976053J2560976
5289D04680015J2916784J1429331R316703N695603K365719q42686l516100l309959
5281D38735410l671945l848472o092561q949746j1003804j0780481r395187p129473
5273C77863741m726767k260984L50786K582527M226946L514525q20649p155434
5265C73574691j1700339j3887048j3003818j0070775n826448m472488m579207
5258C10034568m683897o564311n934387o336634o150420o302853p032066p353975
5250B59676025p654036p859558p244801p673647p183699o303141o443968n590509
$$ plain form
5305 350554598 341856835 335016015 331648978 331123822 331597655 333321675 336157331 340230404
5297 340230404 345215104 350812115 357233854 363885724 371610435 381142986 392119039 404680015
5289 404680015 417596799 429026130 438342833 444038436 446404155 445561469 442045369 438735410
5281 438735410 435063465 431214993 425122432 416172686 405168882 394388401 384993214 377863741
5273 377863741 373136974 370875990 371226776 373809303 378036249 381550774 380730125 373574691
5265 373574691 361874352 347987304 334983486 324912711 319086263 314613775 310034568
5258 310034568 305350671 298786360 292851973 286515339 280364919 274062066 267030000 259676025
5250 259676025 252021989 244162431 236917630 229243983 222060284 215757143 209313175 203722666
5242B03722666m236908l743767m095405n505656p579273q929497r972363q739115
5234A50920682p076018n991682n829432n192609m923311m091337m130987m520194
5226A09165112l388274l237386l073280k927857k275068k684060j838841j112376
5218H8627970j667589j109532o34530l1736q54592q00147n46041m03093m31090
5209H2149620n82748k48211o13938l99303Q07299O80369M99300j69127o22386
5200H1500875o21506j872294j721141j484155j655810j690881j743963j354271
5192F9356854j453111j248329j367070j352805j054185j202701R4490m07576l62708
5183F1002859J17157M90718l60801m40279J4702l34454Q466j68278n22366p27466
$$ plain form
5242 203722666 199485758 195741991 191646586 186140930 178561657 169632160 159659797 150920682
5234 150920682 143844664 137852982 132023550 126830941 121907630 117816293 113685306 109165112
5226 109165112 105776838 102539452 99466172 96538315 94263247 91579187 89740346 88627970
5218 88627970 86960381 85850849 85216319 85184583 84329991 83529844 82983803 82580710 82149620
5209 82149620 81566872 81318661 80704723 80305420 81112719 81793088 82292388 82123261 81500875
5200 81500875 80879369 79007075 77285934 75801779 74145969 72455088 70711125 69356854
5192 69356854 67903743 66655414 65288344 63935539 62881354 61678653 61773143 61365567 61002859
5183 61002859 61120016 61610734 61249933 60809654 60824356 60489902 60498368 60330090 59807724 59080258
5173E9080258q02430q03929j131291o05303l24252r15553r51444j395042j796558
5164E0354456j450687j227441j655868j585444q56316p78112n92493k93085p68625
5155D1146385l12621q9752q56190j099751o05367p03818r22116o51152k73593
5146C5632025k19229J76103P3464N48850q784n18213q22835j078127r86702j208551
5136C1588001j472246o79691n16968j197771r15197k20296p36810m33364n66205
5127B4849453l34763M66360m9913k39055J1250J43326K91508N92138q7522k35077
5117B5407705M84583N27211k70261P62202N43936M59457R0912R63452J50913J47514
5107B9267624l82632n20832q13543j128013m69263q00385M5474l41363l44256
$$ plain form
5173 59080258 58277828 57473899 56342608 55737305 55413053 54497500 53546056 52151014 50354456
5164 50354456 48903769 47676328 46020460 44435016 43578700 42800588 42208095 41915010 41146385
5155 41146385 40833764 40744012 39887822 38788071 38182704 37478886 36556770 35905618 35632025
5146 35632025 35412796 35588899 35662363 36211213 36202429 35684216 34861381 33783254 32796552 31588001
5136 31588001 30115755 29436064 28919096 27721325 26806128 26585832 25849022 25415658 24849453
5127 24849453 24514690 24981050 24931137 24692082 24703332 24846658 25138166 25730304 25642782 25407705
5117 25407705 25892288 26419499 26149238 26911440 27455376 27914833 28005745 28969197 29120110 29267624
5107 29267624 28884992 28364160 27550617 26422604 25953341 25152956 25198430 24857067 24512811
5098B4512811r0283j74287q78992r69067r7755K92462k44640k83649L14063Q24038
5088B3204701q0421J044511L49918J228265Q97496M17432R1240Q4049l84374j78747
5078B6674070k98891o98284L76792L47828l09937m86740k78847m90324j75279
5069B4660388l77516J5101j26731K12859O8823J12026O76120N89512J25876N14746
5059B6471204J58596L28703K89531L70229O20275m08257j15056K5169N18912O57931
5049B8917237K8495K53209M7970J75755j70827l49668q17120o72484j043220n15846
5039B5853501n35656l14903k4574k66076L6911K49450j54364l71017j82553j84015
5029B4106704q1536j04440J60007j31508R76815M57560p6208R2057L03681K65021
$$ plain form
5098 24512811 24422528 24248241 23369249 22400182 22302427 22594889 22350249 22066600 22380663 23204701
5088 23204701 23124280 24168791 24518709 25746974 26644470 27061902 27153142 27237191 26852817 26674070
5078 26674070 26375179 25676895 26053687 26401515 26091578 25604838 25325991 24835667 24660388
5069 24660388 24282872 24297973 24171242 24384101 24452924 24564950 25241070 25830582 25956458 26471204
5059 26471204 26629800 26958503 27248034 27618263 28238538 27830281 27715225 27740394 28259306 28917237
5049 28917237 28945732 29198941 29246911 29422666 29251839 28902171 28085051 27412567 26369347 25853501
5039 25853501 25317845 25002942 24978368 24712292 24749203 24998653 24844289 24473272 24290719 24106704
5029 24106704 24025168 23920728 24080735 23949227 24926042 25383602 25307394 25399451 25703132 25968153
5019B5968153k09053k63760n7932m33045K76569m3203L93285N82374l05251o8050
5009B5840087J284Q82007J73882L95823N87626L95347N17238J021329P41629P41590
4999C1297842L72414K15549P25315K02266P325M54488P22150M27100M78817J282996
4989C6186262J53001N54L17186j12500k29878R7279K75730m8632p0639L96011
4979C6964374k19305Q0275M23989l01812M48802L68651j77047r4076J25256J013407
4969C8632514M40920O46794J305451R14967R99174J586142J679256J895615J088937
4960D9189770J597761K581432K852007L493972L416806L602459K620716J256968
4952G0611891k36334j259754l054330m104713l955782l567488l283946j632224
$$ plain form
5019 25968153 25759100 25495340 25437408 25004363 25280932 25237729 25631014 26213388 25908137 25840087
5009 25840087 25841371 26723378 26897260 27293083 27880709 28276056 28793294 29814623 30556252 31297842
4999 31297842 31670256 31885805 32611120 32813386 32820711 33275199 33997349 34424449 34903266 36186262
4989 36186262 36339263 36339817 36657003 36544503 36314625 36411904 36687634 36639002 36568363 36964374
4979 36964374 36745069 36825344 37249333 36947521 37396323 37764974 37587927 37493851 37619107 38632514
4969 38632514 39073434 39720228 41025679 41940646 42939820 44525962 46205218 48100833 49189770
4960 49189770 50787531 53368963 56220970 59714942 63131748 66734207 69354923 70611891
4952 70611891 70375557 69115803 66061473 61956760 58000978 54433490 51149544 49517320
4944D9517320j102332j255461j242093m89254J4662o2557K9867J66956M59427
4935D6036535l0364K89582J246186M77079M27587L51563J17846m47094n22671
4926D7946249j150231j025707q92369j150458J75589m3332n05584k06999L47462
4917D3494620k52319j223546j514826j051415l42082j348487j135593r40125n88487
4908C5097740k41967m05710m32040J14607r0733j79241K07371L31039j66831J71684
4898C4405919R5043m3883N09109L81396L99265L17360L92075P20324J303242J065847
4888C9545697Q38832L02629L16112M98333l39063l1931K944m0429M4194R8621
4878D1235939O42805J128444O79719M96751J085642J438195P47875N68196J913226
$$ plain form
4944 49517320 48414988 47159527 45917434 45428180 45442842 45380285 45410152 45577108 46036535
4935 46036535 46006171 46295753 47541939 48019018 48446605 48798168 48916014 48468920 47946249
4926 47946249 46796018 45770311 44877942 43727484 43903073 43859741 43354157 43147158 43494620
4917 43494620 43242301 42018755 40503929 39452514 39110432 37761945 36626352 35686227 35097740
4908 35097740 34855773 34450063 34018023 34132630 34041897 33862656 34070027 34401066 34234235 34405919
4898 34405919 34500962 34457079 34966188 35347584 35746849 36064209 36456284 37176608 38479850 39545697
4888 39545697 40384529 40687158 41003270 41501603 41162540 41130609 41133553 41093124 41137318 41235939
4878 41235939 41878744 43007188 43686907 44183658 45269300 46707495 47455370 48023566 49936792
4869D9936792K286060J833284L77863Q0451J1091P00487N21237J533813J706661
4860E8987739K227148K829041L367005M463711N121911O167191P209842P963433
4852I8337021R109527O353794k0982m853289n569554l773191M02503L732578O307364
4843A10025771Q934868J2476581J5529488J3101109R3874j3444012j7680791j7678362
4835A11358526j1672905o480954k842533M85180K850101M624324M182531N82240
4827A03086510n851432r528416r805253p900402n783947l870510k831963j822516
4819E5692071j347123k170181r10044n13832j132023r02778j404375r05143o29439
4810D5777133l06845r45802j033639m64935r87380r29575n19645l06180n52349
$$ plain form
4869 49936792 52222852 54056136 54433999 54514450 54525541 55226028 55747265 57281078 58987739
4860 58987739 61214887 64043928 67410933 71874644 76996555 83163746 90373588 98337021
4852 98337021 107446548 113800342 113779360 108926071 103356517 99583326 99985829 103718407 110025771
4843 110025771 118960639 131437220 146966708 160067817 160161691 146717679 129036888 111358526
4835 111358526 99685621 93204667 90362134 90847314 93697415 98321739 102504270 103086510
4827 103086510 97235078 87706662 77901409 70001007 64217060 60346550 57514587 55692071
4819 55692071 54344948 52174767 51264723 50750891 49618868 48716090 47311715 46406572 45777133
4810 45777133 45470288 44524486 43490847 43025912 42038532 41108957 40589312 40283132 39730783
4801C9730783j17858j081632l98474P4808Q5360k40750j86273o50883j67244k83424
4791C6764413k84713j9761m13532p30749p591J95704q91008p59916n08002Q6207
4781C3431052k97820k44712M85194O07116M51913K69093K46733K16616N44522
4772C5709707J11319m81547l56558l92103n15577m3617q18567r72033K09498m19494
4762C2031028r76245o13231l94373m42528l41750o43555p30134l61876K6839p0005
4752B7484170n14274o07909q65627l58628k00421K81754L20789p93972q0482R9968
4742B4765368q68844K20547M15717j1477J90990M52915K43032l11332n79755l14580
4732B4202581q20944k14924O4040o28189p6841j24110J95858m08595L24061k14757
$$ plain form
4801 39730783 39612925 38531293 38132819 38207627 38292987 38052237 37865964 37215081 37047837 36764413
4791 36764413 36479700 36459939 36046407 35315658 35308067 35503771 34612763 33852847 33344845 33431052
4781 33431052 33133232 32888520 33373714 33980830 34432743 34701836 34948569 35165185 35709707
4772 35709707 35821026 35339479 34982921 34590818 34075241 34031624 33213057 32241024 32450522 32031028
4762 32031028 31054783 30441552 30047179 29604651 29262901 28619346 27889212 27527336 27554175 27484170
4752 27484170 26969896 26361987 25496360 25137732 24937311 25219065 25539854 24745882 24665400 24765368
4742 24765368 23896524 24117071 24532788 24521311 24712301 25165216 25408248 25096916 24517161 24202581
4732 24202581 23381637 23166713 23230753 22602564 22525723 22401613 22597471 22188876 22512937 22298180
4722B2298180N9281O8009k96469Q8292Q9590j71104M20066L36492j25089Q3360
4712B2850608l42355l59774K04934K1154O4645M17900j52300n20210P2357M38828
4702B2695787O43809L58325j29112R113K74769L84822K74133L17515L3038M42833
4692B5305032K07554K72886K16391M59858P29449J4203N1025K33442J83780k1551
4682B7652069M50415N17165k84930L81254M15796J007266K54966O844O75237L02917
4672C1378999N80388M19488J116725N49912K20699P03388P69017J032820Q58136
4663C7629572J051389P86424P93956K76670R56403J505098J059754J083247J198456
4654D6340969J698271J208719J584026K023321K258028K142680P08604J956384
$$ plain form
4722 22298180 22357461 22425470 22129001 22217293 22306883 22135779 22555845 22892337 22767248 22850608
4712 22850608 22508253 22148479 22353413 22374567 22439212 22857112 22704812 22184602 22256959 22695787
4702 22695787 23339596 23697921 23568809 23577922 23852691 24237513 24511646 24829161 24862199 25305032
4692 25305032 25512586 25785472 26001863 26461721 27191170 27205373 27256398 27489840 27673620 27652069
4682 27652069 28102484 28619649 28334719 28715973 29131769 30139035 30394001 30400845 31076082 31378999
4672 31378999 31959387 32378875 33495600 34045512 34266211 34969599 35738616 36771436 37629572
4663 37629572 38680961 39467385 40261341 40538011 41494414 42999512 44059266 45142513 46340969
4654 46340969 48039240 49247959 50831985 52855306 55113334 57256014 57964618 59921002
4646E9921002J655450J354689J965903Q25070Q45635N76618K74458O80774J476798
4637F9576397J256188K206922K229409K888819L330350L295168L694102L261639
4629I1738994K931441K571028K961162K416475L275854L106264L235487K985356
4621A15222061L357747K760793J635547J384468J028789J207611J445051J287841
4613A29329908J775113K583183L386987M813197N421734O250366N865963M971122
4605A64397573M324190M210061L236439J637348Q85825M70641J332541K577792
4597A83072410K706486K014013L09639j058122j374849p68125J34531J231915
4589A86267898J239707J068623R9974j216451j286243q56062R17044L020479M585666
$$ plain form
4646 59921002 61576452 62931141 64897044 65722114 66567749 67144367 67418825 68099599 69576397
4637 69576397 70832585 73039507 75268916 78157735 81488085 84783253 88477355 91738994
4629 91738994 94670435 97241463 100202625 102619100 105894954 109001218 112236705 115222061
4621 115222061 118579808 121340601 122976148 124360616 125389405 126597016 128042067 129329908
4613 129329908 131105021 133688204 137075191 141888388 147310122 153560488 159426451 164397573
4605 164397573 168721763 172931824 176168263 177805611 178691436 179162077 180494618 183072410
4597 183072410 185778896 187792909 188102548 187044426 185669577 184901452 185035983 186267898
4589 186267898 187507605 188576228 188676202 187459751 186173508 185317446 186234490 189254969 193840635
4580A93840635O077913O944125O706610O375398N904140K966033K139429K402927
4572B33357210K578621L597950L783236M094978L043644Q27623O2835n4625O93668
4563B51985140J342844J525987m29072r54254k497604k562151j102297P49933
4555B48058526K223997M586581N947717P440998R662545R146542Q615518P514835
4547C03197259N838043M925107L806522L884771L641576L033598K607668K882816
4539C33817360J800568m39880k911131o225384o012261m649758r67241J551024
4531C15963297L174891M934330O224067P118444O152506L192137P97241l76890
4523C47180023J09047P11446M96689j386795l954216n639605m491499m027304
$$ plain form
4580 193840635 199918548 206862673 213569283 219944681 225848821 228814854 230954283 233357210
4572 233357210 235935831 239533781 243317017 247411995 250455639 251283262 251346097 251291472 251985140
4563 251985140 253327984 254853971 254424899 253470645 250973041 248410890 247308593 248058526
4555 248058526 250282523 254869104 260816821 268257819 277920364 287066906 295682424 303197259
4547 303197259 309035302 313960409 317766931 321651702 325293278 328326876 330934544 333817360
4539 333817360 335617928 335178048 332266917 326041533 320029272 315379514 314412273 315963297
4531 315963297 319138188 324072518 330296585 337415029 343567535 346759672 347556913 347180023
4523 347180023 347289070 348000516 348497205 347110410 343156194 337516589 333025090 328997786
4515C28997786k072519j780976k878626l670247m525089n321835o261492p034988
4507B95452014o349268n669795l552616k021588n84109r59834r16221k548797
4499B72849786k921933m430622n575651o061586o684934n618728n400547l939764
4491B32216021l780776k457131p59122N2396M10342j519672m508103o324566p846249
4482B05483140o584583n367341m108159l792795k964643k472943j947572j344468
4474A76900636j819752k015638j413010j399285r69953k255321k123149l194691
4466A61709837k776671k255417j223932q87977j979492r11996q62860p22660k272891
4457A47815941l719573l133686k138621r93256j02775L73706Q46952L93584O16202
$$ plain form
4515 328997786 326925267 325144291 322265665 318595418 314070329 308748494 302487002 295452014
4507 295452014 289102746 283432951 279880335 277858747 277274638 276314804 275398583 272849786
4499 272849786 269927853 265497231 259921580 253859994 247175060 241556332 236155785 232216021
4491 232216021 228435245 225978114 225218992 225271388 225681730 224162058 219653955 213329389 205483140
4482 205483140 198898557 193531216 189423057 185630262 182665619 180192676 178245104 176900636
4474 176900636 175080884 173065246 171652236 170252951 169282998 167027677 164904528 161709837
4466 161709837 158933166 156677749 155453817 154565840 152586348 151674352 150811492 150088832 147815941
4457 147815941 144096368 140962682 138824061 137830805 137728030 138101736 138948688 139342272 139958474
4448A39958474p90190j697779j568883j179436j628649p69571k2709q29333r85760
4439A30486164j129288m83131r20823j597857j831634k126163k079248k284869
4431A18033151k800087k379819k397466j874831j656083j389900j237744m82616
4423A03814605j185484j606179j771553k159672k311459l411188l633388k964613
4415H4771069k762751j595392j609634j316849r31066j023081j104341q01011
4407G3626944o98309j090564j451382j510956j813917j655199j098901j084457
4399F3223259j596245j768336n22442q72913l10195p74675j63766J69205n6071
4390E7327821L15783M89435m58286q38839n61226m62573m03767p33718j078811
$$ plain form
4448 139958474 139168284 137470505 135901622 134722186 133093537 132323966 132301257 131471924 130486164
4439 130486164 129356876 128873745 127952922 126355065 124523431 122397268 120318020 118033151
4431 118033151 115233064 112853245 110455779 108580948 106924865 105534965 104297221 103814605
4423 103814605 102629121 101022942 99251389 97091717 94780258 91369070 87735682 84771069
4415 84771069 82008318 80412926 78803292 77486443 76555377 75532296 74427955 73626944
4407 73626944 72928635 71838071 70386689 68875733 67061816 65406617 64307716 63223259
4399 63223259 61627014 59858678 59336236 58463323 58153128 57378453 57214687 57383892 57327821
4390 57327821 57643604 58133039 57674753 56835914 56274688 55812115 55408348 54674630 53595819
4381E3595819j84280M55124P88315Q31397O89753R34077L73850O50937o10503
4372E7524489p84484j266183k111072k097459j601509r49530m45991j59442p51805
4363D7357014j12303j49282r73339j64846M88031n80188q82525j252004q43151
4354D2887407k58102m06324n24657k15027k08468l88918m2022q9700K02707O24801
4344D1581697K65535k79640L15358M3012l37270k2908n26357k80538n18667k03975
4334D0036247K00305n6484L38437Q14320O16537K16972M26946l37728n41910l37534
4324D1376108q1219P02176L66953N37592R93521J220956J051678J552242K301970
4315E0021977J601647Q16556J133545J154741M70409M94805J48507J96641L97954
$$ plain form
4381 53595819 53411539 53866663 54654978 55486375 56176128 57110205 57484055 58134992 57524489
4372 57524489 56740005 55473822 53362750 51265291 49663782 48714252 48268261 48108819 47357014
4363 47357014 47244711 47095429 46122090 45957244 46445275 45865087 44982562 43730558 42887407
4354 42887407 42629305 42222981 41698324 41483297 41274829 40885911 40843889 40754189 40956896 41581697
4344 41581697 41847232 41567592 41882950 41925962 41588692 41565784 41039427 40758889 40240222 40036247
4334 40036247 40236552 40180068 40518505 41332825 41949362 42166334 42593280 42255552 41713642 41376108
4324 41376108 41294889 41997065 42364018 42901610 43895131 45116087 46167765 47720007 50021977
4315 50021977 51623624 52440180 53573725 54728466 55198875 55693680 55842187 56038828 56436782
4306E6436782J260782J179998O14564R64902R5684K91894j40812K80436N64435
4297F1548665j314982l065049m045931l410568m020576l124200k776409l034693
4289C6756257j842153k032246j488884j142947j179605j059814r12790q6033m59451
4280B6552334j079367n42251m94405m64674j00341q3721l00460n51244p16179
4271B2219692m27651K32103n882O14147K53463q23286l52899k38791j00755q6342
4261B1283799n47541k42543j06497k03391K21595J1036l31816P5191M01459L13567
4251B0874859M13248m84963q46703l16675L1785j9141J65638m21266J98655m23343
4241A9172094N3299j66394L18428Q1914j91664J91280j95398j70449J65558J29521
$$ plain form
4306 56436782 57697564 58877562 59492126 60457028 60552712 60844606 60703794 60984230 61548665
4297 61548665 60233683 57168634 53122703 49712135 45691559 42567359 39790950 36756257
4289 36756257 34914104 32881858 31392974 30250027 29070422 28010608 27097818 27011785 26552334
4280 26552334 25472967 24930716 24436311 23971637 23871296 23787575 23487115 22935871 22219692
4271 22219692 21792041 22024144 22018262 22632409 22885872 22062586 21709687 21470896 21370141 21283799
4261 21283799 20736258 20493715 20387218 20183827 20405422 20416458 20084642 20159833 20561292 20874859
4251 20874859 21288107 20803144 19956441 19639766 19671551 19652410 19818048 19396782 19595437 19172094
4241 19172094 19225393 19058999 19377427 19459341 19267677 19458957 19263559 19093110 19258668 19388189
4231A9388189N86278K76697p82340L31543O9434k24095j37652O1582l79433N4409
4221A9244612q14171J95768Q14362m10346j28651P72011j91388j7803L89170k60468
4211A9593096j11495N17254k18151L39751J25053m54725m89759l76402M7426M506
4201A8976554N18110P0780J46719K97882N63519N65144M58608J67483M44055K61189
4191B2470043K86575o0504Q1817q3703P5548J01277p6084L60119k98362L6856
4181B2893582m47510j8638j06175Q95000N38343M56935J76911J93971J089470
4172B5671889N54350L82742k16255j05826L87630p7610q9181l26116o54215P0868
4162B5598276M40215m20203K5670K66518L79314Q4003J3478L59945L97721M8756
$$ plain form
4231 19388189 19974467 20251164 19468824 19800367 19869801 19645706 19508054 19569636 19190203 19244612
4221 19244612 18430441 18626209 19440571 19030225 18901574 19673585 19482197 19464394 19853564 19593096
4211 19593096 19481601 19998855 19780704 20120455 20245508 19790783 19301024 18924622 18972048 18976554
4201 18976554 19494664 19565444 19712163 20010045 20573564 21138708 21597316 21764799 22208854 22470043
4191 22470043 22756618 22696114 22777931 22694228 22769776 22871053 22794969 23155088 22856726 22893582
4181 22893582 22446072 22427434 22321259 23216259 23754602 24211537 24388448 24582419 25671889
4172 25671889 26226239 26608981 26392726 26286900 26674530 26596920 26507739 26181623 25527408 25598276
4162 25598276 26038491 25618288 25643958 25910476 26289790 26373793 26387271 26747216 27144937 27193693
4152B7193693m52208j17466n35787N98451l80220m33553N81231q9097l79404N85606
4142B6571246j84012N36310j05357J04807M55492N17791N64964j12868j56241
4133B8192132J34862J43933M9646K6956j9258J64205k35999Q5168M54438K1670
4123B9017753k53386L13792O860K13072J84113P78404M47776M9005K76305L17813
4113C1351507M17204N82057n21844o50811N52629k43196q99293n0521l28208J87242
4103C0396766o44722k81633n49582l46354N77241L68102o2393k26291l44095N3218
4093B8940257K25485K5800o05337n09691k1053m29302k34336J34821p71327k75823
4083B6479494J9564k9142p5808P1564J20209l08017J25139l95805j07732o96277
$$ plain form
4152 27193693 26741485 26624019 26088232 26686683 26306463 25872910 26454141 26365044 25985640 26571246
4142 26571246 26387234 26923544 26818187 26922994 27378486 27896277 28461241 28348373 28192132
4133 28192132 28326994 28470927 28520573 28547529 28528271 28692476 28456477 28541645 28996083 29017753
4123 29017753 28764367 29078159 29085019 29298091 29482204 30260608 30708384 30757389 31033694 31351507
4113 31351507 31768711 32350768 31828924 31178113 31730742 31487546 30588253 30537732 30209524 30396766
4103 30396766 29752044 29470411 28920829 28574475 29151716 29519818 29457425 29231134 28887039 28940257
4093 28940257 29165742 29191542 28586205 28076514 28055461 27626159 27391823 27526644 26755317 26479494
4083 26479494 26499058 26469916 26394108 26465672 26585881 26277864 26403003 26007198 25899466 25203189
4073B5203189m039k57123K69099o92283L0953n7942k76398j51927L2322k66507
4063B3829344J93096K55589k57256M3769R00960M89246J9628j6648n58K46331
4053B5703501k06169k62339k35961o76935l71713M15993N08976k05559M79740
4044B5149534M89948n07890j49308K79094J00944L33347j81889M61600O35267
4035B6610647N41691L44351N35382P50971M11197J195914r1445k42524j48513
4026B9907671p833K64333l04549j37245l898M43217L88936j96979P45578N26131
4016C1625362P79645N39833M56813J203425J421859P44673K15796M30034J75761
4007C7593201o2835O85k44760l28020m60410J69945M75823l32335J99925M37288
$$ plain form
4073 25203189 25199150 24942027 25211126 24518843 24549796 24491854 24215456 24063529 24095851 23829344
4063 23829344 24022440 24278029 24020773 24064542 24965502 25454748 25474376 25457728 25457170 25703501
4053 25703501 25497332 25234993 24999032 24322097 23950384 24366377 24875353 24669794 25149534
4044 25149534 25639482 25131592 24982284 25261378 25362322 25695669 25513780 25975380 26610647
4035 26610647 27152338 27496689 28032071 28783042 29194239 30390153 30298708 30056184 29907671
4026 29907671 29899838 30164171 29859622 29722377 29718479 30161696 30550632 30353653 31099231 31625362
4016 31625362 32405007 32944840 33401653 34605078 36026937 36771610 36987406 37417440 37593201
4007 37593201 37530366 37531051 37286291 36958271 36497861 36667806 37143629 36811294 37011219 37448507
3997C7448507Q19003P71355L85373P05387N2208P85939L03565J249841Q78652
3988D3399830J136610Q41488J294746J255437O35542P94722J646740R51925R26315
3979E2883355J834117K575279K687397L036950L804154L354853M044271L729643
3971G7950019M142474L654961J733844J083789P23017k11078j561471j624168
3963H5891387k235154l060362l004605k629066j924678j668516j204625j991115
3955F8173266k314506j601453k266878j932016j653029j442839j323741j937658
3947E3701146k464536k374233j862940k251387k236284k285877k212109j748886
3939C6264894j759968j579943r56084l88405o61465j217862r64548j98668r6944
$$ plain form
3997 37448507 38267510 39038865 39424238 40129625 40181833 40967772 41271337 42521178 43399830
3988 43399830 44536440 45377928 46672674 47928111 48563653 49358375 51005115 51957040 52883355
3979 52883355 54717472 57292751 59980148 63017098 66821252 70176105 74220376 77950019
3971 77950019 82092493 85747454 87481298 88565087 89288104 89077026 87515555 85891387
3963 85891387 83656233 80595871 77591266 74962200 73037522 71369006 70164381 68173266
3955 68173266 65858760 64257307 61990429 60058413 58405384 56962545 55638804 53701146
3947 53701146 51236610 48862377 46999437 44748050 42511766 40225889 38013780 36264894
3939 36264894 34504926 32924983 31968899 31580494 30919029 29701167 28736619 28537951 28441007
3930B8441007l74507j99994k63657J04262k02034J81639q4543n11596o60179p99884
3920B5630514r89333r81911m51852n45550q93566K3110n57844j5299P1870k36705
3910B1053434j5063J92891m88280m8923q4308n08641l75542k1198k34620q4058
3900A9385692l0853p11070P3584K05703j62688K45271L5573N27942P03980p6326
3890B0196808K86499k0626k85241j71727n01277j02882m42617o72942o7603k65152
3880A7953240K96231m79665r89478O3574K60238j55982q23749n49361L99120M01438
3870A6375606j51184M85597K5871l09850o47664k9654k41275M3807N2225r10572
3860A4692907k00633l96992j36753l53599q24396p02237J41712m77738k47276
$$ plain form
3930 28441007 28066500 27866506 27602849 27707111 27505077 27686716 27602173 27090577 26430398 25630514
3920 25630514 24641181 23659270 23207418 22661868 21768302 21791412 21233568 21218269 21290139 21053434
3910 21053434 21038371 21231262 20742982 20694059 20609751 20101110 19725568 19704370 19469750 19385692
3900 19385692 19354839 18643769 18717353 18923056 18760368 19005639 19041212 19569154 20273134 20196808
3890 20196808 20483307 20462681 20177440 20005713 19504436 19401554 18958937 18285995 18218392 17953240
3880 17953240 18249471 17769806 16780328 16843902 17104140 16948158 16124409 15575048 15974168 16375606
3870 16375606 16224422 16710019 16735890 16426040 15778376 15748722 15507447 15551254 15603479 14692907
3860 14692907 14492274 14095282 13958529 13604930 12780534 12078297 12220009 11742271 11494995
3851A1494995K31753J0087J22746K95946L07671J95161J21679L77943M21237k36081
3841A3343137m34616o44984k0664J9505J21491k85860j15383K04846r47608N3769
3831A1293633L17265O9842l09001L05213l31869n42411K16377o7407R8515J11919
3821A1162076j89710r1626l53637n32612M46195J42596q09375l29187Q1069l92102
3811I133687p46224K11548l77547j78915o39082n49302J62281k65506k9058l66488
3801F355394L75140M22104m96762k13444J67679j6017j12210M14037O66650m28931
3791G133640k44193l60777L31582O25260M1686O66836K3606k13820Q7012l28225
3781G762607k74934J17664n51927j6745j47366n35686M7604m55241L96468N3830
$$ plain form
3851 11494995 11726748 11736835 11859581 12155527 12463198 12658359 12780038 13157981 13579218 13343137
3841 13343137 12908521 12263537 12242873 12262378 12383869 12098009 11982626 12187472 11239864 11293633
3831 11293633 11610898 11680740 11371739 11676952 11345083 10802672 11019049 10951642 11050157 11162076
3821 11162076 10972366 10880740 10527103 9994491 10440686 10583282 9773907 9444720 9525789 9133687
3811 9133687 8387463 8599011 8221464 8042549 7403467 6854165 7016446 6750940 6721882 6355394
3801 6355394 6730534 7152638 6655876 6442432 6610111 6594094 6481884 6895921 7562571 7133640
3791 7133640 6889447 6528670 6860252 7485512 7527198 8194034 8217640 8003820 8090832 7762607
3781 7762607 7487673 7605337 7053410 7036665 6889299 6353613 6401217 5945976 6342444 6396274
3771F396274j7113l08706p38777n70985j4235K3430l00776L0096J59219L69246
3761E027673j24994j3910m17229N8279L50200P8957K13855m65767p22859j19753
3751C864452K78828P11860J10674J32770j25793k40624q6940k35879P4395K57918
3741D741661k46963m95848L41788J26455K39625j40894J37291j12306R6111m8578
3731D638342L39467P6037n44144L42328M42880M2898k83187j62532K00762j33583
3721D959268O82267J35605l49057J99946Q1765r1506l23061K3191M19381K4555
3711E762354J5938k62418M26312K92190j94441k77078P4230M38636k25392P9349
3701F129680R7886J63086k84607L14665K53315N55013n02769J3368m0123l0614
$$ plain form
3771 6396274 6379161 6070455 5331678 4760693 4746458 4769888 4469112 4499208 4658427 5027673
3761 5027673 4902679 4888769 4471540 4529819 4880019 4958976 5172831 4707064 3984205 3864452
3751 3864452 4143280 4855140 4965814 5098584 4972791 4732167 4645227 4409348 4483743 4741661
3741 4741661 4494698 3998850 4340638 4467093 4706718 4565824 4703115 4590809 4686920 4638342
3731 4638342 4977809 5053846 4509702 4852030 5294910 5337808 5054621 4892089 5092851 4959268
3721 4959268 5641535 5777140 5428083 5628029 5709794 5618288 5295227 5318418 5737799 5762354
3711 5762354 5778292 5515874 5942186 6234376 6039935 5762857 5837087 6275723 6050331 6129680
3701 6129680 6227566 6390652 6106045 6420710 6674025 7229038 6726269 6739637 6699514 6668900
3691F668900L64331K46200N97169N63976n09690N75979J33532l06593L85407M47438
3681I166649J61096j62729J60066Q6458M38218l290P8167K49119N61492M77631
3671A1212877n38261k70204N00150L88723K57610O56414J64528Q22939J182428
3662A4377204R97998j08688k0415P15559J152037J547870J122158J101168O87704
3653B1572595J428799J490240J546418Q49963O40414K35831K81330n58570p71107
3644B6715913J27316P09389k80271j91770L37348K57446L65495J8480J93757K29566
3634B8482669L49471K86393n2009L77673Q85589R65152N41972K233438J503633
3625C5573981K434220K784517L101254L465059M371955L195040k3654k337533
$$ plain form
3691 6668900 7033231 7279431 7876600 8440576 7930886 8506865 8640397 8333804 8719211 9166649
3681 9166649 9327745 9165016 9325082 9411540 9849758 9846468 9924635 10173754 10735246 11212877
3671 11212877 10674616 10404412 10904562 11293285 11550895 12207309 12371837 13194776 14377204
3662 14377204 15375202 15266514 15246099 15961658 17113695 18661565 19783723 20884891 21572595
3653 21572595 23001394 24491634 26038052 26888015 27528429 27764260 28045590 27487020 26715913
3644 26715913 26843229 27552618 27272347 27080577 27417925 27675371 28040866 28059346 28253103 28482669
3634 28482669 28832140 29118533 29066524 29444197 30329786 31294938 31836910 34070348 35573981
3625 35573981 38008201 40792718 43893972 47359031 51730986 54926026 54902372 52564839
3617E2564839m852943m614464m717322l203076k689546k225467j623775j470105
3609B7168141j104136p13176o87299l06039o64216q29759l18568K92667k6698
3600B2810917k15283K30877O84598Q0289l43857Q38774L57145Q98129q1355L48523
3590B5608757r9834k13155k45612j151041j144712j463169j549118j525432q67204
3581A7349480j020508j090054n34993p37933m82805p04568p43369m89673n01486
3572A1044091n21383m40674n30830p08408k70142P0222j77421m09723k41979k16206
3562G597547K62196n12047J36290p98840m600l81807O0234m19921p7305K47260
3552F109007j91602k30490r4055k15898l24315k59521m53189o0279n242j68222
$$ plain form
3617 52564839 47711896 43097432 38380110 35177034 32487488 30262021 28638246 27168141
3609 27168141 26064005 25350829 24663530 24357491 23693275 22863516 22544948 22837615 22810917
3600 22810917 22595634 22826511 23511109 23591398 23247541 24086315 24443460 25341589 25260234 25608757
3590 25608757 25508923 25295768 25050156 23899115 22754403 21291234 19742116 18216684 17349480
3581 17349480 16328972 15238918 14703925 13965992 13483187 12778619 12035250 11545577 11044091
3572 11044091 10522708 10082034 9551204 8842796 8572654 8642876 8465455 8055732 7813753 7597547
3562 7597547 7859743 7347696 7483986 6685146 6680546 6298739 6358973 5939052 5861747 6109007
3552 6109007 5917405 5686915 5592860 5376962 5052647 4793126 4339937 4279658 4274416 4106194
3542D106194P8067K24154j40040p44168k31675K40177m13532j63206j50247K91808
3532C097532M26077m6118m80497k34476M65567m6023k69122l04979n107n19056
3522B083798Q571N73542J6635K68643k66486r39761Q8653J40647J88664M07447
3512B570353p83386J3400J05081J37402j10679J60062K8431J60469l71330M60562
3502B370365j4252n36791J21358K07102q5150m78137k22836L3505K16815K04996
3492A816975L05760l03068N3867m78711k38897M2146J18541q4405K97469m698
3482A524979j246670M24849N44608o47943j15427K68333L40172k59051j05367
3473G28483O53700P7440o6160k4048J55525l05423o70371q8062l2866L9483M57057
$$ plain form
3542 4106194 4184261 4408415 4268375 3524207 3292532 3532709 3119177 2955971 2805724 3097532
3532 3097532 3523609 3477491 2996994 2762518 3228085 3182062 2912940 2607961 2602854 2083798
3522 2083798 2092369 2665911 2682546 2951189 2684703 1744942 1833595 1974242 2162906 2570353
3512 2570353 1786967 1800367 1905448 2042850 1932171 2092233 2120664 2281133 1909803 2370365
3502 2370365 2356113 1819322 1940680 2147782 2062632 1584495 1361659 1395164 1611979 1816975
3492 1816975 2122735 1819667 1873534 1394823 1155926 1198072 1316613 1232208 1529677 1524979
3482 1524979 278309 703158 1247766 599823 484396 752729 1092901 833850 728483
3473 728483 1382183 1459623 1393463 1369415 1524940 1219517 549146 461084 428218 467701 924758
3462I24758l0781k4742N36233k90144j36105J25363k27843J90878K23832j76235
3452A115214j76979Q2588k16306j35419J57475L54025j48089L90888K06972j092253
3442E38116j45709J891L57542j7522r30572O33717J13591M12690L1840q4495n396
3431I05693o20921N3549J49335j64170K9526J47070j31315n5021l62512m23361
3421d72127O83594j13158r2670K56412L33307r1495M0392L27435k96452k64385
3411C10853J51342M50549l91046n7294L57155O1489k49892m0881J7405J13155
3401G22835R7603m9884j38877l48355k16068L44868K16209k01289J39854k50359
3391C16537j32824L17632k18495l5721K03090N8209k09777O1888j78098j53594
$$ plain form
3462 924758 893977 869235 1405468 1115324 979219 1104582 876739 1067617 1291449 1115214
3452 1115214 938235 1020823 804517 669098 826573 1180598 1032509 1423397 1630369 538116
3442 538116 392407 394298 751840 734318 -196254 437463 551054 963744 995584 911089 905693
3431 905693 284772 338321 487656 323486 353012 500082 368767 313746 -48766 -472127
3421 -472127 211467 98309 5639 262051 595358 503863 544255 871690 575238 310853
3411 310853 462195 912744 521698 464404 821559 883048 633156 592275 609680 722835
3401 722835 820438 770554 631677 283322 67254 412122 628331 427042 566896 316537
3391 316537 183713 501345 282850 247129 450219 508428 298651 360539 182441 28847
3381B8847K13216o562m6886M20979J45330p45349j02383J60012L36625L36564
3371G40393J39119k4483R3807k88773n8404j52609m64507L19450L2831l4201j29377
3360A73246J71965l07351L47423J49396k88134j44456M24513j81314P9586l556
3350D21318L08734l14504k15757M03052k23640l02403J16044k36691P25475l98784
3340B82844q30600M93822P92693l03225o03339L4886l78545o7473J46498L27214
3330a05225J37743O355k73349N10442K45316P6322o04242N0808K87105K35807
3320E67082l00295M4127m107j19659k9253k22766N17415M3756j54133o9351l68924
3309i6108j62870L20988N70761j9060o6992j58720q1455m66852p8418L23454P02539
$$ plain form
3381 28847 242063 235501 188615 609594 754924 9575 -92808 67204 403829 740393
3371 740393 879512 855029 948836 660063 601659 449050 -15457 303993 336824 302623 173246
3360 173246 345211 37860 385283 534679 246545 102089 526602 345288 424874 421318
3350 421318 730052 415548 199791 602843 379203 76800 192844 -43847 681628 282844
3340 282844 -547756 -53934 738759 435534 -167805 -132919 -511464 -578937 -432439 -105225
3330 -105225 32518 38873 -234476 275966 521282 597604 -6638 44170 331275 567082
3320 567082 266787 310914 306807 187148 157895 -64871 452544 496300 342167 272816 -96108
3309 -96108 -258978 62010 632771 613711 546719 387999 306544 -160308 -238726 84728 787267
3298G87267r9940j72453M34190o483j67679m02848k11047j57641k08476M93703
3288B88593N6438J69207m66494L70922l12630M31985N46619l76101k54124j00880
3278C53535J13590j96585J91793j38479R2023k57570j42231J0136M7800L8133
3268A12145k69485K61767j32088l31648M28062l13320O8903l68536J46481K52740
3258a44979J15066j63252j02778m71333N56529j46300l24589N41906O1479J03636
3248B5385k19578k96717O0791K63549P4589l23195L14210J22049j2081j66651
3238a57649M13007K65086j49711j68352j94581p808J30575j84466o6074J90148
3228G0175q1232n54562L59272l5831J29536J69289j66510N10974o21353l0302
$$ plain form
3298 787267 687327 514874 949064 942581 774902 372054 161007 3366 -205110 288593
3288 288593 345031 514238 47744 418666 106036 538021 1084640 708539 454415 353535
3278 353535 467125 270540 462333 323854 415877 158307 16076 26212 74012 112145
3268 112145 -157340 104427 -27661 -359309 68753 -244567 -175664 -544200 -397719 -144979
3258 -144979 -29913 -193165 -295943 -767276 -210747 -357047 -681636 -139730 -78251 25385
3248 25385 -194193 -490910 -430119 -166570 -91981 -415176 -100966 21083 9002 -157649
3238 -157649 255358 520444 370733 202381 7800 -8 130567 -53899 -119973 70175
3228 70175 -11057 -565619 -206347 -242178 -112642 56647 -109863 401111 -220242 -250544
3218b50544j08362n53406L25449n6762K40057N40115n96256j66933N05624R7559
3208b3459j96159O87276K14639r83742o2255K73256K22919m13659j10082N49886
3198A58620n28918M67887j80014n1046L54768J30063l16264P1714Q7424j27848
3188F6386J22502R0171j99318j27666R7083j46532n2642L27493K27994J59135
3178E64606k19984r1170J68332p2610r4226l78498l79355K83495J58229L81123
3168C19942m8009R5257j03538l28814J45603J40920k05634l88745O871K60023
3158a06124K27061M31038J66986m12000Q0535O9770k85158j32447j11930K78816
3148B06547j0881k35310l08677j26423k02668K77927L80845j93234J90156J87164
$$ plain form
3218 -250544 -358906 -912312 -586863 -643625 -403568 136547 -459709 -626642 -121018 -23459
3208 -23459 -219618 467658 682297 -301445 -363700 -90444 132475 -281184 -391266 158620
3198 158620 -370298 97589 -82425 -133471 221297 351360 35096 106810 194234 66386
3188 66386 188888 279059 79741 -47925 49158 -97374 -150016 177477 405471 564606
3178 564606 344622 253452 421784 349174 254948 -123550 -502905 -219410 -61181 319942
3168 319942 271933 367190 263652 -65162 80441 221361 15727 -373018 -366147 -106124
3158 -106124 120937 551975 718961 306961 387496 457266 172108 39661 -72269 206547
3148 206547 195666 -39644 -348321 -474744 -677412 -399485 -18640 -211874 -21718 165446
3138A65446L57214k16473o37649k32990N69832l32511L7992K50700Q3049l93885
3128c49275J24845M91176n34990l24229P78416L42504l14838K45792k68629n23831
3118c33059k82895M36042M07463J53488k6923k21356n81928k00679L08109N39456
3108A97718J2943o81256k70402K12646Q4266K79585l4243R5176m10981J75091
3098c39457L68117k4578p4391K92818K791k0372l31230m62222M31651K94869J1722
3087A49718N86035o9169m70183j03680k60762L237J29970J43524k65955n24072
3077f81337j37236O47406n1331J56363j52480J71246k84279O7119l47735M90696
3067a21568K25078J54261k19166k29371m78605q2657O34371J19502j96450L58349
$$ plain form
3138 165446 522660 306187 -331462 -564452 5380 -327131 -289139 -38439 44610 -349275
3128 -349275 -224430 266746 -268244 -592473 185943 528447 213609 459401 190772 -333059
3118 -333059 -615954 -179912 227551 381039 354116 132760 -449168 -649847 -341738 197718
3108 197718 210661 -470595 -740997 -528351 -444085 -164500 -198743 -103567 -514548 -339457
3098 -339457 28660 4082 -70309 222509 225300 204928 -126302 -588524 -156873 137996 149718
3087 149718 735753 666584 196401 92721 -168041 -164804 -34834 108690 -157265 -681337
3077 -681337 -818573 -171167 -222498 -66135 -218615 -47369 -331648 -264529 -612264 -121568
3067 -121568 103510 257771 38605 -190766 -669371 -752028 -117657 1845 -194605 163744
3057A63744Q6322k42774n03667j3387R5114O66838J65327m71415j8166M32059
3047C59995m93529m4559K53858o31556L13505J29750j41026n30116O36534L57356
3037B10212k88426m97048K38099L12906k17278J43154M45792L40801l74374l465
3027C10373R5965j95439j89379l07615j68231O77274L16888j15001q2280K07447
3017E50002L74901n01570O2589j94219l4548j93645k9354L70035O5985j05764
3007C64412k8236k86697k22447O7216N8482K15507L12359l10569l4549k92297
2997a56819q9789j21287L52092K21357N11179l63444m96056M27194p9955j11213
2987I3259L89354N388j54428P411n6812n1284k58690N36374K01834l43911m00606
$$ plain form
3057 163744 250066 7292 -496375 -509762 -414648 252190 417517 -53898 -72064 359995
3047 359995 -133534 -178093 75765 -555791 -242286 -112536 -253562 -783678 -147144 210212
3037 210212 -78214 -575262 -337163 -24257 -241535 -98381 347411 688212 313838 310373
3027 310373 406338 210899 21520 -286095 -454326 222948 539836 424835 342555 550002
3017 550002 924903 423333 485922 291703 257155 63510 34156 404191 470176 364412
3007 364412 336176 49479 -172968 -105752 -47270 168237 480596 170027 135478 -156819
2997 -156819 -246608 -367895 -15803 205554 716733 353289 -142767 284427 204472 93259
2987 93259 482613 488001 333573 340984 284172 232888 -25802 510572 712406 368495 -32111
2976c2111K32457P28914k24767K33085N08339q79611n65418M44762J59004l29680
2966B74974k14121K1795K09502q4057j39802K87793j49538l57240J21100M68520
2956D38926K90598M5400o81172k16016j4555J17804l24603M21280N25030k62712
2946C39980k23117p7223Q8407L24861M5862p96056L06971N68835J31158P1115
2936G80793m02052R6831O75783k51513n03160L91053j5715k98717q3339N29269
2926I19233K63507n45815k16096p7400j29699j37969M16361L49338j56962j58300
2916E26198J19751l8715N96561K86164m20771M8334l39201L71624K48358O3277
2906A461580j11907j41790l06416L38589L67843p62297K07543N42272j95819n06871
$$ plain form
2976 -32111 200346 929260 704493 937578 1445917 566306 888 445650 604654 274974
2966 274974 60853 82648 292150 208093 68291 356084 206546 -150694 -29594 438926
2956 438926 729524 774924 93752 -122264 -136819 -19015 -343618 77662 602692 339980
2946 339980 116863 39640 128047 452908 498770 -297286 9685 578520 709678 780793
2936 780793 378741 475572 1151355 899842 396682 787735 772020 473303 389964 919233
2926 919233 1182740 636925 420829 343429 213730 75761 492122 841460 684498 526198
2916 526198 645949 607234 1203795 1489959 1069188 1117522 778321 1149945 1398303 1461580
2906 1461580 1349673 1207883 901467 1240056 1607899 845602 1053145 1595417 1399598 892727
2896H92727R06178N0946J85084L18546K39161l37659j60908p9639J45594L18472
2886B478502k70648J58425p56547J33073R31740k26255O35152K65089J4375N1206
2876C414112j1988j19948O220R4845R8569K09357o6950k97125N09859k09264Q4965
2865C712652P89911N52953J80959P6592r6645J67931M94956K97094K56267k46515
2855F186155P2265J90150N32032o502K97759P00876J1375j5588J71768P86468
2845H926758L18647N61097J037243R7687J89323O02716M80339J208749Q99127
2836A4321686J970439K495546J060649J373691O84167N02050J770948K296241
2828B6475417L333865L952051N408864P928242Q743771J0797991J5149318J9607350
$$ plain form
2896 892727 1798905 1849851 2034935 2353481 2592642 2254983 2094075 2014436 2160030 2478502
2886 2478502 2207854 2366279 1609732 1742805 2674545 2448290 3083442 3348531 3362906 3414112
2876 3414112 3402124 3282176 3288396 3383241 3481810 3691167 3624217 3327092 3836951 3627687 3712652
2865 3712652 4502563 5055516 5236475 5313067 5216422 5384353 5879309 6176403 6432670 6186155
2855 6186155 6258420 6448570 6980602 6974100 7271859 7972735 7984110 7968522 8140290 8926758
2845 8926758 9245405 9806502 10843745 10941432 11130755 11733471 12213810 13422559 14321686
2836 14321686 16292125 18787671 19848320 21222011 21906178 22408228 24179176 26475417
2828 26475417 29809282 33761333 39170197 47098439 55842210 66640201 81789519 101396869
2820A01396869K1387122P579496j6849503k2285147k0252663j6682122j0250726
2813D4043326p669730n596404l749687k905675l037172k223527j638391n44534
2805A6678206m32310m58863j261928r96110j583493j698016m03705k56617J33467
2796I720631Q844p65178r87437m66432l4679p30882l27462j94746p37244p8855
2786E406560j77690N75325m39893m79377J14581m81180l20392K53291m44868m32184
2776C574173j03766J20736m08353k45972m93377K62014j59628J99684J75936N2091
2766B973538p1649J8790j20236m91831k80550K15487M1811l60593N0578q6176
2756A889169K59006m16095O046O0529k80251K32295p98719k39682O13152m73920
$$ plain form
2820 101396869 122783991 130363487 113513984 91228837 70976174 54294052 44043326
2813 44043326 36373596 30777192 27027505 24121830 21084658 18861131 17222740 16678206
2805 16678206 16245896 15787033 14525105 13528995 11945502 10247486 9843781 9587164 9720631
2796 9720631 9729475 8964297 7976860 7510428 7475749 6744867 6417405 6222659 5485415 5406560
2786 5406560 5228870 5804195 5364302 4884925 4999506 4518326 4197934 4451225 4006357 3574173
2776 3574173 3470407 3591143 3182790 2936818 2443441 2705455 2545827 2745511 2921447 2973538
2766 2973538 2901889 2920679 2800443 2308612 2028062 2243549 2285360 1924767 1975345 1889169
2756 1889169 2148175 1732080 1738126 1798655 1518404 1750699 951980 712298 1325450 851530
2746H51530J9674K15295J88135K59206J51517n14569j66731l55604N22134P30766
2736A901353j8562m59786k64550K4915o4824K20784k99806m11549J8593K08326
2726H54894L02371j09281n0505j15013J18265m01377L76576K67967n83986Q3394
2716G43305Q801J15714p4644k29930r317R9845L6541L0416J83060n59192O9995
2705D14594Q4917q2371M57115o3871k84384m22822K50316l70356L44551J92944
2695E20633L67692M28710q84377j61786L7466J66032O5218l07727K43959L76312
2685H52132j14087j23118l82080j61184J58509k9557O69531J00484l32511J39155
2675G77274p4561k7652K68242m90311m31499K67163j95199M1663J90732k88554
$$ plain form
2746 851530 871204 1086499 1274634 1533840 1685357 1170788 1004057 648453 1170587 1901353
2736 1901353 1882791 1423005 1158455 1183370 1118546 1339330 1039524 627975 646568 854894
2726 854894 1157265 1047984 997479 882466 1000731 599354 975930 1243897 659911 743305
2716 743305 752106 867820 793176 563246 553929 653774 690315 720731 903791 344599 414594
2705 414594 499511 417140 874255 810384 526000 103178 353494 -16862 327689 520633
2695 520633 888325 1317035 432658 270872 308338 474370 539588 231861 475820 852132
2685 852132 738045 614927 232847 71663 230172 200615 870146 970630 638119 777274
2675 777274 702713 675061 943303 452992 21493 288656 93457 135120 325852 37298
2665C7298n8707P11390J47044o29562K60254M1334l7216j28716o81647O73559
2655C35031L2357o3941n92971J16957K20854K07678k18972j39551r2809O50572
2645D55205k29913m07379J04950l18306M5395L90812j90564j47323N42599N46020
2635G91496k76272l43472k02820j48633N48617K21212J7788k81089m49077j19236
2625b41486k6966j62636M30686J43294L74981m4174k86664m21372K23831L6492
2615B5986j42936k15143P52957j6799K34424n86734m98106M72768K37723Q2725
2605C46865j58049m02942j30167L82497J44028q0961l0541n17059r4925L54502
2595a86752m3799j03694j7188K45141J69051k06950J88553l79878l63667L66286
$$ plain form
2665 37298 -21409 689981 837025 207463 467717 509051 471835 343119 -338528 335031
2655 335031 367388 303447 -289524 -172567 48287 255965 36993 -102558 -195367 455205
2645 455205 225292 -182087 -77137 -395443 -350048 40764 -149800 -297123 245476 791496
2635 791496 515224 171752 -31068 -179701 368916 590128 607916 326827 -122250 -241486
2625 -241486 -268452 -431088 -402 142892 517873 473699 187035 -234337 -10506 25986
2615 25986 -116950 -332093 420864 404065 638489 51755 -446351 26417 264140 346865
2605 346865 188816 -214126 -344293 38204 182232 101271 70730 -446329 -541254 -186752
2595 -186752 -230551 -334245 -351433 -106292 62759 -144191 44362 -335516 -699183 -332897
2585c32897J90801o1373j37164K67689Q4657J94030K7044L89759q6874k46872
2575B88800L57393k99088J12238l03015J13489n2233L78913J19106n03573L72486
2565E84516l50461m50298R1768L84441l04835m25078Q30269P60099o36889J8956
2555E02488j14623p9654j47173m72167O51323J69169m7597j91853O0029j46722
2545A83220J52128j5067k45871K8232J63868J93975p626L58382n46004J23953
2535C89190o35281K04493M33939n75237R1841j05147L7874Q8358J16793L08460
2525C55283R5902L96825J62196J70912o92759m83808K95740M19605l08557k76635
$$ plain form
2585 -332897 -142096 -203469 -340633 -72944 11713 205743 232787 622546 535672 288800
2575 288800 646193 347105 459343 156328 269817 217584 596497 715603 212030 584516
2565 584516 234055 -216243 -124475 259966 -44869 -469947 360322 1120421 483532 502488
2555 502488 387865 308211 161038 -311129 340194 509363 461766 269913 329942 183220
2545 183220 335348 320281 74410 102642 266510 460485 452859 811241 265237 389190
2535 389190 -246091 -41598 392341 -182896 -91055 -196202 -158328 -69970 46823 355283
2525 355283 451185 848010 1010206 1181118 488359 4551 300291 719896 411339 134704
$$ [...]
##END NTUPLES=NMR SPECTRUM
##END=
