##TITLE=1H_EC-3339(1)
 200.13MHz, CDCl3,
 24 sc
 
 15.1.2025
##JCAMPDX= 6.0         $$ Bruker NMR JCAMP-DX V2.0
##DATA TYPE= NMR SPECTRUM
##DATA CLASS= NTUPLES
##ORIGIN= UXNMR, Bruker Analytische Messtechnik GmbH
##OWNER= pz
$$ XWIN-NMR		Version 3.5
$$ Wed Jan 15 13:55:52 2025 Russian Standard Time (UT+4h)  she@DPX200
##.OBSERVE FREQUENCY= 200.1312
##.OBSERVE NUCLEUS= ^1H
##.ACQUISITION MODE= SIMULTANEOUS
##.ACQUISITION SCHEME= undefined
##.AVERAGES= 8
##.DIGITISER RES= 18
##SPECTROMETER/DATA SYSTEM= spect
##.PULSE SEQUENCE= zg30
##.SOLVENT NAME= D2O
##.SHIFT REFERENCE= (INTERNAL, D2O, 0, 14.9426)
##AUDIT TRAIL= $$ (NUMBER, WHEN, WHO, WHERE, WHAT)
$$ ##TITLE= Audit trail, XWIN-NMR		Version 3.5
$$ ##JCAMPDX= 5.01
$$ ##ORIGIN= Bruker BioSpin GmbH
$$ ##OWNER= she
$$ F:/spectra/data/she/nmr/H-C/1/pdata/1/auditp.txt
$$ ##AUDIT TRAIL=  $$ (NUMBER, WHEN, WHO, WHERE, WHAT)
(   1,<2025-01-15 13:54:12.23 +0400>,<she>,<DPX200>,
      <created by zg, POWCHK disabled, PULCHK disabled
       configuration hash MD5:
       00 E9 B6 7A A2 85 ED C7 34 08 36 98 17 FE 4E 26
       data hash MD5: 16K
       70 5B 61 CF BA A0 C7 C7 F8 0B C3 F2 C1 F6 43 45>)
(   2,<2025-01-15 13:54:18.42 +0400>,<she>,<DPX200>,
      <Start of raw data processing
       efp BC_mod = 2 LB = 0.25 FT_mod = 6 PKNL = 1 PHC0 = 240.188 PHC1 = 25.39221 SI = 16K 
       data hash MD5: 16K
       60 64 B0 B2 13 EA 6E C9 F6 B0 DC E7 3B E5 CA 28>)
(   3,<2025-01-15 13:54:38.50 +0400>,<she>,<DPX200>,
      <pk PHC0 = 3.056918 PHC1 = -5 
       data hash MD5: 16K
       6E 73 EA 42 50 29 46 C0 18 43 F2 57 B6 B2 C1 F4>)
(   4,<2025-01-15 13:54:41.70 +0400>,<she>,<DPX200>,
      <abs ABSG = 5 
       data hash MD5: 16K
       D4 0F 25 C0 69 B2 31 85 B5 17 83 89 6F 25 CD B7>)
(   5,<2025-01-15 13:55:22.60 +0400>,<she>,<DPX200>,
      <pk PHC0 = 9.926005 PHC1 = -15.40001 
       data hash MD5: 16K
       D5 90 3C 12 24 5C 43 09 13 94 03 7A EA 49 B7 EB>)
(   6,<2025-01-15 13:55:29.82 +0400>,<she>,<DPX200>,
      <abs ABSG = 5 
       data hash MD5: 16K
       C5 76 C3 7A C7 E1 B3 63 DF B6 96 CD 79 FA 21 9C>)
$$ ##END=
$$ 
$$ hash MD5
$$ B8 31 90 BC C2 5C E1 E5 E0 36 7E CE CA C4 11 64
##$RELAX= 
##$RELAX= 
##$RELAX= 
##$RELAX= 
##$RELAX= 
##$RELAX= 
$$ Bruker specific parameters
$$ --------------------------
##$DU= <F:/spectra>
##$EXPNO= 1
##$NAME= <H-C>
##$PROCNO= 1
##$TYPE= <nmr>
##$USER= <she>
##$AMP= (0..31)
100 100 100 100 100 100 100 100 100 100 100 100 100 100 100 100 100 100 
100 100 100 100 100 100 100 100 100 100 100 100 100 100 
##$AQSEQ= 0
##$AQ_mod= 1
##$AUNM= <au_zg>
##$AUTOPOS= <>
##$BF1= 200.13
##$BF2= 200.13
##$BF3= 200.13
##$BF4= 200.13
##$BF5= 200.13
##$BF6= 200.13
##$BF7= 200.13
##$BF8= 200.13
##$BYTORDA= 1
##$CFDGTYP= 0
##$CFRGTYP= 5
##$CHEMSTR= <none>
##$CNST= (0..31)
1 1 145 1 1 1 1 1 1 1 1 1 1 1 1 1 1 1 1 1 1 1 1 1 1 1 1 1 1 1 1 1 
##$CPDPRG= <>
##$CPDPRG1= <>
##$CPDPRG2= <>
##$CPDPRG3= <>
##$CPDPRG4= <mlev>
##$CPDPRG5= <mlev>
##$CPDPRG6= <mlev>
##$CPDPRG7= <mlev>
$$ [...]
##$SUBNAM3= <"">
##$SUBNAM4= <"">
##$SUBNAM5= <"">
##$SUBNAM6= <"">
##$SUBNAM7= <"">
##$SUBNAM8= <"">
##$SUBNAM9= <"">
##$SW= 18.0517418723606
##$SWIBOX= (0..15)
0 0 2 0 0 0 0 0 0 0 0 0 0 0 0 0 
##$SW_h= 3612.71676300578
##$TD= 16384
##$TD0= 1
##$TE= 0
##$TE2= 300
##$TE3= 300
##$TEG= 300
##$TL= (0..7)
0 120 120 120 120 120 120 120 
##$TP= (0..7)
150 150 150 150 150 150 150 150 
##$TP07= 0
##$TPNAME0= <>
##$TPNAME1= <>
##$TPNAME2= <>
##$TPNAME3= <>
##$TPNAME4= <>
##$TPNAME5= <>
##$TPNAME6= <>
##$TPNAME7= <>
##$TPOAL= (0..7)
0.5 0.5 0.5 0.5 0.5 0.5 0.5 0.5 
##$TPOFFS= (0..7)
0 0 0 0 0 0 0 0 
##$TUNHIN= 0
##$TUNHOUT= 0
##$TUNXOUT= 0
##$USERA1= <user>
##$USERA2= <user>
##$USERA3= <user>
##$USERA4= <user>
##$USERA5= <user>
##$V9= 5
##$VALIST= <valist>
##$VCLIST= <CCCCCCCCCCCCCCC>
##$VD= 0
##$VDLIST= <DDDDDDDDDDDDDDD>
##$VPLIST= <PPPPPPPPPPPPPPP>
##$VTLIST= <TTTTTTTTTTTTTTT>
##$WBST= 1024
##$WBSW= 4
##$XGAIN= (0..3)
0 0 0 0 
##$XL= 0
##$YL= 0
##$YMAX_a= 215626
##$YMIN_a= -235003
##$ZGOPTNS= <>
##$ZL1= 120
##$ZL2= 120
##$ZL3= 120
##$ZL4= 120
##$ABSF1= 14.94258
##$ABSF2= -3.109269
##$ABSG= 5
##$ABSL= 3
##$ALPHA= 0
##$AQORDER= 0
##$ASSFAC= 0
##$ASSFACI= 0
##$ASSFACX= 0
##$ASSWID= 0
##$AUNMP= <proc_1d>
##$AZFE= 0.1
##$AZFW= 0.1
##$BCFW= 0
##$BC_mod= 2
##$BYTORDP= 0
##$COROFFS= 0
##$CY= -3
##$DATMOD= 1
##$DC= 0
##$DFILT= <>
##$DTYPP= 0
##$F1P= 0
##$F2P= 0
##$FCOR= 1
##$FTSIZE= 16384
##$FT_mod= 6
##$GAMMA= 0
##$GB= 0
##$INTBC= 1
##$INTSCL= 3.241238e-09
##$ISEN= 128
##$LB= 0.25
##$LEV0= 0
##$LPBIN= 0
##$MAXI= 10000
##$MC2= 0
##$MEAN= 0
##$ME_mod= 0
##$MI= 1.114404
##$NCOEF= 0
##$NC_proc= -8
##$NLEV= 6
##$NOISF1= 3.799351
##$NOISF2= 2.8
##$NSP= 0
##$NTH_PI= 0
##$NZP= 0
##$OFFSET= 14.94258
##$PC= 1
##$PHC0= 253.1709
##$PHC1= 4.9922
##$PH_mod= 1
##$PKNL= yes
##$PPARMOD= 0
##$PSCAL= 0
##$PSIGN= 0
##$REVERSE= no
##$SF= 200.130015900592
##$SI= 16384
##$SIGF1= 3
##$SIGF2= 2
##$SINO= 0.751879
##$SIOLD= 32768
##$SREGLST= <19F.Aceton>
##$SSB= 0
##$STSI= 16384
##$STSR= 0
##$SW_p= 3612.71676300577
##$SYMM= 0
##$S_DEV= 0
##$TDeff= 16384
##$TDoff= 0
##$TI= <>
##$TILT= no
##$TM1= 0
##$TM2= 0
##$TOPLEV= 0
##$USERP1= <user>
##$USERP2= <user>
##$USERP3= <user>
##$USERP4= <user>
##$USERP5= <user>
##$WDW= 1
##$XDIM= 16384
##$YMAX_p= 475701754
##$YMIN_p= -1720936
$$ End of Bruker specific parameters
$$ ---------------------------------
##NTUPLES= NMR SPECTRUM
##VAR_NAME=  FREQUENCY,     SPECTRUM/REAL,   SPECTRUM/IMAG
##SYMBOL=    X,             R,               I
##VAR_TYPE=  INDEPENDENT,   DEPENDENT,       DEPENDENT
##VAR_FORM=  AFFN,          ASDF,            ASDF
##VAR_DIM=   16384,         16384,           16384
##UNITS=     HZ,            ARBITRARY UNITS, ARBITRARY UNITS
##FACTOR=    0.220516191357247, 1,           1
##FIRST=     2990.45881764157, 0,            0
##LAST=      -622.257945364198, 0,           0
##MIN=       -622.257945364198, -1720936,    0
##MAX=       2990.45881764157, 475701754,    0
$$ Real data points
##PAGE= N=1
##DATA TABLE= (X++(R..R)), XYDATA
$$ [...]
10255 -914534 -936089 -888554 -885888 -870209 -876409 -778773 -818037 -1093798 -883826 -633730 -1080753
10244 -1080753 -1292004 -976527 -793578 -269294 -358006 -542421 -195508 -243008 -170085 -345483
10234 -345483 -583991 -98183 -299047 -383919 -305444 -321698 -313037 -78909 -261798 -211421 -409577
10223 -409577 66715 68522 45148 245894 -120097 -446286 -365775 -76739 -562008 -249895
10213 -249895 213484 356088 58154 301501 700554 581656 54184 -116438 -219383 -530169
10203 -530169 -544398 103049 213901 473593 105128 -213650 -127089 -138396 -167733 -160158 951
10192 951 -309281 -1325448 -1014911 -684644 -270165 -321333 -251359 -43344 -3950 23711 144142
10181 144142 328521 -435608 -598213 -608595 -349899 208810 386622 -246569 -207949 -29615
10171 -29615 -62975 217265 -126015 -150229 -285065 -297318 172814 -228987 -409209 -23989
10161 -23989 224662 312913 224307 390848 288765 490675 316018 -392990 -278502 -58565
10151 -58565 92398 -373557 -160773 220781 205479 176855 42757 425256 428250 -268365
10141 -268365 4343 551666 465629 147365 264327 957332 444014 381632 525108 444175
10131 444175 643712 527304 358810 197041 104724 -128287 -61355 111868 440701 40934
10121 40934 19300 700248 449264 -138033 -206795 -470046 -390849 420 -317421 -78978
10111 -78978 314691 801648 828306 -132536 -157407 -423368 -635913 -1064649 -433796 -44453
10101 -44453 -218839 -463322 -58233 579640 449481 135782 120573 203932 163618 358748
10091 358748 300096 468029 454513 96758 -105103 89724 -71398 -89095 -80420 182059
10081 182059 680169 640616 501646 31457 -181610 371542 371701 506993 299718 643578
10071 643578 648261 -143689 -585341 -568920 -351748 -35435 -49737 -227002 -210786 -511531
10061 -511531 -709437 30690 301125 485407 498780 368295 -1642 -381314 -583758 -643874
10051 -643874 -235610 -743124 -569702 -522263 -470989 29149 -406882 -249087 -78740 120770
10041 120770 -109376 -140825 363229 209227 216343 934376 762196 104343 -51140 -140811
10031 -140811 -267219 -353843 -379935 -32327 281603 425668 488857 430937 389477 370525 545218
10020 545218 851095 710663 697795 668212 578423 433988 -58784 119722 75880 -159339
10010 -159339 20834 98333 254106 84521 344333 215930 85210 97756 135846 4757
10000 4757 104809 282524 523218 408975 129323 341185 27539 171084 303580 -158860
9990 -158860 123562 332497 -101895 102217 189513 -361295 19117 311090 256382 375367
9980 375367 533983 797332 1221793 1073063 697775 1333689 1195013 1225503 880042 943079
9970 943079 1255928 961492 681958 956999 494829 637810 605398 833472 270836 462364
9960 462364 755057 1089293 980613 973981 1187668 1793790 1765323 1802847 1853306 1377552 749359
9949 749359 1122183 1107090 1820090 1757038 1512041 1707780 1650723 2011368 1501606 1551620
9939 1551620 1758159 2424029 1896512 1635720 1409785 1526791 1061396 743558 939484 1097175
9929 1097175 1013656 1300375 1554457 1533447 1206162 1284576 1313394 1484009 1488696 927605 1263364
9918 1263364 953968 1137444 931217 728479 897520 1107866 894436 213260 562815 719778
9908 719778 567372 709044 811183 956430 1198716 1055840 614923 1113096 1498436 1209849
9898 1209849 1194377 1088003 1044343 837702 907858 891174 1274961 1641742 1877360 1537577
9888 1537577 1483101 1838909 1856202 1711354 1903985 1375316 1770010 1575653 1491704 1106688
9878 1106688 1537561 1903428 1546136 1547423 2218627 2414377 1896810 1812156 1953589 2021030
9868 2021030 2207801 2092365 2233098 2473700 2356647 2569393 2746861 2873167 2747380 3045150
9858 3045150 2813278 2949094 2851747 2811126 3453892 3173122 3782625 3485089 3612481 3339674
9848 3339674 3569388 3843149 3728866 4061598 3212493 3479248 4025517 4159960 4327883 4178967
9838 4178967 4443389 4645053 4935878 4764312 4406815 4528206 4852884 5366356 5282193 5374729
9828 5374729 5633303 5667009 5406206 5585124 5916304 5595571 5415344 5786373 6542856 6626410
9818 6626410 6439895 6335367 6293179 6575254 6772625 7073081 7463081 7520736 7864302 8046903
9808 8046903 7637614 8001937 8458057 8635874 8720696 8990653 9361097 9646398 9751701 10250777
9798 10250777 10543458 11169480 11408402 11800404 12024084 12847784 12783568 13025060 13167124 13278219
9788 13278219 13647654 13982547 14042108 14577257 15348016 16380090 16855212 17722923 19140517
9779 19140517 20734605 22373718 24741963 27932110 31089970 34451395 36848735 38664139
9771 38664139 39892334 39072911 37877382 36522447 35803898 36113230 36994534 38775380 40718389
9762 40718389 41777481 41504241 39591230 36384452 33911658 31455848 29109744 27343940
9754 27343940 26176542 26049057 26241425 26413964 27176556 28320562 29874609 32152559 33885315
9745 33885315 35159292 35206964 35232456 34564806 33697413 34086152 35444237 37379503 41008631
9736 41008631 44402440 46653988 47914773 49465509 50549653 49948158 49384891 48263543
9728 48263543 45649921 41682572 37898029 34138403 30660577 28088814 26399416 24729926
9720 24729926 23912960 23396302 23529500 22852818 22390167 22529063 22761439 22794582 22299247 21214414
9710 21214414 20709645 20710062 20095718 19672118 19323228 19102243 19147946 18545466 18528196 18061515
9700 18061515 17868341 17764438 17265929 16841417 16872907 17259871 17726277 17579661 17542324 17422691
9690 17422691 18118198 17765565 17217550 17519448 17509870 17745844 18331410 18924699 19131323 19122186
9680 19122186 19290534 18992728 18872666 19246926 19337839 19851839 20293527 20432186 20565034 21014289
9670 21014289 21664236 21596071 21815424 22577201 22964052 23357273 23983368 24424684 25073420 25814641
9660 25814641 26019811 25890813 26549396 27203161 27878981 28478410 29475957 29960745 30726654
9651 30726654 31185267 32125651 32780675 34036915 35182490 35247805 36402075 37160529 38442676
9642 38442676 39553434 40677384 41872189 42530473 43646427 45159759 47608411 49309634
9634 49309634 50832640 53456244 57215759 60868514 65622835 71147071 77893334 86769022
9626 86769022 95781222 104406827 111622964 118310360 123905055 127476343 128505024 128706990
9618 128706990 126682402 123776716 121152379 118499307 113947567 108977686 103603118 98435684
9610 98435684 93991767 90864449 89503243 90132011 91715204 94693841 97722073 100008658
9602 100008658 102166734 103594045 104069631 104950004 105947943 107727834 110229080 113133802
9594 113133802 117430270 123689860 132468606 141818409 150776417 158238983 162935761 164713828
9586 164713828 164520151 163236637 160504754 156435130 151979083 146248101 138667107 130261951
9578 130261951 121823482 114834805 109687249 106491459 103528697 101645512 99204808 95241889
9570 95241889 91078745 87350039 83857061 81738940 81396422 82242941 83332763 84118298 83827799
9561 83827799 82407308 80050106 76133921 71612075 66065165 60848871 56306948 53047474
9553 53047474 49772160 47525900 45941949 44842629 44216750 43574650 43078245 43143844 43378642
9544 43378642 42971214 43576756 43640249 43394834 43089765 42893491 42702908 42677817 42810871 42301765
9534 42301765 42016377 42138424 42123490 41835643 42171790 42104609 41695491 41916379 42065114 41747829
9524 41747829 42247897 42255811 43068595 43758211 44497646 45340418 46491914 47369947 48074438 49675410
9514 49675410 50800560 52385636 54293427 57471821 61973463 67115273 72872645 80307260
9506 80307260 88485650 94933606 100617345 105344556 108826547 111852858 114011195 114487690
9498 114487690 113182409 109608030 103177161 94931088 86472606 78395796 71536460 66112216
9490 66112216 62226995 59309109 57535218 55812892 55635729 55455505 55205692 55878291 56307250
9481 56307250 57540535 58627175 60257438 62807597 65991076 69112091 73734908 79599733
9473 79599733 88251744 98549025 109268156 118731615 126562477 133848077 141687952 148886946
9465 148886946 154320657 156839513 154822240 149682598 142604327 132396321 119637129 105707189
9457 105707189 92475602 81752056 72390853 65635378 60763487 57036042 53775348 51382943
9449 51382943 49188227 47749272 46600257 46143072 45469031 44225135 43459639 42619398 41503010
9440 41503010 40745056 40623943 39792638 39813061 39409259 39172611 39328007 38846212 39010269 39385141
9430 39385141 39234057 39346234 39982112 40553366 40802793 40981203 42100262 43100738 44462927
9421 44462927 45605147 46615352 47723034 49333698 50489946 51608374 51815975 52742174
9413 52742174 53886090 55221308 56820253 58343030 59543252 60251561 60835728 61412653 61494872
9404 61494872 60974492 60461498 59946467 59646807 59825734 59805779 60039219 60961505 62406769
9395 62406769 64610677 66250458 68157222 69192734 70829902 73310419 75681841 78220880
9387 78220880 81696605 86290900 92415615 100027912 108990242 120982143 136502725 155211789
9379 155211789 176166023 200256376 219682120 222275459 210489055 193219986 174060664
9372 174060664 156605651 144494039 136667364 131566887 126786436 120960614 114951393 109141913
9364 109141913 103081215 97942163 94459875 92121247 91233596 91250414 91728969 93241413 95603362
9355 95603362 98239847 101824143 105714579 109901536 115046961 121157493 127725599 135651877
9347 135651877 145735923 156525143 169117218 180957135 189179595 191471554 189846593
9340 189846593 186398887 182510330 179006069 175901610 171709520 164537516 155700401 147723421
9332 147723421 140056464 132892177 126403887 121647365 117406583 114605324 114174381 115563581
9324 115563581 117668841 121176989 125861913 131164891 134544318 135989837 136628617 136680825
9316 136680825 137189361 139351254 144006710 150346944 158128656 166397829 174928592 183537774
9308 183537774 190362902 193951579 195760831 195283274 191478261 188307685 185693799 183946613
9300 183946613 182419436 180060417 178620840 179827796 184139243 191953214 205128395 221272653
9292 221272653 231513923 231903035 226193099 218061725 209474574 203946956 198557095 187538241
9284 187538241 177691749 166921006 156678677 149630504 145239477 144175966 145804657 147783480
9276 147783480 149086964 150484600 151688455 152598406 151634333 148331250 145160808 141602798
9268 141602798 140543409 141293702 144554367 150037185 153275999 157928017 164062273 171240668
9260 171240668 177439831 183581421 187529924 186988511 187971384 189436312 190156713 187514112
9252 187514112 179193460 166435894 152875910 138400744 126838421 117914875 111736506
9245 111736506 106734800 102519507 99341214 97259560 95912930 94218694 92276153 89933720
9237 89933720 88395304 87489393 87429871 88468320 89942265 91848548 94629602 98075062 103643919
9228 103643919 111984995 121475375 129971523 135875326 137826715 133713907 126254682 117193726
9220 117193726 106463675 95617817 85105884 75724639 67913867 61776519 56584480 53173795
9212 53173795 50151593 48254588 46276053 44755425 42582699 41728366 41103179 40167146 39871963
9203 39871963 39469497 39552562 40676914 42603520 44523009 47644231 51080325 54634945 57447562
9194 57447562 56672007 53027588 48220206 43120165 39192276 35879254 33419996 31231188
9186 31231188 29570479 28377973 27433636 25964082 24233680 23327236 22682768 22111201 21569162
9177 21569162 21319560 20793511 20707335 20001646 19455902 19227294 19366289 18786396 18721703 19118649
9167 19118649 19230803 19153112 18535897 18969803 18955153 19315718 19661481 18865872 18010756 17992201
9157 17992201 17998115 18028894 17972645 17317457 17158790 17402744 16911858 16899079 16295218 15886236
9147 15886236 15216188 14846741 14725811 14639686 15333197 15056106 15038573 15075793 14817156 15173753
9137 15173753 15423859 16155918 16847011 16941999 16742691 17139768 18041859 18406092 18659557 18761014
9127 18761014 19058855 19007296 18494921 18506746 19001138 19546841 18989700 18462024 18566262 17603200
9117 17603200 17544786 16705664 16535314 16042870 15195263 14703630 14311868 14099317 12856506
9108 12856506 12529138 12272985 11809074 11789265 11409390 11826160 11073620 11565602 11787854 11709060
9098 11709060 11722904 11872508 12055857 12085486 12022007 12114044 11990965 11970176 12256696 12454707
9088 12454707 12737774 12800037 12480883 12409008 12423522 12306657 11945163 12159427 12395467 12329391
9078 12329391 11741230 11783003 11881657 11812466 12445747 13069129 14139265 14136489 14571758 14221992
9068 14221992 14713415 15122189 15024914 14838606 14575018 14893603 14589748 14029370 13475141 12975395
9058 12975395 12258612 11527366 11103274 10564675 10365355 9689306 9634006 9392221 9269298 8614584
9048 8614584 8218042 8308082 8445321 8265762 8236398 8263060 8417015 8138133 8021360 7877005
9038 7877005 8237503 8381486 8211285 8672033 8401839 8366950 8502574 8169054 8348825 8937296
9028 8937296 8751853 8559862 8721644 8426231 8591405 8143060 6973605 6568255 6339631
9019 6339631 5864497 5675215 6084797 6019796 5811573 5839295 5611503 5474435 5403645 5545293
9009 5545293 5531046 5810887 5497107 5147380 5494509 5877754 5272426 5190854 4696273 4882328
8999 4882328 4927002 5008603 5295540 5021011 5282402 5223780 4533392 4604043 5119736 5078540
8989 5078540 5149445 5181572 4427625 4349471 4381912 3940358 3294078 3594119 4251185 4200962
8979 4200962 4005743 4099607 4418503 4754228 4563442 4513052 4986723 4681658 4404244 4218942
8969 4218942 4363059 4795111 4270828 3844664 3965075 4202762 4630083 4137516 3822057 3842420
8959 3842420 3909302 3656288 4152100 3704595 4028005 4082786 3870583 3910959 3786490 3812430
8949 3812430 4417487 3979076 3915210 3537876 3725792 3825329 4070779 4239240 4053512 4566666
8939 4566666 4355534 4127621 4674879 4643073 5038394 4615846 4050748 3858051 4544289 4979158
8929 4979158 4933002 4672583 4278520 4622890 4293085 4267626 4077900 4326266 4137665 4426428
8919 4426428 4914879 4800926 4836768 4824065 4767001 4170872 3901348 4256814 4318136 4638262
8909 4638262 5005047 5087125 4814509 4805199 4691562 4387537 5201960 4925745 5486877 5941918
8899 5941918 5187520 4977751 4549072 4286911 4348896 4787315 4401154 3675948 3716655 3622960
8889 3622960 3384813 3386675 3659296 3287351 3229902 3835443 3467285 3440925 3452994 3726050
8879 3726050 3597054 4172922 4284302 4104693 4425597 4203288 4314959 5186360 5069114 4349892
8869 4349892 3864568 3941831 4128175 3969950 4003348 3963249 4047413 3563263 2726557 2580396
8859 2580396 2973125 2597927 2636114 2624294 2699523 2657288 2574855 2752123 2713852 2686577 2392484
8848 2392484 2036543 1447765 1717087 1827140 1781196 2112543 2105628 1885898 1818807 1716924
8838 1716924 1353485 1615717 2230396 2175807 1798639 1379521 1399940 1621799 885631 933309
8828 933309 1099450 1647225 2089320 1857528 1921129 1875685 1383213 1266542 1111947 1475254
8818 1475254 2180349 1757491 2181996 2249502 1863674 1545357 1630830 1973571 1946422 1665932
8808 1665932 1865967 1582941 1945435 2398271 2524987 2933216 3327666 2990524 2907854 2850796
8798 2850796 2976467 2843506 2970172 3293936 3184036 2698202 2599884 2318164 2157444 2216469
8788 2216469 1868771 1264939 1467201 1652590 1544703 1548161 1709165 982762 1181601 1037252
8778 1037252 677243 751450 928562 914547 1192583 1177722 1092528 1134747 743496 1132049
8768 1132049 1841760 1825498 1226539 962613 954983 1203246 973903 1077951 1071840 857660
8758 857660 524965 509937 286081 888965 1346609 1406965 1015148 725595 647909 812478
8748 812478 1186132 1633361 1642278 1783184 1888945 2104055 1651191 1991206 2590397 2585105
8738 2585105 2601693 2489496 1993636 2175179 2245823 2239851 2012008 1338682 1357210 1696236
8728 1696236 1253156 1185982 769826 897814 1165118 753270 467821 1025956 1170779 1057617
8718 1057617 409145 329060 533907 808630 435996 832006 924708 1209848 1591384 1164064
8708 1164064 1405118 1373592 1098140 1155213 1161962 1298116 1369809 1157770 1423581 1095716
8698 1095716 860247 483152 1208965 1222474 1126338 1271795 882755 581760 391715 495383
8688 495383 348686 277842 56323 522193 1111034 1024841 1191966 997923 860111 882567
8678 882567 1213608 1411083 1434860 948571 1187893 1150444 808743 924767 1695589 2324049
8668 2324049 2426014 2322667 2705616 2675994 2250985 1942618 2209932 1923257 1640039 1082197
8658 1082197 648195 714308 1089272 1242083 1411295 1820558 1409089 924016 730749 370725
8648 370725 174705 429489 935793 896401 932710 1039876 656198 562960 558124 743467 942797
8637 942797 714973 590863 545375 282983 608463 272213 341838 1088663 1457688 1091238
8627 1091238 971549 939972 1264981 1050981 1089495 1346279 1323116 1072489 1091730 1242694
8617 1242694 1243717 1354194 1136708 1500576 2207833 2468016 2042975 1835210 1863054 1794328
8607 1794328 1704618 1745165 1856619 2210675 2174219 2855816 2730070 2320272 2826850 3094611
8597 3094611 2520426 1910435 2362110 2679921 2589985 2314260 2523481 1877789 1766737 1897407
8587 1897407 1524528 1551698 1518960 1509333 1343905 1518592 2078004 2325398 2709844 2748074
8577 2748074 2980577 2922355 2992319 3145699 3203699 3039208 3475864 4077537 4299715 5067712
8567 5067712 5466110 6421448 7144919 8262877 9343750 10531503 11815611 12515138 12820275
8558 12820275 13327675 13305874 13175898 12474331 11933674 10817902 10000960 9037129 8065468
8549 8065468 6829563 6137001 5166446 4201712 3770549 3088346 3121830 3123510 2817585 2933208
8539 2933208 2232396 2043200 2161231 2172738 2058939 1604788 1535221 785124 709932 938586
8529 938586 765324 821861 1270467 880406 1080164 1059339 892762 1328949 1356186 795536
8519 795536 530086 558835 282239 248687 169269 -162851 129430 172151 431291 244557
8509 244557 374052 163562 55982 194666 361815 608593 605953 444803 438376 588547
8499 588547 720358 79522 44536 -139623 -3271 204621 191547 229636 427131 405586
8489 405586 214731 392188 440287 821934 431489 246665 405965 166713 117103 197383
8479 197383 243639 -205509 -67499 285393 299298 155577 -38215 -453900 -502756 -152161
8469 -152161 587697 421091 628256 1136282 1101485 1079650 748770 844424 758576 864234
8459 864234 1562132 1424227 954380 1033314 1381650 1349456 812257 939797 862016 1043203
8449 1043203 994513 800822 586914 176601 -423208 -120195 225458 444087 -87931 76085
8439 76085 264696 237019 398487 107266 -268205 -254387 226272 -82086 327519 679111
8429 679111 -61486 -59362 49492 102550 508909 650970 374279 332828 -67879 -102343 458518
8418 458518 498003 495543 776977 749275 307040 337514 499654 444988 368885 68246 165664
8407 165664 321787 424134 238231 368360 -188563 259617 598941 336779 573274 97560
8397 97560 -29155 72813 690264 618365 411840 481051 506774 651004 443347 468363 790079
8386 790079 1037915 1669243 1580134 1518288 1230097 1616820 1416666 1593220 1745690 1302194
8376 1302194 1704151 1445288 1226918 1044398 1047973 680249 636925 781647 893476 862923
8366 862923 768306 305729 94766 567950 537119 481872 1002797 684582 776179 1298469
8356 1298469 1211573 1445240 1493886 653240 619491 1098986 1111143 1461055 1493071 1496742 2034851
8345 2034851 2172547 2253169 2161605 1466903 1476510 1185560 1406834 1377596 1585483 1858047
8335 1858047 1538294 1636106 1766610 1381448 662922 879831 971174 559300 -90807 -108106
8325 -108106 342168 361539 419716 285926 394401 430886 775450 716342 769229 670252 376952
8314 376952 424976 512497 174235 73295 119001 34106 529682 326586 373492 124382 -59870
8303 -59870 -227595 -221101 55603 79332 448652 154565 -154433 81016 11720 -898 -225114
8292 -225114 -179373 -503215 -468093 -518768 -556724 -19815 3295 50601 88459 -242689 -313718
8281 -313718 -14654 -121467 -72268 171814 425784 294826 318008 -20095 -84240 -11276
8271 -11276 -324287 -107000 -79616 239654 164304 418668 64000 15502 698985 1117377
8261 1117377 1240126 891490 762310 991763 1467109 1074986 663814 296969 291490 724886
8251 724886 489632 222266 545260 271775 600811 -23543 -207396 -15869 103965 102703
8241 102703 -572327 -215861 259959 -3269 284339 -156326 -28226 255778 -128656 -144221
8231 -144221 551278 574863 383046 521935 500766 968681 981833 1029188 941290 778688 866667
8220 866667 970371 607151 937755 889855 1161659 863860 434166 987244 1390617 1300934
8210 1300934 1225847 1232865 1212348 1380107 1281545 857878 1276142 1342446 2039909 1470653 1077085
8199 1077085 1674436 1949432 2032739 1940455 2693293 2586619 3899277 4210545 2209202 2954630
8189 2954630 3376753 3133297 2601608 2527444 2394125 1752077 2590654 2789775 2676034 3063339
8179 3063339 2501386 2190309 2609032 2574972 2373093 2220087 2622811 2609772 2715803 2706668
8169 2706668 2699692 2492495 2580224 2067186 1398283 1182827 1520690 1428054 1136860 778529
8159 778529 358139 136818 650732 1067979 1094239 953836 878253 1026320 959525 314835
8149 314835 621156 889610 1126671 1325708 869425 979967 925960 988016 727531 1216179
8139 1216179 1398091 876364 996270 921524 838024 879023 655213 734318 744472 612932
8129 612932 1251938 1437633 1121780 634830 711279 781291 454170 415226 757699 1003137
8119 1003137 714304 914039 550771 -8101 171562 431640 625417 926261 632483 656290
8109 656290 270745 684832 863224 683757 706074 925127 1149850 1293706 1256944 948848
8099 948848 1438788 1391780 1477155 1837592 1658013 1698526 1812041 1339422 1007756 1025832
8089 1025832 443297 673880 689551 732036 967554 1411047 1105762 699866 609081 355290
8079 355290 720597 926305 989270 635265 913955 1315483 916411 115255 780087 973905
8069 973905 937271 1046858 1169255 1611364 1566569 1590439 2230924 2673955 2027276 1820094
8059 1820094 1812428 1859362 1879426 2344553 2121828 1390309 1544482 1881335 2219682 1801890
8049 1801890 1511177 1862102 1690535 1793717 1464620 1560551 1557207 1465194 1640849 1734626
8039 1734626 2263934 1944463 1481774 1876715 1886633 1398385 1462176 1705744 1809093 1548303
8029 1548303 1915405 2126020 2017516 1904697 2222269 1989077 1880414 2147118 2021820 2052917
8019 2052917 2040348 1451047 1858183 2232092 1945817 1780330 1588624 1815983 2546126 3068315
8009 3068315 2523810 2867681 2778355 3150957 3207252 3170524 3272466 3004611 3234831 3108895
7999 3108895 2701773 2557838 2518969 2172327 2493756 3020324 3293227 3068104 2828790 3356731
7989 3356731 4148303 3380858 3016516 3440964 3764806 4182630 4459606 4867272 5211600 4639111
7979 4639111 4535964 4635055 4617742 4021930 3840405 4163095 4677770 4928042 4938611 4580461
7969 4580461 4761737 4449502 3882097 3830107 3978704 4025454 4189416 4707523 4691511 4701570
7959 4701570 4173421 4422292 4169937 4919237 5098339 5281718 5262789 4880624 4675402 4359121
7949 4359121 4685508 5160800 5398911 4926877 4951370 4785622 4903544 5354097 5860208 6154657
7939 6154657 6013440 6118970 6536992 6953235 7059888 7200381 7313078 7616467 7888173 7872499
7929 7872499 8239648 8378099 8472342 9112333 9549203 9793401 10263861 11423890 11722271 12228635
7919 12228635 12912655 12754666 12753581 12797580 12687306 12690718 13380398 14017428 14097210 14703414
7909 14703414 14963215 15210216 15298612 15197397 16016319 16226568 16357734 16873689 17283973 17967887
7899 17967887 18709031 19181765 19910640 20662443 21338381 22375854 23984923 25667639 27065144
7890 27065144 28009660 29338154 30848444 31859308 33029512 34918246 37534801 40575605
7882 40575605 44578769 49542016 55720785 64232696 75565767 89793459 106576411 124031636
7874 124031636 135864199 138162623 130699602 117197165 100965065 84817085 71023510
7867 71023510 60384633 52307370 47243823 43902589 41344019 39778562 38612654 37538135
7859 37538135 37039452 37772877 38358656 39073149 39888564 41746607 44351572 48013641 52323509
7850 52323509 58753934 67445921 78979049 93912860 110295776 123846100 129089690 124357859
7842 124357859 112875165 97216344 80351157 65691863 53560167 43915138 37400236
7835 37400236 32414686 28726567 25828514 23606403 21964026 20225100 18367162 17013853
7827 17013853 16260663 15505141 14356207 12863109 12425495 12023704 10922531 10791551 9888072
7818 9888072 9505227 9057690 8538825 8435533 7949313 7286252 6931330 6839686 6573206 6222335
7808 6222335 6443060 6343956 6286022 6368226 6032701 5437544 5891426 6240230 5768743 5635433
7798 5635433 5209315 5321741 4862914 4767534 4608224 4123184 4462671 4859431 4176335 4155635
7788 4155635 3549653 3263820 3143734 2820704 2907239 2977043 2734941 2848698 3106131 2944497
7778 2944497 3119918 2924907 2714824 2988893 2863419 2682395 2096909 1832451 1502566 1518521
7768 1518521 1685741 1955539 1970943 1449082 973837 890164 872512 1027308 1111990 1429499
7758 1429499 991806 1116560 1390758 1296028 1348750 1028811 1296932 1043209 1150890 1634131
7748 1634131 1209232 1449886 1406773 1310456 1087686 797238 1073239 621305 733980 648339
7738 648339 -35882 112862 794823 934903 720959 680323 204472 566281 636263 193358
7728 193358 292683 532136 378640 366734 80127 -238797 477365 276692 342399 530335
7718 530335 401215 609625 205254 480648 718159 608696 664461 653323 392845 361284
7708 361284 272007 397703 371606 8195 503730 534824 425383 324988 -91731 139686
7698 139686 561113 816740 814149 683686 1016365 470135 661909 266961 -66303 -179043
7688 -179043 94844 279843 -154882 -227021 -241111 -157097 192804 83506 -115376 284848
7678 284848 824887 484990 145466 279713 623770 1149060 789083 581034 666540 154968
7668 154968 864939 1133527 478212 -119609 79976 366615 730189 464176 406042 953535
7658 953535 1215892 581828 352363 266074 42782 374207 53372 210634 322909 367978
7648 367978 284693 149485 412667 412063 425648 221676 -281730 182005 730846 497653 562818
7637 562818 1003616 967562 610752 482407 824217 131801 157757 244007 234602 274396 155871
7626 155871 503073 1265537 937960 1068573 1739202 1698011 1719092 1524916 1676150 1450697
7616 1450697 1709120 2410374 2465170 2580848 2415810 2288162 3265976 3361594 3409165 3454254
7606 3454254 4209663 4791727 4488024 4612276 4426194 3781582 3332520 2831111 2803741 3012408
7596 3012408 2690316 2555837 2285946 2031573 2031094 2129169 2330754 2306571 1774817 1931156
7586 1931156 2374690 2394000 2530890 2264041 2005201 2169719 2339896 1777748 1066636 1316076
7576 1316076 701192 822331 1496850 995796 827501 468060 428603 709628 1271397 1285605
7566 1285605 1364244 1437333 1674185 1786771 1880780 2311858 2416077 3103488 2990225 2885385
7556 2885385 2737414 2562048 2125215 1915003 2352794 2173959 2346505 2958245 2604153 2582537
7546 2582537 3080528 3333881 3044747 2504818 2436961 2867023 2779720 2657066 2905166 2769526
7536 2769526 2838122 2867006 2741414 2833789 2815109 2716295 2399432 2045653 2023294 2063573 1520212
7525 1520212 1486103 1843571 1903772 1920858 1307566 861710 1442329 1305530 1114374 1432512
7515 1432512 1428800 1483222 1617540 1230077 1499719 1643227 1690402 1453219 1522269 1065201
7505 1065201 1516691 2007645 2243188 2238203 1752216 1354030 1759934 2455968 2249093 1879061
7495 1879061 1958822 2130823 2474123 2054347 1507562 1742292 1839893 1684099 1855689 2019958
7485 2019958 1752690 1539629 1375331 1458894 1519958 1669716 2050322 2153560 2044342 2176605
7475 2176605 2114719 1561658 1710238 1694178 1199090 1481226 1498063 1669914 934956 1087869
7465 1087869 1627846 1348372 1427178 1591696 2306230 2635125 2251853 2266764 2230602 2759145
7455 2759145 2580166 2815516 2901143 3243158 3385037 3479802 3016308 2704452 2635196 2373678
7445 2373678 2701480 2943938 2292531 2556794 2857419 3053553 3474454 3060651 3040959 3166798
7435 3166798 2694336 2413878 1801574 1683435 1856372 1140586 1068185 1312943 957048 1046125
7425 1046125 1178807 1240513 1346647 1164906 725576 1031418 972763 907922 838391 1024564
7415 1024564 1019042 1292230 941967 1033564 1134569 1463472 1229251 1240064 753562 873540
7405 873540 838172 359710 852612 726318 823406 871280 1252710 1377313 865176 1037834
7395 1037834 1397187 1051401 1459762 1001516 399763 335931 486462 400875 586520 638486
7385 638486 983807 883949 992536 1096402 1725580 1842690 1439979 1161668 935402 1209897
7375 1209897 1322704 1641309 1812825 1740328 1505029 1295685 1816088 1722717 1862422 1480918
7365 1480918 1620304 1115649 894133 924006 612473 1110007 1576481 1291122 1288638 895657
7355 895657 972537 1062166 1054742 1449535 1331415 1441124 1223938 1192603 1132119 1562074 2054009
7344 2054009 2133829 2283368 1856084 1912164 2072068 2204811 1845391 2337465 2313935 1962690
7334 1962690 2137057 2812402 2592282 2471702 2249188 2240300 2595464 2487053 2894993 2813356
7324 2813356 3244834 3308884 3516250 3478069 3498731 3725820 4656771 4811243 4627805 4070692
7314 4070692 4132857 4531425 4208887 4012917 4360966 4582244 4506496 4799370 4454979 4465169
7304 4465169 4185295 4218227 4770150 4379062 3543149 2935966 2545702 3129313 3353257 3320278
7294 3320278 3124235 3222705 3233943 3114342 3050996 3243908 3077652 2938480 2444540 2437456
7284 2437456 2966983 2719033 2726472 3305441 3350784 3073898 2938416 2738451 2708504 3215140
7274 3215140 3791283 3206462 3202319 3259790 3308444 3344391 2914696 2851395 3026942 3018582 3369324
7263 3369324 3748205 3987898 3565409 3643280 3839796 3948372 4107185 3954277 3933044 3862009
7253 3862009 3707144 4064545 4092776 4122319 4050225 4287336 4330528 4285955 4433539 4714301
7243 4714301 5438391 5736648 5570457 5885737 5776193 5508975 5808185 6099375 6438438 6272271
7233 6272271 6016699 6529100 6489382 7075475 6930274 7411586 7253282 7056697 7800935 8467425
7223 8467425 8283153 8259422 8188056 7599622 8543980 9487578 9856652 10157288 10775902 11623406
7213 11623406 12144657 12132751 12435166 12502006 12899963 12867495 13610759 14241682 14098899 14564570
7203 14564570 14634494 15078262 15357688 15527890 15972156 15930390 16194743 17353872 17643413 17969429
7193 17969429 18399649 18502508 19017636 19591505 19850643 20334851 21182148 22085686 22392689
7184 22392689 22985751 23331094 23970031 25167741 25665695 26818193 27657620 28992409 29979630
7175 29979630 30750636 31599071 32195728 33367089 34109141 35678970 37194893 38742437 40123588
7166 40123588 41091848 42388086 43416523 45112303 46873993 48060191 49323514 50755663
7158 50755663 52453535 54201434 55682717 57647567 59800543 62473018 64950309 68130121
7150 68130121 70452381 73127416 76319177 79594692 83364271 87795048 93368705 99131121
7142 99131121 106558262 115087047 125226578 137391331 152108872 171286137 195977626
7135 195977626 227689405 267319881 313181876 359484758 390863790 394510149 374292811
7128 374292811 340900902 306980001 281034747 268746724 271928584 289420234 318046112
7121 318046112 352594274 379516327 382157232 356706803 312827640 262711131 215547450
7114 215547450 176131545 148188976 127497426 111344517 99767768 89899632 81562200
7107 81562200 74366467 68443771 62641426 57685769 53131681 49595749 46943788 44390188
7099 44390188 41490101 39109007 36644120 34164798 32244834 30642335 29600120 28157437
7091 28157437 26423066 25383105 24833892 23585353 22428973 20778032 20037163 19344807 19027235
7082 19027235 18676814 18365930 17056091 15824048 14855639 14991434 15078250 14870619 14200297
7073 14200297 13617308 13409087 12437456 11827690 11123993 10889320 10666702 10070019 9482432
7064 9482432 9062287 9086134 9312366 9123547 8597897 8049552 7516422 7954097 7590916 6973657
7054 6973657 6802677 6604062 6910871 7117561 7317739 6787159 6292012 5863515 5750040 5909164
7044 5909164 6476948 6309389 6464815 6683445 6405887 5910495 5777611 5158122 5184982 4763057
7034 4763057 4729474 4083946 3802224 4181160 3916075 3822985 4040260 3491895 3110784 3099978
7024 3099978 2851217 3178543 2974090 2820395 3059484 2801262 2638513 2225875 2649417 2578351
7014 2578351 2884160 2930037 2832553 2911902 2826394 2631530 2184444 1777889 2117976 2412063
7004 2412063 2453321 1924114 2231610 2230410 2424494 2639141 2556427 2153035 1974275 1933809
6994 1933809 1723283 2153420 2144918 1633930 1067429 871060 1001762 1111110 892493 941600
6984 941600 1439311 1404230 1097573 1316680 643719 1311994 1047361 828975 886994 717416
6974 717416 726419 672905 546229 886422 806986 582700 658229 547380 975491 1002205 715838
6963 715838 861843 1189840 1030402 309747 247906 34408 224344 703311 1205656 1559136
6953 1559136 1015311 1128862 849612 851802 866394 685101 731230 925439 870623 543656
6943 543656 510201 715652 994963 972977 1115015 876080 509727 826408 602249 506568
6933 506568 951390 1141125 978331 806944 870106 813640 946745 650692 1033879 896252
6923 896252 1194561 729094 891735 1194219 1587090 1193353 872000 638686 865945 1624456
6913 1624456 1592190 1135246 1189732 1090012 1187209 1193122 935364 552042 -24266 209955 425121
6902 425121 737383 1441457 1494989 952195 933916 1121569 1066460 1197787 1361210 1264699
6892 1264699 1489022 1423988 1288030 1653385 1557917 1435829 1768120 1916997 1839646 1485697
6882 1485697 1153192 1325556 1707002 2406923 2547254 1893552 1646724 1712009 1666408 1813864
6872 1813864 2235892 1339207 807233 773690 1119574 1072701 930862 585413 819507 893071
6862 893071 591918 770211 995818 723790 265300 609633 657038 1135026 953525 825105
6852 825105 1026676 508538 -273380 -311247 -9675 306861 156403 175960 528237 145060
6842 145060 222849 192879 383334 197083 544341 510190 272745 236235 444141 93967
6832 93967 8200 101124 279695 240529 766708 805161 594116 441456 466619 573096 442454
6821 442454 465014 294954 185278 667071 836278 962396 1001494 627334 539581 457733
6811 457733 967441 1460602 1588984 1479814 1502398 1196705 1217326 910474 899748 736961
6801 736961 689264 1045734 998021 1279907 1777118 2022349 1605312 615913 728402 592086
6791 592086 313779 664969 375268 90603 152694 420001 753739 638323 63059 252278
6781 252278 815496 637708 533217 10727 14729 -288585 -101157 329750 203153 24502
6771 24502 -804976 -292025 -233956 221777 -435944 -312402 -280253 -180730 269246 -228457
6761 -228457 -363616 -500854 -277369 -178077 -300686 -404560 -356042 -340959 -212279 -559720
6751 -559720 -1031405 -626925 -449312 -81033 373674 -259980 -479301 -36822 -169458 196985
6741 196985 504749 -205772 -568624 -393448 -59972 -30770 -105013 -181084 -3027 -455304
6731 -455304 202401 136141 76997 146594 131374 -47002 131158 396812 161727 251194 -498719
6720 -498719 -260749 -383871 -478267 -231988 -716036 -331963 -28836 324052 359445 -98842
6710 -98842 -277634 112874 413839 -25051 456863 819245 741238 1457773 2091745 2751792
6700 2751792 2693875 2757567 2183779 1691280 1466465 1279417 956568 724883 973814 1396783
6690 1396783 1949304 2286418 1976966 1983294 1404076 952650 441041 85228 384606 227769
6680 227769 385477 535144 473585 84325 -120008 -821849 -678205 -603267 -903210 -856748
6670 -856748 -939995 -424079 -241035 -786712 -936646 -1014974 -708674 -350876 -284220 -681883
6660 -681883 -341546 -538745 -947106 -647998 -726126 -637673 -621911 -52064 -446571 -552985
6650 -552985 -729656 -659503 -347698 -269658 -585307 -916003 -712542 -266048 -354466 -746837
6640 -746837 -751963 -757468 -515232 -553730 -646008 -644130 -969479 -937236 -422789 -410646 -322723 -585510
6628 -585510 -503266 -366134 -137458 115737 -458883 -1270333 -1188934 -1094638 -569271 -551976
6618 -551976 -551649 -539327 -504402 -297604 -886566 -590362 -748025 -1017591 -443290 -525820 -531355
6607 -531355 -830855 -593141 -608453 -638258 -248220 -332299 -998286 -784709 -679480 -786121
6597 -786121 -1165214 -679092 -813562 -1034798 -456848 -854602 -1063973 -829778 -902099 -1037232
6587 -1037232 -895810 -738900 -721970 -941984 -854681 -536563 -500469 -557644 -297735 -124312
6577 -124312 -715792 -1021920 -730543 -979351 -708615 -896110 -1538935 -1412072 -1167312 -1149898
6567 -1149898 -952510 -1252977 -1672503 -1375128 -874485 -1050507 -1048348 -976758 -1006438 -1259690
6557 -1259690 -1247504 -951011 -1027132 -908326 -822843 -778360 -523395 -688498 -810614 -1000038
6547 -1000038 -802827 -736736 -602831 -500008 -975459 -849087 -894847 -1232816 -924736 -1041317
6537 -1041317 -943162 -527818 -906947 -1351492 -803323 -663328 -1301190 -1579384 -1671943 -1202753
6527 -1202753 -546211 -536807 -952028 -1213293 -1646230 -1362893 -1324649 -1126049 -709242 -1006007
6517 -1006007 -1302124 -1441450 -866149 -503379 -455412 -456555 -443744 -656908 -448283 -804691
6507 -804691 -885016 -927860 -1145400 -968106 -1082454 -1155830 -781642 -687152 -1109436 -989804
6497 -989804 -766657 -670202 -1147799 -1016933 -641531 -506848 -1222556 -1407977 -1242845 -1294470
6487 -1294470 -1039590 -1148389 -1050002 -1157072 -1037954 -1223216 -1338177 -758631 -218298 -1094519
6477 -1094519 -610391 -972060 -1411822 -1585873 -670746 -770857 -951415 -881012 -1031233 -457399
6467 -457399 -862566 -641498 -544012 -212396 -507548 -946216 -718944 -298925 -1070319 -520853
6457 -520853 -119042 -79379 -319081 -782642 -553784 -263795 -220932 -260256 -426172 -559638
6447 -559638 -442502 -270599 -223431 -576694 -595598 -350101 -763907 -753056 -283575 -72444
6437 -72444 -362441 -221798 -615291 -600432 -906258 -1534763 -1435863 -1700915 -1613460 -1255198
6427 -1255198 -937742 -626219 -483533 -530995 -1035931 -759269 -582890 -772666 -606847 -590304
6417 -590304 -980540 -1402200 -1559186 -1304996 -1182949 -1032456 -916460 -758268 -319830 -493764
6407 -493764 -545205 -379498 -87471 -185009 -113099 -676961 -718707 -460612 -912426 -720119
6397 -720119 -1174372 -1154318 -833313 -894878 -461153 -772062 -942179 -805522 -619316 -506076
6387 -506076 -484616 -646880 -1264403 -1075387 -618194 -1163795 -1368039 -1228729 -1143353 -725531
6377 -725531 -533814 -347780 -199972 -259542 -736303 -877768 -640266 -1011391 -1149696 -498734
6367 -498734 -688992 -1104774 -916484 -1057833 -1041774 -1146148 -1009092 -860284 -649502 -294588
6357 -294588 -490568 -1134750 -1139272 -1103378 -886698 -695593 -559461 -1282357 -1081479 -725391
6347 -725391 -1000555 -640983 -735889 -902715 -1220004 -1259679 -1097477 -1082297 -763275 -596235
6337 -596235 -765723 -786884 -212232 -743229 -886008 -456225 -251128 -243262 -683556 -1444747
6327 -1444747 -1440728 -677807 -876829 -1004347 -1048393 -925115 -892100 -1069141 -824978 -833856 -1236667
6316 -1236667 -680357 -432190 -801982 -730534 -1182789 -1166796 -608888 -600126 -649107 -794643
6306 -794643 -571788 -433692 -214528 95894 -378044 -591970 -377285 -762636 -408252 -825649
6296 -825649 -1186119 -1233502 -657544 -472064 -565701 -536775 -839284 -485420 -298628 -381605
6286 -381605 -183584 -271827 -382369 210193 16613 -1141499 -1478515 -1060902 -643754 -658903
6276 -658903 -245350 -2087 237110 -298770 -545916 -355821 -691707 -1530616 -1220289 -317417
6266 -317417 -537457 -894533 -1080584 -632548 -444641 -220155 -323969 -813687 -996149 -897972
6256 -897972 -972848 -717078 -937215 -1029138 -643682 -693804 -1131576 -521529 -209507 21162
6246 21162 349810 24851 -525561 -180621 -628696 -702614 -701360 -684034 -380247 -534700 -539965
6235 -539965 -662766 -318476 -215963 -304510 -388374 -523090 -924827 -1074394 -509588 -67295
6225 -67295 -8740 -15362 -405473 -925105 -1001958 -742627 -695597 -696090 -263868 -231195 153634
6214 153634 683595 304882 135265 -271286 96224 367907 316504 101849 334938 580707
6204 580707 284510 -206695 -909413 -532734 -356700 -139515 -266095 85976 149679 -279969
6194 -279969 -214107 -598318 -139925 80277 -114418 96694 206611 -212121 -653530 -737421
6184 -737421 -468364 -346295 143508 -38255 -393822 -440793 -419724 -180216 -308691 -205488
6174 -205488 -299246 -498678 -378066 -470581 138733 -120638 -420349 -265401 -295007 -159682
6164 -159682 397661 436067 170447 357044 476667 349175 436292 816200 490552 492281
6154 492281 305822 304081 -28124 -62614 77758 -356820 -282900 -238266 -57968 280139 326174
6143 326174 271306 406390 615151 326690 86794 -474833 115103 237681 40277 -136068
6133 -136068 -44603 106416 157736 440609 -217199 -99630 119183 438289 335550 126267
6123 126267 264504 383046 696488 649358 749629 425602 524101 288009 308738 182850
6113 182850 340010 316473 413893 629598 300162 446577 608669 213739 255689 343391
6103 343391 464700 168552 223131 812746 962612 595853 -53967 276104 512597 -74470
6093 -74470 -23918 456253 634181 668053 409056 244533 319854 934749 1212247 1027313
6083 1027313 431934 336970 241609 -58957 12422 119762 486145 1036087 1165536 1093812
6073 1093812 951837 599056 463975 604531 11964 482783 -192803 -55026 127720 29924
6063 29924 440560 332727 -11713 653293 1116923 814166 1360796 1323670 1057608 719033
6053 719033 800167 889984 899446 1042354 1475455 1248799 1171903 1116225 1324894 2073849 1498302
6042 1498302 1500715 1582810 1934638 1556576 1754314 1469989 1161098 1244107 887134 421202
6032 421202 593494 712224 859136 975321 1218405 1762503 1449743 1047022 571088 920069
6022 920069 1138705 1179782 927894 1023905 691585 405061 726269 595308 -136028 9615
6012 9615 393741 1255942 804093 508555 678582 631780 1141663 1536743 1596186 1322427
6002 1322427 1367351 1393934 928875 869371 903560 942845 859657 1017375 1302932 951994 1114168
5991 1114168 848090 974300 1025114 1290899 1677566 1287777 1302743 1633974 1789883 1413574
5981 1413574 836439 724805 1101374 1544451 1934695 1665306 2019955 2107490 1860440 2044627
5971 2044627 2240147 1970557 2166323 2099973 1770550 2056304 1609905 1419403 1602016 1472276
5961 1472276 1683187 2129906 1696632 1954507 1809089 1840123 1981468 1984041 1990290 1851396
5951 1851396 1889580 2417905 2438287 2117478 2273391 2066325 2060573 1934975 2173492 2501002
5941 2501002 2957291 2577200 2357111 1964009 2266478 2105004 1748563 1782301 1970081 1878381
5931 1878381 1781332 2358112 2176447 1892627 2115343 2328489 2584635 2449709 3099961 2848962
5921 2848962 2521839 2763613 3038728 2912575 2521648 2504477 2678834 2970630 3307381 3369738
5911 3369738 3115500 3242193 3237186 2806811 2936577 2786596 2579303 2588468 2635481 3152878
5901 3152878 3240227 2863410 2839160 3040751 2816754 2984532 2871893 2958337 2434254 2408922
5891 2408922 2733375 2713174 2362238 2519441 2850656 2878471 2908001 3504782 3440275 3393522
5881 3393522 3621225 3675278 3402974 2837176 2009502 2062572 2130102 2605816 2237148 3047999
5871 3047999 3368917 2960745 2905136 3087190 2903196 3264401 3312349 3283483 4068727 4317173
5861 4317173 4521945 3771212 4173634 3952363 3258486 3388990 3260917 2471211 2757221 3318139
5851 3318139 4092761 4070568 3657532 3500945 3423738 3334896 3376760 3880241 3767030 4173289
5841 4173289 4750369 4904237 5012458 5469401 5134494 4920115 5338875 5287465 4774130 4476020
5831 4476020 4412372 4864745 4983124 4034258 3681791 3553557 3571351 3320087 3295469 2912911
5821 2912911 2682328 2568849 2586077 2676364 2825718 2240686 2428967 2895257 2806297 2783110
5811 2783110 2422240 2212445 2345064 2596248 2694028 2721536 2200950 1728200 1565122 1944088
5801 1944088 2028304 1909725 1726221 1816402 1993057 2200743 2065947 2175029 2152360 1816936
5791 1816936 1880730 1714862 1703186 1758828 2237853 2430529 2560940 1422374 1061355 1671035
5781 1671035 1682482 1396782 1729269 1972757 2205183 1987040 1858626 2048944 1559433 1507876
5771 1507876 1523059 1852225 1986584 1690979 2062638 2242249 2579499 2342043 2333145 1878519
5761 1878519 1408545 1984061 2026342 1711099 1527038 1451739 1757478 2021185 1835712 2144365
5751 2144365 2006694 2290254 1526180 1728236 1320842 992006 1201733 1510978 1919934 2152630
5741 2152630 2151117 2159542 2247114 2251615 1929000 1402892 2032512 1933865 1953801 2720595 2663444
5730 2663444 2312309 2143894 1848470 1637867 1798488 2023746 1944232 2147918 2640447 2859873
5720 2859873 2859542 3044034 2909523 2657995 3036113 2415345 2720172 3261033 3310612 3349254
5710 3349254 3473740 3683008 3753535 4060824 3219385 3418311 3720926 3716632 4105053 4297787
5700 4297787 3550978 3146711 3367949 3820420 3725735 3692723 3615519 3923621 4170076 3723462
5690 3723462 2905211 3224599 3764456 3536482 3195756 3306147 3673056 4333826 4611165 4723510
5680 4723510 4507354 4538570 4841997 4773324 4767503 5174316 5326419 5240726 5209874 4779692 5180467
5669 5180467 5214436 5196516 5171749 5505318 5202292 4993419 5093871 4678807 4375062 4487526
5659 4487526 5316004 5481691 5360634 5670465 5788190 5593776 5081068 5107440 5090197 5529759
5649 5529759 5912743 5543536 5917698 6702284 6420896 6024884 6200967 6234232 6124354 6608094
5639 6608094 6033824 6009926 6749034 6471494 6791575 6866265 7078784 6917970 6958308 7398602
5629 7398602 7705729 7931385 8073759 8433380 8366791 8302959 7616472 7469371 7977867 8046671
5619 8046671 8786035 8739359 8773507 9473959 9224431 9213099 8803578 9144224 9607255 9812132
5609 9812132 9717221 9664743 9729913 10212463 10412395 10367679 10512801 10211621 10489542 10886851
5599 10886851 11059012 10905809 10324854 9940394 10408799 10080152 10504230 10653701 10500774
5590 10500774 10724558 10555019 10559439 10648544 10967755 11066551 11510253 11650945 11040751 10736355
5580 10736355 11134610 11501998 11552102 11575063 11649478 11589252 11792129 11730520 11612832 11518455
5570 11518455 11278834 11423622 11346482 11350791 11897435 11493922 11432990 11755314 11646325 11740826
5560 11740826 11965067 11452430 11515741 11567039 11591313 11999126 11844411 12299984 12344966 12029924
5550 12029924 11946307 12159317 12277751 12188697 12215255 12575113 12702012 12119265 11938190 12551944
5540 12551944 12907113 12414288 12157675 12082245 11937665 12580862 13143698 12763570 12729474 13063660
5530 13063660 13192971 13425055 13438457 13836462 14164214 13802928 13492031 13191035 13686676 13967578
5520 13967578 13809378 14017419 14548220 14837122 14936495 14711058 14501784 14777366 14590196 15031974
5510 15031974 14748171 14738508 15201111 15466131 14883631 14383441 15094043 15061268 15167127 15774584
5500 15774584 15725985 15521396 15943467 15888095 15295788 15290316 15761951 16314916 16748862 17020708
5490 17020708 16736915 17126685 16878753 16698873 16894421 16648635 16562435 16846283 16833666 16946160
5480 16946160 16994409 17165864 17127138 17576364 17837907 17892718 17714687 17984070 18440905 18254860
5470 18254860 18274438 18596589 18941894 18644142 18646276 18774341 19218734 18727532 18806843 18989102
5460 18989102 19349948 19634320 19569781 19762095 19353609 19368178 20026515 20062990 20032947 20358849
5450 20358849 20863692 21048287 21597152 21662554 21586185 22058499 21912468 22199527 22130425 22504749
5440 22504749 22493530 23012319 23516360 23702903 24434048 24945917 24595618 25063998 25457818 26229383
5430 26229383 26702246 26794788 27123259 27363745 28099470 28408382 28157227 28576021 29362706 29784392
5420 29784392 30279500 30442267 31101992 31842384 32613691 33600932 34089426 34274164 34814083
5411 34814083 35700784 36509219 37060369 37641057 38449592 39209984 39640118 40207502 40713260
5402 40713260 41701719 43032283 44542527 45056874 46401990 47406627 47794341 48107066 49161761
5393 49161761 50210262 50592357 51141082 52912059 54752719 56254589 57279216 58173112 59850259
5384 59850259 61625359 62644771 63644561 64675919 66756373 68851545 70408712 71984134
5376 71984134 73474505 75221753 77652727 79477744 81231222 83345312 86122374 89135823
5368 89135823 92166941 95185718 97938739 101236130 104943325 109043135 113955137 118576115
5360 118576115 124202965 130574483 136949970 143550742 150571089 157998469 165309347 174399522
5352 174399522 183295503 192710441 202047232 210489137 218447348 224657168 230105978 235030565
5344 235030565 239185012 242655017 245851909 247646677 248325001 248047953 247897150 247950991 249045936
5335 249045936 251512110 255495028 259778746 265291111 272088454 279751741 289406778 300060199
5327 300060199 313205549 327143087 342878736 361024000 380602518 400413400 418553487
5320 418553487 434904648 448342604 456860879 463274542 466662216 467318512 463669907 456981338
5312 456981338 446696655 434065772 420228207 406289692 393781862 384107014 377105314
5305 377105314 372317136 369358720 367836159 367619518 368509324 369359938 371939339 376290510
5297 376290510 381870454 390630181 402526993 416019692 431293725 446086214 458591189
5290 458591189 468153518 473867645 475701754 474211384 470708099 465427200 459032799 449921692
5282 449921692 438276753 424286074 408931304 393058678 377897631 364750557 353670306
5275 353670306 344874037 337414736 331240566 326226342 321599731 316031912 309166086 302003293
5267 302003293 294217673 287020530 281657781 277175783 273512015 269325632 264408292 259643370
5259 259643370 254798005 250355815 245374190 239006735 231914283 224194205 215742964 207468523
5251 207468523 198429160 189759906 181622728 174182805 166751433 159714794 153200805 146846185
5243 146846185 140611428 133484743 126222797 119107557 111931377 105221806 98837324 93264602
5235 93264602 88005945 83490010 79343887 75156567 71323003 67844380 65767078 63030806
5227 63030806 59968799 58065114 56190765 54706603 52316252 50853316 49597916 48501665
5219 48501665 47666418 46241392 45342927 44931047 43860869 42851430 41894992 41033021 40214711
5210 40214711 40140188 39520838 38775449 38334639 37600869 37352272 36334646 35188937 34197345
5201 34197345 33212063 32930859 32650884 31663113 30994788 30725960 29963386 29264221 29417095
5192 29417095 28883815 28121001 27349627 26717232 26185397 26094505 25656962 25679696 25740889 24794526
5182 24794526 24260142 23333364 22069273 21805504 21837311 21428386 20451188 19766904 20062333
5173 20062333 19737865 18983769 19181910 18646110 18216215 17410371 16937294 16765676 16641774
5164 16641774 17071849 16991565 16849380 16310681 16314220 15933696 15194833 15235973 15470733 14748790
5154 14748790 14761254 14695229 14047727 13832185 13929666 14080105 14423063 14234562 13302769 12848661
5144 12848661 12959086 13210032 12840110 12827384 12668803 12500154 12846745 12026537 11823590 11482669
5134 11482669 10977533 10877281 11302464 11080938 10869730 10694893 10702198 11183291 11077305 11011495
5124 11011495 10723483 10360850 10508071 10665124 10084540 10058475 9903478 10368734 10389101 10122418
5114 10122418 9999172 9491966 9950683 9811036 10098873 10328881 9808217 9650651 9685878 9767620
5104 9767620 9879511 9722349 9712147 9647556 9549658 9553105 9526949 9393458 9692972 9871601 9780564
5093 9780564 9787327 9055291 9013054 9365060 9259652 9228805 9447352 9125479 9629575 9733061
5083 9733061 9889313 9414185 9974676 9982202 9771654 10022868 10297649 10463975 9779307 9585255
5073 9585255 10153168 10371001 10485041 10742550 10449682 10531405 10851730 10631760 10995531 11323422
5063 11323422 10926973 10648836 11030636 11350762 11162353 11334937 11433875 10994376 10992861 10913276
5053 10913276 10954648 11412119 11499641 11751645 11738933 11527688 11871018 12234218 11972642 11407660
5043 11407660 11251851 11723661 11624189 11710030 11753563 11947536 12388185 12474044 12090746 12155613
5033 12155613 12213051 12470742 13029867 12876116 12383292 12143171 12214358 12044821 12630102 12548908
5023 12548908 12314355 12631479 12771800 12781869 12431309 13212850 13312650 13503552 13524718 13418213
5013 13418213 14354681 14100409 14363246 14515012 14564917 15195103 15140806 14850423 15362497 15895006
5003 15895006 15744702 15888522 16298074 16847121 16841504 17145754 17449296 17622992 17587612 17800549
4993 17800549 18013036 18272212 18562367 18772637 18949704 19068790 19596644 19699699 19793574 19872670
4983 19872670 20437606 20719474 20541512 21092983 21449214 21850715 22558435 23330353 24280501
4974 24280501 25007273 25408443 26663285 27619497 29020862 30538070 31594037 33267926 35604710
4965 35604710 37673751 40913687 45477159 50110654 56691496 65046649 73502641 81417211
4957 81417211 86798159 89533578 90167534 86584189 80880316 72886610 64147199 56498042
4949 56498042 49403573 43300277 38503767 35348080 32881053 31099383 29326323 27638745
4941 27638745 26328500 25113791 24330853 24146352 23778728 23088313 22586395 21938264 21138953
4932 21138953 21436949 21028729 20742595 21313654 20834007 20776910 21171008 21016301 21231166 21352026
4922 21352026 21285031 21218932 21219554 21415210 21552454 21508429 21984704 21786194 22344440 22527731
4912 22527731 22676486 22851258 22706048 23299189 23549089 24010336 24196919 24702117 25125355
4903 25125355 25305209 25393429 25685047 25757708 25700872 26466816 26733941 26967733 27332028 28403270
4893 28403270 28861443 28754649 29540410 30070124 30434386 30972764 31486893 32256203 32696062
4884 32696062 33365501 33850219 34515400 35456254 35880149 37093640 37898466 39020952 40503351
4875 40503351 42322547 44546596 46790553 48783422 50126561 49964426 50150595 49948124 48951509
4866 48951509 48685528 49272038 50284209 52165841 54712541 57133361 61423741 67446774
4858 67446774 73949980 82721893 93021920 104245385 110453502 109664843 105813539 99912161
4850 99912161 96157644 95055913 97328189 104650795 116546873 132262649 151711659 165063224
4842 165063224 161030286 149687854 132060275 114764800 100866644 91243544 86905344
4835 86905344 86043694 89986413 95677963 100553340 98893256 92179632 82887625 71900460
4827 71900460 62374093 54514931 48783265 44780501 41816424 39627471 37841694 35950818
4819 35950818 34232082 32752191 31870392 31038443 29293661 28413546 27584862 27228800 26115769
4810 26115769 25957373 26188091 25143424 24655678 24326122 23962498 23856341 23416959 23185070
4801 23185070 22578147 22263204 22479663 22102680 22344882 21674005 21297316 21174686 20900665
4792 20900665 20372070 19963976 19950137 19108119 19410726 19884764 19989004 19575401 19705370 19559460
4782 19559460 19663366 19455298 19219503 18694576 18842824 19127355 19215650 18709141 18314173 18416299
4772 18416299 18363088 18351050 18425675 18330019 18325828 18436009 18727276 18127697 18227393 18135046 17955325
4761 17955325 17927396 17833202 17834096 18163318 18148152 17749547 17819990 18420204 18316102 18107082 18108242
4750 18108242 17721891 18069684 18073913 18467757 18664779 19261492 19866482 20182397 20438760 20999278
4740 20999278 21558403 21741436 22231409 22479128 21267308 20558868 20270368 20367121 20508447
4731 20508447 20442553 20634891 20462185 20131293 19950019 20808071 20793229 20983648 21025053 20773279
4721 20773279 21338104 20980058 20905604 21593723 22117989 21896438 22044204 22260721 22575830 22707468
4711 22707468 21968130 22466869 22735004 23374509 23646288 23950938 24131468 24753845 24973364
4702 24973364 24621913 25124367 25449416 26367476 26332732 26543504 26976289 27389374 27639491 27914616
4692 27914616 28458583 29193160 29411633 29783916 29935767 30234459 30859314 31549767 31414409
4683 31414409 32012318 32995487 33244177 33861792 34559432 35057910 35499319 35450447 36345686 37570090
4673 37570090 38569384 39391291 40271724 41149907 41674423 42338504 43246259 43894138 44999782
4664 44999782 45922889 46790394 48140213 49800119 51230650 52861759 54787279 56384080
4656 56384080 58631157 60284574 62428639 64978408 67339947 69640206 71463280 73014139
4648 73014139 74386015 75896212 77393582 77696762 79130028 80562539 81460181 83062718
4640 83062718 84890167 87149999 90114307 93623889 97703425 101592876 104911202 108334632
4632 108334632 110970847 113937303 116971592 120055216 122891023 126017780 128529120 131038608
4624 131038608 132946168 134750324 137073481 139449939 141569555 143533359 145007080 145554458
4616 145554458 146369298 147742788 149218196 151782762 156864014 162868125 170030204 178245719
4608 178245719 185987216 192565804 197452258 199860388 201552407 202338787 203753202 205294343
4600 205294343 206818080 208196855 208796012 209040977 209303773 210491468 211474981 212876563 214774663
4591 214774663 215488046 214328727 213025346 212275298 211619198 212697948 215567237 220967949
4583 220967949 227933147 235588235 244065677 251255932 256069444 259614823 261914343 263998020
4575 263998020 267176018 270411019 273727963 276362062 277688849 277883345 277340579 276878398
4567 276878398 277309425 277120485 275323093 272055841 268181038 264305448 260984358 258480034
4559 258480034 258233645 260421849 265537115 272619495 280710720 289596122 297844508 305018212
4551 305018212 311077025 316314524 320128907 323309715 324946224 325842867 326522557 327590804
4543 327590804 327127295 324044611 318985803 312700349 306306961 300278491 295440824 293606935
4535 293606935 293607734 295956448 300502681 306172991 310823967 315212531 318820487 320535892 321774534
4526 321774534 322518880 321802550 320164679 317255451 312773616 308414418 305243591 303092133
4518 303092133 301127554 298295101 294220002 289902078 284372933 277868662 271295661 265180041
4510 265180041 260854695 258328715 256950408 257286957 257313151 257062101 256401783 255051543 252533221
4501 252533221 249122406 244299986 239692967 234436209 228564087 222960382 218703024 215903584
4493 215903584 214671368 215316555 216085753 215203365 213038768 208115882 201155506 193984700
4485 193984700 186717675 180145484 174981455 170929232 167561156 165755150 162890864 160209655
4477 160209655 157689166 155905339 154131147 152263041 149006349 145164756 141296788 137572335
4469 137572335 133800634 129417810 126045312 123036187 121192848 119099631 116961376 113706019
4461 113706019 109402708 105273970 101216091 97118605 93829244 91176897 88748046 86835832
4453 86835832 85149496 83921000 82768117 80821004 79080242 77921069 76238140 74120060
4445 74120060 72628836 70356526 67702083 64584579 61779757 59342097 57047056 55012658
4437 55012658 53275008 51209613 49705417 48596401 47309995 46158419 45286936 44383369
4429 44383369 43019328 41951052 40765945 39581950 38219550 37450867 36300606 35411204
4421 35411204 34145058 32815915 32009757 31447911 31037405 29972465 29593936 29578079 28384588
4412 28384588 27915155 27491902 26699420 26201234 26204074 25778674 24986846 24186802 24357483 24304055
4402 24304055 23692658 23566093 23452231 23015266 22576675 21952669 21417827 20906171 20820771 20690269
4392 20690269 20467263 20531457 20360092 20051829 19607341 18697903 18362888 18616673 18657728 19144674
4382 19144674 18552289 18119079 17914033 17980770 17723250 17467647 17688167 17164772 16634340 16830042
4372 16830042 16665351 16872103 16846638 16441702 15946465 16167148 15570273 15285822 15601881 15321408
4362 15321408 15374906 15658258 15630324 15530285 15982259 15865290 15528274 15199319 15174598 14908096
4352 14908096 14746545 14525588 14490356 14124440 14502530 14615620 14591485 14148237 13855488 14260504
4342 14260504 14182224 14438422 14456189 14263550 14110413 14000047 13262723 13604154 13668998 13428190
4332 13428190 13073726 13016341 13611128 13996394 14116557 13879600 13369695 13312603 13473778 13507517
4322 13507517 13480834 13485634 13620703 13308156 13067718 13188158 12915207 12735927 13030276 13458968
4312 13458968 13603458 13494456 13061048 13087181 13353607 13172466 13085064 12860882 12838343 12882971
4302 12882971 13215866 13534747 13875215 13705731 13429635 13255370 13698003 13264388 13884302
4293 13884302 14373721 14374709 14214588 14329452 14662037 14406239 14119528 14325166 14497496 14550496
4283 14550496 14200713 14433291 14800680 14635032 15173892 14636236 14594300 14445534 14492554 15011365
4273 15011365 15075959 15536439 15848080 15990008 16521778 16181926 15875039 15791799 16066072 16421802
4263 16421802 16060176 16137250 16668761 16941446 16924869 16846945 16852230 16689360 17193946 16865963
4253 16865963 16787333 16636007 17069547 17400009 17589139 18113336 18133263 18761892 19162762 19686649
4243 19686649 19712346 19496585 20030547 20367940 20497631 20643828 20934484 21164639 21256718 21832662
4233 21832662 22465634 23027217 23069037 24122516 24279407 25318991 26029271 27626422 28886975
4224 28886975 29517689 30906944 32185167 33278432 34992469 36633744 38576708 40907733
4216 40907733 44154566 47543603 50944768 55214038 59014091 63041012 65834135 68141945
4208 68141945 68742966 68039852 65424482 62208518 58352028 54190151 49506783 45324419
4200 45324419 41413500 37996663 35116836 32717065 30809412 28985025 27714273 26334140
4192 26334140 25221820 25236223 24037744 23211130 22454344 21763237 21385110 20747497 20310530
4183 20310530 20715519 20565723 20210625 19723167 19729512 18656457 18196034 18680452 18859272 19128940
4173 19128940 19031479 18646269 18385958 18740796 18667929 18411301 18258928 18211693 17857504 18489332
4163 18489332 18684487 18657044 18464475 18307195 18126503 18516744 18824590 18735320 18273079 18710939
4153 18710939 18863862 18871544 18398553 18179458 18623282 19161174 18867951 18999671 19683888 20552417
4143 20552417 20190039 20180387 20622730 20494783 20665902 20051369 20463723 20753579 21110369 21648156
4133 21648156 22105158 22438932 22416022 21873603 22022558 22308512 22786834 22775894 23209860 23869725
4123 23869725 23373576 23279995 23441744 23803816 23717794 23898593 24006669 24097755 24524785 24599203
4113 24599203 24462495 24608464 24461095 23891121 23837866 24006132 23790831 24020158 23897355 24142443
4103 24142443 24304126 23810472 22743606 22665311 22544447 22335664 22565933 22627423 22336762 21798527
4093 21798527 21986263 21919991 21455560 21551851 21091617 20572534 20209178 20181861 19898118 19653097
4083 19653097 20268570 20322435 20015177 19492072 18833513 18544300 18917573 18610763 18268763 17912164
4073 17912164 17680017 17505890 17258405 17307730 17367717 17107019 17459277 17532831 17248706 17052870
4063 17052870 16920489 16860742 16478817 16301406 16271716 16117259 16261672 16539151 16333204 16063593
4053 16063593 15875407 15859414 16074040 16337579 16423304 15698592 15810791 16027557 16358854 16794536
4043 16794536 16892040 17151138 16813462 16859893 17047983 16772551 17556194 17549597 17674376 18180093
4033 18180093 17855571 17253744 17199701 17317860 17307120 17117825 17384161 17960627 17657456 17105115
4023 17105115 16971232 17281945 17610286 18067586 18364484 18207440 18180344 18122211 18122774 18557947
4013 18557947 18447677 18716482 18706296 18997421 19532217 19652075 19789247 19961015 20169439 19859247
4003 19859247 20181647 20893836 20911535 21216887 21536433 22050731 22466808 22597935 22936204 23221572
3993 23221572 23580054 24325509 25040053 25557939 26410048 26885557 27411859 28095846 28515316
3984 28515316 28691640 29328607 29586573 29916799 31246993 32448210 33456420 34515845 35653789
3975 35653789 36211580 37527170 38515380 39595062 41021789 42055636 43020495 44309795 45075761
3966 45075761 45070391 45658657 47059622 47941558 48651928 48919926 47895396 46840498 45831592
3957 45831592 44575817 42637648 40337807 38033239 36204575 33992259 32097822 30784448
3949 30784448 29196675 27206016 26372001 25754044 24595648 23145697 22447631 21514690 20920685
3940 20920685 20546462 19894573 19471355 19188724 18466329 18192429 18110046 17688920 17469080 16848745
3930 16848745 16025569 16150014 16421945 16091435 16011314 15321494 15438353 15747108 15086541 15098502
3920 15098502 15264954 15205647 15506770 15477183 15579523 14530804 14338642 13742696 13904335 13963237
3910 13963237 13832114 13834911 13979653 14733357 14776196 14572905 14122267 13201838 12905071 12375574
3900 12375574 11667228 11578590 11209273 11245775 11268224 11141537 11898433 12433843 12292191 12194817
3890 12194817 11581477 11894960 12611140 12831391 12805115 13343249 13294711 13140211 12789617 12164441
3880 12164441 11539138 11429009 12450209 12650689 13084043 13779517 13811772 13673636 13556337
3871 13556337 12678172 11492242 10999625 10279013 9765273 9540589 8960737 8451153 8257180
3862 8257180 8527646 7919938 7854299 8241825 8442539 8442258 8467804 8115714 8616553 9283639
3852 9283639 9395659 8788648 8343092 8217773 7891819 7999253 7779080 7943101 8110468 8668255
3842 8668255 9066199 8719599 8123400 7644595 6986768 6387613 6547773 6389787 5813262 5885108
3832 5885108 5803070 6083184 6141980 5967314 5659466 5126571 5045433 5525382 5251514 5146375
3822 5146375 4903671 5277729 5120848 4870450 4704431 4544548 4677079 4412505 4471247 4315508
3812 4315508 4043690 4291987 4099365 4337435 4000992 4532337 4725295 4191730 4486868 4822696
3802 4822696 4972121 4829158 4477445 4121735 3938914 4633971 4641559 4478765 4176920 3933810
3792 3933810 3755284 4112221 4032793 3967174 3973104 4392126 4133995 3537300 4506090 4129196
3782 4129196 4200172 4144296 4225241 3935296 3993643 3549908 3452964 3510367 3657864 3520563 3507853
3771 3507853 3146969 3472192 4023270 3451006 3289943 3663901 3715033 3816683 3608241 3634682
3761 3634682 3568681 3588252 3619835 4012294 3775075 3367273 3612545 3992020 3335532 3502508
3751 3502508 4009849 3671774 3584928 3819529 3828789 3748612 4015475 3952706 3928500 3773752 3720163
3740 3720163 3296266 3812970 3840946 3691125 3498420 3484975 3947147 4220092 3737999 3719160
3730 3719160 3960560 3936896 3728079 4018520 3897850 3514069 4374990 4306542 4489764 4310983
3720 4310983 3789160 3600479 3739823 4359675 4648163 4486174 5092039 4996978 5418337 5482291
3710 5482291 5032966 4989825 4951317 5220854 5018314 5139292 5246001 5519897 4983805 5152187
3700 5152187 5434192 5998977 5882681 5437929 6138066 6631526 6825531 6678771 6441962 6241064
3690 6241064 6022166 6789967 7025600 6762069 6666542 6711091 6396191 6866016 7133061 6979338
3680 6979338 7354413 7358573 7533520 7487629 7562363 7228662 7362312 7564055 8312857 8633152
3670 8633152 8718685 8362848 9071470 9388490 9489565 9290064 9110967 9800185 10524394 10448762
3660 10448762 10784687 11600769 11162894 11828780 12481601 13332416 13650078 13669314 13832656 14251671
3650 14251671 14124737 14252422 14418895 14821161 15263423 15158575 15139450 15166831 15295637 14998031
3640 14998031 15455252 15654482 15741895 15980993 16031129 16284989 16958476 17228014 17947402 18647513
3630 18647513 18244359 19043899 20073625 21375803 21827590 23673633 25129840 25224726 25483524
3621 25483524 25226697 24681283 23164690 21720762 21431488 20352297 19566535 18882681 18350315
3612 18350315 17779033 17245096 16986130 16469929 16644637 16367704 16158558 16661581 16861429
3603 16861429 17378228 17739102 17312675 17413045 18030713 18262107 18634765 18511351 18444640 18765084
3593 18765084 18705973 18891478 18681711 17887230 17316764 16132328 15266171 14985768 14219224
3584 14219224 13711010 13424899 12675789 12285504 12170501 11725344 11328414 11667986 11099362
3575 11099362 10599673 10936471 10973305 11162108 10949699 10808315 10510761 10096625 9827208 9024629
3565 9024629 8754455 8628852 7890004 8151641 7502158 7413366 7326859 7268659 6478037 6435796
3555 6435796 6049247 6140083 5475118 5573208 5264311 5338552 5591877 4986514 4716199 4725324
3545 4725324 4226137 3734436 4051620 4257256 4345294 4100131 3860686 3923621 3654191 3205004
3535 3205004 3550620 3065755 3041534 2851676 2808801 3023123 3241606 3069756 2941330 3459815
3525 3459815 3105217 2937432 2953404 3202742 2769154 2678592 2834704 2439668 2832815 2904572
3515 2904572 2046709 2122294 1940040 1661591 1917773 2149259 2626635 1885394 1660515 1694765
3505 1694765 2222986 2541969 2309145 1759223 1778484 1457158 1922767 1709766 1126102 846381
3495 846381 1271700 1148026 810534 956249 1508587 1738668 1363236 1086131 984893 624705
3485 624705 597642 862522 614671 893440 1058909 906902 974276 765092 558326 730304
3475 730304 571547 199433 135096 300192 375414 157185 402272 454377 1131533 1262009
3465 1262009 625231 372660 178884 30557 180083 824405 746752 154984 418713 -58135
3455 -58135 -156095 -290521 -241076 24060 -172124 -251339 -801718 -785500 -879801 -186038 -399581
3444 -399581 101450 215176 43947 -26971 -252381 -98321 193362 279435 -190334 94968
3434 94968 413328 21597 -329597 -302651 -263755 -268599 -471830 -566916 29162 -249074 -139354
3423 -139354 23257 -437937 -396493 -320399 -279064 -212596 -617012 -439471 -414480 -77996 -105925
3412 -105925 -175178 -414953 -468490 -233322 -313723 -52691 -198225 -432168 -194857 95405
3402 95405 -48323 -320073 -583819 -876949 -700816 -265691 -281125 202434 116188 -74298
3392 -74298 -89893 -176883 -612615 -688643 -867300 -480170 44252 -274230 -325758 -470942 -488821
3381 -488821 -541244 -364557 -380311 -990414 -789988 -332133 -336063 -152432 3383 -531894
3371 -531894 -423338 -896241 -526658 -370908 -1103006 -827393 -554134 -282074 -307633 -980378
3361 -980378 -987739 -824373 -408335 -382187 -483363 261705 626435 420276 247787 -60860
3351 -60860 -266985 -352956 -376839 -249652 -323025 -300655 191179 87669 -262955 -58176 -288157
3340 -288157 -17705 645797 1008000 543442 -223329 -300739 -261428 -614553 -498374 -819478
3330 -819478 -578254 -754119 -867371 -279903 -310155 -44499 -258185 -456258 -349906 -582966
3320 -582966 -554729 -473182 -393712 -659393 -706434 -848851 -791901 -1004452 -905156 -909387 -763641
3309 -763641 -400526 32921 -226300 -615631 -455531 -606474 -664546 -241921 -424383 -577421
3299 -577421 -465757 -788338 -833651 -381774 -516140 -794327 -474662 -568626 -774717 -813618
3289 -813618 -178725 -33312 -761916 -704046 -729297 -589182 -552926 -955650 -516878 -563306
3279 -563306 -708566 -769709 -911800 -231525 -383921 -726070 -876408 -962972 -396821 -499311
3269 -499311 -643344 -691261 -584766 -511442 -449770 -899836 -676617 -159370 5938 16421
3259 16421 -147658 -500479 -570758 -423259 -379386 -438635 -1061466 -1147640 -493552 -476194 -932404
3248 -932404 -534393 -238994 -430078 -413312 -141488 168544 -434346 -713877 -749893 -745385
3238 -745385 -746402 -402914 -231532 -225737 -175539 -37426 -510330 -623865 -786799 -865314 -408168
3227 -408168 -98385 -315820 -426537 -472190 -386681 -675264 -817234 -650561 -734687 -931461
3217 -931461 -1011653 -672851 -230820 -407486 -640700 -400698 -172964 -464511 -336684 -465735
3207 -465735 -486431 -838586 -909229 -291314 -181725 60791 162293 -245140 -396743 -279602
3197 -279602 -558019 -807096 -682921 -549874 -915557 -844710 -843590 -1102193 -1244687 -1000166
3187 -1000166 -1037769 -1496322 -1386359 -958682 -901192 29822 -224021 -216590 -301792 -419805
3177 -419805 -709084 -338090 -434867 -221867 -60516 -222875 -1101790 -1280261 -1238878 -904081
3167 -904081 -1005178 -851358 -800454 -455913 -290382 -1018379 -966185 -1093506 -803798 -489095
3157 -489095 -271926 -268234 -406018 -271751 -699778 -764005 -647269 -747176 -706029 -771042 -667210
3146 -667210 -764953 -282299 -217647 120175 -26933 -423044 -687680 -525278 -692346 -352878
3136 -352878 82488 101057 -230501 -508255 -332366 -248826 -433669 -635387 -1021645 -435776
3126 -435776 -660219 -821807 -1108795 -1033530 -916156 -800678 -428441 -372002 -794672 -880740
3116 -880740 -759235 -568531 -252163 -647845 -779258 -958825 -772139 -622733 -476250 -731951
3106 -731951 -847021 -680848 -577827 -464457 -766726 -495376 -53061 -279046 -94411 -461727
3096 -461727 -789612 23889 30060 -351449 -305244 -286796 204697 462704 343944 -1837
3086 -1837 -716469 -569274 -428479 -733855 -479946 -524490 -797763 -530003 -566268 -637045 -286377
3075 -286377 190653 -268720 -612504 -484161 -470493 -139029 77948 320862 140147 -44577
3065 -44577 -687863 -490741 -494312 -483578 -695167 -558387 -970365 -583738 -355665 -744310
3055 -744310 -350110 -214440 -160475 -604446 -412603 228002 195214 -283395 -22846 45638
3045 45638 -265674 -580574 -772092 -766795 -186212 -175671 -546173 -595331 -517554 -572742 -474955
3034 -474955 -522415 -525493 47880 310114 52866 -359760 -714545 -508462 -187607 183467
3024 183467 -4153 54767 -72097 -75658 -185077 -40073 38982 -117772 -445121 -906593
3014 -906593 -633245 -493791 -460096 -443163 -98177 -244160 -350997 317068 279556 -139980
3004 -139980 -237181 -233458 -88150 -292036 -487347 -439909 -19207 -229757 -482140 -945397
2994 -945397 -1085264 -433210 -259551 56126 342415 446059 -121460 -297385 289644 -26787
2984 -26787 -163061 -262258 -550651 -199694 -98159 -69210 471215 950142 810377 696977
2974 696977 758714 -62693 -165715 -106970 -234879 332458 507752 428632 14623 -417751
2964 -417751 60175 6159 -125024 -401211 65566 180254 68110 -149800 309880 624519
2954 624519 190220 -26751 -283628 -204469 28977 518673 504365 678014 53267 -480285
2944 -480285 -10957 209711 79446 141886 223489 672116 230819 468695 521006 77202
2934 77202 163963 792270 1006339 606029 421767 771822 837199 802324 869485 651094 757609
2923 757609 1214663 1411336 1419125 933327 1282338 1305539 1017793 712637 698825 806436
2913 806436 767718 819250 1016431 1624142 1293505 1528196 1341433 1327621 1563220 1683715
2903 1683715 1867016 2169552 2444715 2481254 2413202 2930188 3189153 3284436 2707524 3040494
2893 3040494 3348773 2912718 3028498 2963581 3242890 2916026 3166902 3445370 3432096 4161829
2883 4161829 3984994 3995479 4120548 4181624 3692645 3908788 4589065 4634614 4107123 4579397
2873 4579397 5108441 5059688 5235094 5264284 5853779 5912603 6158292 6772968 6631842 6542341
2863 6542341 7127958 7405370 7269664 7597588 8028950 8321152 8311607 8778476 9131711 9097151
2853 9097151 9624245 10026591 10343865 11062532 11082071 10789759 11179735 11756569 12428279 13399231
2843 13399231 14124783 14640169 16105141 16932451 17819799 19482105 20259974 20968407 21784786
2834 21784786 23273273 24709393 26747864 29671460 33747423 38530614 45105161 53832724
2826 53832724 65076613 80500197 100315930 116527972 111514892 103839570 93639773
2819 93639773 77307519 62267180 48036294 38160311 31545382 26712380 23194668 20541692
2811 20541692 18077432 16696688 16302627 15587418 13721310 12504611 11734832 10799980 9970210
2802 9970210 9431865 8725238 8011579 7125770 6430802 5636377 5246901 5174019 4887129 4641312
2792 4641312 4362126 3833377 3345219 3041347 3888827 4064516 3366686 3209708 2776513 2447884
2782 2447884 2585832 2348769 2503053 2657577 2551054 2292788 2623582 1688347 1483151 1960833
2772 1960833 2038137 1672573 1765971 1400949 1911959 2192094 2212488 1753893 1455083 1353056
2762 1353056 1049418 1187412 1086521 763218 647740 1261574 1244888 1023097 938314 669719
2752 669719 460882 738129 459241 49801 340336 519940 198189 311930 29969 -73661
2742 -73661 480155 530247 234793 -44251 174759 674477 329362 158693 549016 390980
2732 390980 257104 295111 723742 407501 543808 515156 36551 -467277 -480850 -186002
2722 -186002 90025 272127 178760 106366 -121516 231905 164032 -619010 -361748 -422577
2712 -422577 -675890 -304225 -648228 -780789 -378542 -328959 -736201 -599493 -741809 -216371
2702 -216371 31409 237389 150874 711369 405829 -142044 135982 158117 -1158 381055
2692 381055 295778 -78458 -848482 -30846 9323 -215110 -314681 -140723 411707 337578
2682 337578 368084 146435 -60043 -521997 -216449 104648 -447448 -507450 -146452 -213179
2672 -213179 202488 -36210 -149494 -237989 -510073 -175631 -451083 -580003 -53774 -400786
2662 -400786 -597754 -467528 -470743 -320333 129620 -254508 -877008 -889716 -379441 -210911
2652 -210911 -281202 -67834 190212 -148473 -839171 -996847 -508784 -255311 -647105 -253581
2642 -253581 -75742 -271528 -304036 -340666 -486849 -1060984 -798313 -528307 -500821 -293507
2632 -293507 -330772 -247973 -295324 19970 -274227 -357104 -359609 -400523 -578432 -233989 -31227
2621 -31227 -536085 -193058 -494117 -440703 -309632 -464170 -296051 91043 293975 -99559
2611 -99559 -576198 -545595 -867021 -500647 -453890 -157593 -67968 -368632 -349037 -494159 -406531
2600 -406531 -636068 -549093 -266047 -372927 -240989 272508 99610 -565890 -753930 -956894
2590 -956894 -1031858 -811131 -933708 -1109853 -785331 -559818 -425138 -806018 -741533 -619434
2580 -619434 -682106 -690110 -300800 4764 -29292 61122 243202 473093 241062 25700 269624
2569 269624 412198 -231025 -89037 -118707 409096 54206 -449183 -69104 3433 -50331
2559 -50331 -304810 -650124 -30832 188151 283518 874491 750152 1002112 300839 133279
2549 133279 -121379 419074 645970 656020 122510 -376242 -309329 131547 198308 -40169
2539 -40169 -385275 -505173 -307110 278578 470849 -54217 394356 75974 613723 137654
2529 137654 -36988 -247029 -118440 -357114 -368221 82003 -25603 -484610 -717414 26965
2519 26965 109012 88403 93682 108187 -304244 -308532 -682228 -897716 -493105 68206 -271374
2508 -271374 -493739 210605 46240 -404717 -25528 326242 129819 -191330 -88144 148548
2498 148548 -46009 134816 136290 -116025 -258610 -650581 -656875 -335752 -99716 -425728
2488 -425728 -809854 -197727 -414554 -602672 -310078 -279082 -541250 -356736 -296594 -359522
2478 -359522 -346092 -175866 -687623 -782496 -443130 -405776 -270655 -248330 -43700 110785
2468 110785 196411 122745 -476520 -532825 -328381 -68331 -250870 -222860 -543991 -363265
2458 -363265 -91362 -842098 -911883 -556363 -359607 33962 489506 50316 -196720 -285717
2448 -285717 -649340 -395595 64376 31886 -48492 107647 262373 139718 -128662 -192711
2438 -192711 -196877 -540225 -454137 -693544 -927272 -758553 -646649 -331493 -180552 -176740 -427646
2427 -427646 -684619 -574987 -578628 -426330 -316274 -259243 -92993 -187290 -363223 -56054
2417 -56054 -157560 -553928 -395891 -411513 -658492 -704632 -391916 -585140 -871122 -633540
2407 -633540 -666855 6899 -153895 -529296 -135970 223512 -99303 -249222 274930 360497
2397 360497 175843 -87556 -201401 -81756 -2904 -26145 -15451 -254278 -162563 208342
2387 208342 128626 56354 -352000 -359358 -435084 -946138 -569816 174581 -257884 -276651 22539
2376 22539 61227 -56267 346291 685299 532356 344822 -151448 -579994 -46144 -72106
2366 -72106 -131208 -39008 -8453 -174999 149792 -58052 -196600 -478847 -677499 -538238
2356 -538238 -95496 -185126 -49263 635923 -408865 -438244 177446 490400 208003 -122367
2346 -122367 -569081 -505014 -180229 -413409 -845099 -681838 -481147 -1061419 -617690 -636357
2336 -636357 -1007571 -821145 -778069 -258298 -29691 -446031 -273270 169930 -219222 -149400
2326 -149400 -681840 -729253 -723843 -409352 -243796 -465803 -501024 -721338 -466385 109796
2316 109796 346604 700907 222223 104226 -224082 -201964 -122708 -176693 -345026 155050
2306 155050 376588 493293 323672 202033 448714 291478 -158789 -381845 -44976 -442688
2296 -442688 -457693 -698081 -502044 140065 402903 465997 -282583 5797 -3424 106365
2286 106365 -246271 -135268 85140 276233 411379 249817 213279 341064 453358 -36079
2276 -36079 22451 102524 286849 -70505 569360 4114 -745234 36234 384153 -367171
2266 -367171 -1071988 -474107 -294931 -601390 -211517 -348924 -312188 -663674 -710944 -469988
2256 -469988 -61791 -1622 520909 189912 -67012 -214952 -181481 -72333 296055 78432
2246 78432 -364450 359903 291790 259581 598085 358019 393669 82945 165021 316335 193741
2235 193741 57867 -255225 -486960 -77463 -192540 73090 431032 47076 46011 -223242
2225 -223242 -84971 258895 398329 78422 -265530 -128288 -418217 -83502 64236 -563424
2215 -563424 -381180 -209311 -469499 -901314 -624053 -515953 -147905 -488418 70501 504308
2205 504308 271810 322117 88790 -24141 -92725 -583029 -607380 -297298 -392495 45472
2195 45472 399246 14075 -42936 -149886 -251467 456740 687399 658355 186096 145302
2185 145302 -309223 -102223 68103 -321596 -155834 79866 -63480 -201884 188627 267485
2175 267485 214944 -195132 -135616 -243049 -258373 -490047 92873 437989 202496 -77695
2165 -77695 16547 -403888 -445384 -578513 -494137 -352647 -180300 82223 -102195 -209609
2155 -209609 -390798 -701595 -709552 -673912 -410239 -157859 -130516 43769 62721 410002 1245723
2144 1245723 728762 115663 506987 590487 108876 117906 48398 6795 -164560 -1589
2134 -1589 213934 273138 529585 -14911 33944 94072 100745 -512168 -447995 -195913 235758
2123 235758 117881 -304674 -397144 -102906 48246 -147421 -206143 -235225 -132909 146837
2113 146837 -105425 118602 34278 -184676 -442132 -631562 44389 394353 -25852 460227
2103 460227 300546 211519 -252927 -478948 -320324 -212509 100919 197099 312606 637122
2093 637122 452767 333611 327422 662444 377195 750030 253273 -110479 -63849 28788
2083 28788 131899 30664 -3609 -83003 -348775 -656790 -187703 163628 850898 296798
2073 296798 19858 52566 68618 -80927 -4092 -60570 127840 -349692 -263386 -536346 59579
2062 59579 79127 -393432 -357736 -26744 -192540 137754 502004 329952 329723 72309 32152
2051 32152 -45382 -360136 -13244 210508 323049 -11055 -50000 -34627 -135901 72180
2041 72180 -66764 -236654 -188127 449582 268669 67098 -30921 -145246 530379 740221
2031 740221 676235 402269 421396 168139 -332765 -249465 -300240 -248379 493736 441436 106029
2020 106029 -601946 -235385 292755 446941 444951 -411256 55114 81555 272795 -169917
2010 -169917 -34086 247195 25516 309279 648797 156985 41468 -360732 -627773 -39946
2000 -39946 538399 440373 89903 -85863 -139371 -305979 -429250 -104450 -32601 -430129
1990 -430129 -115990 245580 -161048 120929 346394 89438 379092 -10979 -513766 -139591
1980 -139591 302315 541633 158141 -99130 72310 5071 155052 -289227 -281550 -281562 -237276
1969 -237276 120768 462535 784882 564033 449614 -34988 120861 104922 -83164 22601
1959 22601 84140 373234 769985 183054 26198 420973 266847 833799 511216 -35851
1949 -35851 110290 -105357 -11720 -220437 -121311 -75102 445525 423836 222261 232479 75074
1938 75074 -101088 -56189 -133521 50091 -75074 -67744 351335 329856 148925 534434 -56870
1927 -56870 -106728 -140765 -872830 -887508 -818439 -50168 -189473 -98480 348071 379516 -86582
1916 -86582 82254 536238 76295 282319 784705 381543 238098 437405 466522 437782
1906 437782 248526 292473 202313 -215145 71373 12124 -79809 -255660 176585 -231149
1896 -231149 -124813 -89834 250402 578771 318648 92829 6214 -231187 -2782 -151938
1886 -151938 11374 688384 325874 29834 -163428 92980 -87059 -427821 -81229 -94314
1876 -94314 200259 40811 53971 -439596 -570132 -16780 146137 80260 204103 181076
1866 181076 82354 487359 565743 627807 290491 298574 238345 184311 85465 47840 -386909
1855 -386909 -216357 135982 452681 680570 624456 129261 477628 607686 746894 780161
1845 780161 409011 443433 529496 -79933 344831 521124 112157 97551 -61658 432056
1835 432056 404252 -151971 -3243 70776 206205 -97026 -404503 -181555 293379 332799
1825 332799 147647 88945 241823 112930 452239 454138 7976 -450253 -247493 -246523 -197067
1814 -197067 72803 660850 674113 -257132 -27566 249269 -237676 -336782 71089 -219407
1804 -219407 65550 -52471 73778 -451492 -352873 410975 441184 198947 370582 375737
1794 375737 -112449 167255 -320806 -182319 166889 307058 656169 519848 768459 871894
1784 871894 1033149 964130 658262 829438 431026 127712 84977 310161 113179 -383680
1774 -383680 455571 117417 -549875 -181803 -107430 -391565 -39888 113301 422236 99159
1764 99159 -138146 -85146 120497 283546 146714 -210570 404494 469763 249116 618895
1754 618895 551114 515097 744459 522885 725566 110118 -199560 -120617 -35376 57017 -221394
1743 -221394 -72290 181241 219220 287428 511322 554867 538226 587004 697231 506006 504718
1732 504718 484215 148609 43692 520287 235910 388363 500089 919163 340247 665574
1722 665574 358592 367838 232399 -121516 -103442 -149171 -89656 43153 10633 -170855 -50134
1711 -50134 -120122 -32822 137800 174333 -238841 -6013 469377 -55024 -189649 510364
1701 510364 381796 358767 261854 -143047 -213096 6519 193949 507051 492912 244710
1691 244710 298547 227673 378472 804626 282950 75818 235420 -44749 -128131 -62900
1681 -62900 585901 611927 112070 132552 -326131 -405294 -267620 -241427 214351 -63717 -274871
1670 -274871 -43593 145605 414211 198289 567137 387367 521566 414652 272312 225724
1660 225724 11382 -75216 -122780 453820 316531 807299 751300 95243 44301 -245488
1650 -245488 -103227 325355 427620 37725 -229453 445358 506294 341836 226280 -328582
1640 -328582 160799 212267 402249 533991 44854 -211008 -138262 -601992 -561844 -327363
1630 -327363 -204917 -490558 -585890 69322 -22648 -60249 -322222 -422200 82532 136156 44323
1619 44323 -91032 -235106 -354852 212175 46103 -108323 11047 401649 273625 -1667
1609 -1667 639009 320733 -207359 -130183 -590032 -387123 223534 233687 157042 120443 -78641
1598 -78641 32380 83092 -360513 440193 350996 121751 356000 588160 711417 111854
1588 111854 127638 358727 379136 487520 457719 469380 12374 3792 424587 873378 -85059
1577 -85059 107713 288445 -162080 -154543 54527 -126412 36664 276485 194718 80362
1567 80362 91972 540130 101093 -371527 -40540 -139682 -429164 -587885 -27616 505085
1557 505085 422105 -260103 -140439 -135605 56428 -152764 -102792 51786 278881 173711
1547 173711 218727 28847 50540 354934 257703 867597 279471 182727 -43337 280950
1537 280950 379597 752963 771414 501345 531090 892561 709688 343173 97741 103756 -59039
1526 -59039 74154 185563 17566 527916 726111 689638 393150 391475 524498 446912 392779
1515 392779 209767 167916 304675 -158597 -462581 -209842 -151961 626116 513522 57432
1505 57432 300733 377671 755641 865136 1070650 686061 423659 385402 22071 33349
1495 33349 149357 -60616 81932 243288 284983 689649 852951 563836 444763 975043
1485 975043 513844 88647 117682 241451 431684 590966 345747 527058 364654 -126593
1475 -126593 -192181 180297 158969 319430 789679 546914 304241 743878 375302 515322
1465 515322 543095 132841 70684 76242 -199727 92282 691424 240396 60626 752707
1455 752707 -1015 -632477 -272416 -432066 -356274 -92248 241588 571019 123385 -336510
1445 -336510 409656 678441 557908 300377 560007 632598 311327 185543 113059 169805
1435 169805 321199 771736 771337 -18159 6073 -294393 -51059 105729 -209943 -172774 -298178
1424 -298178 38587 -219315 -615353 -759182 -220989 -167155 -93977 -123064 -482 270116
1414 270116 -175591 -234894 534964 345662 -76915 220707 -269086 -205499 -501665 430016
1404 430016 300366 -262004 187281 404512 249935 347201 591881 688662 137359 -117379
1394 -117379 -355731 -226806 -244684 100699 -110562 480292 590564 145447 293958 -127341
1384 -127341 -41558 15830 506602 86355 68749 178105 602070 994827 519035 161433
1374 161433 -129307 -233655 -170903 -109924 102986 -140512 145284 165076 145236 718252
1364 718252 740092 374263 -80838 217560 -92140 -131750 158435 303246 334777 544921
1354 544921 148887 -75271 -432692 -384387 129449 257798 445321 494048 156844 296286
1344 296286 278108 47567 163274 -12652 411054 163305 474747 460158 183732 490290
1334 490290 789734 423520 519731 911714 898995 713991 482576 531703 550346 140014
1324 140014 -73859 -648859 -266363 137811 138976 308735 241676 -159297 -239353 189806
1314 189806 239591 82061 -286052 -285687 32219 -20110 351794 137750 121749 106795 546106
1303 546106 557814 190757 73473 578394 514090 685330 395532 349182 584094 985967
1293 985967 877259 52099 140369 218338 675339 393538 122636 183707 391212 435099
1283 435099 264252 370599 846768 736062 794236 116187 -79204 -102255 -27469 17366
1273 17366 137558 386040 584225 245927 -331314 -182105 181286 478523 507042 344030
1263 344030 264266 -54344 96748 495272 611137 693662 371327 412331 324260 102367
1253 102367 369793 681903 190901 497197 486778 246828 275841 651729 387823 124893
1243 124893 519464 162148 116143 197918 452356 267874 378411 -27869 -162302 129822
1233 129822 -254607 -273447 -124841 -309903 335932 401915 68002 -308190 613427 483722
1223 483722 407630 402086 391934 204697 89425 137430 -208963 -573894 -155289 228044 -25482
1212 -25482 -90550 -73106 167768 66808 338136 399504 234067 310492 594489 230975 382071
1201 382071 392010 321849 705760 689414 685990 649969 619453 210986 -146423 -153047 -414565
1190 -414565 -8718 152417 572960 174753 561261 722300 463848 770703 579721 138270
1180 138270 277320 796299 998609 680163 416095 211965 -128895 -69816 -90214 179930
1170 179930 269843 123061 -253038 -17913 90431 378426 250336 -138721 330759 195880
1160 195880 739117 570109 713305 456128 231616 362390 555239 395775 36434 84648
1150 84648 213902 770118 984790 632805 -144060 -138295 109187 -193561 -542421 -699109
1140 -699109 -205476 160684 -17884 -206158 -307920 20295 -51435 -145066 729578 623626
1130 623626 225345 -45726 22052 153347 -23929 -185317 44146 301605 625041 147423
1120 147423 109577 718337 397519 301394 -171424 -390204 -218298 -251298 -543286 -345458
1110 -345458 301606 701642 331139 -47890 443617 451792 15972 265519 123355 125155
1100 125155 231677 154750 -94665 614815 735540 352782 282702 323407 -528575 -511143
1090 -511143 -219044 -514806 456875 384298 -211405 156385 165876 28675 244818 939525
1080 939525 695383 695483 266171 -13157 184055 341551 30558 -259069 -27335 -182974
1070 -182974 31935 -106401 70100 452102 565142 417879 -53557 -190715 -258988 -342414
1060 -342414 124721 444314 232871 58485 181723 258763 437938 397877 537309 140310
1050 140310 -83513 131639 480498 86851 130154 388289 194424 291555 -157638 188964
1040 188964 416243 238664 22891 330043 211161 -160037 14631 87218 -353945 254918
1030 254918 285051 -236837 66131 180455 -214372 97995 432371 414681 330193 396157
1020 396157 473849 292996 -9892 -273884 -461748 -222142 -120054 -151407 142953 483745
1010 483745 288006 457326 900383 121753 231217 436130 820732 9143 244474 264415
1000 264415 196316 447637 355678 -11737 -194788 -97341 -211206 311802 788963 437949
990 437949 361924 453745 178956 518290 644853 428683 373425 84342 67132 162972 -296455
979 -296455 -467625 46218 -316847 79170 283941 123293 -45999 -226639 -87740 155015
969 155015 454763 84900 -74172 329323 102392 70131 384542 321051 174115 -19948
959 -19948 130300 296811 28861 41542 43775 318824 320936 257132 -44049 5360 243746
948 243746 -127172 38343 89330 -123424 -173028 527689 590452 416803 655832 364350
938 364350 -89705 -425661 275449 369981 451488 296352 -169663 -164778 -134153 303611 447838
927 447838 -154952 -820174 -249953 -275737 52100 -406012 -670663 -607281 -98969 517685
917 517685 137564 284986 332200 -57497 -94478 -669330 -600372 -469987 -284580 120920
907 120920 19299 -266557 -167262 -197023 13980 -235850 -519763 -694549 -557630 -618316
897 -618316 333253 597637 553651 419306 506807 296869 137578 -516366 -541304 -73967
887 -73967 45570 145404 -345368 43570 94245 -163587 -397110 161107 541037 368493
877 368493 8939 373930 614710 786866 284766 110999 262015 166388 366829 476258
867 476258 242180 263475 400178 49774 -260099 -351325 -24481 -59919 56852 584177
857 584177 496022 720082 -379439 -724465 -646623 -542804 -266673 -199931 -488695 -426613
847 -426613 -109604 154461 97259 46389 -95991 278099 556456 239471 -175954 404122
837 404122 491279 4964 -94309 -121728 -151202 -105039 772670 424745 150913 -49214 34330
826 34330 82049 -31094 170526 -15581 291853 153433 203522 253590 405463 420454 301150
815 301150 224517 -221514 384880 219835 -89580 -345843 -120857 -197371 224323 332518
805 332518 -273185 -393937 -315788 268908 400294 131792 128438 127505 -309102 -549467 169235
794 169235 82270 27084 -177402 -266072 -84241 -27561 -145868 -471397 -188001 21484 541847
783 541847 754316 457485 836791 690158 734828 258997 517617 96910 89818 238374
773 238374 -34903 -257767 -157836 -500505 -536631 -262606 -185578 -90032 -726509 -81889 -175239
762 -175239 -161439 -489455 -112645 26102 333051 -147461 42256 -65829 221153 -185808
752 -185808 172176 532947 610948 459032 227478 60369 479804 569891 -176726 -225225
742 -225225 -131794 -198942 -71909 -391043 -245388 -224240 -743424 -563362 -725731 -612680
732 -612680 -295764 -608092 -351736 311959 447658 394150 296398 246643 -253408 -683322
722 -683322 -1240355 -699602 -411958 -254319 -282556 -628327 -100407 376093 166893 120910
712 120910 -124419 25450 206384 253168 320946 721956 427128 355297 631308 464441
702 464441 50205 -269477 -15410 -515262 -606250 30970 -194114 -37131 31436 -79522
692 -79522 -697691 -513789 -333125 -605248 -662150 -34905 106970 98938 6320 -269515 -421561
681 -421561 -108259 8150 72861 335130 -154954 -260260 -164778 -380371 116420 225677
671 225677 29274 -30694 -26585 351255 111001 122751 19926 -86120 175038 288669 318135
660 318135 -206074 -428919 -296179 -19997 650838 433978 -140071 -124429 250199 309794
650 309794 653213 561468 -54123 113496 623411 448884 -89882 -260515 -162297 -206853
640 -206853 -357575 -466771 -268606 -277256 -348673 -303242 -70264 -142153 -446004 -405816 80530
629 80530 48339 -383277 -410800 -302001 -296810 -342032 -177286 47121 -147338 -25937 -115842
618 -115842 -361506 -202674 -318593 117084 -300243 -568501 -388494 -361865 -79696 122445
608 122445 355642 -5660 -335246 -265396 -681998 -195917 -210278 -179317 58815 207126
598 207126 -193317 -381985 41683 -1705 -321085 -38448 156501 124118 61281 -283878
588 -283878 -37077 -17815 246996 212395 171470 206839 467358 -46682 -161360 320104 768836
577 768836 233309 -19638 -98531 -481325 144745 179357 499631 339684 73570 423071
567 423071 27033 416661 -233239 -450813 -547098 -502588 -213653 252982 167374 -371953
557 -371953 -600792 -364802 -698822 -1295818 -1243107 -909587 -281592 52344 360398 174361
547 174361 -600055 -235888 198843 474794 648248 86346 -227072 -399741 -62239 350821
537 350821 -144516 -124573 4479 295 -138548 -174507 98593 232338 -272255 -321523 65930
526 65930 237835 52552 -348239 -477882 -411555 -147235 -344210 -222359 -339070 -517580
516 -517580 -546369 106318 37901 -228957 30092 -58301 -584481 22784 -127740 -659675
506 -659675 -844224 -414154 -373967 -290963 -31467 -205826 -463304 -149975 -390517 -491953
496 -491953 -568554 -436481 -399980 -229562 -246278 -514913 -510193 -289114 -161753 -507992 -689816
485 -689816 -766846 -497611 -274480 -251104 -203680 39669 -390638 -771714 -789331 -556300 -357996
474 -357996 -330556 -181060 -658704 -696097 86941 -562562 -425035 87404 -420467 -55272
464 -55272 126898 221755 271542 -128966 -400433 -591972 -65539 12312 -391369 -506031 -127330
453 -127330 -319126 -138738 -158733 -425845 -317930 -20768 87491 169810 67415 -418269
443 -418269 -582260 -598466 -516119 -245370 -196335 -275722 -420076 -612901 -728768 -512614 -612864
432 -612864 -737755 -537485 -651298 -172203 -188837 -293268 -721072 -473410 -771572 -857767
422 -857767 -735585 -770296 69438 -480734 -658916 -769979 -963207 -868934 -374213 -512089
412 -512089 -303880 197 -275421 -630783 -722763 -608807 -190501 -636416 -303505 -29316
402 -29316 -517568 -437951 -813583 -476999 -548385 -559791 -704178 -452745 -709644 -455227 -446298
391 -446298 17553 424259 446900 89710 -536149 -529289 -581249 -301918 -661084 -771566 -253425
380 -253425 -523918 -816137 -867941 -585802 -819289 -487935 -658345 -456951 -652773 -1226756
370 -1226756 -1160091 -763181 -635369 -626392 -437507 -329816 103056 -147982 -675853 -944918
360 -944918 -726437 -874621 -669004 -480704 -353184 -737208 -397040 -665137 -657507 -196432
350 -196432 -240169 -234718 -386458 -829112 -748765 -473156 -96982 -438795 -708092 -881662 -165120
339 -165120 212744 -223105 -408965 -955690 -855742 -756533 -670633 -336202 -324265 -195018 -467184
328 -467184 -1183910 -938791 -669554 -377523 -519756 -724673 -1144660 -1087883 -201504 462003
318 462003 408113 -63282 75066 33014 -261454 -482407 -875026 -1117479 -1140608 -1349418
308 -1349418 -907890 -436511 -467117 -765102 -372776 -610407 -582200 -785686 -955882 -947707
298 -947707 -509536 -335860 -378103 -485108 -661518 -689332 -300279 -645704 -1295872 -1060963
288 -1060963 -577921 -393628 -562288 -216402 -255423 -519964 -611364 -371187 -623618 -377353
278 -377353 -461716 -557498 -740947 -1131626 -868907 -1078097 -487167 -256125 -502322 -325305
268 -325305 -833320 -628433 -569135 -504642 -780595 -1268191 -982589 -509698 -356047 -792326
258 -792326 -839242 -1082825 -868869 -466503 -783623 -580175 -475112 -746886 -817137 -644267
248 -644267 -947373 -865165 -833251 -705421 -428216 -364819 -711845 -1023241 -681176 -153836
238 -153836 -437424 -743281 -849751 -655672 -464357 -191976 -620057 -322479 132451 -201358
$$ [...]
##END NTUPLES=NMR SPECTRUM
##END=
