##TITLE=1H_EC-3338
 CDCl3
 8 sc, 
 10.1.2025
##JCAMPDX= 6.0         $$ Bruker NMR JCAMP-DX V2.0
##DATA TYPE= NMR SPECTRUM
##DATA CLASS= NTUPLES
##ORIGIN= UXNMR, Bruker Analytische Messtechnik GmbH
##OWNER= root
$$ XWIN-NMR		Version 3.5
$$ Fri Jan 10 13:55:30 2025 Russian Standard Time (UT+4h)  she@DPX200
##.OBSERVE FREQUENCY= 200.1315
##.OBSERVE NUCLEUS= ^1H
##.ACQUISITION MODE= SIMULTANEOUS
##.ACQUISITION SCHEME= undefined
##.AVERAGES= 8
##.DIGITISER RES= 18
##SPECTROMETER/DATA SYSTEM= spect
##.PULSE SEQUENCE= zg30
##.SOLVENT NAME= CDCl3
##.SHIFT REFERENCE= (INTERNAL, CDCl3, 0, 19.4592)
##AUDIT TRAIL= $$ (NUMBER, WHEN, WHO, WHERE, WHAT)
$$ ##TITLE= Audit trail, XWIN-NMR		Version 3.5
$$ ##JCAMPDX= 5.01
$$ ##ORIGIN= Bruker BioSpin GmbH
$$ ##OWNER= she
$$ F:/spectra/data/she/nmr/H-F/1/pdata/1/auditp.txt
$$ ##AUDIT TRAIL=  $$ (NUMBER, WHEN, WHO, WHERE, WHAT)
(   1,<2025-01-10 13:54:16.85 +0400>,<she>,<DPX200>,
      <created by zg, POWCHK disabled, PULCHK disabled
       configuration hash MD5:
       00 E9 B6 7A A2 85 ED C7 34 08 36 98 17 FE 4E 26
       data hash MD5: 16K
       5F 46 98 5A 91 FE 30 DA 34 D8 82 76 F3 3F 5D A7>)
(   2,<2025-01-10 13:54:19.43 +0400>,<she>,<DPX200>,
      <Start of raw data processing
       efp BC_mod = 2 LB = 0.24 FT_mod = 6 PKNL = 1 PHC0 = -26578.65 PHC1 = 16.18744 SI = 16K 
       data hash MD5: 16K
       A7 F3 50 07 3F 7D 52 00 BA 11 5C 47 21 AD 6F 68>)
(   3,<2025-01-10 13:54:43.59 +0400>,<she>,<DPX200>,
      <pk PHC0 = 17.13846 PHC1 = -19 
       data hash MD5: 16K
       11 72 3E 1F 51 C8 73 AF FD 8B 75 1F 7B 0D EA 66>)
(   4,<2025-01-10 13:54:47.23 +0400>,<she>,<DPX200>,
      <abs ABSG = 5 
       data hash MD5: 16K
       41 4F 01 FF 8C 76 35 F0 39 95 B8 17 50 82 59 18>)
$$ ##END=
$$ 
$$ hash MD5
$$ 15 8E DF FC 8D 64 EB 90 2B 8E 32 4B 64 23 F6 17
##$RELAX= 
##$RELAX= 
##$RELAX= 
##$RELAX= 
##$RELAX= 
##$RELAX= 
$$ Bruker specific parameters
$$ --------------------------
##$DU= <F:/spectra>
##$EXPNO= 1
##$NAME= <H-F>
##$PROCNO= 1
##$TYPE= <nmr>
##$USER= <she>
##$AMP= (0..31)
100 100 100 100 100 100 100 100 100 100 100 100 100 100 100 100 100 100 
100 100 100 100 100 100 100 100 100 100 100 100 100 100 
##$AQSEQ= 0
##$AQ_mod= 1
##$AUNM= <au_zg>
##$AUTOPOS= <>
##$BF1= 200.13
##$BF2= 200.13
##$BF3= 200.13
##$BF4= 200.13
##$BF5= 200.13
##$BF6= 200.13
##$BF7= 200.13
##$BF8= 200.13
##$BYTORDA= 1
##$CFDGTYP= 0
##$CFRGTYP= 5
##$CHEMSTR= <none>
##$CNST= (0..31)
1 1 145 1 1 1 1 1 1 1 1 1 1 1 1 1 1 1 1 1 1 1 1 1 1 1 1 1 1 1 1 1 
##$CPDPRG= <>
##$CPDPRG1= <>
##$CPDPRG2= <>
##$CPDPRG3= <>
##$CPDPRG4= <mlev>
##$CPDPRG5= <mlev>
##$CPDPRG6= <mlev>
##$CPDPRG7= <mlev>
##$CPDPRG8= <mlev>
##$CPDPRGB= <>
##$CPDPRGT= <>
##$D= (0..31)
0 1.2 0 0 0 0 0 0 0 0.06 0 0.03 0 0 0 0 0.0002 0 0 0 0 0 0 0 0 0 0 0 0 
0 0 0 
##$DATE= 1736502856
##$DBL= (0..7)
120 120 120 120 120 120 120 120 
##$DBP= (0..7)
150 150 150 150 150 150 150 150 
##$DBP07= 0
##$DBPNAM0= <>
##$DBPNAM1= <>
##$DBPNAM2= <>
##$DBPNAM3= <>
##$DBPNAM4= <>
##$DBPNAM5= <>
$$ [...]
##$SUBNAM3= <"">
##$SUBNAM4= <"">
##$SUBNAM5= <"">
##$SUBNAM6= <"">
##$SUBNAM7= <"">
##$SUBNAM8= <"">
##$SUBNAM9= <"">
##$SW= 24.0689530833862
##$SWIBOX= (0..15)
0 0 2 0 0 0 0 0 0 0 0 0 0 0 0 0 
##$SW_h= 4816.95568400771
##$TD= 16384
##$TD0= 1
##$TE= 0
##$TE2= 300
##$TE3= 300
##$TEG= 300
##$TL= (0..7)
0 120 120 120 120 120 120 120 
##$TP= (0..7)
150 150 150 150 150 150 150 150 
##$TP07= 0
##$TPNAME0= <>
##$TPNAME1= <>
##$TPNAME2= <>
##$TPNAME3= <>
##$TPNAME4= <>
##$TPNAME5= <>
##$TPNAME6= <>
##$TPNAME7= <>
##$TPOAL= (0..7)
0.5 0.5 0.5 0.5 0.5 0.5 0.5 0.5 
##$TPOFFS= (0..7)
0 0 0 0 0 0 0 0 
##$TUNHIN= 0
##$TUNHOUT= 0
##$TUNXOUT= 0
##$USERA1= <user>
##$USERA2= <user>
##$USERA3= <user>
##$USERA4= <user>
##$USERA5= <user>
##$V9= 5
##$VALIST= <valist>
##$VCLIST= <CCCCCCCCCCCCCCC>
##$VD= 0
##$VDLIST= <DDDDDDDDDDDDDDD>
##$VPLIST= <PPPPPPPPPPPPPPP>
##$VTLIST= <TTTTTTTTTTTTTTT>
##$WBST= 1024
##$WBSW= 4
##$XGAIN= (0..3)
0 0 0 0 
##$XL= 0
##$YL= 0
##$YMAX_a= 209383
##$YMIN_a= -367310
##$ZGOPTNS= <>
##$ZL1= 120
##$ZL2= 120
##$ZL3= 120
##$ZL4= 120
##$ABSF1= 19.61256
##$ABSF2= -4.456575
##$ABSG= 5
##$ABSL= 3
##$ALPHA= 0
##$AQORDER= 0
##$ASSFAC= 0
##$ASSFACI= 0
##$ASSFACX= 0
##$ASSWID= 0
##$AUNMP= <proc_1d>
##$AZFE= 0.1
##$AZFW= 0.1
##$BCFW= 0
##$BC_mod= 2
##$BYTORDP= 0
##$COROFFS= 0
##$CY= -3
##$DATMOD= 1
##$DC= 0
##$DFILT= <>
##$DTYPP= 0
##$F1P= 0
##$F2P= 0
##$FCOR= 1
##$FTSIZE= 16384
##$FT_mod= 6
##$GAMMA= 0
##$GB= 0
##$INTBC= 1
##$INTSCL= 2.524811e-10
##$ISEN= 128
##$LB= 0.24
##$LEV0= 0
##$LPBIN= 0
##$MAXI= 10000
##$MC2= 0
##$MEAN= 0
##$ME_mod= 0
##$MI= 1.114404
##$NCOEF= 0
##$NC_proc= -7
##$NLEV= 6
##$NOISF1= 3.799351
##$NOISF2= 2.8
##$NSP= 0
##$NTH_PI= 0
##$NZP= 0
##$OFFSET= 19.45921
##$PC= 1
##$PHC0= -26561.51
##$PHC1= -2.812559
##$PH_mod= 1
##$PKNL= yes
##$PPARMOD= 0
##$PSCAL= 0
##$PSIGN= 0
##$REVERSE= no
##$SF= 200.130014104662
##$SI= 16384
##$SIGF1= 3
##$SIGF2= 2
##$SINO= 5.538805
##$SIOLD= 16384
##$SREGLST= <1H.CDCl3>
##$SSB= 0
##$STSI= 16384
##$STSR= 0
##$SW_p= 4816.95568400771
##$SYMM= 0
##$S_DEV= 0
##$TDeff= 16384
##$TDoff= 0
##$TI= <>
##$TILT= no
##$TM1= 0
##$TM2= 0
##$TOPLEV= 0
##$USERP1= <user>
##$USERP2= <user>
##$USERP3= <user>
##$USERP4= <user>
##$USERP5= <user>
##$WDW= 1
##$XDIM= 16384
##$YMAX_p= 368454529
##$YMIN_p= -878369
$$ End of Bruker specific parameters
$$ ---------------------------------
##NTUPLES= NMR SPECTRUM
##VAR_NAME=  FREQUENCY,     SPECTRUM/REAL,   SPECTRUM/IMAG
##SYMBOL=    X,             R,               I
##VAR_TYPE=  INDEPENDENT,   DEPENDENT,       DEPENDENT
##VAR_FORM=  AFFN,          ASDF,            ASDF
##VAR_DIM=   16384,         16384,           16384
##UNITS=     HZ,            ARBITRARY UNITS, ARBITRARY UNITS
##FACTOR=    0.29402158847633, 1,            1
##FIRST=     3894.37186012078, 0,            0
##LAST=      -922.583823886926, 0,           0
##MIN=       -922.583823886926, -878369,     0
##MAX=       3894.37186012078, 368454529,    0
$$ Real data points
##PAGE= N=1
##DATA TABLE= (X++(R..R)), XYDATA
$$ [...]
9158a48426j18456J03317k09575K05029o4263O2301j12383k8309j0895J16148
9148b05512p158L675K44580l9950l60946j45228L5555L7781K06575o3560j22359
9137d16547R7145J07130J23464J01781n4922K06846k49191K78525j85134k82333
9127b73236N8086K3404j90149r0685K15O7922M16787l50910J05956J45634j93190
9116b80166k33406N3456J75467J86777j35185N5178L3911m15932J92695l2730
9106c99935j94122M06300L67987l08009j79096M05472l57827j08137K07240j61102
9096c21229J67254j40184k51470j33376J00219M15080K4692p0966j14205m783
9086c28968j3549M04517Q1895l25641m77247M9554J39217L06599J6290k09582
$$ plain form
9158 -148426 -266882 -163565 -373140 -168111 -232374 -170073 -282456 -310765 -321660 -205512
9148 -205512 -212670 -208995 35585 -4365 -365311 -510539 -474984 -437203 -230628 -294188 -416547
9137 -416547 -319402 -212272 -88808 12973 -41949 164897 -84294 194231 9097 -273236
9127 -273236 -215150 -191746 -381895 -472580 -472365 -404443 12344 -338566 -232610 -86976 -280166
9116 -280166 -513572 -460116 -284649 -97872 -233057 -177879 -143968 -559900 -367205 -399935
9106 -399935 -594057 -187757 180230 -127779 -306875 98597 -259230 -367367 -160127 -321229
9096 -321229 -153975 -294159 -545629 -679005 -578786 -163706 -139014 -209980 -324185 -328968
9086 -328968 -342517 62000 143895 -181746 -658993 -609439 -470222 -163623 -147333 -356915
9076c56915M6541l2826M3217J7850K96560P9575p9999l4111m40516K86436L0727
9065a43461j92895j908m2518J66995n1210K47484L7886L8945J5715K4273k30729
9054a31423r5358J33874j62975O6787n0722j2712l3267q2594J50081Q5886j24933
9043b57356k54270N2062K03844P1820k45062J3043J00088L43324p3971o7098q5727
9032a99303k07785J6134L80170j97315p1075j00862k87039J06105M65147o6047
9022a61870j82614K02814m22828Q3930O2529j63495L8069r2686K51691J78460
9012b06000q9303j84162J99608J95614m10738P4011K56112l36776L24010K770
9002a74854j81892J57979R8643l86038j01904p6685R7806J90982m5640J57975
$$ plain form
9076 -356915 -310374 -343200 -299983 -282133 14427 94002 14003 -20108 -460624 -174188 -143461
9065 -143461 -336356 -338264 -380782 -213787 -264997 -17513 20373 59318 75033 99306 -131423
9054 -131423 -226781 -92907 -255882 -189095 -239817 -252529 -285796 -368390 -218309 -132423 -257356
9043 -257356 -511626 -459564 -255720 -183900 -428962 -415919 -315831 27493 -46478 -113576 -199303
9032 -199303 -407088 -390954 -10784 -208099 -279174 -380036 -667075 -560970 -95823 -161870
9022 -161870 -344484 -141670 -564498 -480568 -418039 -581534 -543465 -636151 -384460 -206000
9012 -206000 -295303 -479465 -279857 -84243 -494981 -420970 -164858 -501634 -177624 -174854
9002 -174854 -356746 -198767 -100124 -486162 -588066 -664751 -566945 -375963 -421603 -263628
8992b63628K34549j70544k23668J90003j65784K44953j59000k51578l9818J19842
8982d84673K18409l6547j49977L820J60815k8436J78373l41074k47486L07231
8972d19545M7224j45768k9319K14931M4193K7560m49522K12475K72780J68632
8962e6359K06056j19096j26195r1799j33204l3179K32495j458k81677j69656K63037
8951c11035n7514K01954J12297l36949N06464j2404m17519r6948J05365j65130
8941d71419R5517J67229j5729j77329k11351L77947J6675m9831j4422j25364L43782
8930f4295R4728k48178n773q6630j43414L44704J80243l58668K7206K0722J35672
8919a03683r6548j45790N1185q3030K24543k01304J25737Q6023l43427N8412K88026
$$ plain form
8992 -263628 -29079 -199623 -423291 -233288 -399072 -154119 -313119 -564697 -604515 -484673
8982 -484673 -266264 -302811 -452788 -448968 -288153 -316589 -138216 -479290 -726776 -419545
8972 -419545 -372321 -518089 -547408 -332477 -288284 -260724 -710246 -497771 -224991 -56359
8962 -56359 149697 30601 -95594 -187393 -320597 -353776 -121281 -122739 -404416 -574072 -311035
8951 -311035 -368549 -166595 -54298 -391247 115217 102813 -314706 -411654 -306289 -471419
8941 -471419 -375902 -208673 -224402 -401731 -613082 -235135 -218460 -268291 -282713 -408077 -64295
8930 -64295 30433 -217745 -223518 -310148 -453562 -108858 71385 -287283 -260077 -239355 -103683
8919 -103683 -200231 -346021 -294836 -377866 -153323 -354627 -228890 -142867 -486294 -427882 -139856
8908a39856j69131j87577J7241j95730M29654O8289O636k7250k7681j56832j22479
8897e04716K31943q0656j49680r4148J34240j50638L33391Q7721o8282Q4223j05397
8886b81999k72683J4981J92495l4299P6365J203N2567m5847j7404K81878J78549
8875A45806k10528j04226N7411j76993k27608K84758K46399n49191j44074K45638
8865d32608N9528J26231p5321n2433K59289j16163o6766k7758j80428J93865j64626
8854d77190K79524q1857J61100M4262k20150J67598r8744l289j34195p7999j88913
8843f29853J97202j546O6395q91O2788Q7957j87749j73863L28687j84497k07846
8832f43216Q3414J56332O5037j28082P8990J99775K29377R9028k33651l2423N6231
$$ plain form
8908 -139856 -308987 -496564 -479323 -675053 -245399 -177110 -170474 -197724 -225405 -382237 -504716
8897 -504716 -272773 -353429 -503109 -597257 -463017 -613655 -280264 -192543 -260825 -176602 -281999
8886 -281999 -554682 -539701 -347206 -381505 -305140 -303937 -251370 -297217 -314621 -32743 145806
8875 145806 -64722 -168948 -111537 -288530 -516138 -231380 15019 -534172 -678246 -432608
8865 -432608 -373080 -246849 -322170 -374603 -115314 -231477 -298243 -326001 -506429 -312564 -477190
8854 -477190 -197666 -279523 -118423 -74161 -294311 -126713 -225457 -228746 -362941 -440940 -629853
8843 -629853 -432651 -434197 -367802 -368693 -305905 -217948 -405697 -579560 -250873 -435370 -643216
8832 -643216 -559802 -403470 -338433 -466515 -387525 -187750 41627 140655 -92996 -125419 -69188
8821f9188l08212j36349J84880M09396k05385O4988O9907j04635K51576k40471
8811h3493j56596J13069J22770J13918m00899j95649j28358j9289j75468N81827
8801b28168k57092k34269K79041L9646L03606k03832k675M82342m06950Q2899
8791a45452j82270j15562m715j23774Q0081k1378J65858J06236o8205L11048j64143
8780a62276k7883K0730o5676j02584J1913j35994J25704K56444k47608K31400
8770i5830j93558q6935j38818j09430J87208J43602k85373j3169M12304K244k83337
8759d61092K5604J61687P1886N8916N0441k1581j05120J790K10053k92272K72831
8748b6857j124J58397l34266l35011J66383k6146J11384K97773j74822j66829
$$ plain form
8821 -69188 -377400 -513749 -328869 80527 -124858 -59870 10037 -94598 156978 -83493
8811 -83493 -240089 -127020 -4250 109668 -291231 -486880 -615238 -634527 -809995 -228168
8801 -228168 -485260 -719529 -440488 -400842 -97236 -301068 -303743 178599 -228351 -145452
8791 -145452 -327722 -443284 -447999 -571773 -491692 -513070 -347212 -240976 -309181 1867 -162276
8780 -162276 -190159 -169429 -235105 -337689 -325776 -461770 -336066 -79622 -327230 -95830
8770 -95830 -289388 -376323 -515141 -624571 -437363 -293761 -579134 -592303 -179999 -177755 -461092
8759 -461092 -435488 -273801 -201915 -142999 -92558 -114139 -219259 -217469 -7416 -299688 -26857
8748 -26857 -27981 130416 -203850 -538861 -372478 -398624 -287240 10533 -164289 -331118
8738c31118j09923J50750Q11L1693L4203N2250l8790k08876J32408Q5710R8758
8727a02124P7264j14609j32967L74610o9998l12266p0757P5203K70466j19423
8717a24601j2j39126K35535k41811p8307J48771j27540k6239p5492k63172j86375
8706h78369M13603R2396K53963k55424j10163j06620K50546K35502j15141J48396
8696g1311j50263M4629K77505j00383m0747j56854k29610K11230O1757n9885J19702
8685i4230J7841L0643l9110p3004j1520J30072P1595k95156O11087o6804K2743
8674C04157j42960m2820j38078Q420M27608m14785L0211J68045p2347j71004K86913
8663B43360j46282j2853p5251K27748o375O1318j14744l268p117L3125K68086
$$ plain form
8738 -331118 -441041 -290291 -289480 -257787 -223584 -171334 -210124 -419000 -286592 -200882 -102124
8727 -102124 -24860 -139469 -272436 102174 32176 -280090 -350847 -275644 -5178 -124601
8717 -124601 -124613 -263739 -28204 -270015 -348322 -199551 -327091 -353330 -428822 -691994 -878369
8706 -878369 -464766 -372370 -118407 -373831 -483994 -590614 -340068 -104566 -219707 -71311
8696 -71311 -221574 -176945 100560 177 -40570 -197424 -427034 -215804 -154047 -213932 -94230
8685 -94230 -76389 -45746 -84856 -157860 -169380 -39308 32287 -262869 348218 281414 304157
8674 304157 161197 118377 -19701 -11281 416327 1542 31753 199798 127451 -43553 243360
8663 243360 97078 84225 8974 236722 230347 291665 176921 173653 166536 199661 467747
8652D67747l16089J02927p045j50823K71280k33569k98114L69197J53369j51066
8642B07814j34415k1377L02175J10460k24904m49Q9296k07110K03511k28536R3684
8631A90149L59938k14606J2163O9018j52848k71269j0413J70138o5803j3376R5332
8620A68423n0978J56994L0379l72035J12237k56438L41454j16795Q8402J03681
8610B05324r420K5240N9007K25517k54437r9698J42951o7485k43593K12113j06065
8599H9454K15242n7911j57591p4900K47713j1848k28203Q6365l1260O6434K65161
8588D08656m24396J01199K7941O4301P1105O3895Q8970L17747l06975q4852O1751
8577C89342N0277j31560j69156L28294J88519m4922K0544K9342J03433j23394
$$ plain form
8652 467747 151658 254585 247540 96717 367997 134428 -163686 205511 358880 207814
8642 207814 73399 52022 354197 464657 239753 239304 328600 121490 325001 96465 190149
8631 190149 550087 335481 347644 416662 263814 -7455 -17868 152270 86467 73091 168423
8620 168423 117445 274439 304818 -67217 45020 -211418 130036 13241 101643 205324
8610 205324 195904 221144 280151 505668 251231 151533 294484 226999 -16594 195519 89454
8599 89454 304696 246785 89194 14294 262007 250159 21956 108321 77061 143495 408656
8588 408656 -15740 85459 113400 177701 248806 312701 401671 719418 412443 327591 389342
8577 389342 439619 308059 138903 467197 655716 610794 631338 660680 764113 640719
8567F40719K61672M94861N0861P6566K2997Q1647n88489n8433j48416K30834l9411
8556A025408j18676N0688K7690j71343k16310L13427L92346K95435J13175p0420
8546A641420N5316K18196k79943n08960k61624L54298j2614m5338Q92J41405M4176
8535A347224k7744K81379O0670L6052o316k63674k47471K1007j45562o0971j35031
8524H59563K73209q5661k70922K16827J70673J95804R3611L30671O3501J93458
8514B040734J79255l42191j18320l94453j11271k62514K1197j19597J687r7130
8504G97397R140L9589j42850J38651q3605J38636l80968J46978J49530K9657J0373
8493H52528M230l84311K54340j35126M04780M6544L0038l80468N57201J63295
$$ plain form
8567 640719 902391 1397252 1448113 1524679 1547676 1629323 1040834 982401 833985 1064819 1025408
8556 1025408 906732 957420 985110 813767 597457 910884 1303230 1598665 1711840 1641420
8546 1641420 1696736 1914932 1634989 1126029 864405 1218703 1206089 1160751 1161643 1303048 1347224
8535 1347224 1319480 1600859 1661529 1697581 1691265 1427591 1180120 1201127 1055565 994594 859563
8524 859563 1132772 1047111 776189 993016 1163689 1359493 1453104 1783775 1847276 2040734
8514 2040734 2219989 1877798 1759478 1365025 1253754 991240 1012437 892840 894527 797397
8504 797397 806537 846126 703276 841927 758322 896958 515990 662968 812498 842155 852528
8493 852528 856758 472447 726787 591661 996441 1042985 1073023 692555 1249756 1413051
8483A413051j229642M24266m14877K02423M26243J58210l38123k26481M44562
8474H59632N8106J52472o3448J69095J20088k74104J63261J04471q221j90506
8464A090846J65331J93869L40711J77162j51251p2739l9987L61797M15424J36317
8454B617480K26227J35663K1927J39507o5264k91256O5847j75674J89550J04400
8444B968407L03099L49444m9103j27739k82261q3839k9497J88823q8737j41171
8434C007426j1787k96214K77206k13063L5938J49310J91874L59515J1083P2198
8424C583486K97498L85571K25406L45515K6733L57811O7627J99015j8770L5650
8414E505542K30716M42790m5000L98574J48368K5561j92599n7188j9665l50903
$$ plain form
8483 1413051 183409 607675 192798 395221 821464 979674 641551 415070 859632
8474 859632 917738 1070210 1006762 1175857 1295945 1021841 1185102 1289573 1281352 1090846
8464 1090846 1256177 1450046 1790757 1967919 1816668 1743929 1703942 2065739 2481163 2617480
8454 2617480 2843707 2979370 3001297 3140804 3075540 2784284 2850131 2674457 2864007 2968407
8444 2968407 3271506 3620950 3571847 3444108 3161847 3078008 3048511 3237334 3148597 3007426
8434 3007426 2995639 2699425 2976631 2763568 2799506 2948816 3140690 3500205 3511288 3583486
8424 3583486 3880984 4266555 4491961 4837476 4864209 5222020 5289647 5488662 5469892 5505542
8414 5505542 5736258 6179048 6134048 6532622 6680990 6706551 6513952 6456764 6437099 6086196
8404F086196J95479R2081K32581R128L20713Q2027K61487K54623K22268L9551
8394G796134K65703L12787j07765K69300M85900J2225L9621J47926J1358Q5912
8384I319101M73266K8285N4801L2292j00319L31860k30753J8573J78396L8023
8374A0143525J50131l57615j67384j4198l09790k75942k39677m02867j43967K9995
8364H412211o3504m04256p2040m45786k22509k2255p44954J4412J49683l21764
8354F279238J18085k44133l10339J2371K44949j75486j53690m27468l06080m2868
8344D994579n5702m8173K25882j80510K2658n6086j93510L42781m19380l12468
8334D320071M8081K34028k95395l35206M2144K23545P2437L18071l70027j65466
$$ plain form
8404 6086196 6281675 6373756 6606337 6615465 6936178 7018205 7279692 7534315 7756583 7796134
8394 7796134 8061837 8374624 8266859 8536159 9022059 9034284 9073905 9221831 9233189 9319101
8384 9319101 9792367 9820652 9875453 9907745 9807426 10139286 9908533 9927106 10105502 10143525
8374 10143525 10293656 9936041 9768657 9754459 9444669 9168727 8929050 8526183 8382216 8412211
8364 8412211 8348707 7944451 7872411 7426625 7204116 7181861 6436907 6451319 6601002 6279238
8354 6279238 6397323 6153190 5842851 5855222 6100171 5924685 5770995 5343527 5037447 4994579
8344 4994579 4938877 4890704 5116586 4936076 4958734 4902648 4709138 5051919 4632539 4320071
8334 4320071 4368152 4602180 4306785 3971579 4013723 4237268 4309705 4627776 4257749 4092283
8324D092283k3339L53661o069K8613J47958k42764j47278M0563J13158k24859
8314D131927p1095K68616K82705J81585n3254N7202O4972K99721K68717M12756
8304E843852M0160P42941N60964J05652O88338N65229j27208o56803m69033l04268
8294F989824o9733J2868R4008K18364J92877O78252M48703O06503O87265J033821
8284A0892752Q03619M41688R3467L6123P28161J433573J343872Q13975K74014
8275A6861244r22170j457789j061559j04765K11922N86463O29276K79229l09940
8266A4711911o89412K50930N80217J373184J299973M80490R6042r88377j309855
8257A5805103o77591L03985L61472N90153J41843K39895K84418J003188P64304
$$ plain form
8324 4092283 4068944 4422605 4416536 4445149 4593107 4350343 4203065 4243628 4356786 4131927
8314 4131927 4060832 4329448 4612153 4793738 4740484 4797686 4862658 5162379 5431096 5843852
8304 5843852 5884012 6626953 7187917 7293569 7981907 8547136 8419928 7763125 7294092 6989824
8294 6989824 6920091 6932959 7026967 7245331 7438208 8116460 8565163 9171666 9858931 10892752
8284 10892752 11696371 12138059 12231526 12267649 12995810 14429383 15773255 16587230 16861244
8275 16861244 15939074 14481285 13419726 13314961 13526883 14113346 14742622 15021851 14711911
8266 14711911 14022499 14273429 14853646 16226830 17526803 18007293 18103335 17114958 15805103
8257 15805103 15127512 15431497 15792969 16383122 16524965 16764860 17049278 18052466 18816770
8248A8816770O42818q66294j903065k339148j748540r93029n26393l66763l01466
8239A0414890J95393J52545M90759P35701J354896J703201J457358O28418r88344
8230A6144817j871569k048480j473924j254994r73287m74221o58853J36054m79965
8221G045578o88130l85322k92646j28727o6131o1332k17616l23938p4288j58525
8211D648923O9504j7564r8927L0726n0157j36247l69247K18924o6003O0210j29904
8200D160238K54472j90197k05921J5253L3204j84800M40285k98344o26500J172262
8190D569952J57526N7804j65888P6877k75195J69328K30622O6614k03623J77640
8180D861657L25074J18840j17261q6982k52702n2387l9200o8125L90949j3773
$$ plain form
8248 18816770 19459588 18593294 16690229 14351081 12602541 11609512 11083119 10716356 10414890
8239 10414890 10610283 10762828 11253587 11989288 13344184 15047385 16504743 17133161 16144817
8230 16144817 14273248 12224768 10750844 9495850 8522563 8048342 7389489 7525543 7045578
8221 7045578 6357448 5972126 5679480 5550753 5484622 5423290 5205674 4881736 4807448 4648923
8211 4648923 4718427 4700863 4601936 4632662 4582505 4446258 4077011 4295935 4229932 4290142 4160238
8200 4160238 4414710 4224513 4018592 4033845 4067049 3882249 4322534 4024190 3397690 4569952
8190 4569952 4727478 4785282 4619394 4696271 4421076 4590404 4821026 4887640 4684017 4861657
8180 4861657 5186731 5305571 5188310 5101328 4848626 4796239 4757039 4688914 5079863 5066090
8170E066090R4250K43536K87935N5845J05090J96375L46039K11093l4208K1278
8160F593323K8112P9079J25162j58359K11854J84633n7784K91740J66659j1867
8150G452552R7008k0613L15986P1624o4016m9296k92860P1730K95249K28173N66474
8139H672011k55082M78469L81059K05109k45292M49118L54518M30145J13212R5561
8129A0678828K06245J05326M47456K59536L78866M18124N74766N11149R00403
8120A4480699M11581L43594N32908K81745M18742O44317Q87908O66031R49692
8111A9617217J429266J674528K231614K423220K437879J018634k6200o62709p06177
8102B9437272O50066J071164J787157K727541K169884O84717q08139j219501j268456
$$ plain form
8170 5066090 5160340 5403876 5691811 5747656 5852746 6049121 6395160 6606253 6572045 6593323
8160 6593323 6621435 6700514 6825676 6667317 6879171 7063804 7006020 7297760 7464419 7452552
8150 7452552 7549560 7528947 7844933 7916557 7852541 7803245 7510385 7582115 7877364 8105537 8672011
8139 8672011 8416929 8895398 9276457 9481566 9236274 9685392 10039910 10470055 10583267 10678828
8129 10678828 10885073 10990399 11437855 11697391 12076257 12494381 13069147 13580296 14480699
8120 14480699 14892280 15235874 15768782 16050527 16469269 17113586 18001494 18667525 19617217
8111 19617217 21046483 22721011 24952625 27375845 29813724 30832358 30806158 30143449 29437272
8102 29437272 30087338 31158502 32945659 35673200 37843084 38527801 37719662 36500161 35231705
8093C5231705k35425L48763M99531J444361J547723K002068L212032L525827M600326
8084E2176911N760892Q029704J0640027J3160376J2014623O320029k372964q757437
8076I6972161j0762791q064175l902307q27647J568027L331787M440619N420934
8068H8176608P317262R749014J2264123J2117068Q519890O389245O612231J3474546
8060A64619987J1279815j2914577k9762956k3128800j1790062m808690J27956
8053I3622673M176298Q531386J0470026Q806935J806687p668341j4309961j4847868
8045I0587835j1054721p113449m117087k228012P2601K071776M769503P647753
8037H0636199J1104944J2204923Q311431k65550r418213j3843566j3077800r393043
$$ plain form
8093 35231705 34996280 35345043 35844574 37288935 38836658 40838726 44050758 47576585 52176911
8084 52176911 57937803 65967507 76607534 89767910 101782533 108102562 105729598 96972161
8076 96972161 86209370 78145195 74242888 73415241 74983268 78315055 82755674 88176608
8068 88176608 95493870 105242884 117507007 129624075 138143965 144533210 151145441 164619987
8060 164619987 175899802 162985225 133222269 110093469 98303407 93494717 93622673
8053 93622673 97798971 106330357 116800383 125607318 127414005 119745664 105435703 90587835
8045 90587835 79533114 72419665 68302578 66074566 66147167 68218943 72988446 80636199
8037 80636199 91741143 103946066 112257497 111991947 102573734 88730168 75652368 66259325
8029F6259325o410042m548629l545567k772211k547762k164954j513531j217942
8021D1538687j032086j83840K22245K66306M47692Q94512J538631J831244J886854
8012D7410245J302888J81620j144679j377209o91847k79428L12270M25537O61448
8003D6800845J042399J598855K143014L277290M024833N382297N584395O016128
7995G5870056P434050R116570J0038976O936430J006189m387289o352702l954139
7987I5708141J595889P450474J1238755J1217186M988339l630651j0521451j2632901
7979A05413781r997190o510833l940968l280102l874465l064771k006120k33064
7971G2506268K084191L383149M030728L791307J416313m18211j115229R42633
$$ plain form
8029 66259325 59849283 55300654 51755087 48982876 46435114 44270160 42756629 41538687
8021 41538687 40506601 40322761 40545006 40811312 41259004 42153516 43692147 45523391 47410245
8012 47410245 48713133 48894753 47750074 46372865 45681018 45401590 45713860 46139397 46800845
8003 46800845 47843244 49442099 51585113 54862403 58887236 64269533 69853928 75870056
7995 75870056 83304106 92420676 102459652 109396082 110402271 106014982 99662280 95708141
7987 95708141 97304030 104754504 115993259 127210445 132198784 128568133 118046682 105413781
7979 105413781 95416591 88905758 84964790 81684688 77810223 74745452 72739332 72506268
7971 72506268 74590459 77973608 82004336 85795643 87211956 86793745 85678516 86621149
7963H6621149M526970P385259R375064O843939J899060m036332p526498o748262
7955I8340349k323250L280584P772781P652199L622272k911180r518922j1804468
7947I4110365j1018343o975985m744263l987648l776135l643227l359969k135547
7939E4469248p34991M89920R58985P51365J41340r50526j486543j882607k026210
7930D9729981j754028j690400j420764j130844j331833p29422o85331p18050j120563
7921C9148746j647059j249635k135695j573921r77745j245891p56893j255081
7913B8306826m68167K6550k51731N17034P88922J368351J376902J347470R40780
7904C3952937q42505q42094m99911p87924q94694j328896k04199o51768j96316
$$ plain form
7963 86621149 91148119 98533378 107908442 114752381 116651441 112615109 105088611 98340349
7955 98340349 96017099 99297683 107070464 114722663 118344935 115433755 105914833 94110365
7947 94110365 83092022 76116037 71371774 67384126 63607991 59964764 56604795 54469248
7939 54469248 53734257 54224177 55183162 55934527 56075867 55125341 53638798 51756191 49729981
7930 49729981 47975953 46285553 44864789 43733945 42402112 41672690 40987359 40269309 39148746
7921 39148746 37501687 36252052 34116357 32542436 31564691 30318800 29561907 28306826
7913 28306826 27838659 27865209 27613478 28130512 28919434 30287785 31664687 33012157 33952937
7904 33952937 33110432 32268338 31768427 30980503 30085809 28756913 28552714 27900946 27704630
7895B7704630N72989L78489P14411j90487p40168r56196m48429Q1333L54885N86852
7885B8058309J286128P98424M66308k58309m75081k70229K89825P56342J364682
7876C2016399J481371J597170J791668K405687M246347O391525P230589Q338251
7868F5499007N138213q72597n397194n697801l768828j73619K871493M131216
7860F1729890M117936N31465m206004o928381o554195m757677l139593j898324
7852C8895117q85305p26696l8723N4696R89218J421078J840637K326895L319786
7843D7196703M203670N103139P056249R225795J0968402J0269345O171711J57410
7835A00352424n772766p742225n902270r63555L151247N006747M170968l03160
$$ plain form
7895 27704630 28277619 28656108 29370519 29180032 28439864 27483668 27035239 27116572 27471457 28058309
7885 28058309 29344437 30142861 30609169 30350860 29875779 29605550 29895375 30651717 32016399
7876 32016399 33497770 35094940 36886608 39292295 43538642 49930167 57160756 65499007
7868 65499007 70637220 69764623 64367429 58669628 54900800 54727181 57598674 61729890
7860 61729890 65847826 66379291 62173287 55244906 48690711 43933034 40793441 38895117
7852 38895117 38009812 37283116 37244393 37299089 38288307 39709385 41550022 43876917 47196703
7843 47196703 51400373 56503512 63559761 72785556 83753958 94023303 100195014 100352424
7835 100352424 94579658 86837433 80935163 79971608 83122855 88129602 92300570 91997410
7827I1997410n975807j0333582j0923982q958847o208414l792364k385998j201719
7819D2216697j46830J44057L25546L79784p3764j62169J08329J051107K300619
7810D6143376L367970M677389N208981M913141J281701k767798n532837n110897
7802E2181026l071525p19598R55969K300468J728853q51611m283497o332444m984062
7793C6923579l576657k149795j072127q0291L36416Q04233J453658O49389L82013
7784C3670418p58401j493358j507902j176852P0025J22459o9344K55310p07138
7775B8405217j572926k140202k121414j618414j168118j459569j099415r55733
7767A6269426q83537o47670m27638o6897j51345J1725k34484M63390K48119O28499
$$ plain form
7827 91997410 86021603 75688021 64764039 55805192 49596778 45804414 43418416 42216697
7819 42216697 42069867 42213924 42539470 42919254 42845490 42683321 42791650 43842757 46143376
7810 46143376 49511346 54188735 59397716 64310857 65592558 62824760 57291923 52181026
7802 52181026 49109501 48389903 49345872 51646340 53375193 52523582 48240085 41907641 36923579
7793 36923579 33346922 31197127 30125000 30044709 30381125 31185358 32639016 33288405 33670418
7784 33670418 32912017 31418659 29910757 28733905 28803930 28926389 28857045 29112355 28405217
7775 28405217 26832291 24692089 22570675 20952261 19784143 18324574 17225159 16269426
7767 16269426 15385889 14738219 14310581 14243684 14092339 14104064 13869580 14332970 14581089 15209588
7757A5209588J182096Q60793J97267j84978r10294r86660r79097j99958j30567
7748A4058190R8038O10986L6883n77309j467357j215643o48383p24097k85223
7739I886085n22497o21969q6638m87514j04602j45476j06745J42527l22612j94105
7729G436454L4082J70735p0660k53405k27630j39323j37868J34927l3191J06193
7719G020314l23267J00496j71587j75277j8520M37083l14493l17402J30993m93174
7709E875166o0935N9389m3924K9888o040L91108o1368K10899j92058m17912j49665
7698E634548k14146j90348k24684L38193k43765j06292m7969m15572q9241L42341
7688D783065J31641l83099J85636J68687J55747n2856l59759r8723l4964k76467
$$ plain form
7757 15209588 16391684 17252477 17449744 17264766 16354472 15367812 14388715 14188757 14058190
7748 14058190 14156228 14767214 14804097 14226788 12759431 11543788 10895405 10171308 9886085
7739 9886085 9363588 8741619 8654981 8167467 8062865 7917389 7810644 7953171 7630559 7436454
7729 7436454 7470536 7641271 7570611 7317206 7089576 6950253 6812385 6947312 6914121 7020314
7719 7020314 6697047 6797543 6625956 6450679 6432159 6869242 6554749 6237347 6368340 5875166
7709 5875166 5814231 5873620 5829696 5859584 5853544 6244652 6183284 6394183 6202125 5784213 5634548
7698 5634548 5420402 5230054 5005370 5343563 5099798 4993506 4945537 4529965 4440724 4783065
7688 4783065 4914706 4531607 4717243 4885930 5041677 4988821 4629062 4530339 4495375 4218908
7678D218908j090P7161R6319J18002J7941L4519J0427k952m32909P9882k9558
7667D186650l08430j83022K81357J95098K67239M619o5585k92581j12605o431
7657C966309L7320N1913J4860k42402J52980k15507l0241J54952K03833k02214
7647C891803k89785K12347j72060O4841O5446k032R4106m9631q7961j57706K55599
7636C824967R643j23570Q6342k14396K10575j57252J65322J96723J87037k36714
7626C948677n8573k00217m7982J23835L4890j89072N9316L04163l32080R8083
7616C741040K86487J19380J7443M3094l23369K95966K72880J15663m25183m35978
7606C707423K50941J53363k63349J71005J26727K78160R7907j91565q9050j21454
$$ plain form
7678 4218908 4217818 4294979 4391298 4509300 4527241 4561760 4572187 4569235 4136326 4216208 4186650
7667 4186650 3878220 3695198 3976555 4171653 4438892 4443511 4377926 4085345 3972740 3966309
7657 3966309 4003629 4055542 4070402 3828000 3980980 3765473 3735232 3890184 4094017 3891803
7647 3891803 3602018 3814365 3642305 3707146 3772592 3770560 3864666 3815035 3727074 3569368 3824967
7636 3824967 3834610 3711040 3797382 3582986 3793561 3636309 3801631 3998354 4185391 3948677
7626 3948677 3890104 3689887 3641905 3765740 3800630 3611558 3670874 3975037 3642957 3741040
7616 3741040 4027527 4146907 4164350 4207444 3884075 4180041 4452921 4568584 4143401 3707423
7606 3707423 3958364 4111727 3848378 4019383 4146110 4424270 4522177 4330612 4241562 4120108
7596D120108K82177M0707n6307K72314M20596J53406L49500j27653l73459J62359
7586E243748p8443q3952Q079J95166m870J47560o6199m8543o67750k28695j46178
7575D269923k02708k9033j07483K66299k86119M31556M4129R847Q9526k63955
7565D221982L37369J30006J11034K95319L28044K11429J16650K40091r7932n99958
7555E294034j59729J39817N0625M29512O1313Q380J30437k50066k97706m71108
7545D935509k07466l94337Q3779J29188l0722m62507m711o5747l07542L35283
7535D010727J05875J28829r8932n6682m283J39099L67762M85890j35432j92010
7525D750843m11167K7477J7968k9889L05080J20047J16330k58109l43571l23783
$$ plain form
7596 4120108 4402285 4442992 4386685 4658999 5079595 5233001 5582501 5454848 5081389 5243748
7586 5243748 5165305 5081353 5089432 5284598 5279728 5427288 5361089 5312546 4644796 4416101 4269923
7575 4269923 4067215 4038182 3930699 4196998 3910879 4342435 4386564 4396411 4485937 4221982
7565 4221982 4559351 4689357 4800391 5095710 5423754 5635183 5751833 5991924 5893992 5294034
7555 5294034 5134305 5274122 5324747 5754259 5815572 5823952 5954389 5704323 5406617 4935509
7545 4935509 4728043 4333706 4417485 4546673 4515951 4053444 4048733 3982986 3675444 4010727
7535 4010727 4116602 4245431 4146499 4089817 4085534 4224633 4592395 5078285 4942853 4750843
7525 4750843 4339676 4367153 4385121 4355232 4660312 4780359 4896689 4638580 4295009 3971226
7515C971226k77277j06499j94819L84962k07452k41434R0505l3345K26761j26710
7505C485918j31305Q1947K80797K2441K46668K04679O97448K19349L39168K5719
7495E472829j01866l08187m58687k4640m24243J08722j10685J28345J04987j03687
7485D282888K01932L9223O7567M06392J95881J8440m40920j65786m79823m84336
7475C641458K08610P2548l23791r1132K05253j66410o090M29200j76413J40836
7465C934069m7336k62906k78917j41469j08924j03750j23623J92291r7430j33484
7455B828521J35839j73082J49904L35203k37159M6277k01657l1032j18759k10067
7445B523988k92055L29925R1131k00967j29354j68410J82963J5074k60302j59449
$$ plain form
7515 3971226 3693949 3587450 3392631 3777593 3570141 3328707 3419212 3385867 3612628 3485918
7505 3485918 3354613 3436560 3717357 3739798 3986466 4191145 4888593 5107942 5447110 5472829
7495 5472829 5370963 5062776 4604089 4579449 4155206 4263928 4153243 4281588 4386575 4282888
7485 4282888 4484820 4524043 4591610 4998002 5193883 5212323 4771403 4605617 4125794 3641458
7475 3641458 3850068 3922616 3598825 3507693 3712946 3546536 3540446 3969646 3793233 3934069
7465 3934069 3886733 3623827 3344910 3203441 3094517 2990767 2867144 3059435 2962005 2828521
7455 2828521 2964360 2791278 2941182 3276385 3039226 3085503 2883846 2852814 2734055 2523988
7445 2523988 2231933 2561858 2652989 2452022 2322668 2154258 2337221 2352295 2091993 1932544
7435A932544l8535M8756k8986J04617l10732j59266J58452j03262L5370Q4053
7425A723011j0711j03935k61947M51473L76882k81750k65489j54449Q8291j45703
7415A415673R4536M0877k421j00952J11851J33678j61163m38012p0714J58084
7405A181437O6492q5514L23963K30098j50782m04343N2437M02767j50782j49479
7395A316294j971J63756J39103l1639j6136p2410L5989k32367q1970j56698K98671
7384A360622m9779K88806k91081j21548J18962L981j41653j51933J63361J05579
7374A285317K1952L1496M7970N6209J46622O4983k91278j38754j60793K44908
7364A308632J65334J15369J1372p0624M007j12045M4200m111k33305N6887o3801
$$ plain form
7435 1932544 1894009 1942765 1913779 2018396 1707664 1548398 1706850 1603588 1638958 1723011
7425 1723011 1712300 1608365 1346418 1797891 2174773 1893023 1627534 1473085 1561376 1415673
7415 1415673 1510209 1551086 1548665 1447713 1559564 1693242 1532079 1094067 1023353 1181437
7405 1181437 1247929 1162415 1486378 1716476 1565694 1161351 1213788 1616555 1465773 1316294
7395 1316294 1314323 1478079 1617182 1585543 1569407 1496997 1532986 1300619 1218649 1061951 1360622
7384 1360622 1310843 1599649 1308568 1187020 1305982 1309963 1168310 1016377 1179738 1285317
7374 1285317 1307269 1338765 1386735 1442944 1589566 1654549 1363271 1224517 1063724 1308632
7364 1308632 1473966 1589335 1600707 1530083 1534090 1422045 1466245 1462134 1228829 1285716 1221915
7353A221915K05082j23047J06857k9710j69199k72985J7476M65223j87027J13593
7343A348178L26038J93214J02117K31354j5653k00529K0727j17962j31053O1985
7333A818416r6777j37992O5999l9795j73533J07729J21975k50602j5347J39781
7323A539854P5366k6389m5794K66330j24196j47302J18345M877J81304j52926
7313A689469j5361q2038J54853O3600p1132m2172j96017K18800o2609J93805l67080
7302A484118J65600K83114l52718j07801L96196j58646q1020j92726m5461J80641
7292A571297L64202P3639l18273K2886j70850J03723K90726r566M76245j54068
7282B249961k21941j51862K13663l9066k0022K80276J26510n3913l32971k14481
$$ plain form
7353 1221915 1426997 1303950 1410807 1381097 1211898 938913 956389 1421612 1234585 1348178
7343 1348178 1674216 1867430 1969547 2200901 2185248 1984719 2005446 1887484 1756431 1818416
7333 1818416 1721639 1583647 1649646 1609851 1436318 1544047 1666022 1415420 1400073 1539854
7323 1539854 1615220 1588831 1543037 1809367 1685171 1537869 1656214 1661091 1842395 1689469
7313 1689469 1674108 1592070 1746923 1810523 1739391 1697219 1501202 1720002 1657393 1851198 1484118
7302 1484118 1649718 1932832 1580114 1472313 1868509 1709863 1628843 1436117 1390656 1571297
7292 1571297 1935499 2009138 1690865 1713751 1542901 1646624 1937350 1927784 2404029 2249961
7282 2249961 2028020 1876158 2089821 2050755 2030733 2311009 2437519 2383606 2050635 1836154
7272A836154R6576m2988j70339P7332L0807q0566j42985q3670J94005j44424J2480
7261A582382L7177k6034J54047k44015l79905L62173J64326j52600J32476K61654
7251A891681o6937L5798J94235k51401q1203j26485J28726j57818o3054J82278
7241A685820J91845J03029k42350J6057J04517j68573J10299J52160l31011K01886
7231A823679M5519j20963L72922K3319k44123j42924l89570L17469J61256j47535
7221A699049m6231k84225N80841M57906k18446k9170J58852m59785k10270J1658
7211A660179L7668n8936q3758q4439k1422k3915m4876P9904J39848L76103o3646
7200A912710k17763J26271p7423k13405J69557J63112k44694P8099R2375l8267
$$ plain form
7272 1836154 1932730 1889742 1719403 1796735 1827542 1746976 1603991 1520321 1714326 1569902 1582382
7261 1582382 1619559 1593525 1747572 1503557 1123652 1485825 1650151 1497551 1630027 1891681
7251 1891681 1824744 1860542 2054777 1803376 1722173 1595688 1724414 1566596 1503542 1685820
7241 1685820 1877665 1980694 1738344 1754401 1858918 1690345 1800644 1952804 1621793 1823679
7231 1823679 1869198 1748235 2121157 2144476 1900353 1757429 1367859 1685328 1846584 1699049
7221 1699049 1652818 1368593 1949434 2407340 2188894 2159724 2318576 1858791 1648521 1660179
7211 1660179 1697847 1638911 1555153 1470714 1449292 1425377 1380501 1460405 1600253 1976356 1912710
7200 1912710 1694947 1821218 1743795 1530390 1699947 1863059 1618365 1696464 1788839 1750572
7190A750572k24306O1719K9490n8983l8081K83461J37920K38179p2541m38577
7180A668853J01064K16582j61842j69083J21948O3104k6814j04711J07267m0621
7170A775747j23446J69593j68998J75266R5338j00346P5708J46318m5054K43953
7160B244079j54193k05525K44408j34065O9182J37366l3029k00307K68099k0386
7150B215629j92112k501l948j19791J66799k00837J22122k96632j17683r7645
7140A473401J07822J77255J01816K44764k25448J3879N3358R4686k85446Q382
7130A764469K89450L66235k46240l78088R9160k2117l6494j47778j06392k4749
7120A557456M1164J04725l22438J97610L39516R8526p5644k30409J05617j11017
$$ plain form
7190 1750572 1526266 1587985 1617475 1558492 1520411 1803872 1941792 2179971 2107430 1668853
7180 1668853 1769917 1986499 1824657 1655574 1777522 1840626 1813812 1709101 1816368 1775747
7170 1775747 1652301 1821894 1652896 1828162 1923500 1823154 1898862 2045180 2000126 2244079
7160 2244079 2089886 1884361 2128769 1994704 2063886 2201252 2168223 1967916 2236015 2215629
7150 2215629 2023517 2021016 2017068 1897277 2064076 1863239 1985361 1688729 1571046 1473401
7140 1473401 1581223 1758478 1860294 2105058 1879610 1893489 1946847 2041533 1756087 1764469
7130 1764469 2053919 2420154 2173914 1795826 1894986 1872869 1836375 1688597 1582205 1557456
7120 1557456 1598620 1703345 1380907 1578517 1918033 2016559 1940915 1710506 1816123 1705106
7110A705106K48392N4167r8123q077j5396J37343N2986Q2179Q366J96686k09430
7099B154199l69680Q5050J99124k71026J43376j6304Q884k9273P3821Q9315k23388
7088A844098K12008L5396R8720k59924L7621k1543k66254K09260O8000K58129
7078B215511k90554J21017J3440n9173l380j33299l2771J78438J35764j33769
7068B011224o8373M19138l2393o5141K31054q9516J2944R020J83601l9698Q9691
7057B661551j13997J16778J77620k8430k09682R0405m322M7491j90783j70600
7047B376031J83092o7757j18805J01695J9444K43496J97097J06447l915l6529
7037C000296K1195l3860J32026l778M6866K15667M99941j65739k87223J59596
$$ plain form
7110 1705106 1953498 2007665 1909542 1901465 1886069 2023412 2076398 2158577 2166943 2363629 2154199
7099 2154199 1784519 1869569 2068693 1797667 1941043 1924739 1933623 1904350 1978171 2067486 1844098
7088 1844098 2056106 2091502 2190222 1930298 1967919 1946376 1680122 1889382 1957382 2215511
7078 2215511 1924957 2045974 2059414 2000241 1996861 1863562 1830791 2009229 2144993 2011224
7068 2011224 1942851 2361989 2329596 2264455 2495509 2405993 2418937 2427957 2611558 2571860 2661551
7057 2661551 2547554 2664332 2841952 2813522 2603840 2694245 2689923 2737414 2546631 2376031
7047 2376031 2559123 2491366 2372561 2474256 2493700 2737196 2934293 3040740 3036825 3000296
7037 3000296 3021491 2987631 3119657 3115879 3162745 3378412 3878353 3712614 3425391 3584987
7027C584987J17066k40817k30840k6686J67863j89253l0172l0221l35167k32964
7017B553796J76033J40905R6832j07123k5199J12126K97410j17551j73278J51129
7007C105080J67773J31231l00777M74959L7423m4157j91330k67599l8189j47225
6997B927189k66795R9728p1599j88547N8888J03036q3280j11663O7477k24288
6987B310146K22087r4432J33372J06186P7832L31811N8521N6063j35952O15104
6977C680738r0064J97287N0081L77057J76394j8251n7263m07546j03949K10593
6967D015077j33817L60095J63006l76614K01515j26908L3687J6892L28897J04328
6957D586158J46329k2150J95855J31372p015M45659K18756J91270R8051p0571
$$ plain form
7027 3584987 3702053 3461236 3230396 3203710 3371573 3182320 3152148 3121927 2786760 2553796
7017 2553796 2729829 2870734 2967566 2860443 2835244 2947370 3244780 3127229 2953951 3105080
7007 3105080 3272853 3404084 3103307 3578266 3615689 3571532 3380202 3112603 3074414 2927189
6997 2927189 2660394 2760122 2688523 2499976 2558864 2661900 2578620 2466957 2534434 2310146
6987 2310146 2532233 2437801 2571173 2677359 2755191 3087002 3145523 3201586 3065634 3680738
6977 3680738 3590674 3787961 3838042 4215099 4391493 4373242 4315979 3908433 3804484 4015077
6967 4015077 3881260 4241355 4404361 4027747 4229262 4102354 4136041 4152933 4481830 4586158
6957 4586158 4732487 4710337 4906192 5037564 5030549 5476208 5694964 5886234 5984285 5913714
6947E913714J99974k07495K67426L33934J13237N80941N08416M50086J128989
6938I289222J189582K123854K913562L094063K640742L86218j714121l254654
6930A6668468k976161k518869j094655r46653p56336l92925m80770K04220m38472
6921G267847J80167M59228L3508L53841Q82534J186843J826851K692728K817078
6912A7700625K251315K14743j851439l173926l161537k479732j299342r14324
6904G286383q74145o94948n89823k94818l10473k04558l44956r8390l74482m02257
6894C097533J00201R5250k08575j7566k29028J1487l39028K00396J28900j93310
6884B646260n4128k19501K51027n9389k3955j30632K01926k901l26670j94467
$$ plain form
6947 5913714 6113688 5906193 6173619 6507553 6620790 7201731 7710147 8160233 9289222
6938 9289222 10478804 12602658 15516220 18610283 21251025 21637243 19923122 16668468
6930 16668468 13692307 11173438 10078783 9132130 8375794 7982869 7502099 7706319 7267847
6921 7267847 7448014 7907242 7940750 8294591 9177125 10363968 12190819 14883547 17700625
6912 17700625 19951940 20166683 18315244 15141318 11979781 9500049 8200707 7286383
6904 7286383 6412238 5717290 5127467 4832649 4522176 4317618 3972662 3874272 3499790 3097533
6894 3097533 3197734 3292984 3084409 3066843 2837815 2849302 2510274 2710670 2839570 2646260
6884 2646260 2592132 2372631 2623658 2564269 2540314 2409682 2611608 2608707 2282037 2087570
6874B087570J51616R741j49619o5400N4964j43463K46793M2474j2366j42686J67467
6863B247091J15515k36398K08244L0699K14874n875K9775J97138L92304N60505
6853C753872J82261k33133O1689J84489P2075j31951J07793j84659l09051o372
6843C497013k02919j36736J28870l6815j89181m52832q3825O5548K17494j21360
6833B685257J69068P2540k66288j80306m37110q438j77723m25087M05924j01592
6823A736245l4676k24650O6402k2194L60888J93658m2170q0172j20870N5664j61054
6812A727071K30987k91077k48994K60730j43245L2653j97885J13961J17038K92636
6802A893875r249k67894L1674K43079M51281j52542K196k20746M2257k17503P6032
$$ plain form
6874 2087570 2239186 2248927 2099308 2033908 2088872 1945409 2192202 2234676 2222310 2079624 2247091
6863 2247091 2362606 2126208 2334452 2365151 2580025 2574150 2603925 2801063 3193367 3753872
6853 3753872 3936133 3703000 3764689 3949178 4021253 3889302 3997095 3812436 3503385 3497013
6843 3497013 3294094 3157358 3286228 3249413 3060232 2607400 2523575 2589123 2806617 2685257
6833 2685257 2854325 2926865 2660577 2480271 2043161 2034723 1857000 1431913 1837837 1736245
6823 1736245 1701569 1476919 1543321 1521127 1882015 2075673 2033503 1953331 1832461 1888125 1727071
6812 1727071 1958058 1666981 1417987 1678717 1535472 1568125 1370240 1484201 1601239 1893875
6802 1893875 1884626 1616732 1648406 1891485 2342766 2190224 2192420 1971674 2013931 1796428 1872460
6791A872460k22303j38039j57563L27514l1624o4884p3558k93401K4331K17580
6781A460513j11061k9308L5911L4623j99405J17702O8699K14160J17333l88216
6771A320951k35925K27362J78114j57010J73232Q459J51767j57612j49832J8568
6761A378074p3449K54902J06372j42234N2557P8079k58436j50353J38353j59415
6751A224450J29557K63232k52148r2262Q6966p7473J09618K97826j99975r544
6741A480247M51845k4516j83832k02420L43433j78606j59230k50682N44354J17489
6731A938082j7449j944J80967O64709k11439K30148p8211L22830l15064j52618
6721B560011m3949k3452J3357M83555K244k34300l43349J130L28341l67204L34003
$$ plain form
6791 1872460 1650157 1512118 1354555 1682069 1650445 1585561 1512003 1218602 1242933 1460513
6781 1460513 1349452 1320144 1356055 1390678 1191273 1308975 1377674 1591834 1709167 1320951
6771 1320951 1085026 1312388 1490502 1333492 1506724 1515183 1666950 1509338 1359506 1378074
6761 1378074 1304625 1559527 1665899 1523665 1576222 1654301 1395865 1245512 1383865 1224450
6751 1224450 1354007 1617239 1365091 1272829 1359795 1282322 1391940 1689766 1489791 1480247
6741 1480247 1932092 1907576 1723744 1521324 1864757 1686151 1526921 1276239 1820593 1938082
6731 1938082 1920633 1918689 2099656 2764365 2552926 2783074 2704863 3027693 2712629 2560011
6721 2560011 2516062 2492610 2505967 2989522 2991766 2757466 2414117 2415247 2743588 2376384 2710387
6710B710387o2414j65834M17287K6217O13842K20701L23083J20450j30623l85121
6700C687975j55528j71245l31037j32144J36171p5865k07004Q8633k55806J51046
6690B735196j33596n306K45785O4413N50992L21140J16299N48515Q3619k71142
6680D255915l45584k43785o73045r7211O6098p4275l2500J35916j12824j01270
6670B777435n70296n8310K45993M8662l64780N0115O68643K05029k84584L25605
6660C043512J04117j48919k42820l6371j6420j25675j46998Q0642q7063J23445
6650B547450L9264j86222L62628j8411M73058L43698q2504l46262l48034l50638
6640B434027j42680m5278M8767j62795k00593n7954J2667L08945r4108J25689
$$ plain form
6710 2710387 2647973 2482139 2899426 2925643 3539485 3760186 4083269 4203719 4073096 3687975
6700 3687975 3532447 3361202 3030165 2898021 3034192 2958327 2751323 2839956 2584150 2735196
6690 2735196 2601600 2596294 2842079 2906492 3457484 3778624 3894923 4443438 4527057 4255915
6680 4255915 3910331 3666546 2993501 2896290 2962388 2888113 2855613 2991529 2878705 2777435
6670 2777435 2207139 2148829 2394822 2443484 2078704 2128819 2797462 3002491 2717907 3043512
6660 3043512 3147629 2998710 2755890 2719519 2703099 2577424 2430426 2511068 2424005 2547450
6650 2547450 2586714 2400492 2763120 2744709 3217767 3561465 3478961 3132699 2784665 2434027
6640 2434027 2291347 2246069 2294836 2132041 1931448 1873494 1886161 2195106 2100998 2226687
6630B226687J25514q8036J63776m24041j18375L06898k14223J02676J2549K9864
6620B123289J30801k75674L86013J84051M3448J3520p8674k16906l36190K8750
6610B002428M57419l63267l3926l5239K13073j67604Q4224j49206J52775K15491
6600B376168K10394q6425o3138L02497l9014N3721j23031k784K91228L65652k42082
6589C043186K59960j68573M48435K8809M5013l67607K31613j76153m8838J67401
6579C463246Q8691M46754L4914o54818j94908n1603k39503k4293J44131J38073
6569C150684q247R4893m23204N1137J577q7866M4325L6754L8372o7132J5377K0961
6557B867631K07760P4420j73445J2387J31673J2420m1771K12126K5647J46385
$$ plain form
6630 2226687 2352201 2264165 2427941 2003900 1885525 2192423 1978200 2080876 2093425 2123289
6620 2123289 2254090 1978416 2364429 2548480 2591928 2605448 2526774 2309868 1973678 2002428
6610 2002428 2459847 2096580 2062654 2027415 2240488 2072884 2157108 2007902 2160677 2376168
6600 2376168 2586562 2500137 2436999 2739496 2700482 2754203 2631172 2628388 2919616 3285268 3043186
6589 3043186 3303146 3134573 3583008 3611817 3656830 3289223 3520836 3344683 3295845 3463246
6579 3463246 3551937 3998691 4033605 3378787 3183879 3132276 2892773 2868480 3012611 3150684
6569 3150684 3142437 3237330 2814126 2865263 2866840 2778974 2823299 2860053 2898425 2831293 2846670 2867631
6557 2867631 3075391 3149811 2976366 2988753 3120426 3132846 3091075 3303201 3328848 3475233
6547C475233K0646p8079P5200K93860K3329L42627K64689J43235Q5124L04842
6537D950706L50800K7453O40909N08462O14491J057434J182818J581183Q30569
6528A1744825j046117j087656q18437J69758L68649Q67003J221618N75456p16515
6519A1278584j628017j342428n64760q31925q59346j59539o611N3104n07949j70444
6509E260669P4958J62598L2008Q9200m1048p1051O6024J83161J70242J67528J69585
6498F263874L95015L55486N42194P47767N91850L36345p2757j49961o56162o17496
6488G736155m04202r1570N74902M18318O79946N79575K59503m56807p47793q79897
6478G668130o14634n36088k30611K19628M43831L39566K47593J89177M28771o5027
$$ plain form
6547 3475233 3495879 3417800 3493000 3786860 3810189 4152816 4417505 4560740 4645864 4950706
6537 4950706 5301506 5328959 5969868 6478330 7092821 8150255 9333073 10914256 11744825
6528 11744825 10698708 9611052 8792615 8962373 9331022 10198025 11419643 11995099 11278584
6519 11278584 9650567 8308139 7743379 6911454 6052108 5892569 5885958 5939062 5431113 5260669
6509 5260669 5335627 5498225 5530233 5619433 5578385 5507334 5573358 5756519 5926761 6094289 6263874
6498 6263874 6658889 7014375 7556569 8304336 8896186 9232531 9159774 9009813 8353651 7736155
6488 7736155 7331953 7240383 7815285 8233603 8913549 9493124 9752627 9295820 8548027 7668130
6478 7668130 7053496 6517408 6286797 6506425 6950256 7289822 7537415 7726592 8155363 8090336
6468H090336o60641n36334n33289j28901L37499L52051N40877Q16212M09111m92433
6458H194488n42385o99916o96040p26037j01806m31650l90468J91136L53025M020
6448E154367M1819J77288j92283k12833K51377J65175q9547K60795J28448j28951
6438E555655J62090J8753j03756n2006J15301K39140j5355J46278L8014J14894
6428F219008J04313K60598j96316J03512K45578K33472M16081J66836K9225J61728
6418G744035M63831K77401M53314N34800j23197L91097L36128O06856o5427M06614
6408A1025452N45187J32364N47566L08299O04711M53702p5038M12200K11475M63736
6398A4629654K76153K17333O12680K83299O40247M94109L47661N78433N07198
$$ plain form
6468 8090336 7429695 6893361 6360072 6231171 6568670 6920721 7461598 8277810 8686921 8194488
6458 8194488 7652103 6952187 6256147 5530110 5428304 4996654 4606186 4797322 5150347 5154367
6448 5154367 5196186 5373474 5181191 4968358 5219735 5384910 5295363 5556158 5684606 5555655
6438 5555655 5717745 5736498 5632742 5580736 5696037 5935177 5919822 6066100 6104114 6219008
6428 6219008 6323321 6583919 6387603 6491115 6736693 6970165 7386246 7553082 7582307 7744035
6418 7744035 8207866 8485267 8938581 9473381 9350184 9741281 10077409 10684265 10618838 11025452
6408 11025452 11570639 11703003 12250569 12558868 13163579 13617281 13542243 13954443 14165918 14629654
6398 14629654 14905807 15123140 15735820 16019119 16659366 17153475 17501136 18079569 18586767
6389A8586767N44737O06890P41917P31917Q70010P26660J013081Q73992N88050
6380B5284021Q58854J096721J095636J016653J688524J288020J492159J404832
6372C5225420J124870J706699J481362J098604J739210J661674J817147K211627
6364D8066613K452740K984010K773529L101979L494062L600690M059121N414240
6356G5946984O315707Q275813J0392078J2632732J5848632K0394210K8257508
6349A78063664L9861797N1839649N7911798M0777621q355892m6142107m3244077
6342B70712453j9800852M291130K4590582L8574026L7947218L082825m8997213
6335C10400169o8561719n5676044l6760389k4534736j6773355j3487395j1181761
$$ plain form
6389 18586767 19131504 19738394 20480311 21212228 22082238 22808898 23821979 24695971 25284021
6380 25284021 26142875 27239596 28335232 29351885 31040409 32328429 33820588 35225420
6372 35225420 36350290 38056989 39538351 40636955 42376165 44037839 45854986 48066613
6364 48066613 50519353 53503363 56276892 59378871 62872933 66473623 70532744 75946984
6356 75946984 82262691 90538504 100930582 113563314 129411946 149806156 178063664
6349 178063664 217925461 269765110 327676908 368454529 360098637 313956530 270712453
6342 270712453 250911601 255202731 279793313 318367339 356314557 359397382 310400169
6335 310400169 241838450 186162406 149402017 124867281 108093926 94606531 83424770
6328H3424770r335005p496308n958723m767650m471060l728322l614964l316670
6320D0736068k736941k345029k000325j599035j656313j857499j604089j604649
6312B5332188j421669j256782q36468j001446m35976o39674p74557r38925p72457
6303A7254234p18537m38054p08510o84651n86748J2534m08279m91026m69935k60389
6293A2500639n66199l94384m26676k64616l54317m85083n67164N9237J07180l43331
6283I265286k22385j40459k11240l40504j77821l20682l11694M77283j70056l74118
6273G473610K4425N9737k68612l44818m0581o9204p45454N499j9028l36110q3400
6262E656064L08157k68660j80268o8758l0223J84013k75317J03054p2427N3918
$$ plain form
6328 83424770 74089765 66593457 60634734 55867084 51396024 47667702 44052738 40736068
6320 40736068 37999127 35654098 33653773 32054738 30398425 28540926 26936837 25332188
6312 25332188 23910519 22653737 21817269 20815823 20379847 19740173 18965616 18026691 17254234
6303 17254234 16535697 16097643 15389133 14704482 14117734 14130268 13721989 13230963 12761028 12500639
6293 12500639 11934440 11540056 11113380 10848764 10494447 10009364 9442200 9501437 9608617 9265286
6283 9265286 9042901 8902442 8691202 8350698 8172877 7852195 7540501 8017784 7847728 7473610
6273 7473610 7498035 7557772 7289160 6944342 6903761 6834557 6089103 6094602 6075574 5739464 5656064
6262 5656064 5964221 5695561 5515293 5446535 5416312 5600325 5325008 5428062 5355635 5409553
6252E409553k19370l50641N4136k48386j33643o5955j50955J99664K23473o0127
6242D657749k19315J05144l13486Q6091l63982J55443p2455J69986m7799j26622
6232D030754m62375J19074P6853l15961J70883m6078Q4499j67763j93157K89498
6222C586227j105N9863q9018K98808K04781k64255M5361j65978j37675k22116
6212C314893j28970K31079k26026j21875K33633k26130J94273J08817K85206K6255
6202C691155L35445j04340j42561J86071l14159L19074o1778k3749Q8975K2256
6192C996389M9920K52618k08773j38144k19807k11709J99327k6307J44848r0691
6182C747671Q7783l01923q7683j4160j13379k42771J64527o0623j8243k27685
$$ plain form
6252 5409553 5190183 4839542 4893678 4645292 4511649 4445694 4294739 4494403 4717876 4657749
6242 4657749 4438434 4543578 4230092 4316183 3952201 4107644 4035189 4205175 4157376 4030754
6232 4030754 3568379 3687453 3764306 3448345 3619228 3573150 3657649 3489886 3296729 3586227
6222 3586227 3585122 3644985 3555967 3854775 4059556 3795301 3840662 3674684 3537009 3314893
6212 3314893 3185923 3417002 3190976 3069101 3302734 3076604 3270877 3379694 3664900 3691155
6202 3691155 4026600 3922260 3779699 3965770 3651611 3970685 3908907 3885158 3974133 3996389
6192 3996389 4046309 4298927 4090154 3952010 3732203 3520494 3719821 3693514 3838362 3747671
6182 3747671 3835454 3533531 3445848 3431688 3318309 3075538 3240065 3179442 3161199 2933514
6172B933514j73318J26754l64072J00881j72378M0367j37725O6417J67778k32876
6162B355342j53197K48634q4558j03246q393M09906M35839m70543N324K45231
6152B880339r9032j42159k9768R8705L34292p4929k1748J45736K03221J73970
6142C468627L2478M91314P253J33945K12794k28627j31020n9310R9456J46945
6132D173855K89791j49630J58664j54988k47094k65647J17922K88880j16838N20538
6122D615453K73502r8824J20505m2814l33839o5472j14993j79299R1234Q6729
6112D352182K70937K2094j89332R1405l82568j42570J37117K41424M85350k67064
6102D618975j42110J50589j77404j92229k11060L337J9586L82296n4882m43468
$$ plain form
6172 2933514 2760196 2886950 2522878 2623759 2451381 2491748 2354023 2420440 2588218 2355342
6162 2355342 2202145 2450779 2366221 2262975 2254582 2664488 3100327 2629784 2635108 2880339
6152 2880339 2781307 2639148 2609380 2708085 3042377 2967448 2945700 3091436 3294657 3468627
6142 3468627 3501105 3992419 3999672 4133617 4346411 4117784 3986764 3927454 4026910 4173855
6132 4173855 4463646 4314016 4472680 4317692 4070598 3804951 3922873 4211753 4094915 4615453
6122 4615453 4888955 4790131 4910636 4867822 4533983 4468511 4353518 4174219 4265453 4352182
6112 4352182 4623119 4645213 4455881 4547286 4164718 4022148 4159265 4400689 4886039 4618975
6102 4618975 4476865 4627454 4450050 4257821 4046761 4050098 4069684 4451980 4397098 3953630
6092C953630n20780j00590K2135K96734m45140l35926q6858j77653L68452k9307
6082B944697j48447p0331J15400M3712L12321r5768j16251J74567M9565l7533
6072C171932J6244K22927J39315P1669J57759k04831K1845M86743j63282k7833
6062C892488J23419J22013L01562L78824j00235j69423l0342l40845n8961O9906
6052D188406q6804K21314L58306L55690L21687l75182l78213n21989k03095n17186
6042C362934R2653q1826l62184M92221j6120l22949J3108m93203l25595P1050
6032B430089K37853m0620o11636J1689j12157k83011L44025J00598k13827j68421
6022A694582j8852o6322O1j32206J39591K74830k45235j89562K06962J34852J61817
$$ plain form
6092 3953630 3432850 3332260 3354395 3651129 3205989 2870063 2783205 2605552 2974004 2944697
6082 2944697 2796250 2725919 2841319 2885031 3197352 3101584 2985333 3159900 3209465 3171932
6072 3171932 3188176 3411103 3550418 3622087 3779846 3575015 3596860 4083603 3920321 3892488
6062 3892488 4015907 4137920 4439482 4818306 4718071 4548648 4518306 4177461 4118500 4188406
6052 4188406 4101602 4322916 4681222 5036912 5358599 4983417 4605204 4083215 3880120 3362934
6042 3362934 3455587 3373761 3011577 3503798 3487678 3164729 3177837 2684634 2359039 2430089
6032 2430089 2667942 2627322 2015686 2027375 1915218 1632207 1976232 2076830 1863003 1694582
6022 1694582 1675730 1609408 1609469 1477263 1616854 1891684 1646449 1456887 1663849 1798701 1960518
6011A960518j88293k19050j64195J66283K61133k01377R4938K528K1915k0973
6001A713427k81945O9564J57463J5522L16086r2888j10717Q2007k25958l4010
5991A608551J45059r9643m8185M56026K27952k50789k18034J66387r9808Q9481
5981A976997R1715k90711J33864K82138j17162j87575O14586j39746j63316k4064
5971B176726j39603O7537r8917p5647J66599r8547j00761J43201o32047L60046
5961A768587N57091j10975Q6610k41855k50998K51381j38025L3134J21057O1803
5951B137810j43760K58306M48866k85635K43174j3494K28141K3042L25277J04046
5941C325773o1504n4460j78243J94051J53873L64804L04291R2421k23883k41734
$$ plain form
6011 1960518 1772225 1553175 1388980 1555263 1816396 1615019 1709957 1712485 1734400 1713427
6001 1713427 1431482 1501046 1658509 1674031 1990117 1897229 1786512 1868519 1642561 1608551
5991 1608551 1753610 1653967 1605782 2061808 2289760 2038971 1820937 1987324 1887516 1976997
5981 1976997 2068712 1778001 1911865 2194003 2076841 1889266 2503852 2364106 2200790 2176726
5971 2176726 2037123 2104660 2005743 1930096 2096695 1998148 1897387 2040588 1408541 1768587
5961 1768587 2325678 2214703 2301313 2059458 1808460 2059841 1921816 1954950 2076007 2137810
5951 2137810 1994050 2252356 2701222 2415587 2658761 2645267 2873408 2896450 3221727 3325773
5941 3325773 3264269 3209809 3031566 3225617 3379490 3744294 4048585 4141006 3917123 3675389
5931C675389J22695o6598k10670k56555J82607R6118L25642K09654L57279N8873
5921D494434p6665k49028m43968o1251O71497K42409K45011J36801o6462j67759
5911D725019l33131r128J01020J74603j77581j15168Q1332l18714l86231j4805
5901C727216K2539N6955k06630l66071j89179l51328j33333N32908l63327k63636
5891B466114j46149O9538l10186m39903l7234K38353N1279J17538k06048k43925
5881A559377L69017k09104j52601o9477L97303j03063k75653P3992J9255R6935
5871A705981P2718l97333l1431L44006k40278j72618Q8786M11797P6277j98791
5861A659114L3985n5217l14110N45770l83088j8335K07113m64526L36364l0266
$$ plain form
5931 3675389 3798084 3731486 3520816 3264261 3446868 3542986 3868628 4078282 4435561 4494434
5921 4494434 4417769 4168741 3724773 3663522 4335019 4577428 4822439 4959240 4892778 4725019
5911 4725019 4391888 4382760 4483780 4658383 4480802 4365634 4446966 4128252 3742021 3727216
5901 3727216 3749755 3806710 3600080 3234009 3044830 2693502 2560169 3093077 2729750 2466114
5891 2466114 2319965 2389503 2079317 1639414 1602180 1840533 1891812 2009350 1803302 1559377
5881 1559377 1928394 1719290 1566689 1497212 1894515 1791452 1515799 1589791 1609046 1705981
5871 1705981 1778699 1381366 1349935 1693941 1453663 1281045 1369831 1781628 1857905 1659114
5861 1659114 1693099 1637882 1323772 1869542 1486454 1468119 1675232 1210706 1547070 1516804
5851A516804J60181o8895L5767M02604O6435l3895k51088j71777J1084K5319j62302
5840A530237J05273l3600L04582k83585J5619K01227k44686k11185J58103L6822
5830A578807M0643L1516k70093J12654L37906l54786O4474r8096j02667K49637
5820A589995j8233K2589j516n7812M3060k15310J39184K00094K2416L0621j19685
5809A635403k10846k0861J22252J05651j6493L5377q8434O8520k23910k4026j23947
5798A258686J47774J22745J59936J30894j93844J41903j22263J04858l3493O8150
5788A785346m99549M01186j77087M55555L7381K48100J20774p2966J92119l46039
5778B144820j37021k27279l03458K01128J79900J08340L46436p8544K91577k48763
$$ plain form
5851 1516804 1676985 1608090 1643857 2046461 2112896 2079001 1827913 1656136 1667220 1692539 1530237
5840 1530237 1635510 1601910 1906492 1622907 1638526 1839753 1595067 1383882 1541985 1578807
5830 1578807 1619450 1650966 1380873 1493527 1831433 1476647 1541121 1443025 1340358 1589995
5820 1589995 1571762 1594351 1592835 1535023 1578083 1362773 1501957 1702051 1724467 1755088 1635403
5809 1635403 1424557 1403696 1525948 1631599 1615106 1650483 1562049 1630569 1406659 1382633 1258686
5798 1258686 1406460 1529205 1689141 1820035 1626191 1768094 1645831 1750689 1717196 1785346
5788 1785346 1285797 1686983 1509896 1965451 2002832 2250932 2371706 2298740 2490859 2144820
5778 2144820 2007799 1780520 1477062 1678190 1858090 1966430 2312866 2234322 2525899 2277136
5768B277136m95052K16543L14209l22850J56410j57087k2091N72066j73564K04047
5758B569767l40511R1972k21014j12233j47221K26208K33170O2522k31620j30792
5748B000248P4812j7704J40308j364j41928K41187q7323j14933P5242O5510L65839
5737B599894k92715Q6973j74869K62051j55266K59438j91699k53249J61713k35314
5727B066957m2425M82966l83207j21932J19130r0835K40362l2739J09583j84962
5717B162898J98965j69676L69006n1998j35304J47062m28828k1847J15888L72637
5707B558803j65854k76184N8206j77718K08344J86979J01101J67685j69464k01074
5697B290824m05353K70205K40423J17878q5102k66251Q7880M10764q7712j82742
$$ plain form
5768 2277136 1782084 1998627 2312836 1989986 2146396 1989309 1967218 2539284 2365720 2569767
5758 2569767 2229256 2321228 2100214 1987981 1840760 2066968 2300138 2362660 2131040 2000248
5748 2000248 2075060 2057356 2197664 2196300 2054372 2295559 2208236 2093303 2168545 2234055 2599894
5737 2599894 2307179 2394152 2219283 2481334 2326068 2585506 2393807 2140558 2302271 2066957
5727 2066957 2024532 2507498 2124291 2002359 2121489 2030654 2271016 2238277 2347860 2162898
5717 2162898 2361863 2192187 2561193 2509195 2373891 2520953 2092125 2070278 2186166 2558803
5707 2558803 2392949 2116765 2174971 1997253 2205597 2392576 2493677 2661362 2491898 2290824
5697 2290824 1885471 2155676 2396099 2513977 2428875 2162624 2250504 2661268 2573556 2390814
5687B390814J80686J21970k65135k37886N55673j98153L88583j90075j24487O5934
5677B687924K276M3018J79620n0636j60095n4743q842J70898K25539p7717J32228
5666C089470j43679j105P2061J97983O8035J90224N14166j19671M54538N54362
5656D876384j62466k25114R0289k01526J37580o5624L17727J13617J36568m05115
5646D612320l34682j86314m05492l52241k29505k04262j24037K02694p233q3506
5636B887742J47056j12285j90907K54124Q4311j77857O5540j6220k1656R4459
5626C014307j0420J0664P4143O1949J26742O9254K00694K18354N43685J70376
5616D479748k4534l02331j10471q7270P3590K45226J66384M0542K3691l62436
$$ plain form
5687 2390814 2571500 2693470 2428335 2190449 2746122 2547969 2936552 2746477 2621990 2687924
5677 2687924 2690200 2733218 2912838 2862202 2702107 2647364 2638522 2809420 3034959 2957242 3089470
5666 3089470 2945791 2944686 3016747 3214730 3282765 3472989 3987155 3867484 4322022 4876384
5656 4876384 4713918 4488804 4579093 4377567 4515147 4449523 4767250 4880867 5017435 4612320
5646 4612320 4277638 4091324 3685832 3333591 3104086 2899824 2775787 2978481 2971248 2887742
5636 2887742 3034798 2922513 2731606 2985730 3070041 2892184 2957724 2941504 2919848 3014307
5626 3014307 3003887 3014551 3088694 3150643 3277385 3346639 3547333 3765687 4309372 4479748
5616 4479748 4455214 4152883 4042412 3955142 4028732 4273958 4440342 4480884 4504575 4142139
5606D142139K68431l69516j57272K87893M66531M8132j81632L64272q2152N74595
5596E361421O78106K65182K90989J62821M73390L34134l8202q4606P137n1045
5586G399327k9243J1633K0539j24049m65825p69707p35375m59838L1910k57472
5576D621900j65222n9865r6173L77990k51599N55388j14031J78665P9739Q5716
5566E212508M68185K73107l732l28174k16709n63081n40924K74398J02871O7037
5556D745486j73666l62218k56411R4216l23172j99837n6350l6791l5807R9851
5546C495301k48146l4821j19989N2355k2654P8392l7475k62473P8625k33965J5011
5535B760161k5114q1021l38704R7897j57180L71659l4448j31604j13184P710J44100
$$ plain form
5606 4142139 4410570 4041054 3883782 4171675 4638206 4686338 4504706 4868978 4786826 5361421
5596 5361421 6039527 6304709 6595698 6758519 7231909 7566043 7527841 7443235 7450372 7399327
5586 7399327 7370084 7381717 7402256 7278207 6812382 6042675 5307300 4847462 4879372 4621900
5576 4621900 4456678 4396813 4300640 4678630 4427031 4982419 4868388 5047053 5126792 5212508
5566 5212508 5680693 5953800 5950068 5621894 5405185 4842104 4301180 4575578 4678449 4745486
5556 4745486 4571820 4209602 3953191 4047407 3724235 3524398 3468048 3431257 3395450 3495301
5546 3495301 3247155 3212334 3092345 3144700 3122046 3200438 3162963 2900490 2979115 2745150 2760161
5535 2760161 2735047 2654026 2315322 2413219 2256039 2627698 2593250 2461646 2348462 2356172 2500272
5524B500272o7076j52711J47793J59370j77053M27685L2852j18165J09674K14165
5514C076806O4647k25370l56337J89034L22979k46664k37311n0284k66562J62956
5504B433894q2271J34793K8842J06356J83715k00854J46064J50571k31139m48497
5494B221474J71908o0864J1764J5407J18453J62671k24211n14683J56003K93557
5484B351479j45447P7648j14370l8382J33813N5792j96423j97437J40542K98951
5474B366166j99988J66571l6728L23833l1088j59070l33215K1551M49445k73952
5464B293525l02307M38924L44157K3204j55650k94271K2369K23207l7833q3731
5454B471594k75743O3814J71478M2772J09002m37554R8782J43683r3967l9053
$$ plain form
5524 2500272 2433196 2280485 2428278 2587648 2410595 2838280 2871132 2752967 2862641 3076806
5514 3076806 3141453 2916083 2559746 2748780 3071759 2825095 2587784 2537500 2270938 2433894
5504 2433894 2351623 2486416 2515258 2621614 2805329 2604475 2750539 2901110 2669971 2221474
5494 2221474 2393382 2332518 2344282 2359689 2478142 2640813 2416602 1901919 2057922 2351479
5484 2351479 2206032 2283680 2169310 2130928 2264741 2320533 2124110 1926673 2067215 2366166
5474 2366166 2166178 2332749 2296021 2619854 2588766 2429696 2096481 2118032 2567477 2293525
5464 2293525 1991218 2430142 2774299 2797503 2641853 2347582 2369951 2593158 2555325 2471594
5454 2471594 2195851 2259665 2431143 2473915 2582917 2145363 2244145 2387828 2293861 2254808
5444B254808Q0144P3441p3293r1719K55115N1082n7200k07897L00811R0748k1393
5433B654647j61194j51232J07522j97616O7120j62R7510K40531j1184K26977n8052
5422B814867M2676j24140L02262j25140Q0645l3070j30919j27393Q8863k60329
5412B528322K07029M46421j79842J00800j92835J80516L19573r1889M0944J62421
5402C521460L17r717K02375k4646k1931M68542K16340J97988K61489K88439O56083
5391E756739M12432K11674j66550m70005m55137l05349j77056l97084k10416q6480
5381D112768o0379q6732L22144k56828K1804J91786k36370L33978M45390o5123
5371D722438M65039L99530L77999M68002N30732P25937K49678j12306p07294n07139
$$ plain form
5444 2254808 2334952 2408393 2335100 2243381 2498496 2549578 2492378 2284481 2585292 2676040 2654647
5433 2654647 2493453 2342221 2449743 2252127 2319247 2319085 2416595 2657126 2645942 2872919 2814867
5422 2814867 2857543 2733403 3035665 2910525 2991170 2958100 2827181 2699788 2788651 2528322
5412 2528322 2735351 3181772 3001930 3102730 2909895 3090411 3409984 3318095 3359039 3521460
5402 3521460 3521777 3512060 3714435 3689789 3667858 4136400 4352740 4550728 4812217 5100656 5756739
5391 5756739 6169171 6380845 6214295 5744290 5289153 4983804 4806748 4409664 4199248 4112768
5381 4112768 4052389 3965657 4287801 4030973 4052777 4244563 4008193 4342171 4787561 4722438
5371 4722438 5187477 5587007 5965006 6433008 6963740 7689677 7939355 7827049 7119755 6612616
5361F612616m17756p26441l37915n36477J06490j9903k97023L5230O6601k04339
5351D281083k0154J60901j24311J29098L340J47980K07180L35024P1315M52806
5341E644262j2333L47975J1123k27298m33495n28367n34676m22343m3459P561
5331C808950M06470l33543m23568M8328o9131j37868J95889L3810O0589n280O4042
5320C648688j05004p6848k0578J28665K65441k21357k72056r7119M26384J74905
5310C851121j44812K84632k97073o6823J57956R5685K44243m75533Q4442K65589
5300C999427o2865J24024K857R7281k3307J29624p7366j31784K46035L42064N0893
5289D696883K74980l54147r1561N77446M46652J63776K66616M43488K18839j06168
$$ plain form
5361 6612616 6194860 5468419 5130504 4594027 4700517 4680614 4383591 4418821 4485422 4281083
5351 4281083 4260929 4421830 4297519 4426617 4429957 4577937 4785117 5120141 5191456 5644262
5341 5644262 5631929 5979904 5991027 5763729 5330234 4801867 4267191 3844848 3801389 3808950
5331 3808950 4215420 3881877 3458309 3506637 3437506 3299638 3495527 3529337 3589926 3584646 3648688
5320 3648688 3543684 3466836 3446258 3574923 3840364 3619007 3346951 3249832 3676216 3851121
5310 3851121 3706309 3990941 3693868 3627045 3785001 3880686 4124929 3649396 3733838 3999427
5300 3999427 3936562 4060586 4063443 4160724 4137417 4267041 4189675 4057891 4303926 4645990 4696883
5289 4696883 4971863 4617716 4526155 5103601 5550253 5714029 5980645 6424133 6642972 6536804
5279F536804P468m46229j80407j64116r6060J29120j04207j11551Q4603o8549
5269E586876J81878n6318Q2157K8946N3274M84390r9180L46573N23439J79586
5259G311621M48307Q48041N10185O23858P00747p400k32552l12838q50526q71721
5249H167722l28734l63787p6184m13612l39861M3961r7548K71114k07003J38678
5239F794746M31925K59467l18989R2436O32917J85491L65594K37557N12155N44208
5229I737507O8680J50948Q5037l21005m29067n54715l07544k66823j67760K29785
5219H225043k21143j20358J05079l42037J4134L26660j6868M6455P0839K22971
5209H310775k74855r0242J02818M37387m8436J12855j29845J60510r1889P4053
$$ plain form
5279 6536804 6544272 6098043 5917636 5753520 5657460 5786580 5682373 5570822 5655425 5586876
5269 5586876 5768754 5712436 5794593 5823539 5876813 6361203 6262023 6608596 7132035 7311621
5259 7311621 7759928 8607969 9118154 9742012 10442759 10435359 10202807 9889969 9039443 8167722
5249 8167722 7838988 7475201 7399017 6985405 6645544 6689505 6591957 6863071 6656068 6794746
5239 6794746 7226671 7486138 7167149 7259585 7892502 8077993 8443587 8681144 9193299 9737507
5229 9737507 9806187 9957135 10042172 9721167 9292100 8737385 8429841 8163018 7995258 8225043
5219 8225043 8003900 7883542 7988621 7646584 7660718 7987378 7970510 8016965 8087804 8310775
5209 8310775 8035920 7945678 8048496 8485883 8437447 8550302 8420457 8580967 8489078 8563131
5199H563131N8175k1248M23696J68858k1527O4235l99387J6290n7913J88271K55327
5188I237908q4592K82583K07778N1903M84877r5162m2903L72759l09438K63947
5178A0369660J05615Q8963j78369J89938m50688J92049J06155N3586k74836J08277
5168A0310350L16279m3469o7721M68047L11483j98615M13183P8948K24786K47673
5158A2060944J79170M75710L49230J83231J463J04308m7466j08875j09325K7112
5148A3115502K16324K30034J5533O1947J76199M07779M60761K49739N10960n0464
5138A5394314M93111L00444K96663M30367K39973O87531R05963O14179M10009
5129A9772554N02607M16860L92206m3139J77035K57657J93691M60850J49223L37642
$$ plain form
5199 8563131 8621306 8600058 9023754 9192612 9171085 9235320 8835933 8852223 8794310 8982581 9237908
5188 9237908 9153316 9435899 9643677 9695580 10180457 10085295 10042392 10415151 10105713 10369660
5178 10369660 10475275 10564238 10385869 10575807 10125119 10317168 10423323 10476909 10202073 10310350
5168 10310350 10626629 10583160 10515439 10983486 11294969 11096354 11509537 11588485 11813271 12060944
5158 12060944 12240114 12715824 13065054 13248285 13249748 13354056 13306590 13197715 13088390 13115502
5148 13115502 13331826 13561860 13577393 13639340 13815539 14223318 14684079 14933818 15444778 15394314
5138 15394314 15887425 16187869 16484532 16914899 17154872 17842403 18748366 19362545 19772554
5129 19772554 20275161 20692021 21084227 21041088 21218123 21475780 21669471 22130321 22279544 22617186
5119B2617186j75923K93322K54815L36848O75576P00692K62820Q6179J47848j2333
5109B5187030L82765k11360M03624N67871m74928l29832J66620k46177k77458
5100B5168155r9615k01294r4078L90762O88266P94602P05533R23958J161206Q32571
5090C0270066O92699J833922J854959K098489K659514J987890J171973m1792n57217
5081D1970503q16844k14568N03576R67276J772712R60337M11603p44907j747391
5072D3062297j559164j127843k56595j13448M0003L279k84468p8604j15377N6242
5062C9626322n259N0374l27087j52828o2807l53738n80469l38087K14390r8901
5052C7971910K7157K1545O58854R31372O95765O94853Q84013J137617Q59422Q90738
$$ plain form
5119 22617186 22441263 22734585 22989400 23326248 24001824 24702516 24965336 25051515 25199363 25187030
5109 25187030 25569795 25358435 25762059 26329930 25855002 25525170 25691790 25445613 25168155
5100 25168155 25068540 24867246 24773168 25163930 25852196 26646798 27352331 28276289 29437495 30270066
5090 30270066 30962765 32796687 34651646 36750135 39409649 41397539 42569512 42527720 41970503
5081 41970503 41153659 40939091 41442667 42409943 44182655 45142992 45554595 44809688 43062297
5072 43062297 41503133 40375290 40118695 40005247 40045250 40048529 39764061 39685457 39570080 39626322
5062 39626322 39621063 39671437 39344350 39191522 39128715 38774977 38194508 37856421 38070811 37971910
5052 37971910 37999067 38020612 38679466 39610838 40306603 41001456 41885469 43023086 43882508 44773246
5042D4773246J220455J205831R75543J365858J686918J335100J711299J603672
5034E5877922K146085K749080K930149L753378M530175M713302M648818L540369
5026H4889278L015773L486172M534026N987730P932802Q698770R004016R473427
5018A37021994Q081417N777833M034825K495741O57948L20699k91510j259582
5010A56839365j757567k135367j290866J66474K042198M793691O576078Q519902
5002A73753908J0235640J0937931J1900313J2236303J2571888J2446942R159289
4995B53242214K910672l521160p587529q393421p855782q228918j0350168j1573477
4987A98642431j1079162q124386m394893j425261J414327K450253K604901K965419
$$ plain form
5042 44773246 45993701 47199532 48175075 49540933 51227851 52562951 54274250 55877922
5034 55877922 58024007 60773087 63703236 67456614 71986789 76700091 81348909 84889278
5026 84889278 87905051 91391223 95925249 101912979 109845781 118544551 127548567 137021994
5018 137021994 145103411 150881244 154916069 157411810 158069758 158390457 158098947 156839365
5010 156839365 155081798 152946431 151655565 151822039 153864237 158657928 165234006 173753908
5002 173753908 183989548 194927479 206827792 219064095 231635983 244082925 253242214
4995 253242214 256152886 252631726 245044197 236650776 228794994 220566076 210215908 198642431
4987 198642431 187563269 179438883 175043990 173618729 175033056 177483309 180088210 183053629
4979A83053629L567903M342262N715466N954757M602891K259898L78352m95916
4971B09379242r5464P94227N99893L06950N62245O70339R78105Q0099l05635m69008
4961B12500993P7249Q9096k316780m666336n704304n258933m385571j960696j195393
4952A87179325k82447N50111J683492L400223O560253R984435J2417641J2992705
4944B34485738J1463107R171221Q005272Q403270Q205921N591412j935947r918870
4936B73471124j3433895j3166426j1380482j0328237j0075876r356420q385562
4929A97344226o836316n211782l313202j495185J121274K083000J160393K93457
4921A85145865m20199k338923m713784q039779j1345646j2387479j1726385j0539087
$$ plain form
4979 183053629 186621532 190963794 196679260 202634017 207236908 209496806 209875158 209379242
4971 209379242 209283778 210078005 210677898 210984848 211547093 212217432 213195537 213275636 212970001 212500993
4961 212500993 212578242 212667338 210350558 205684222 199979918 194720985 190335414 188374718 187179325
4952 187179325 186896878 187446989 189130481 192530704 199090957 209075392 221493033 234485738
4944 234485738 245948845 255120066 263125338 271528608 279734529 285325941 283389994 273471124
4936 273471124 260037229 246870803 235490321 225162084 215086208 205729788 197344226
4929 197344226 190507910 185296128 181982926 180487741 181609015 183692015 184852408 185145865
4921 185145865 184725666 182386743 177672959 169633180 158287534 145900055 134173670 123634583
4913A23634583r592211r699335q982468q435526p036479n780072n239640m450463
4905F4418389m121372l317118k971108k345937j729773k049743j575827j205343
4897D5102168j200663p01716n58449o277L9084J19780K94811N81400J204269J166171
4887D6040578M62836L98188o37370j284163j242139j335594j173332n45561j85233
4878D0498210N645l52270r35091p38685r69096j033564q90067n40746k49550K9212
4868C4823998j26343o2307j89781o61323p44966j140251j145359q58575p77377
4859B9117716q08545n54323k00757k91072n2724p27397j17467l56391l88739o03839
4849B5016462l36564j89338K45026J39826J24545N56829N45123J3909l98901j032407
$$ plain form
4913 123634583 114042372 104343037 95360569 86925043 79888564 74108492 68868852 64418389
4905 64418389 60297017 56979899 54008791 51662854 49933081 47883338 46307511 45102168
4897 45102168 43901505 43199789 42641340 42635063 42674147 42793927 43088738 43670138 44874407 46040578
4887 46040578 46503414 46901602 46264232 44980069 43737930 42402336 41229004 40683443 40498210
4878 40498210 40503855 40151585 39216494 38477809 37508713 36475149 35585082 35044336 34794786 34823998
4868 34823998 34697655 34635348 34445567 33784244 33039278 31899027 30753668 29895093 29117716
4859 29117716 28309171 27754848 27554091 27263019 27210295 26482898 26365431 26009040 25620301 25016462
4849 25016462 24679898 24490560 24735586 24875412 24999957 25556786 26101909 26115818 25716917 24684510
4839B4684510j138770j410039j098285o96426n17094j97360j61523q4771k92196
4830A9088046J66178O52652P58053O44841J067559J105957J184363M40159J79047
4821B5286855n21121j083229j506621j080786j130325j079233q59876l51434p49686
4812A6924544l64466l29469O7524j83764k3553j43734L16361M4151J67608L89013
4802A6864215J15157J03703N62661J54822O03056N50099K1852o9986n63263p18665
4792A7623651k09477N6533j42586l05413p2006q3845M40884J72439N77001N22045
4782A8579226O12776J204149J065626Q54108J251663P84781O12965M16517p47939
4773B4633872p55316j313885p41117q6690L35859M30540K30053j96328n21879
$$ plain form
4839 24684510 23545740 22135701 21037416 20340990 19823896 19626536 19465013 19380242 19088046
4830 19088046 19254224 19906876 20664929 21309770 22377329 23483286 24667649 25107808 25286855
4821 25286855 24765734 23682505 22175884 21095098 19964773 18885540 18025664 17674230 16924544
4812 16924544 16560078 16230609 16298133 16114369 16090816 15947082 16263443 16307594 16475202 16864215
4802 16864215 16979372 17083075 17645736 17800558 18403614 18953713 18975565 18905579 18342316 17623651
4792 17623651 17414174 17470707 17328121 17022708 16950702 16866857 17307741 17480180 18057181 18579226
4782 18579226 19192002 20396151 21461777 22315885 23567548 24352329 24965294 25381811 24633872
4773 24633872 23878556 22564671 21823554 21736864 22072723 22503263 22733316 22536988 22015109
4764B2015109p83510j63797m58625p0869R0317M76069J27660P9904J76161L7617
4754B1526036N78648M44881N08519O33422J037842J065387J089663J464611J006545
4745B9355554J000725P63908N05399Q16698K208860K839233L197909K595833R16134
4736D4200253n54289k195073j290413r47181j161042n80003K38093l30067o22920
4727C6757358n47854n21162k46699K88253R70916R07027J526442J230659J189317
4718D1554257J317208J128681J378437K162429K314285L656231N308774O779734
4710F5600036Q818562Q959492K558746k654231o228827o640871l762695j625340
4702F5024872N44679J718024J772981J567168J897446K661621M327130P851064
$$ plain form
4764 22015109 21231599 21067802 20609177 20538308 20628625 21104694 21232354 21312258 21488419 21526036
4754 21526036 22104684 22549565 23058084 23691506 24729348 25794735 26884398 28349009 29355554
4745 29355554 30356279 31120187 31625586 32442284 34651144 37490377 40688286 43284119 44200253
4736 44200253 43645964 41450891 40160478 39213297 38052255 37472252 37710345 37380278 36757358
4727 36757358 36209504 35688342 35441643 35729896 36700812 37607839 39134281 40364940 41554257
4718 41554257 42871465 44000146 45378583 47541012 49855297 53511528 58820302 65600036
4710 65600036 74418598 83378090 85936836 83282605 77053778 70412907 66650212 65024872
4702 65024872 65569551 67287575 69060556 70627724 72525170 75186791 79513921 87364985
4694H7364985J0557432J1849267M382710m152334j0854658j0876500p903670n075768
4686G5291464k731965j090807Q28088J317705J299502J818281K143772M256184
4678H3132224P186440J0521483J3631384J6314124R699364j926186j0275176o701760
4670A21581897J186714J0435687J7731371K5187152K1290621j796772k4403970
4663A71212700l0780656j7983163q283434K44837M474956P830506R10931j0014004
4655A17612673j7948110j5097067j0022061o908098n169435l158182k348616j788932
4647E5172172j459308r35593m13968m08587p06493j013191j353654j205720r20059
4638D6755599l66462M5918M16865P83840O38065k16858j173943j887102k044596
$$ plain form
4694 87364985 97922417 109771684 114154394 110002060 99147402 88270902 80367232 75291464
4686 75291464 72559499 71468692 72296780 73614485 74913987 76732268 78876040 83132224
4678 83132224 90318664 100840147 114471531 130785655 140485019 138558833 128283657 121581897
4670 121581897 122768611 133204298 150935669 176122821 197413442 195616670 171212700
4663 171212700 140432044 122448881 114165447 114410284 118885240 126715746 127626677 117612673
4655 117612673 99664563 84567496 74545435 67637337 62467902 59309720 56961104 55172172
4647 55172172 53712864 52777271 52363303 51954716 51248223 50235032 48881378 47675658 46755599
4638 46755599 46389137 46435055 46851920 47635760 48273825 48056967 46883024 44995922 42951326
4629D2951326j685938j273484p66949j145512j245025r56933n73733p04086k32366
4620C4367300j27621l03608K7385L83444K05880P1788n5850L1266J87507q3166
4610C4704325L8695l1876O39524R66021J660362K062527J507396M81149q20422
4601D1207701k000965k395580k008248j191675n65978K0762M70227J88285o97452
4592C3027077r88088j164964q00743o49792l96545k00190J9744P5941l04065o99054
4582B7919321j043031j24351l174j52336K3875M98321K85257k00995j025072j96638
4572B5981177j66376K94761M83358R38175N71039J67625m28536j227944j185574
4563B5427705n66294J12816K29581K84484M66352o2786l08361l50537n508j52209
$$ plain form
4629 42951326 41265388 39991904 39224955 38079443 36834418 35877485 35303752 34599666 34367300
4620 34367300 34239679 33936071 33963456 34346900 34552780 34624568 34568718 34599984 34787491 34704325
4610 34704325 34743020 34711144 35350668 36316689 37977051 40039578 41546974 42028123 41207701
4601 41207701 39206736 36811156 34802908 33611233 33045255 33066017 33536244 33724529 33027077
4592 33027077 32038989 30874025 30073282 29423490 29026945 28826755 28846499 28922440 28618375 27919321
4582 27919321 26876290 26751939 26748765 26596429 26620304 27118625 27403882 27202887 26177815 25981177
4572 25981177 25814801 26109562 26592920 27531095 28102134 28269759 27841223 26613279 25427705
4563 25427705 24861411 24974227 25203808 25488292 25954644 25891858 25583497 25232960 25227452 25075243
4553B5075243k52290J11814K00548O5327L93572n8877J83849K36217L31566O08687
4543B6895656M78718L24228L70085J27912N62101L26250K85606O53035M06056
4534C0429647M73351K38295M46627P62043O94469M99370P45186R07851P22314
4525C5919153P97767P82550J103097J353343J885887K101811K328863L276184
4517D9548655K753946R60281J5785o48838N37404J352084L053269M102845N228015
4508F6903446M370090R70949k056969l042181m53985J103039K670644L305157
4500G3770190L818798K465362J076169q25158j969165j740830o78113J53250J360925
4491G7431428K503939L207069L678043K992991K350386K336835K338141K829694
$$ plain form
4553 25075243 24822953 24934767 25135315 25200642 25594214 25535337 25719186 25955403 26286969 26895656
4543 26895656 27374374 27698602 28068687 28196599 28758700 29084950 29370556 30023591 30429647
4534 30429647 30902998 31141293 31587920 32349963 33044432 33543802 34288988 35196839 35919153
4525 35919153 36716920 37499470 38602567 39955910 41841797 43943608 46272471 49548655
4517 49548655 52302601 53262882 53278667 52629829 53167233 54519317 57572586 61675431 66903446
4508 66903446 71273536 72244485 70187516 67145335 66691350 67794389 70465033 73770190
4500 73770190 77588988 80054350 81130519 80305361 78336196 76595366 75917253 76070503 77431428
4491 77431428 79935367 83142436 86820479 89813470 92163856 94500691 96838832 99668526
4483I9668526L121609L462349L772949L350951L046613K533652J702561O51696
4475A21310906N5186N19903J609213L055718N504771P514047Q993441P491220
4467A56054405L919144P88422o76743K24073J249522J130596K53231r1800L96769
4458A63247619J834738K131920J806874l09440j923315j738261n38400K331225
4450A66842960M962929P141522Q396222O951456M282189J909712J766193K353024
4442B04606207L216165L398080R22082j55586m74341j176457k697296l628422
4434B04010432l599308k475685l39772K371252N411922Q153678Q360905Q135185
4426B30028609O561137M959797M019335L283699L274317K633005J63119m800672
$$ plain form
4483 99668526 102790135 106252484 110025433 113376384 116422997 118956649 120659210 121310906
4475 121310906 121366092 121885995 123495208 126550926 132055697 139569744 148563185 156054405
4467 156054405 159973549 160761971 160085228 160309301 161558823 162689419 162942650 162850850 163247619
4458 163247619 165082357 167214277 169021151 168711711 166788396 165050135 164511735 166842960
4450 166842960 171805889 178947411 187343633 194295089 198577278 200486990 202253183 204606207
4442 204606207 207822372 211220452 212142534 211986948 211512607 210336150 207638854 204010432
4434 204010432 200411124 197935439 197595667 199966919 205378841 213532519 221893424 230028609
4426 230028609 236589746 241549543 245568878 248852577 252126894 254759899 254923018 250122346
4418B50122346q386471r025684p479924l889701k70827L606256N203446M973776
4410B34853217L060475J993782J230302K51021j79917k404143m091385m730819
4402B29982533k834188j228327k538223o123321r856964j1961845j0249467o964295
4394A78225903l281000p9135J718936J640290n13351k873911l749222m070640
4386A67017870l161385l723324l934134k938653j200610k33477n28135k810627
4378A48487525o478909r092923r261355p152809m793712k465911n79743L27529
4370A08989692n99883k536686l551392l932839l767480l842628l190087k391759
4362H5176938j964129j798290k289802k300565l144156l960589m031797l148646
$$ plain form
4418 250122346 241735875 232710191 225230267 221340566 221069739 224675995 229879441 234853217
4410 234853217 237913692 239907474 241137776 241388797 241208880 238804737 234713352 229982533
4402 229982533 227148345 225920018 223381795 217258474 207401510 195439665 185190198 178225903
4394 178225903 174944903 174865768 176584704 178224994 177711643 174837732 171088510 167017870
4386 167017870 163856485 160133161 156199027 153260374 152059764 151826287 151298152 148487525
4378 148487525 142008616 132915693 123654338 116501529 111707817 109241906 108662163 108989692
4370 108989692 108389809 105853123 102301731 98368892 94601412 90758784 87568697 85176938
4362 85176938 83212809 81414519 79124717 76824152 73679996 69719407 65687610 62538964
4354F2538964j827138q00290o09021o56443q97969j391827j286112j158107j431192
4345E2480865j947389k127417k476006j759589j087638m91363q27125j047930
4337D0716408o54745p06009j402467j043409m65003n62066l51914j75233j12255
4328C5243307n44590k03930j053126m66086n90591l75223J62492q3450J42760
4319C2231563P18050Q33381J012250J113749O32303L78584n84051p65179o93093
4310C4877557n95053M80724J074299J383880J439929J208307N93869l36345j511378
4301C8615789k237997k044863j461517j122729p58332K07463K0165o1637l099
4292C1153243m29584r98750j410784j178433q29136m78351m07789l71809J42968
$$ plain form
4354 62538964 60711826 59911536 59302515 58646072 57748103 56356276 55070164 53912057 52480865
4345 52480865 50533476 48406059 45930053 44170464 43082826 42591463 41764338 40716408
4337 40716408 40061663 39355654 37953187 36909778 36444775 35882709 35530795 35355562 35243307
4328 35243307 34698717 34494787 33441661 32975575 32384984 32009761 32172253 32088803 32231563
4319 32231563 32949613 33782994 34795244 35908993 36541296 36919880 36335829 35570650 34877557
4310 34877557 34282504 34763228 35837527 37221407 38661336 39869643 40463512 40127167 38615789
4301 38615789 36377792 34332929 32871412 31748683 30990351 31197814 31217979 31156342 31153243
4292 31153243 30723659 29724909 28314125 27135692 26306556 25828205 25420416 25048607 25191575
4283B5191575J08075j60449J36440J75868m39516l14513r47044r73601q60547
4274B1916288l20387l24843k53663L49746J9093J30462o7165M8439r31647j029281
4264A9537042j158955j167316n87364l04926n73764m0366Q0486L53352m5200j73310
4254A5919679o32266p17286o75704l83652M5281o36295l96714O1118m45475q5276
4244A2053410J74060j08294J89598k9848k53050L37526J59021O3857L58926l39668
4234A2605538l46626k78735o1078k60394L20776p753k01099m82652K50234n4789
4224A1483422k369l55991j54366J27166M9346M18803m42796O9748m19150l02147
4214A0471666O1081j60318k3613r1859M9417J3876o80290j53514j68109l6717
$$ plain form
4283 25191575 25299650 25139201 25275641 25451509 25011993 24697480 23750436 22776835 21916288
4274 21916288 21595901 21271058 21017395 21367141 21386234 21516696 21449531 21497970 20566323 19537042
4264 19537042 18378087 17210771 16623407 16318481 15744717 15704351 15784837 16138189 16092989 15919679
4254 15919679 15287413 14570127 13894423 13510771 13556052 12919757 12523043 12584161 12138686 12053410
4244 12053410 12227470 12119176 12308774 12278926 12025876 12363402 12522423 12586280 12945206 12605538
4234 12605538 12258912 11980177 11919099 11658705 11979481 11971728 11770629 11287977 11538211 11483422
4224 11483422 11481053 11125062 10970696 11097862 11147208 11566011 11123215 11192963 10773813 10471666
4214 10471666 10532747 10372429 10348816 10256957 10306374 10320250 9639960 9486446 9318337 9281620
4204I281620m66068K44422q5048m59065O0549J49030l9663J31216p7580q6089
4194H653324J88847K18751K12839j64921M75678j22577Q3183K27035K6610M65487
4184A0264256k5014m52220l20939m0359l55817j14348J8362q0083L47095J39421
4174I380354J8442L07769N97430L57524l4323l61779m42000l60655o335j31428
4164I324999r0249n6508L36827J52409j08310p8480j06369O6582r7525L70356
4154I713732M68973J70991l09694J89481J60369j35426L23898J87276J16237K60019
4144A1145856M02155J3356J41735k06580m97407m82137j73668k91964l06144j92134
4134I553068K00545q869K59355Q0043M51212M35768L12780L50934j71552m61465
$$ plain form
4204 9281620 8815552 9059974 8974926 8515861 8576410 8725440 8685777 8816993 8739413 8653324
4194 8653324 8842171 9060922 9273761 9108840 9584518 9461941 9545124 9772159 9798769 10264256
4184 10264256 10239242 9787022 9466083 9425724 9069907 8955559 8973921 8893838 9240933 9380354
4174 9380354 9398796 9706565 10303995 10661519 10627196 10265417 9823417 9462762 9456427 9324999
4164 9324999 9234750 9178242 9515069 9667478 9559168 9480688 9374319 9440901 9343376 9713732
4154 9713732 10182705 10353696 10044002 10233483 10393852 10258426 10582324 10769600 10885837 11145856
4144 11145856 11548011 11561367 11703102 11496522 10999115 10516978 10343310 10051346 9745202 9553068
4134 9553068 9753613 9744744 10004099 10084142 10535354 10971122 11283902 11634836 11463284 11001819
4124A1001819p77178l16959m05117L20310M0989J27577n5645N3255M05916k71877
4114A0123090K15818j80187m4720J16325k8423J41235L07012j17273j12996m01351
4104A0018530L50380j3165l03200K24629j54895K11290K40693l79720p23365J24782
4094I595959N6811k78425K9639q2954l93582j99663p6472K36663L24577N51193
4084I763746K55590j75M9626o04791l56034k03658l32957J3654j6065j05443j91835
4073H271658R724L41319J25745J08728L66816o3871k22111O8104k01236m72560
4063H332316p2213k7201j71331M07950J54365J5590l3618k20239P2410j96893
4053H261136K38638M0296P5386M48555J57913m12943j16445K3650N8146J11586
$$ plain form
4124 11001819 10224641 9907682 9502565 9822875 9863864 9991441 9935796 9989051 10394967 10123090
4114 10123090 10338908 10158721 10114001 10230326 10201903 10343138 10650150 10532877 10419881 10018530
4104 10018530 10368910 10355745 10052545 10277174 10122279 10333569 10574262 10194542 9471177 9595959
4094 9595959 9652770 9374345 9403984 9321030 8927448 8727785 8651313 8887976 9212553 9763746
4084 9763746 10019336 10019161 10068787 9463996 9107962 8904304 8571347 8585001 8568936 8463493 8271658
4073 8271658 8281382 8622701 8748446 8857174 9223990 9160119 8938008 9006112 8804876 8332316
4063 8332316 8260103 8232902 8061571 8469521 8623886 8639476 8605858 8385619 8458029 8261136
4053 8261136 8499774 8540070 8615456 9064011 9221924 8808981 8692536 8716186 8774332 8885918
4043H885918K5817K19625J52123o5956l5539j39656k41834m23725Q132K6860n0229
4032H361536J54938J82816j7518M86907K98228N5344M09800K81746J71534l31016
4022A0054315L28905J15981q3584K17338J37293K58310M25378L34561o822l27886
4012A1453789j05658q6160r4269K41582J58597j43015R6131L09359K33840M50972
4002A2515168O10471L98312J63892K46124N20918R13858P53723O81002N73717
3993A7377185L827R1190n65908r02312p74755p23351q13578r20668o46725n66903
3983A1558002j66419m86839r4368k25344k75907k12877k55108K97152J71792Q6814
3973A0396898J26541K72735N35780P99915P24470J85914O15826j90894q66933
$$ plain form
4043 8885918 8911735 9131360 9283483 9217527 9181988 9042332 8800498 8376773 8384905 8411765 8361536
4032 8361536 8516474 8699290 8681772 9168679 9466907 9522251 9932051 10213797 10385331 10054315
4022 10054315 10383220 10499201 10415617 10632955 10770248 11028558 11453936 11788497 11781675 11453789
4012 11453789 11348131 11261971 11167702 11409284 11567881 11424866 11520997 11830356 12064196 12515168
4002 12515168 13125639 13523951 13687843 13933967 14454885 15368743 16122466 16803468 17377185
3993 17377185 17381012 17472202 16906294 16003982 15229227 14505876 13692298 12771630 12124905 11558002
3983 11558002 11391583 10904744 10810376 10585032 10309125 10096248 9841140 10138292 10310084 10396898
3973 10396898 10523439 10796174 11331954 12131869 12856339 13042253 13658079 13467185 12600252
3964A2600252q33727q27920o06455k49947l28056m91648l17004r1966j58047K78476
3954H973958K59237j2691J49601J35622J80932K25280N06514M53692J29825L36711
3944A1338681O44690l5267J46810l25831k1252j14722k05367L17786j31208m81565
3934A1132755L2631K41744j7207l00821L0343k07073n50766j41314j0155K93944
3924A0504081N24310M54652L07043o7614j78842k14315p39462p65245n48958l79554
3914H896096j21635j28280M51844P44446O8631J52181N01422n4945j77752l59100
3904I972908l09962j07568l46128Q5290k16262K9726K98318J60150L79208j48709
3894I796971j48112j15177l58453l57430M6007k44509L2931K47733j99351o9494
$$ plain form
3964 12600252 11766525 10938605 10332150 10082203 9754147 9262499 8945495 8853529 8695482 8973958
3954 8973958 9233195 9220504 9370105 9505727 9686659 9911939 10418453 10872145 11001970 11338681
3944 11338681 11983371 11948104 12094914 11769083 11747831 11633109 11427742 11745528 11614320 11132755
3934 11132755 11165386 11407130 11389923 11089102 11119445 10912372 10361606 10220292 10210137 10504081
3924 10504081 11028391 11483043 11790086 11722472 11543630 11329315 10589853 9824608 9275650 8896096
3914 8896096 8774461 8646181 9098025 9842471 9911102 10063283 10564705 10509760 10332008 9972908
3904 9972908 9662946 9555378 9209250 9294540 9078278 9108004 9406322 9566472 9945680 9796971
3894 9796971 9648859 9533682 9175229 8817799 8863806 8619297 8652228 8899961 8700610 8631116
3884H631116n73716n02728r12146m22732j19575l61330k71585k28820k01287k51928
3874D785269M7619R1065J1169q617m2538M03770l03627k21475N49341M83042M00321
3863F195339K61747J11232J44103m08954n73001p38328j02516m16644m57277k64301
3853C751400j79316k06129j97479J64169k00967k44744j25757J80753k31781p3377
3843B636772q2294k40523j98640J5541L7672K9072j62567O4833k00672k6718M7445
3832A919921L7542r2521K82516n9279j31315j38304Q5825j6792L3356j38909L5583
3821A817623K0355o1927k33050K73276J9648q9930K03144p3337K17666j63085
3811A930383j7906J98837o3466l014m26L01909n5533m48075l22117J69751K33083
$$ plain form
3884 8631116 8057400 7554672 6642526 6219794 6100219 5738889 5467304 5238484 5037197 4785269
3874 4785269 4832888 4923953 4935122 4926505 4883967 5287737 4984110 4762635 5311976 5795018 6195339
3863 6195339 6457086 6568318 6712421 6303467 5730466 4992138 4889622 4472978 4015701 3751400
3853 3751400 3572084 3365955 3168476 3332645 3131678 2886934 2761177 2941930 2710149 2636772
3843 2636772 2554478 2313955 2115315 2130856 2168528 2197600 2035033 2099866 1899194 1872476 1919921
3832 1919921 1957463 1864942 2147458 2088179 1956864 1818560 1904385 1887593 1920949 1782040 1817623
3821 1817623 1837978 1776051 1543001 1816277 1835925 1745995 1949139 1875802 2093468 1930383
3811 1930383 1912477 2111314 2047848 2044834 2044408 2346317 2290784 1842709 1520592 1690343 1923426
3800A923426k63231J35637K28778l5755l33647M27602Q0403r5213L49301n6531
3790B360770M35421k18527K03506k60256R427J13526k36262j75248J25601K99701
3780B657659k13102R6203j12468r0376k11257J89276J59262J86877J29962j07210
3770B684826J31028K65159j79484k63518L22563K29526o2517L97505j12581Q0246
3760C492753n0009Q4695J40285j04754j47683K786Q3345N9525Q7781k4251m9909
3749C574564J38542K7572K04895j1034J77680j30377L56643M42916j4022J21178
3739D888557J82769K8712j00959n23408L18124j08973j68405k13319L7778o7764
3729D273112J20953o9052J85124K33722l55345k61553K16022L71311P3175J32125
$$ plain form
3800 1923426 1660195 1795832 2024610 1988855 1655208 2082810 2163213 2068000 2417301 2360770
3790 2360770 2796191 2577664 2781170 2520914 2530341 2643867 2407605 2232357 2357958 2657659
3780 2657659 2444557 2540760 2428292 2337916 2126659 2315935 2475197 2662074 2792036 2684826
3770 2684826 2815854 3081013 2901529 2638011 2960574 3190100 3127583 3525088 3412507 3492753
3760 3492753 3442744 3527439 3667724 3562970 3415287 3418073 3501418 3560943 3648724 3624473 3574564
3749 3574564 3713106 3740678 3945573 3934539 4112219 3981842 4338485 4781401 4767379 4888557
3739 4888557 5071326 5100038 4999079 4475671 4793795 4684822 4516417 4303098 4340876 4273112
3729 4273112 4394065 4325013 4510137 4743859 4388514 4126961 4342983 4714294 4787469 4919594
3719D919594n55796k29829M8101J12010j03686m26850j04608K23526m70237j14089
3709C298136K57393n16923R3497M5195k25481M62551l3381m1481j87434l94179
3699B757893l9561M7547l72137R370l9767k01294R555l48706j05817K43211j65617
3688A794677L6895K73577m83627j13383J60128k20705R0798P544k78050O9951
3678A337805j37783j25476L98504k99947o4691j74783n9020o954N3201j33586
3668G87270M1983P488J10191o5120l28040J94133J09283k6122j81859J29885n2594
3657G26498l60051J25410K12041j79463J88357m06823M5107K42426j00930j17947
3647C74625j8386N0755l05049M90323k76471k77151K74545O7523k32301K7026
$$ plain form
3719 4919594 4363798 4133969 4182070 4294080 4190394 3763544 3658936 3882462 3412225 3298136
3709 3298136 3555529 3038606 3132103 3177298 2951817 3414368 3380987 3339506 3152072 2757893
3699 2757893 2718332 2765879 2393742 2403112 2363345 2162051 2171606 1822900 1717083 1960294 1794677
3688 1794677 1831572 2105149 1621522 1508139 1668267 1447562 1538360 1545904 1267854 1337805
3678 1337805 1200022 1074546 1473050 1173103 1108412 933629 874609 867655 920856 787270
3668 787270 829253 836741 946932 881812 553772 747905 857188 831066 649207 779092 726498
3657 726498 366447 491857 703898 524435 712792 305969 351076 593502 492572 374625
3647 374625 356239 406994 101945 592268 315797 38646 313191 380714 148413 175439
3637A75439L7706K31068k20708q84m373k33703N133M86748j25916j81693J48720
3626C17537j11517l3327L9481j26139k5103K27956k73118J74226J14518j9147
3616B85367j84265R6026j72013j48959J39066n4765J84604n46450o819K84396
3606a23812K15809j71582j88258K36038q2231J22506j79822m37827J73983r4826
3596e30022J55018J79186J40929L9633K8494n4652k17373N9496J69778k98875
3586c28388K68647J66998j01497l40430J25573M16864l73113P8918J28393l95361
3576c53396k89164L32059j7012q7268L75800R0011k79221N3048j5976L47060j74820
3565a8879K66157l89159j73166J62908L2773O752j70153l763M8513m1931L55295
$$ plain form
3637 175439 213145 444213 223505 222621 218248 -15455 -10322 476426 350510 168817 317537
3626 317537 206020 172693 212174 86035 60932 288888 15770 189996 304514 285367
3616 285367 101102 197128 25115 -123844 15222 -39543 145061 -401389 -408208 -123812
3606 -123812 91997 -79585 -267843 -31805 -114036 8470 -171352 -609179 -435196 -530022
3596 -530022 -375004 -195818 -54889 -15256 13238 -41414 -258787 -199291 -29513 -328388
3586 -328388 -59741 107257 5760 -334670 -209097 207767 -165346 -86428 41965 -353396
3576 -353396 -642560 -310501 -327513 -414781 -38981 51030 -228191 -175143 -191119 155941 -18879
3565 -18879 247278 -141881 -315047 -152139 -119366 -112614 -282767 -286530 -238017 -279948 75347
$$ [...]
##END NTUPLES=NMR SPECTRUM
##END=
